{"text_format":"3","workbook":"xlsx","n_sheets":9,"sheets":["HOW TO USE","DA RATE","शालादर्पण कार्मिक DATA","कार्मिक विवरण","बिल और T.V.न.","भते","कटोतियाँ","EDIT PAY POSTING","PRINT PAY POSTING "],"not_rendered":{"images":3,"defined_names":5,"comments":2},"read":"whole","date_system":"1900"}

{"sheet":"HOW TO USE","index":0,"n_rows":25,"n_cols":2,"rows_kept":25,"merged":[[0,1,0,12],[1,1,1,12],[2,1,2,12],[3,1,3,12],[4,1,4,12],[5,1,5,12],[6,1,6,12],[7,1,7,12],[8,1,8,12],[9,1,9,12],[10,1,10,12],[11,1,11,12],[12,1,12,12],[14,1,14,12],[16,1,16,12],[18,1,18,12],[20,1,20,12],[21,1,21,12],[22,1,22,12],[23,1,23,12],[24,1,24,12]]}
[null,"MADE BY:-भागीरथ मल कलवानियाँ कोलिया  MOB. NO 982879204"]
[null,"अति महत्त्व पूर्ण निर्देश इस excell प्रोग्राम में DATA फीड करने से पहले एक बार जरूर पढ़े "]
[null,"   1.DA रेट sheet  पूर्ण रूप से प्रोटेक्ट sheet है अति आवश्यक परिस्तिथियों में केवल DA RATE दर CELL में आगामी वर्षों का बनाने के लिए जिस माह से DA की नई दर से वेतन मिलना लगा है उस माह में DA रेट की  DATA ENTRY करनी है बाकी के cell में कुछ नहीं करना है क्योंकि यह पूरा PROGRAAM इसी sheet पर आधारित है इसका cell रेंज पासवर्ड DA है"]
[]
[null,"   2 सबसे पहले shala दर्पण से कार्मिकों के DATA डाउनलोड कर इस शालादर्पण कार्मिक DATA sheet पर PASTE करे एवं सभी सभी CELLS की आवश्यकतानुसार पूर्ति करे  "]
[]
[null,"    3. TV.NO.AND BIL. NO SHEETS में इनके नंबर और दिनांक लिखे "]
[]
[null,"  4 कार्मिक विवरण sheet में जो data शाला दर्पण कार्मिक sheet से नहीं है उनकी पूर्ति करे,ड्रॉप डाउन सेल से उचित ड्रॉप डाउन चुने "]
[]
{"$rows_left_out":16}
{"sheet":"DA RATE","index":1,"n_rows":21,"n_cols":14,"rows_kept":21,"merged":[[0,0,0,13],[1,0,1,13],[21,0,21,13]]}
["MADE BY:-भागीरथ मल कलवानियाँ कोलिया  MOB. NO 982879204"]
["DA RATE"]
["सत्र ","YEAR","APRIL","MAY","JUNE","JULY","AUGUST","SEPTEMBER","OCTOBER","NOVEMBER","DECEMBER","JANUARY","FEBRUARY","MARCH"]
["2022-23",2022,34,34,{"$f":"D4","v":34},34,34,34,38,38,38,38,38,38]
["2023-24",2023,42,{"$f":"C5","v":42},42,42,42,42,42,46,46,46,{"$f":"L5","v":46},46]
["2024-25",2024,{"$f":"M5","v":46},{"$f":"M5","v":46},46,46,46,46,46,46,46,46,46,46]
["2025-26",2025,46,46,46,46,46,46,46,46,46,46,46,46]
["2026-27",2026,46,46,46,46,46,46,46,46,46,46,46,46]
["2027-28",2027,46,46,46,46,46,46,46,46,46,46,46,46]
["2028-29",2028,46,46,46,46,46,46,46,46,46,46,46,46]
{"$rows_left_out":12}
{"sheet":"शालादर्पण कार्मिक DATA","index":2,"n_rows":28,"n_cols":13,"rows_kept":28,"merged":[[0,0,0,12],[1,0,1,12]]}
["MADE BY:-भागीरथ मल कलवानियाँ कोलिया  MOB. NO 982879204"]
["राजकीय उच्च माध्यमिक विद्यालय डसाणा खुर्द,मौलासर,नागौर"]
["NAME","EMPLOYEE ID","FATHER NAME","GENDER","DOB","POST","SUBJECT","DATE OF JOINING ","ADDRESS","ADHAR NO","PAN No","MOBILE NO","BLOOD GROUP"]
["A","RJNA199728012345","A","M","1971-01-21","Senior Teacher (II Gr.)","Social Science","2016-10-28","A","XXXXXXXX5832","XXXXS1582D","XXXXXX5095","A-"]
["B","B","B","M","1969-04-01","Teacher (III Gr.) Level 1","---","2016-09-08","B","XXXXXXXX7101","XXXXK6245L","XXXXXX9204","O+"]
["C","C","C","M","1989-10-15","Senior Teacher (II Gr.)","Sanskrit","2020-09-03","C","XXXXXXXX7272","XXXXC9446G","XXXXXX5637","B+"]
["D","D","D","M","1987-05-15","Senior Teacher (II Gr.)","Hindi","2014-12-29","D","XXXXXXXX7163","XXXXM3231R","XXXXXX2286","O+"]
["E","E","E","F","1968-06-02","Teacher (III Gr.) Level 1","---","2015-09-18","E","XXXXXXXX5107","XXXXD8016L","XXXXXX7761","A+"]
["F","F","F","M","1985-06-06","Senior Teacher (II Gr.)","English","2018-08-21","F","XXXXXXXX5359","XXXXR3560F","XXXXXX7474","B+"]
["G","G","G","M","1973-12-05","Class IV","---","2016-09-08","G","XXXXXXXX9436","XXXXK6106C","XXXXXX1384","B+"]
{"$rows_left_out":19}
{"sheet":"कार्मिक विवरण","index":3,"n_rows":300,"n_cols":16,"rows_kept":300,"merged":[[0,0,0,15],[1,0,1,15],[2,1,2,15]]}
["MADE BY:-भागीरथ मल कलवानियाँ कोलिया  MOB. NO 982879204"]
["राजकीय उच्च माध्यमिक विद्यालय डसाणा खुर्द,मौलासर,नागौर"]
["Employee Data","कार्मिक विवरण"]
["S.N.","NAME","पद","DOB","PAN NO","EMP. ID","NPS EMPLOYEE","HRA RATE","SI No.","GPF No.","PRAN No.","आधार कार्ड नंबर","बैंक नाम","IFSC Code","बैंक A/c","IS  IN PROBATION"]
[{"$f":"IF(कार्मिक_विवरण[NAME]=\"\",\"\",ROWS($A$2:A2))","v":1},{"$f":"IF('शालादर्पण कार्मिक DATA'!A4=\"\",\"\",'शालादर्पण कार्मिक DATA'!A4)","v":"A"},{"$f":"UPPER(IF('शालादर्पण कार्मिक DATA'!F4=\"\",\"\",'शालादर्पण कार्मिक DATA'!F4))","v":"SENIOR TEACHER (II GR.)"},{"$f":"IF('शालादर्पण कार्मिक DATA'!E4=\"\",\"\",'शालादर्पण कार्मिक DATA'!E4)","v":"1971-01-21"},{"$f":"IF('शालादर्पण कार्मिक DATA'!K4=\"\",\"\",'शालादर्पण कार्मिक DATA'!K4)","v":"XXXXS1582D"},{"$f":"IF('शालादर्पण कार्मिक DATA'!B4=\"\",\"\",'शालादर्पण कार्मिक DATA'!B4)","v":"RJNA199728012345"},"No",{"v":0.09,"d":"9%"},1121192,123456,123654987897,{"$f":"IF('शालादर्पण कार्मिक DATA'!J4=\"\",\"\",'शालादर्पण कार्मिक DATA'!J4)","v":"XXXXXXXX5832"},"SBI","SBIN00",61118966625,"No"]
[{"$f":"IF(कार्मिक_विवरण[NAME]=\"\",\"\",ROWS($A$2:A3))","v":2},{"$f":"IF('शालादर्पण कार्मिक DATA'!A5=\"\",\"\",'शालादर्पण कार्मिक DATA'!A5)","v":"B"},{"$f":"UPPER(IF('शालादर्पण कार्मिक DATA'!F5=\"\",\"\",'शालादर्पण कार्मिक DATA'!F5))","v":"TEACHER (III GR.) LEVEL 1"},{"$f":"IF('शालादर्पण कार्मिक DATA'!E5=\"\",\"\",'शालादर्पण कार्मिक DATA'!E5)","v":"1969-04-01"},{"$f":"IF('शालादर्पण कार्मिक DATA'!K5=\"\",\"\",'शालादर्पण कार्मिक DATA'!K5)","v":"XXXXK6245L"},{"$f":"IF('शालादर्पण कार्मिक DATA'!B5=\"\",\"\",'शालादर्पण कार्मिक DATA'!B5)","v":"B"},"No",{"v":0.09,"d":"9%"},1121192,123456,123654987897,{"$f":"IF('शालादर्पण कार्मिक DATA'!J5=\"\",\"\",'शालादर्पण कार्मिक DATA'!J5)","v":"XXXXXXXX7101"},"SBI","SBIN0031406",61118966625,"No"]
[{"$f":"IF(कार्मिक_विवरण[NAME]=\"\",\"\",ROWS($A$2:A4))","v":3},{"$f":"IF('शालादर्पण कार्मिक DATA'!A6=\"\",\"\",'शालादर्पण कार्मिक DATA'!A6)","v":"C"},{"$f":"UPPER(IF('शालादर्पण कार्मिक DATA'!F6=\"\",\"\",'शालादर्पण कार्मिक DATA'!F6))","v":"SENIOR TEACHER (II GR.)"},{"$f":"IF('शालादर्पण कार्मिक DATA'!E6=\"\",\"\",'शालादर्पण कार्मिक DATA'!E6)","v":"1989-10-15"},{"$f":"IF('शालादर्पण कार्मिक DATA'!K6=\"\",\"\",'शालादर्पण कार्मिक DATA'!K6)","v":"XXXXC9446G"},{"$f":"IF('शालादर्पण कार्मिक DATA'!B6=\"\",\"\",'शालादर्पण कार्मिक DATA'!B6)","v":"C"},"No",null,1121192,123456,123654987897,{"$f":"IF('शालादर्पण कार्मिक DATA'!J6=\"\",\"\",'शालादर्पण कार्मिक DATA'!J6)","v":"XXXXXXXX7272"},"SBI","SBIN00",61118966625,"Yes"]
[{"$f":"IF(कार्मिक_विवरण[NAME]=\"\",\"\",ROWS($A$2:A5))","v":4},{"$f":"IF('शालादर्पण कार्मिक DATA'!A7=\"\",\"\",'शालादर्पण कार्मिक DATA'!A7)","v":"D"},{"$f":"UPPER(IF('शालादर्पण कार्मिक DATA'!F7=\"\",\"\",'शालादर्पण कार्मिक DATA'!F7))","v":"SENIOR TEACHER (II GR.)"},{"$f":"IF('शालादर्पण कार्मिक DATA'!E7=\"\",\"\",'शालादर्पण कार्मिक DATA'!E7)","v":"1987-05-15"},{"$f":"IF('शालादर्पण कार्मिक DATA'!K7=\"\",\"\",'शालादर्पण कार्मिक DATA'!K7)","v":"XXXXM3231R"},{"$f":"IF('शालादर्पण कार्मिक DATA'!B7=\"\",\"\",'शालादर्पण कार्मिक DATA'!B7)","v":"D"},"No",null,1121192,123456,123654987897,{"$f":"IF('शालादर्पण कार्मिक DATA'!J7=\"\",\"\",'शालादर्पण कार्मिक DATA'!J7)","v":"XXXXXXXX7163"},"SBI","SBIN00",61118966625,"No"]
[{"$f":"IF(कार्मिक_विवरण[NAME]=\"\",\"\",ROWS($A$2:A6))","v":5},{"$f":"IF('शालादर्पण कार्मिक DATA'!A8=\"\",\"\",'शालादर्पण कार्मिक DATA'!A8)","v":"E"},{"$f":"UPPER(IF('शालादर्पण कार्मिक DATA'!F8=\"\",\"\",'शालादर्पण कार्मिक DATA'!F8))","v":"TEACHER (III GR.) LEVEL 1"},{"$f":"IF('शालादर्पण कार्मिक DATA'!E8=\"\",\"\",'शालादर्पण कार्मिक DATA'!E8)","v":"1968-06-02"},{"$f":"IF('शालादर्पण कार्मिक DATA'!K8=\"\",\"\",'शालादर्पण कार्मिक DATA'!K8)","v":"XXXXD8016L"},{"$f":"IF('शालादर्पण कार्मिक DATA'!B8=\"\",\"\",'शालादर्पण कार्मिक DATA'!B8)","v":"E"},"No",null,1121192,123456,123654987897,{"$f":"IF('शालादर्पण कार्मिक DATA'!J8=\"\",\"\",'शालादर्पण कार्मिक DATA'!J8)","v":"XXXXXXXX5107"},"SBI","SBIN00",61118966625,"No"]
[{"$f":"IF(कार्मिक_विवरण[NAME]=\"\",\"\",ROWS($A$2:A7))","v":6},{"$f":"IF('शालादर्पण कार्मिक DATA'!A9=\"\",\"\",'शालादर्पण कार्मिक DATA'!A9)","v":"F"},{"$f":"UPPER(IF('शालादर्पण कार्मिक DATA'!F9=\"\",\"\",'शालादर्पण कार्मिक DATA'!F9))","v":"SENIOR TEACHER (II GR.)"},{"$f":"IF('शालादर्पण कार्मिक DATA'!E9=\"\",\"\",'शालादर्पण कार्मिक DATA'!E9)","v":"1985-06-06"},{"$f":"IF('शालादर्पण कार्मिक DATA'!K9=\"\",\"\",'शालादर्पण कार्मिक DATA'!K9)","v":"XXXXR3560F"},{"$f":"IF('शालादर्पण कार्मिक DATA'!B9=\"\",\"\",'शालादर्पण कार्मिक DATA'!B9)","v":"F"},"No",null,1121192,123456,123654987897,{"$f":"IF('शालादर्पण कार्मिक DATA'!J9=\"\",\"\",'शालादर्पण कार्मिक DATA'!J9)","v":"XXXXXXXX5359"},"SBI","SBIN00",61118966625,"No"]
{"$rows_left_out":291}
{"sheet":"बिल और T.V.न.","index":4,"n_rows":26,"n_cols":6,"rows_kept":26,"merged":[[0,0,0,5],[1,0,1,5],[2,0,2,5]]}
["MADE BY:-भागीरथ मल कलवानियाँ कोलिया  MOB. NO 982879204"]
[{"$f":"'कार्मिक विवरण'!A2","v":"राजकीय उच्च माध्यमिक विद्यालय डसाणा खुर्द,मौलासर,नागौर"}]
["BILL NO. AND TV NO.DETAIL"]
["क्र.सं.","माह का नाम","बिल नं.","DATE","टी.वी. नं.","DATE"]
[1,"APR",3,"2023-05-07",15843,"2023-05-13"]
[2,"MAY",9,"2023-05-08",22151,"2023-05-14"]
[3,"JUN",11,"2023-05-09",33751,"2023-05-15"]
[4,"JUL",17,"2023-05-10",45857,"2023-05-16"]
[5,"AUG",20,"2023-05-11",54785,"2023-05-17"]
[6,"SEP",22,"2023-05-12",65093,"2023-05-18"]
{"$rows_left_out":17}
{"sheet":"भते","index":5,"n_rows":104,"n_cols":11,"rows_kept":104,"merged":[[0,0,0,10],[1,0,1,10],[2,0,2,10]]}
["MADE BY:-भागीरथ मल कलवानियाँ कोलिया  MOB. NO 982879204"]
[{"$f":"'कार्मिक विवरण'!A2","v":"राजकीय उच्च माध्यमिक विद्यालय डसाणा खुर्द,मौलासर,नागौर"}]
["ALLOWANCES DETAIL "]
["S.NO","NAME","APRIL MONTH मूल वेतन","अवकाश वेतन ","विशेष वेतन","विकलांग भत्ता","शहरी भत्ता ","अन्य 1","अन्य 2","अन्य 3","योग 1"]
[{"$f":"IF(भते[NAME]=\"\",\"\",ROWS($A$2:A2))","v":1},{"$f":"IF('शालादर्पण कार्मिक DATA'!A4=\"\",\"\",'शालादर्पण कार्मिक DATA'!A4)","v":"A"},69200,{"$nulls":7},{"$f":"SUM(C5:J5)","v":69200}]
[{"$f":"IF(भते[NAME]=\"\",\"\",ROWS($A$2:A3))","v":2},{"$f":"IF('शालादर्पण कार्मिक DATA'!A5=\"\",\"\",'शालादर्पण कार्मिक DATA'!A5)","v":"B"},67200,{"$nulls":7},{"$f":"SUM(C6:J6)","v":67200}]
[{"$f":"IF(भते[NAME]=\"\",\"\",ROWS($A$2:A4))","v":3},{"$f":"IF('शालादर्पण कार्मिक DATA'!A6=\"\",\"\",'शालादर्पण कार्मिक DATA'!A6)","v":"C"},26500,{"$nulls":7},26500]
[{"$f":"IF(भते[NAME]=\"\",\"\",ROWS($A$2:A5))","v":4},{"$f":"IF('शालादर्पण कार्मिक DATA'!A7=\"\",\"\",'शालादर्पण कार्मिक DATA'!A7)","v":"D"},41300,{"$nulls":7},41300]
[{"$f":"IF(भते[NAME]=\"\",\"\",ROWS($A$2:A6))","v":5},{"$f":"IF('शालादर्पण कार्मिक DATA'!A8=\"\",\"\",'शालादर्पण कार्मिक DATA'!A8)","v":"E"},61300,{"$nulls":7},61300]
[{"$f":"IF(भते[NAME]=\"\",\"\",ROWS($A$2:A7))","v":6},{"$f":"IF('शालादर्पण कार्मिक DATA'!A9=\"\",\"\",'शालादर्पण कार्मिक DATA'!A9)","v":"F"},45100,{"$nulls":7},45100]
{"$rows_left_out":95}
{"sheet":"कटोतियाँ","index":6,"n_rows":104,"n_cols":15,"rows_kept":104,"merged":[[0,0,0,14],[1,0,1,14],[2,0,2,14]]}
["MADE BY:-भागीरथ मल कलवानियाँ कोलिया  MOB. NO 982879204"]
[{"$f":"'कार्मिक विवरण'!$A$2","v":"राजकीय उच्च माध्यमिक विद्यालय डसाणा खुर्द,मौलासर,नागौर"}]
["DEDUCTION DETAIL"]
["क्र.सं.","नाम","GPF/GPF2004","GPF Loan","SI","SI Loan","ITAX","RPMF/RGHS","LIC","OTHER","GIS","अन्य 1","अन्य 2","अन्य 3","योग 2"]
[{"$f":"IF(कटोतियाँ[नाम]=\"\",\"\",ROWS($A$2:A2))","v":1},{"$f":"IF('शालादर्पण कार्मिक DATA'!A4=\"\",\"\",'शालादर्पण कार्मिक DATA'!A4)","v":"A"},4200,0,5000,0,7000,875,0,0,null,0,0,0,{"$f":"SUM(C5:N5)","v":17075}]
[{"$f":"IF(कटोतियाँ[नाम]=\"\",\"\",ROWS($A$2:A3))","v":2},{"$f":"IF('शालादर्पण कार्मिक DATA'!A5=\"\",\"\",'शालादर्पण कार्मिक DATA'!A5)","v":"B"},4200,0,5000,0,4000,875,0,0,0,0,0,0,{"$f":"SUM(C6:N6)","v":14075}]
[{"$f":"IF(कटोतियाँ[नाम]=\"\",\"\",ROWS($A$2:A4))","v":3},{"$f":"IF('शालादर्पण कार्मिक DATA'!A6=\"\",\"\",'शालादर्पण कार्मिक DATA'!A6)","v":"C"},0,0,null,0,0,0,0,0,220,0,0,0,220]
[{"$f":"IF(कटोतियाँ[नाम]=\"\",\"\",ROWS($A$2:A5))","v":4},{"$f":"IF('शालादर्पण कार्मिक DATA'!A7=\"\",\"\",'शालादर्पण कार्मिक DATA'!A7)","v":"D"},null,null,3000,{"$nulls":5},220,{"$nulls":3},3220]
[{"$f":"IF(कटोतियाँ[नाम]=\"\",\"\",ROWS($A$2:A6))","v":5},{"$f":"IF('शालादर्पण कार्मिक DATA'!A8=\"\",\"\",'शालादर्पण कार्मिक DATA'!A8)","v":"E"},3575,null,3000,6000,1000,875,1171,null,220,{"$nulls":3},15841]
[{"$f":"IF(कटोतियाँ[नाम]=\"\",\"\",ROWS($A$2:A7))","v":6},{"$f":"IF('शालादर्पण कार्मिक DATA'!A9=\"\",\"\",'शालादर्पण कार्मिक DATA'!A9)","v":"F"},null,null,3000,null,500,{"$nulls":7},3500]
{"$rows_left_out":95}
{"sheet":"EDIT PAY POSTING","index":7,"n_rows":61,"n_cols":33,"rows_kept":61,"merged":[[0,2,0,13],[1,0,1,13],[1,15,2,17],[2,0,2,13],[3,0,3,13],[4,1,4,3],[4,5,4,7],[4,9,4,10],[4,12,4,13],[4,15,4,19],[5,1,5,3],[5,5,5,7],[5,9,5,10],[5,12,5,13],[5,15,5,16],[6,1,6,3],[6,5,6,7],[6,9,6,10],[6,12,6,13],[6,15,7,17],[6,18,7,18],[7,0,7,13],[8,15,8,17],[9,0,13,0],[14,0,14,13],[15,0,15,13],[26,0,26,1],[27,0,27,13],[28,0,28,13],[43,0,43,1],[44,0,44,1],[45,0,45,13],[46,2,46,13],[51,0,51,1],[52,0,52,13],[53,0,54,0],[53,2,53,13],[55,0,55,13],[56,0,56,1],[57,0,57,13],[58,0,58,1],[58,2,58,13],[59,0,59,13],[60,0,60,1],[60,2,60,13]]}
[2023,2024,"MADE BY:-भागीरथ मल कलवानियाँ कोलिया  MOB. NO 982879204",{"$nulls":17},{"$f":"YEAR(TODAY())","v":2024}]
[{"$f":"'कार्मिक विवरण'!A2","v":"राजकीय उच्च माध्यमिक विद्यालय डसाणा खुर्द,मौलासर,नागौर"},{"$nulls":13},{"$f":"VLOOKUP($P$2,कार्मिक_विवरण[],16,0)","v":"No"},1]
["PAY POSTING RAGISTER",{"$nulls":13},{"$f":"VLOOKUP($P$2,कार्मिक_विवरण[],7,0)","v":"No"}]
[]
["नाम-",{"$f":"IFERROR((VLOOKUP($P$2,कार्मिक_विवरण[],2,0)),\"\")","v":"A"},null,null,"पद-",{"$f":"IFERROR(UPPER(VLOOKUP($P$2,कार्मिक_विवरण[],3,0)),\"\")","v":"SENIOR TEACHER (II GR.)"},null,null,"DOB-",{"$f":"IFERROR(VLOOKUP($P$2,कार्मिक_विवरण[],4,0),\"\")","v":"1971-01-21"},null,"पैन नंबर-",{"$f":"IFERROR(VLOOKUP($P$2,कार्मिक_विवरण[],5,0),\"\")","v":"XXXXS1582D"},null,null,"BASIC CHANGE हो तो पीले सेल में मूल वेतन लिखे "]
["EMP. ID-",{"$f":"IFERROR(VLOOKUP($P$2,कार्मिक_विवरण[],6,0),\"\")","v":"RJNA199728012345"},null,null,"SI No.-",{"$f":"IFERROR(VLOOKUP($P$2,कार्मिक_विवरण[],9,0),\"\")","v":1121192},null,null,"GPF No.-",{"$f":"IFERROR(VLOOKUP($P$2,कार्मिक_विवरण[],10,0),\"\")","v":123456},null,"PRAN No.",{"$f":"IFERROR(VLOOKUP($P$2,कार्मिक_विवरण[],11,0),\"\")","v":123654987897},null,null,"DEC-2023",null,73200]
["आधार कार्ड नंबर-",{"$f":"IFERROR(VLOOKUP($P$2,कार्मिक_विवरण[],12,0),\"\")","v":"XXXXXXXX5832"},null,null,"बैंक नाम-",{"$f":"IFERROR(VLOOKUP($P$2,कार्मिक_विवरण[],13,0),\"\")","v":"SBI"},null,null,"IFSC Cod-",{"$f":"IFERROR(VLOOKUP($P$2,कार्मिक_विवरण[],14,0),\"\")","v":"SBIN00"},null,"बैंक A/c-",{"$f":"IFERROR(VLOOKUP($P$2,कार्मिक_विवरण[],15,0),\"\")","v":61118966625},null,null,"समर्पित अवकाश माह",null,null,"राजपत्रित",null,"APR-2022-23","may-2022-23","jun-22-23","july-22-23"]
[]
[{"$f":"$B$5","v":"A"},"Month",{"$f":"V$11&\"-\"&$A$1","v":"APR-2023"},"MAY-2023","JUN-2023","JUL-2023","AUG-2023","SEP-2023","OCT-2023","NOV-2023","DEC-2023",{"$f":"AE$11&\"-\"&RIGHT($B$1,4)","v":"JAN-2024"},{"$f":"AF$11&\"-\"&RIGHT($B$1,4)","v":"FEB-2024"},{"$f":"AG$11&\"-\"&RIGHT($B$1,4)","v":"MAR-2024"},null,"DEC-2023",null,null,"No",null,{"$f":"IFERROR(VLOOKUP(U7,U7:AF7,21,0),U$7)","v":"APR-2022-23"},{"$f":"IFERROR(VLOOKUP(V7,V7:AG7,21,0),V$7)","v":"may-2022-23"},{"$f":"IFERROR(VLOOKUP(W7,W7:AH7,21,0),W$7)","v":"jun-22-23"},{"$f":"IFERROR(VLOOKUP(X7,X7:AH7,21,0),X$7)","v":"july-22-23"}]
["वेतन एवं कटौती का विवरण","DA Rates %",{"$f":"IFERROR(VLOOKUP($A$1,DA,2,0),\"\")","v":42},{"$f":"IFERROR(VLOOKUP($A$1,DA,3,0),\"\")","v":42},{"$f":"IFERROR(VLOOKUP($A$1,DA,4,0),\"\")","v":42},{"$f":"IFERROR(VLOOKUP($A$1,DA,5,0),\"\")","v":42},{"$f":"IFERROR(VLOOKUP($A$1,DA,6,0),\"\")","v":42},{"$f":"IFERROR(VLOOKUP($A$1,DA,7,0),\"\")","v":42},{"$f":"IFERROR(VLOOKUP($A$1,DA,8,0),\"\")","v":42},{"$f":"IFERROR(VLOOKUP($A$1,DA,9,0),\"\")","v":46},{"$f":"IFERROR(VLOOKUP($A$1,DA,10,0),\"\")","v":46},{"$f":"IFERROR(VLOOKUP($A$1,DA,11,0),\"\")","v":46},{"$f":"IFERROR(VLOOKUP($A$1,DA,12,0),\"\")","v":46},{"$f":"IFERROR(VLOOKUP($A$1,DA,13,0),\"\")","v":46},{"$nulls":6},{"$f":"IFERROR(VLOOKUP(U8,U8:AF8,21,0),$U$7)","v":"APR-2022-23"}]
{"$rows_left_out":52}
{"sheet":"PRINT PAY POSTING ","index":8,"n_rows":61,"n_cols":14,"rows_kept":61,"merged":[[0,0,0,13],[1,0,1,13],[2,0,2,13],[3,0,3,13],[4,1,4,3],[4,5,4,7],[4,9,4,10],[4,12,4,13],[5,1,5,3],[5,5,5,7],[5,9,5,10],[5,12,5,13],[6,1,6,3],[6,5,6,7],[6,9,6,10],[6,12,6,13],[7,0,7,13],[9,0,13,0],[14,0,14,13],[15,0,15,13],[16,0,25,0],[26,0,26,1],[27,0,27,13],[28,0,28,13],[29,0,42,0],[43,0,43,1],[44,0,44,1],[45,0,45,13],[46,2,46,13],[51,0,51,1],[52,0,52,13],[53,0,54,0],[53,2,53,13],[55,0,55,13],[56,0,56,1],[57,0,57,13],[58,0,58,4],[58,5,58,8],[58,9,58,13],[59,0,59,13],[60,0,60,4],[60,5,60,8],[60,9,60,13]]}
["MADE BY:-भागीरथ मल कलवानियाँ कोलिया  MOB. NO 982879204"]
[{"$f":"'EDIT PAY POSTING'!A2","v":"राजकीय उच्च माध्यमिक विद्यालय डसाणा खुर्द,मौलासर,नागौर"}]
["PAY POSTING RAGISTER"]
[]
["नाम-",{"$f":"'EDIT PAY POSTING'!B5","v":"A"},null,null,"पद-",{"$f":"'EDIT PAY POSTING'!F5","v":"SENIOR TEACHER (II GR.)"},null,null,"DOB-",{"$f":"'EDIT PAY POSTING'!J5","v":"1971-01-21"},null,"पैन नंबर-",{"$f":"'EDIT PAY POSTING'!M5","v":"XXXXS1582D"}]
["EMP. ID-",{"$f":"'EDIT PAY POSTING'!B6","v":"RJNA199728012345"},null,null,"SI No.-",{"$f":"'EDIT PAY POSTING'!F6","v":1121192},null,null,"GPF No.-",{"$f":"'EDIT PAY POSTING'!J6","v":123456},null,"PRAN No.",{"$f":"'EDIT PAY POSTING'!M6","v":123654987897}]
["आधार कार्ड नंबर-",{"$f":"'EDIT PAY POSTING'!B7","v":"XXXXXXXX5832"},null,null,"बैंक नाम-",{"$f":"'EDIT PAY POSTING'!F7","v":"SBI"},null,null,"IFSC Cod-",{"$f":"'EDIT PAY POSTING'!J7","v":"SBIN00"},null,"बैंक A/c-",{"$f":"'EDIT PAY POSTING'!M7","v":61118966625}]
[]
[{"$f":"'EDIT PAY POSTING'!A9","v":"A"},"Month",{"$f":"'EDIT PAY POSTING'!C9","v":"APR-2023"},{"$f":"'EDIT PAY POSTING'!D9","v":"MAY-2023"},{"$f":"'EDIT PAY POSTING'!E9","v":"JUN-2023"},{"$f":"'EDIT PAY POSTING'!F9","v":"JUL-2023"},{"$f":"'EDIT PAY POSTING'!G9","v":"AUG-2023"},{"$f":"'EDIT PAY POSTING'!H9","v":"SEP-2023"},{"$f":"'EDIT PAY POSTING'!I9","v":"OCT-2023"},{"$f":"'EDIT PAY POSTING'!J9","v":"NOV-2023"},{"$f":"'EDIT PAY POSTING'!K9","v":"DEC-2023"},{"$f":"'EDIT PAY POSTING'!L9","v":"JAN-2024"},{"$f":"'EDIT PAY POSTING'!M9","v":"FEB-2024"},{"$f":"'EDIT PAY POSTING'!N9","v":"MAR-2024"}]
["वेतन एवं कटौती का विवरण","DA RATES%",{"$f":"'EDIT PAY POSTING'!C10","v":42},{"$f":"'EDIT PAY POSTING'!D10","v":42},{"$f":"'EDIT PAY POSTING'!E10","v":42},{"$f":"'EDIT PAY POSTING'!F10","v":42},{"$f":"'EDIT PAY POSTING'!G10","v":42},{"$f":"'EDIT PAY POSTING'!H10","v":42},{"$f":"'EDIT PAY POSTING'!I10","v":42},{"$f":"'EDIT PAY POSTING'!J10","v":46},{"$f":"'EDIT PAY POSTING'!K10","v":46},{"$f":"'EDIT PAY POSTING'!L10","v":46},{"$f":"'EDIT PAY POSTING'!M10","v":46},{"$f":"'EDIT PAY POSTING'!N10","v":46}]
{"$rows_left_out":51}