{"text_format":"3","workbook":"xlsx","n_sheets":9,"sheets":["HOW TO USE","DA RATE","शालादर्पण कार्मिक DATA","कार्मिक विवरण","बिल और T.V.न.","भते","कटोतियाँ","EDIT PAY POSTING","PRINT PAY POSTING "],"not_rendered":{"images":3,"defined_names":5,"comments":2},"read":"whole","date_system":"1900"}

{"sheet":"HOW TO USE","index":0,"n_rows":25,"n_cols":2,"rows_kept":25,"merged":[[0,1,0,12],[1,1,1,12],[2,1,2,12],[3,1,3,12],[4,1,4,12],[5,1,5,12],[6,1,6,12],[7,1,7,12],[8,1,8,12],[9,1,9,12],[10,1,10,12],[11,1,11,12],[12,1,12,12],[14,1,14,12],[16,1,16,12],[18,1,18,12],[20,1,20,12],[21,1,21,12],[22,1,22,12],[23,1,23,12],[24,1,24,12]]}
[null,"MADE BY:-भागीरथ मल कलवानियाँ कोलिया  MOB. NO 982879204"]
[null,"अति महत्त्व पूर्ण निर्देश इस excell प्रोग्राम में DATA फीड करने से पहले एक बार जरूर पढ़े "]
[null,"   1.DA रेट sheet  पूर्ण रूप से प्रोटेक्ट sheet है अति आवश्यक परिस्तिथियों में केवल DA RATE दर CELL में आगामी वर्षों का बनाने के लिए जिस माह से DA की नई दर से वेतन मिलना लगा है उस माह में DA रेट की  DATA ENTRY करनी है बाकी के cell में कुछ नहीं करना है क्योंकि यह पूरा PROGRAAM इसी sheet पर आधारित है इसका cell रेंज पासवर्ड DA है"]
[]
[null,"   2 सबसे पहले shala दर्पण से कार्मिकों के DATA डाउनलोड कर इस शालादर्पण कार्मिक DATA sheet पर PASTE करे एवं सभी सभी CELLS की आवश्यकतानुसार पूर्ति करे  "]
[]
[null,"    3. TV.NO.AND BIL. NO SHEETS में इनके नंबर और दिनांक लिखे "]
[]
[null,"  4 कार्मिक विवरण sheet में जो data शाला दर्पण कार्मिक sheet से नहीं है उनकी पूर्ति करे,ड्रॉप डाउन सेल से उचित ड्रॉप डाउन चुने "]
[]
[null," 5 .भते sheet के white colour unlock cell में आवश्यकता नुसार data फीड करे BASICसैलरी CELL में जिस वर्ष का आप पे रजिस्टर बनाना चाहते है उस वर्ष के अप्रैल माह का बेसिक वेतन लिखे "]
[]
[null," 6 .कटोतियाँ  sheet के white colour unlock cell में आवश्यकता नुसार data फीड करे"]
[]
[null," 7 .EDITPAY पोस्टिंग sheet में सबसे पहले जिस वर्ष का PAY POSTNG RAGISTER बना रहे है वो वितीय वर्ष CELL A1और B1 दोनों CELL में अलग अलग लिखने है उसके बाद कॉलम Q2 CELLS में सबसे पहले उस कार्मिक के क्रम संख्या न कार्मिक  विवरण sheet की क्रं संख्या लिखनी है इससे निचे Q4 cell में अगर उस वर्ष में उसकी बेसिक change हुई है तो माह dropdown से SELECT करइसके  आगे के cell में CHANGE बेसिक वेतन लिखे उसके निचे cell में अगर SURRENDER का भुगतान लिया है तो माह DROPDOWN से SELECT  करे   उसके बाद आप इसको एक बार अच्छी तरह अपने ऑफलाइन से मिलान कर ले फिर इस sheet के कटोतियाँ या अन्य कोई CELL में कोई संसोधन करना है तो उन CELLS को UNPROTECT कर उनमे संसोधन कर सकते है CELL रेंज पासवर्ड वेतन CELL RANGE का 1 कटोतियाँ CELLS RANGE का 2 व अन्य बकाया भुगतान RANGE का 3   अन्य CELLS  में किसी प्रकार की अनावश्यक EDITING नहीं करे नहीं तो गणना सही नहीं रहेगी |इस sheet के जिन CELLS में संसोधन आवश्यक हो उसके अलावा अन्य में  नहीं करे प्रिंट लेने के बाद जिन सेल्स में संसोधन किया उस CELL में = का निसान लगाकर पीछे के सेल पर क्लिक कर ENTER दबा दो एक ROW में  एक से ज्यादा CELLS में संसोधन  किया है तो यह कार्य MAY माह के CELL में कर आगे मार्च माह तक ड्रैग कर दो  क्योंकि दुसरे कार्मिक का प्रिंट करने पर जिस सेल में संसोधन किया उसके आगे के सेल में हम जितने के कार्मिक के भी बनायेंगे वो संसोधित राशि ही आएगी इस से बचने के लिए प्रिंट लेने के बाद पीछे वाले CELLS को आगे ड्रैग करना आवश्यक है |जिस वर्ष का बना रहे APRIL माह  बेसिक उसी वर्ष का लिखे,भते SHEET में| "]
[]
[null,"8 .प्रिंट पे पोस्टिंग sheet में आप CONTROL+P के प्रिंट ले सकते हैऔर PRINT बटन पर क्लिक करेंगे तो भी कंप्यूटर से प्रिंट भी निकल जायेगा और PDF SAVE LOCATION भी आपसे मांग लेगा वंहा आप कार्मिक के नाम से सेव भी कर सकते है  आप अपने कार्यालय कार्मिकों का वर्ष वार PAYRECORD संधारण कर सकते है|"]
[]
[null,"यह मेरा एक छोटा सा प्रयास है किसी भी कार्यालय में कार्यरत कार्मिको का ऑफलाइन पे REGISTER संधारण के लिए|इसमें किसी भी प्रकार के सुधार की आवश्यकता है तो मुझे अपने विचारों से अवगत करवाए |इसको हो सके जितना SHARE करे किसी के कार्य  में सहयोग मिल सके "]
[]
[null,"प्रोग्राम निर्माणकर्ता"]
[null,"भागीरथ मल MOB. NO 982879204"]
[null,"अध्यापक L-1 , राजकीय उच्च मा.विद्यालय डसाणा खुर्द (मौलासर) नागौर  "]
[null,"स्थाई पता :- कोलिया , तह. - डीडवाना , जिला - नागौर "]
[null,"bhagirathmalkalwania@gmail.com"]

{"sheet":"DA RATE","index":1,"n_rows":21,"n_cols":14,"rows_kept":21,"merged":[[0,0,0,13],[1,0,1,13],[21,0,21,13]]}
["MADE BY:-भागीरथ मल कलवानियाँ कोलिया  MOB. NO 982879204"]
["DA RATE"]
["सत्र ","YEAR","APRIL","MAY","JUNE","JULY","AUGUST","SEPTEMBER","OCTOBER","NOVEMBER","DECEMBER","JANUARY","FEBRUARY","MARCH"]
["2022-23",2022,34,34,{"$f":"D4","v":34},34,34,34,38,38,38,38,38,38]
["2023-24",2023,42,{"$f":"C5","v":42},42,42,42,42,42,46,46,46,{"$f":"L5","v":46},46]
["2024-25",2024,{"$f":"M5","v":46},{"$f":"M5","v":46},46,46,46,46,46,46,46,46,46,46]
["2025-26",2025,46,46,46,46,46,46,46,46,46,46,46,46]
["2026-27",2026,46,46,46,46,46,46,46,46,46,46,46,46]
["2027-28",2027,46,46,46,46,46,46,46,46,46,46,46,46]
["2028-29",2028,46,46,46,46,46,46,46,46,46,46,46,46]
["2029-30",2029,46,46,46,46,46,46,46,46,46,46,46,46]
[null,null,0,{"$f":"C12","v":0},0,0,0,0,0,0,0,0,0,0]
[null,null,{"$f":"N12","v":0},0,0,0,0,0,0,0,0,0,0,0]
[null,null,0,0,0,0,0,0,0,0,0,0,0,0]
[null,null,0,0,0,0,0,0,0,0,0,0,0,0]
[null,null,0,0,0,0,0,0,0,0,0,0,0,0]
[null,null,0,0,0,0,0,0,0,0,0,0,0,0]
[null,null,0,0,0,0,0,0,0,0,0,0,0,0]
[null,null,0,0,0,0,0,0,0,0,0,0,0,0]
[null,null,0,0,{"$f":"D20","v":0},0,0,0,0,0,0,0,0,0]
[null,null,0,0,{"$f":"D21","v":0},0,0,0,0,0,0,0,0,0]

{"sheet":"शालादर्पण कार्मिक DATA","index":2,"n_rows":28,"n_cols":13,"rows_kept":28,"merged":[[0,0,0,12],[1,0,1,12]]}
["MADE BY:-भागीरथ मल कलवानियाँ कोलिया  MOB. NO 982879204"]
["राजकीय उच्च माध्यमिक विद्यालय डसाणा खुर्द,मौलासर,नागौर"]
["NAME","EMPLOYEE ID","FATHER NAME","GENDER","DOB","POST","SUBJECT","DATE OF JOINING ","ADDRESS","ADHAR NO","PAN No","MOBILE NO","BLOOD GROUP"]
["A","RJNA199728012345","A","M","1971-01-21","Senior Teacher (II Gr.)","Social Science","2016-10-28","A","XXXXXXXX5832","XXXXS1582D","XXXXXX5095","A-"]
["B","B","B","M","1969-04-01","Teacher (III Gr.) Level 1","---","2016-09-08","B","XXXXXXXX7101","XXXXK6245L","XXXXXX9204","O+"]
["C","C","C","M","1989-10-15","Senior Teacher (II Gr.)","Sanskrit","2020-09-03","C","XXXXXXXX7272","XXXXC9446G","XXXXXX5637","B+"]
["D","D","D","M","1987-05-15","Senior Teacher (II Gr.)","Hindi","2014-12-29","D","XXXXXXXX7163","XXXXM3231R","XXXXXX2286","O+"]
["E","E","E","F","1968-06-02","Teacher (III Gr.) Level 1","---","2015-09-18","E","XXXXXXXX5107","XXXXD8016L","XXXXXX7761","A+"]
["F","F","F","M","1985-06-06","Senior Teacher (II Gr.)","English","2018-08-21","F","XXXXXXXX5359","XXXXR3560F","XXXXXX7474","B+"]
["G","G","G","M","1973-12-05","Class IV","---","2016-09-08","G","XXXXXXXX9436","XXXXK6106C","XXXXXX1384","B+"]
["H","H","H","M","1974-07-17","PET (III Gr.)","---","2016-06-09","H","XXXXXXXX0113","XXXXM5115H","XXXXXX5076","AB+"]
["I","I","I","M","1986-08-26","Headmaster & Equivalent","---","2019-10-25","I","XXXXXXXX0642","XXXXK6555R","XXXXXX1071","O+"]
["J","J","J","M","1975-06-01","Senior Teacher (II Gr.)","Mathematics","2018-07-26","J","XXXXXXXX0787","XXXXK6782N","XXXXXX2816","O+"]
["K","K","K","F","1980-01-02","Teacher (III Gr.) Level 2","Hindi","2018-09-24","K","XXXXXXXX2059","XXXXs9321a","XXXXXX6091","A+"]
["L","L","L","F","1999-03-26","Junior Assistant","---","2020-07-13","L","XXXXXXXX4135","XXXXR4026M","XXXXXX4082","O+"]
["M","M","M",{"$nulls":5},"M"]
["N","N","N",{"$nulls":5},"N"]
["O","O","O",{"$nulls":5},"O"]
["P","P","P",{"$nulls":5},"P"]
["Q","Q","Q",{"$nulls":5},"Q"]
["R","R","R",{"$nulls":5},"R"]
["S","S","S",{"$nulls":5},"S"]
["T","T","T",{"$nulls":5},"T"]
["U","U","U",{"$nulls":5},"U"]
["V","V","V",{"$nulls":5},"V"]
["W","W","W",{"$nulls":5},"W"]
["X","X","X",{"$nulls":5},"X"]
["Z","Z","Z",{"$nulls":5},"Z"]

{"sheet":"कार्मिक विवरण","index":3,"n_rows":300,"n_cols":16,"rows_kept":300,"merged":[[0,0,0,15],[1,0,1,15],[2,1,2,15]]}
["MADE BY:-भागीरथ मल कलवानियाँ कोलिया  MOB. NO 982879204"]
["राजकीय उच्च माध्यमिक विद्यालय डसाणा खुर्द,मौलासर,नागौर"]
["Employee Data","कार्मिक विवरण"]
["S.N.","NAME","पद","DOB","PAN NO","EMP. ID","NPS EMPLOYEE","HRA RATE","SI No.","GPF No.","PRAN No.","आधार कार्ड नंबर","बैंक नाम","IFSC Code","बैंक A/c","IS  IN PROBATION"]
[{"$f":"IF(कार्मिक_विवरण[NAME]=\"\",\"\",ROWS($A$2:A2))","v":1},{"$f":"IF('शालादर्पण कार्मिक DATA'!A4=\"\",\"\",'शालादर्पण कार्मिक DATA'!A4)","v":"A"},{"$f":"UPPER(IF('शालादर्पण कार्मिक DATA'!F4=\"\",\"\",'शालादर्पण कार्मिक DATA'!F4))","v":"SENIOR TEACHER (II GR.)"},{"$f":"IF('शालादर्पण कार्मिक DATA'!E4=\"\",\"\",'शालादर्पण कार्मिक DATA'!E4)","v":"1971-01-21"},{"$f":"IF('शालादर्पण कार्मिक DATA'!K4=\"\",\"\",'शालादर्पण कार्मिक DATA'!K4)","v":"XXXXS1582D"},{"$f":"IF('शालादर्पण कार्मिक DATA'!B4=\"\",\"\",'शालादर्पण कार्मिक DATA'!B4)","v":"RJNA199728012345"},"No",{"v":0.09,"d":"9%"},1121192,123456,123654987897,{"$f":"IF('शालादर्पण कार्मिक DATA'!J4=\"\",\"\",'शालादर्पण कार्मिक DATA'!J4)","v":"XXXXXXXX5832"},"SBI","SBIN00",61118966625,"No"]
[{"$f":"IF(कार्मिक_विवरण[NAME]=\"\",\"\",ROWS($A$2:A3))","v":2},{"$f":"IF('शालादर्पण कार्मिक DATA'!A5=\"\",\"\",'शालादर्पण कार्मिक DATA'!A5)","v":"B"},{"$f":"UPPER(IF('शालादर्पण कार्मिक DATA'!F5=\"\",\"\",'शालादर्पण कार्मिक DATA'!F5))","v":"TEACHER (III GR.) LEVEL 1"},{"$f":"IF('शालादर्पण कार्मिक DATA'!E5=\"\",\"\",'शालादर्पण कार्मिक DATA'!E5)","v":"1969-04-01"},{"$f":"IF('शालादर्पण कार्मिक DATA'!K5=\"\",\"\",'शालादर्पण कार्मिक DATA'!K5)","v":"XXXXK6245L"},{"$f":"IF('शालादर्पण कार्मिक DATA'!B5=\"\",\"\",'शालादर्पण कार्मिक DATA'!B5)","v":"B"},"No",{"v":0.09,"d":"9%"},1121192,123456,123654987897,{"$f":"IF('शालादर्पण कार्मिक DATA'!J5=\"\",\"\",'शालादर्पण कार्मिक DATA'!J5)","v":"XXXXXXXX7101"},"SBI","SBIN0031406",61118966625,"No"]
[{"$f":"IF(कार्मिक_विवरण[NAME]=\"\",\"\",ROWS($A$2:A4))","v":3},{"$f":"IF('शालादर्पण कार्मिक DATA'!A6=\"\",\"\",'शालादर्पण कार्मिक DATA'!A6)","v":"C"},{"$f":"UPPER(IF('शालादर्पण कार्मिक DATA'!F6=\"\",\"\",'शालादर्पण कार्मिक DATA'!F6))","v":"SENIOR TEACHER (II GR.)"},{"$f":"IF('शालादर्पण कार्मिक DATA'!E6=\"\",\"\",'शालादर्पण कार्मिक DATA'!E6)","v":"1989-10-15"},{"$f":"IF('शालादर्पण कार्मिक DATA'!K6=\"\",\"\",'शालादर्पण कार्मिक DATA'!K6)","v":"XXXXC9446G"},{"$f":"IF('शालादर्पण कार्मिक DATA'!B6=\"\",\"\",'शालादर्पण कार्मिक DATA'!B6)","v":"C"},"No",null,1121192,123456,123654987897,{"$f":"IF('शालादर्पण कार्मिक DATA'!J6=\"\",\"\",'शालादर्पण कार्मिक DATA'!J6)","v":"XXXXXXXX7272"},"SBI","SBIN00",61118966625,"Yes"]
[{"$f":"IF(कार्मिक_विवरण[NAME]=\"\",\"\",ROWS($A$2:A5))","v":4},{"$f":"IF('शालादर्पण कार्मिक DATA'!A7=\"\",\"\",'शालादर्पण कार्मिक DATA'!A7)","v":"D"},{"$f":"UPPER(IF('शालादर्पण कार्मिक DATA'!F7=\"\",\"\",'शालादर्पण कार्मिक DATA'!F7))","v":"SENIOR TEACHER (II GR.)"},{"$f":"IF('शालादर्पण कार्मिक DATA'!E7=\"\",\"\",'शालादर्पण कार्मिक DATA'!E7)","v":"1987-05-15"},{"$f":"IF('शालादर्पण कार्मिक DATA'!K7=\"\",\"\",'शालादर्पण कार्मिक DATA'!K7)","v":"XXXXM3231R"},{"$f":"IF('शालादर्पण कार्मिक DATA'!B7=\"\",\"\",'शालादर्पण कार्मिक DATA'!B7)","v":"D"},"No",null,1121192,123456,123654987897,{"$f":"IF('शालादर्पण कार्मिक DATA'!J7=\"\",\"\",'शालादर्पण कार्मिक DATA'!J7)","v":"XXXXXXXX7163"},"SBI","SBIN00",61118966625,"No"]
[{"$f":"IF(कार्मिक_विवरण[NAME]=\"\",\"\",ROWS($A$2:A6))","v":5},{"$f":"IF('शालादर्पण कार्मिक DATA'!A8=\"\",\"\",'शालादर्पण कार्मिक DATA'!A8)","v":"E"},{"$f":"UPPER(IF('शालादर्पण कार्मिक DATA'!F8=\"\",\"\",'शालादर्पण कार्मिक DATA'!F8))","v":"TEACHER (III GR.) LEVEL 1"},{"$f":"IF('शालादर्पण कार्मिक DATA'!E8=\"\",\"\",'शालादर्पण कार्मिक DATA'!E8)","v":"1968-06-02"},{"$f":"IF('शालादर्पण कार्मिक DATA'!K8=\"\",\"\",'शालादर्पण कार्मिक DATA'!K8)","v":"XXXXD8016L"},{"$f":"IF('शालादर्पण कार्मिक DATA'!B8=\"\",\"\",'शालादर्पण कार्मिक DATA'!B8)","v":"E"},"No",null,1121192,123456,123654987897,{"$f":"IF('शालादर्पण कार्मिक DATA'!J8=\"\",\"\",'शालादर्पण कार्मिक DATA'!J8)","v":"XXXXXXXX5107"},"SBI","SBIN00",61118966625,"No"]
[{"$f":"IF(कार्मिक_विवरण[NAME]=\"\",\"\",ROWS($A$2:A7))","v":6},{"$f":"IF('शालादर्पण कार्मिक DATA'!A9=\"\",\"\",'शालादर्पण कार्मिक DATA'!A9)","v":"F"},{"$f":"UPPER(IF('शालादर्पण कार्मिक DATA'!F9=\"\",\"\",'शालादर्पण कार्मिक DATA'!F9))","v":"SENIOR TEACHER (II GR.)"},{"$f":"IF('शालादर्पण कार्मिक DATA'!E9=\"\",\"\",'शालादर्पण कार्मिक DATA'!E9)","v":"1985-06-06"},{"$f":"IF('शालादर्पण कार्मिक DATA'!K9=\"\",\"\",'शालादर्पण कार्मिक DATA'!K9)","v":"XXXXR3560F"},{"$f":"IF('शालादर्पण कार्मिक DATA'!B9=\"\",\"\",'शालादर्पण कार्मिक DATA'!B9)","v":"F"},"No",null,1121192,123456,123654987897,{"$f":"IF('शालादर्पण कार्मिक DATA'!J9=\"\",\"\",'शालादर्पण कार्मिक DATA'!J9)","v":"XXXXXXXX5359"},"SBI","SBIN00",61118966625,"No"]
[{"$f":"IF(कार्मिक_विवरण[NAME]=\"\",\"\",ROWS($A$2:A8))","v":7},{"$f":"IF('शालादर्पण कार्मिक DATA'!A10=\"\",\"\",'शालादर्पण कार्मिक DATA'!A10)","v":"G"},{"$f":"UPPER(IF('शालादर्पण कार्मिक DATA'!F10=\"\",\"\",'शालादर्पण कार्मिक DATA'!F10))","v":"CLASS IV"},{"$f":"IF('शालादर्पण कार्मिक DATA'!E10=\"\",\"\",'शालादर्पण कार्मिक DATA'!E10)","v":"1973-12-05"},{"$f":"IF('शालादर्पण कार्मिक DATA'!K10=\"\",\"\",'शालादर्पण कार्मिक DATA'!K10)","v":"XXXXK6106C"},{"$f":"IF('शालादर्पण कार्मिक DATA'!B10=\"\",\"\",'शालादर्पण कार्मिक DATA'!B10)","v":"G"},"No",null,1121192,123456,123654987897,{"$f":"IF('शालादर्पण कार्मिक DATA'!J10=\"\",\"\",'शालादर्पण कार्मिक DATA'!J10)","v":"XXXXXXXX9436"},"SBI","SBIN00",61118966625,"No"]
[{"$f":"IF(कार्मिक_विवरण[NAME]=\"\",\"\",ROWS($A$2:A9))","v":8},{"$f":"IF('शालादर्पण कार्मिक DATA'!A11=\"\",\"\",'शालादर्पण कार्मिक DATA'!A11)","v":"H"},{"$f":"UPPER(IF('शालादर्पण कार्मिक DATA'!F11=\"\",\"\",'शालादर्पण कार्मिक DATA'!F11))","v":"PET (III GR.)"},{"$f":"IF('शालादर्पण कार्मिक DATA'!E11=\"\",\"\",'शालादर्पण कार्मिक DATA'!E11)","v":"1974-07-17"},{"$f":"IF('शालादर्पण कार्मिक DATA'!K11=\"\",\"\",'शालादर्पण कार्मिक DATA'!K11)","v":"XXXXM5115H"},{"$f":"IF('शालादर्पण कार्मिक DATA'!B11=\"\",\"\",'शालादर्पण कार्मिक DATA'!B11)","v":"H"},"No",null,1121192,123456,123654987897,{"$f":"IF('शालादर्पण कार्मिक DATA'!J11=\"\",\"\",'शालादर्पण कार्मिक DATA'!J11)","v":"XXXXXXXX0113"},"SBI","SBIN00",61118966625,"No"]
[{"$f":"IF(कार्मिक_विवरण[NAME]=\"\",\"\",ROWS($A$2:A10))","v":9},{"$f":"IF('शालादर्पण कार्मिक DATA'!A12=\"\",\"\",'शालादर्पण कार्मिक DATA'!A12)","v":"I"},{"$f":"UPPER(IF('शालादर्पण कार्मिक DATA'!F12=\"\",\"\",'शालादर्पण कार्मिक DATA'!F12))","v":"HEADMASTER & EQUIVALENT"},{"$f":"IF('शालादर्पण कार्मिक DATA'!E12=\"\",\"\",'शालादर्पण कार्मिक DATA'!E12)","v":"1986-08-26"},{"$f":"IF('शालादर्पण कार्मिक DATA'!K12=\"\",\"\",'शालादर्पण कार्मिक DATA'!K12)","v":"XXXXK6555R"},{"$f":"IF('शालादर्पण कार्मिक DATA'!B12=\"\",\"\",'शालादर्पण कार्मिक DATA'!B12)","v":"I"},"No",null,1121192,123456,123654987897,{"$f":"IF('शालादर्पण कार्मिक DATA'!J12=\"\",\"\",'शालादर्पण कार्मिक DATA'!J12)","v":"XXXXXXXX0642"},"SBI","SBIN00",61118966625,"No"]
[{"$f":"IF(कार्मिक_विवरण[NAME]=\"\",\"\",ROWS($A$2:A11))","v":10},{"$f":"IF('शालादर्पण कार्मिक DATA'!A13=\"\",\"\",'शालादर्पण कार्मिक DATA'!A13)","v":"J"},{"$f":"UPPER(IF('शालादर्पण कार्मिक DATA'!F13=\"\",\"\",'शालादर्पण कार्मिक DATA'!F13))","v":"SENIOR TEACHER (II GR.)"},{"$f":"IF('शालादर्पण कार्मिक DATA'!E13=\"\",\"\",'शालादर्पण कार्मिक DATA'!E13)","v":"1975-06-01"},{"$f":"IF('शालादर्पण कार्मिक DATA'!K13=\"\",\"\",'शालादर्पण कार्मिक DATA'!K13)","v":"XXXXK6782N"},{"$f":"IF('शालादर्पण कार्मिक DATA'!B13=\"\",\"\",'शालादर्पण कार्मिक DATA'!B13)","v":"J"},"No",null,1121192,123456,123654987897,{"$f":"IF('शालादर्पण कार्मिक DATA'!J13=\"\",\"\",'शालादर्पण कार्मिक DATA'!J13)","v":"XXXXXXXX0787"},"SBI","SBIN00",61118966625,"Yes"]
[{"$f":"IF(कार्मिक_विवरण[NAME]=\"\",\"\",ROWS($A$2:A12))","v":11},{"$f":"IF('शालादर्पण कार्मिक DATA'!A14=\"\",\"\",'शालादर्पण कार्मिक DATA'!A14)","v":"K"},{"$f":"UPPER(IF('शालादर्पण कार्मिक DATA'!F14=\"\",\"\",'शालादर्पण कार्मिक DATA'!F14))","v":"TEACHER (III GR.) LEVEL 2"},{"$f":"IF('शालादर्पण कार्मिक DATA'!E14=\"\",\"\",'शालादर्पण कार्मिक DATA'!E14)","v":"1980-01-02"},{"$f":"IF('शालादर्पण कार्मिक DATA'!K14=\"\",\"\",'शालादर्पण कार्मिक DATA'!K14)","v":"XXXXs9321a"},{"$f":"IF('शालादर्पण कार्मिक DATA'!B14=\"\",\"\",'शालादर्पण कार्मिक DATA'!B14)","v":"K"},"No",null,1121192,null,123654987897,{"$f":"IF('शालादर्पण कार्मिक DATA'!J14=\"\",\"\",'शालादर्पण कार्मिक DATA'!J14)","v":"XXXXXXXX2059"},"SBI","SBIN00",61118966625,"No"]
[{"$f":"IF(कार्मिक_विवरण[NAME]=\"\",\"\",ROWS($A$2:A13))","v":12},{"$f":"IF('शालादर्पण कार्मिक DATA'!A15=\"\",\"\",'शालादर्पण कार्मिक DATA'!A15)","v":"L"},{"$f":"UPPER(IF('शालादर्पण कार्मिक DATA'!F15=\"\",\"\",'शालादर्पण कार्मिक DATA'!F15))","v":"JUNIOR ASSISTANT"},{"$f":"IF('शालादर्पण कार्मिक DATA'!E15=\"\",\"\",'शालादर्पण कार्मिक DATA'!E15)","v":"1999-03-26"},{"$f":"IF('शालादर्पण कार्मिक DATA'!K15=\"\",\"\",'शालादर्पण कार्मिक DATA'!K15)","v":"XXXXR4026M"},{"$f":"IF('शालादर्पण कार्मिक DATA'!B15=\"\",\"\",'शालादर्पण कार्मिक DATA'!B15)","v":"L"},"No",null,1121192,null,123654987897,{"$f":"IF('शालादर्पण कार्मिक DATA'!J15=\"\",\"\",'शालादर्पण कार्मिक DATA'!J15)","v":"XXXXXXXX4135"},"SBI","SBIN00",61118966625,"Yes"]
[{"$f":"IF(कार्मिक_विवरण[NAME]=\"\",\"\",ROWS($A$2:A14))","v":13},{"$f":"IF('शालादर्पण कार्मिक DATA'!A16=\"\",\"\",'शालादर्पण कार्मिक DATA'!A16)","v":"M"},{"$f":"UPPER(IF('शालादर्पण कार्मिक DATA'!F16=\"\",\"\",'शालादर्पण कार्मिक DATA'!F16))","v":""},{"$f":"IF('शालादर्पण कार्मिक DATA'!E16=\"\",\"\",'शालादर्पण कार्मिक DATA'!E16)","v":""},{"$f":"IF('शालादर्पण कार्मिक DATA'!K16=\"\",\"\",'शालादर्पण कार्मिक DATA'!K16)","v":""},{"$f":"IF('शालादर्पण कार्मिक DATA'!B16=\"\",\"\",'शालादर्पण कार्मिक DATA'!B16)","v":"M"},"No",{"$nulls":4},{"$f":"IF('शालादर्पण कार्मिक DATA'!J16=\"\",\"\",'शालादर्पण कार्मिक DATA'!J16)","v":""}]
[{"$f":"IF(कार्मिक_विवरण[NAME]=\"\",\"\",ROWS($A$2:A15))","v":14},{"$f":"IF('शालादर्पण कार्मिक DATA'!A17=\"\",\"\",'शालादर्पण कार्मिक DATA'!A17)","v":"N"},{"$f":"UPPER(IF('शालादर्पण कार्मिक DATA'!F17=\"\",\"\",'शालादर्पण कार्मिक DATA'!F17))","v":""},{"$f":"IF('शालादर्पण कार्मिक DATA'!E17=\"\",\"\",'शालादर्पण कार्मिक DATA'!E17)","v":""},{"$f":"IF('शालादर्पण कार्मिक DATA'!K17=\"\",\"\",'शालादर्पण कार्मिक DATA'!K17)","v":""},{"$f":"IF('शालादर्पण कार्मिक DATA'!B17=\"\",\"\",'शालादर्पण कार्मिक DATA'!B17)","v":"N"},"No",{"$nulls":4},{"$f":"IF('शालादर्पण कार्मिक DATA'!J17=\"\",\"\",'शालादर्पण कार्मिक DATA'!J17)","v":""}]
[{"$f":"IF(कार्मिक_विवरण[NAME]=\"\",\"\",ROWS($A$2:A16))","v":15},{"$f":"IF('शालादर्पण कार्मिक DATA'!A18=\"\",\"\",'शालादर्पण कार्मिक DATA'!A18)","v":"O"},{"$f":"UPPER(IF('शालादर्पण कार्मिक DATA'!F18=\"\",\"\",'शालादर्पण कार्मिक DATA'!F18))","v":""},{"$f":"IF('शालादर्पण कार्मिक DATA'!E18=\"\",\"\",'शालादर्पण कार्मिक DATA'!E18)","v":""},{"$f":"IF('शालादर्पण कार्मिक DATA'!K18=\"\",\"\",'शालादर्पण कार्मिक DATA'!K18)","v":""},{"$f":"IF('शालादर्पण कार्मिक DATA'!B18=\"\",\"\",'शालादर्पण कार्मिक DATA'!B18)","v":"O"},"No",{"$nulls":4},{"$f":"IF('शालादर्पण कार्मिक DATA'!J18=\"\",\"\",'शालादर्पण कार्मिक DATA'!J18)","v":""}]
[{"$f":"IF(कार्मिक_विवरण[NAME]=\"\",\"\",ROWS($A$2:A17))","v":16},{"$f":"IF('शालादर्पण कार्मिक DATA'!A19=\"\",\"\",'शालादर्पण कार्मिक DATA'!A19)","v":"P"},{"$f":"UPPER(IF('शालादर्पण कार्मिक DATA'!F19=\"\",\"\",'शालादर्पण कार्मिक DATA'!F19))","v":""},{"$f":"IF('शालादर्पण कार्मिक DATA'!E19=\"\",\"\",'शालादर्पण कार्मिक DATA'!E19)","v":""},{"$f":"IF('शालादर्पण कार्मिक DATA'!K19=\"\",\"\",'शालादर्पण कार्मिक DATA'!K19)","v":""},{"$f":"IF('शालादर्पण कार्मिक DATA'!B19=\"\",\"\",'शालादर्पण कार्मिक DATA'!B19)","v":"P"},"No",{"$nulls":4},{"$f":"IF('शालादर्पण कार्मिक DATA'!J19=\"\",\"\",'शालादर्पण कार्मिक DATA'!J19)","v":""}]
[{"$f":"IF(कार्मिक_विवरण[NAME]=\"\",\"\",ROWS($A$2:A18))","v":17},{"$f":"IF('शालादर्पण कार्मिक DATA'!A20=\"\",\"\",'शालादर्पण कार्मिक DATA'!A20)","v":"Q"},{"$f":"UPPER(IF('शालादर्पण कार्मिक DATA'!F20=\"\",\"\",'शालादर्पण कार्मिक DATA'!F20))","v":""},{"$f":"IF('शालादर्पण कार्मिक DATA'!E20=\"\",\"\",'शालादर्पण कार्मिक DATA'!E20)","v":""},{"$f":"IF('शालादर्पण कार्मिक DATA'!K20=\"\",\"\",'शालादर्पण कार्मिक DATA'!K20)","v":""},{"$f":"IF('शालादर्पण कार्मिक DATA'!B20=\"\",\"\",'शालादर्पण कार्मिक DATA'!B20)","v":"Q"},"No",{"$nulls":4},{"$f":"IF('शालादर्पण कार्मिक DATA'!J20=\"\",\"\",'शालादर्पण कार्मिक DATA'!J20)","v":""}]
[{"$f":"IF(कार्मिक_विवरण[NAME]=\"\",\"\",ROWS($A$2:A19))","v":18},{"$f":"IF('शालादर्पण कार्मिक DATA'!A21=\"\",\"\",'शालादर्पण कार्मिक DATA'!A21)","v":"R"},{"$f":"UPPER(IF('शालादर्पण कार्मिक DATA'!F21=\"\",\"\",'शालादर्पण कार्मिक DATA'!F21))","v":""},{"$f":"IF('शालादर्पण कार्मिक DATA'!E21=\"\",\"\",'शालादर्पण कार्मिक DATA'!E21)","v":""},{"$f":"IF('शालादर्पण कार्मिक DATA'!K21=\"\",\"\",'शालादर्पण कार्मिक DATA'!K21)","v":""},{"$f":"IF('शालादर्पण कार्मिक DATA'!B21=\"\",\"\",'शालादर्पण कार्मिक DATA'!B21)","v":"R"},"No",{"$nulls":4},{"$f":"IF('शालादर्पण कार्मिक DATA'!J21=\"\",\"\",'शालादर्पण कार्मिक DATA'!J21)","v":""}]
[{"$f":"IF(कार्मिक_विवरण[NAME]=\"\",\"\",ROWS($A$2:A20))","v":19},{"$f":"IF('शालादर्पण कार्मिक DATA'!A22=\"\",\"\",'शालादर्पण कार्मिक DATA'!A22)","v":"S"},{"$f":"UPPER(IF('शालादर्पण कार्मिक DATA'!F22=\"\",\"\",'शालादर्पण कार्मिक DATA'!F22))","v":""},{"$f":"IF('शालादर्पण कार्मिक DATA'!E22=\"\",\"\",'शालादर्पण कार्मिक DATA'!E22)","v":""},{"$f":"IF('शालादर्पण कार्मिक DATA'!K22=\"\",\"\",'शालादर्पण कार्मिक DATA'!K22)","v":""},{"$f":"IF('शालादर्पण कार्मिक DATA'!B22=\"\",\"\",'शालादर्पण कार्मिक DATA'!B22)","v":"S"},{"$nulls":5},{"$f":"IF('शालादर्पण कार्मिक DATA'!J22=\"\",\"\",'शालादर्पण कार्मिक DATA'!J22)","v":""}]
[{"$f":"IF(कार्मिक_विवरण[NAME]=\"\",\"\",ROWS($A$2:A21))","v":20},{"$f":"IF('शालादर्पण कार्मिक DATA'!A23=\"\",\"\",'शालादर्पण कार्मिक DATA'!A23)","v":"T"},{"$f":"UPPER(IF('शालादर्पण कार्मिक DATA'!F23=\"\",\"\",'शालादर्पण कार्मिक DATA'!F23))","v":""},{"$f":"IF('शालादर्पण कार्मिक DATA'!E23=\"\",\"\",'शालादर्पण कार्मिक DATA'!E23)","v":""},{"$f":"IF('शालादर्पण कार्मिक DATA'!K23=\"\",\"\",'शालादर्पण कार्मिक DATA'!K23)","v":""},{"$f":"IF('शालादर्पण कार्मिक DATA'!B23=\"\",\"\",'शालादर्पण कार्मिक DATA'!B23)","v":"T"},{"$nulls":5},{"$f":"IF('शालादर्पण कार्मिक DATA'!J23=\"\",\"\",'शालादर्पण कार्मिक DATA'!J23)","v":""}]
[{"$f":"IF(कार्मिक_विवरण[NAME]=\"\",\"\",ROWS($A$2:A22))","v":21},{"$f":"IF('शालादर्पण कार्मिक DATA'!A24=\"\",\"\",'शालादर्पण कार्मिक DATA'!A24)","v":"U"},{"$f":"UPPER(IF('शालादर्पण कार्मिक DATA'!F24=\"\",\"\",'शालादर्पण कार्मिक DATA'!F24))","v":""},{"$f":"IF('शालादर्पण कार्मिक DATA'!E24=\"\",\"\",'शालादर्पण कार्मिक DATA'!E24)","v":""},{"$f":"IF('शालादर्पण कार्मिक DATA'!K24=\"\",\"\",'शालादर्पण कार्मिक DATA'!K24)","v":""},{"$f":"IF('शालादर्पण कार्मिक DATA'!B24=\"\",\"\",'शालादर्पण कार्मिक DATA'!B24)","v":"U"},{"$nulls":5},{"$f":"IF('शालादर्पण कार्मिक DATA'!J24=\"\",\"\",'शालादर्पण कार्मिक DATA'!J24)","v":""}]
[{"$f":"IF(कार्मिक_विवरण[NAME]=\"\",\"\",ROWS($A$2:A23))","v":22},{"$f":"IF('शालादर्पण कार्मिक DATA'!A25=\"\",\"\",'शालादर्पण कार्मिक DATA'!A25)","v":"V"},{"$f":"UPPER(IF('शालादर्पण कार्मिक DATA'!F25=\"\",\"\",'शालादर्पण कार्मिक DATA'!F25))","v":""},{"$f":"IF('शालादर्पण कार्मिक DATA'!E25=\"\",\"\",'शालादर्पण कार्मिक DATA'!E25)","v":""},{"$f":"IF('शालादर्पण कार्मिक DATA'!K25=\"\",\"\",'शालादर्पण कार्मिक DATA'!K25)","v":""},{"$f":"IF('शालादर्पण कार्मिक DATA'!B25=\"\",\"\",'शालादर्पण कार्मिक DATA'!B25)","v":"V"},{"$nulls":5},{"$f":"IF('शालादर्पण कार्मिक DATA'!J25=\"\",\"\",'शालादर्पण कार्मिक DATA'!J25)","v":""}]
[{"$f":"IF(कार्मिक_विवरण[NAME]=\"\",\"\",ROWS($A$2:A24))","v":23},{"$f":"IF('शालादर्पण कार्मिक DATA'!A26=\"\",\"\",'शालादर्पण कार्मिक DATA'!A26)","v":"W"},{"$f":"UPPER(IF('शालादर्पण कार्मिक DATA'!F26=\"\",\"\",'शालादर्पण कार्मिक DATA'!F26))","v":""},{"$f":"IF('शालादर्पण कार्मिक DATA'!E26=\"\",\"\",'शालादर्पण कार्मिक DATA'!E26)","v":""},{"$f":"IF('शालादर्पण कार्मिक DATA'!K26=\"\",\"\",'शालादर्पण कार्मिक DATA'!K26)","v":""},{"$f":"IF('शालादर्पण कार्मिक DATA'!B26=\"\",\"\",'शालादर्पण कार्मिक DATA'!B26)","v":"W"},{"$nulls":5},{"$f":"IF('शालादर्पण कार्मिक DATA'!J26=\"\",\"\",'शालादर्पण कार्मिक DATA'!J26)","v":""}]
[{"$f":"IF(कार्मिक_विवरण[NAME]=\"\",\"\",ROWS($A$2:A25))","v":24},{"$f":"IF('शालादर्पण कार्मिक DATA'!A27=\"\",\"\",'शालादर्पण कार्मिक DATA'!A27)","v":"X"},{"$f":"UPPER(IF('शालादर्पण कार्मिक DATA'!F27=\"\",\"\",'शालादर्पण कार्मिक DATA'!F27))","v":""},{"$f":"IF('शालादर्पण कार्मिक DATA'!E27=\"\",\"\",'शालादर्पण कार्मिक DATA'!E27)","v":""},{"$f":"IF('शालादर्पण कार्मिक DATA'!K27=\"\",\"\",'शालादर्पण कार्मिक DATA'!K27)","v":""},{"$f":"IF('शालादर्पण कार्मिक DATA'!B27=\"\",\"\",'शालादर्पण कार्मिक DATA'!B27)","v":"X"},{"$nulls":5},{"$f":"IF('शालादर्पण कार्मिक DATA'!J27=\"\",\"\",'शालादर्पण कार्मिक DATA'!J27)","v":""}]
[{"$f":"IF(कार्मिक_विवरण[NAME]=\"\",\"\",ROWS($A$2:A26))","v":25},{"$f":"IF('शालादर्पण कार्मिक DATA'!A28=\"\",\"\",'शालादर्पण कार्मिक DATA'!A28)","v":"Z"},{"$f":"UPPER(IF('शालादर्पण कार्मिक DATA'!F28=\"\",\"\",'शालादर्पण कार्मिक DATA'!F28))","v":""},{"$f":"IF('शालादर्पण कार्मिक DATA'!E28=\"\",\"\",'शालादर्पण कार्मिक DATA'!E28)","v":""},{"$f":"IF('शालादर्पण कार्मिक DATA'!K28=\"\",\"\",'शालादर्पण कार्मिक DATA'!K28)","v":""},{"$f":"IF('शालादर्पण कार्मिक DATA'!B28=\"\",\"\",'शालादर्पण कार्मिक DATA'!B28)","v":"Z"},{"$nulls":5},{"$f":"IF('शालादर्पण कार्मिक DATA'!J28=\"\",\"\",'शालादर्पण कार्मिक DATA'!J28)","v":""}]
[{"$f":"IF(कार्मिक_विवरण[NAME]=\"\",\"\",ROWS($A$2:A27))","v":""},{"$f":"IF('शालादर्पण कार्मिक DATA'!A29=\"\",\"\",'शालादर्पण कार्मिक DATA'!A29)","v":""},{"$f":"UPPER(IF('शालादर्पण कार्मिक DATA'!F29=\"\",\"\",'शालादर्पण कार्मिक DATA'!F29))","v":""},{"$f":"IF('शालादर्पण कार्मिक DATA'!E29=\"\",\"\",'शालादर्पण कार्मिक DATA'!E29)","v":""},{"$f":"IF('शालादर्पण कार्मिक DATA'!K29=\"\",\"\",'शालादर्पण कार्मिक DATA'!K29)","v":""},{"$f":"IF('शालादर्पण कार्मिक DATA'!B29=\"\",\"\",'शालादर्पण कार्मिक DATA'!B29)","v":""},{"$nulls":5},{"$f":"IF('शालादर्पण कार्मिक DATA'!J29=\"\",\"\",'शालादर्पण कार्मिक DATA'!J29)","v":""}]
[{"$f":"IF(कार्मिक_विवरण[NAME]=\"\",\"\",ROWS($A$2:A28))","v":""},{"$f":"IF('शालादर्पण कार्मिक DATA'!A30=\"\",\"\",'शालादर्पण कार्मिक DATA'!A30)","v":""},{"$f":"UPPER(IF('शालादर्पण कार्मिक DATA'!F30=\"\",\"\",'शालादर्पण कार्मिक DATA'!F30))","v":""},{"$f":"IF('शालादर्पण कार्मिक DATA'!E30=\"\",\"\",'शालादर्पण कार्मिक DATA'!E30)","v":""},{"$f":"IF('शालादर्पण कार्मिक DATA'!K30=\"\",\"\",'शालादर्पण कार्मिक DATA'!K30)","v":""},{"$f":"IF('शालादर्पण कार्मिक DATA'!B30=\"\",\"\",'शालादर्पण कार्मिक DATA'!B30)","v":""},{"$nulls":5},{"$f":"IF('शालादर्पण कार्मिक DATA'!J30=\"\",\"\",'शालादर्पण कार्मिक DATA'!J30)","v":""}]
[{"$f":"IF(कार्मिक_विवरण[NAME]=\"\",\"\",ROWS($A$2:A29))","v":""},{"$f":"IF('शालादर्पण कार्मिक DATA'!A31=\"\",\"\",'शालादर्पण कार्मिक DATA'!A31)","v":""},{"$f":"UPPER(IF('शालादर्पण कार्मिक DATA'!F31=\"\",\"\",'शालादर्पण कार्मिक DATA'!F31))","v":""},{"$f":"IF('शालादर्पण कार्मिक DATA'!E31=\"\",\"\",'शालादर्पण कार्मिक DATA'!E31)","v":""},{"$f":"IF('शालादर्पण कार्मिक DATA'!K31=\"\",\"\",'शालादर्पण कार्मिक DATA'!K31)","v":""},{"$f":"IF('शालादर्पण कार्मिक DATA'!B31=\"\",\"\",'शालादर्पण कार्मिक DATA'!B31)","v":""},{"$nulls":5},{"$f":"IF('शालादर्पण कार्मिक DATA'!J31=\"\",\"\",'शालादर्पण कार्मिक DATA'!J31)","v":""}]
[{"$f":"IF(कार्मिक_विवरण[NAME]=\"\",\"\",ROWS($A$2:A30))","v":""},{"$f":"IF('शालादर्पण कार्मिक DATA'!A32=\"\",\"\",'शालादर्पण कार्मिक DATA'!A32)","v":""},{"$f":"UPPER(IF('शालादर्पण कार्मिक DATA'!F32=\"\",\"\",'शालादर्पण कार्मिक DATA'!F32))","v":""},{"$f":"IF('शालादर्पण कार्मिक DATA'!E32=\"\",\"\",'शालादर्पण कार्मिक DATA'!E32)","v":""},{"$f":"IF('शालादर्पण कार्मिक DATA'!K32=\"\",\"\",'शालादर्पण कार्मिक DATA'!K32)","v":""},{"$f":"IF('शालादर्पण कार्मिक DATA'!B32=\"\",\"\",'शालादर्पण कार्मिक DATA'!B32)","v":""},{"$nulls":5},{"$f":"IF('शालादर्पण कार्मिक DATA'!J32=\"\",\"\",'शालादर्पण कार्मिक DATA'!J32)","v":""}]
[{"$f":"IF(कार्मिक_विवरण[NAME]=\"\",\"\",ROWS($A$2:A31))","v":""},{"$f":"IF('शालादर्पण कार्मिक DATA'!A33=\"\",\"\",'शालादर्पण कार्मिक DATA'!A33)","v":""},{"$f":"UPPER(IF('शालादर्पण कार्मिक DATA'!F33=\"\",\"\",'शालादर्पण कार्मिक DATA'!F33))","v":""},{"$f":"IF('शालादर्पण कार्मिक DATA'!E33=\"\",\"\",'शालादर्पण कार्मिक DATA'!E33)","v":""},{"$f":"IF('शालादर्पण कार्मिक DATA'!K33=\"\",\"\",'शालादर्पण कार्मिक DATA'!K33)","v":""},{"$f":"IF('शालादर्पण कार्मिक DATA'!B33=\"\",\"\",'शालादर्पण कार्मिक DATA'!B33)","v":""},{"$nulls":5},{"$f":"IF('शालादर्पण कार्मिक DATA'!J33=\"\",\"\",'शालादर्पण कार्मिक DATA'!J33)","v":""}]
[{"$f":"IF(कार्मिक_विवरण[NAME]=\"\",\"\",ROWS($A$2:A32))","v":""},{"$f":"IF('शालादर्पण कार्मिक DATA'!A34=\"\",\"\",'शालादर्पण कार्मिक DATA'!A34)","v":""},{"$f":"UPPER(IF('शालादर्पण कार्मिक DATA'!F34=\"\",\"\",'शालादर्पण कार्मिक DATA'!F34))","v":""},{"$f":"IF('शालादर्पण कार्मिक DATA'!E34=\"\",\"\",'शालादर्पण कार्मिक DATA'!E34)","v":""},{"$f":"IF('शालादर्पण कार्मिक DATA'!K34=\"\",\"\",'शालादर्पण कार्मिक DATA'!K34)","v":""},{"$f":"IF('शालादर्पण कार्मिक DATA'!B34=\"\",\"\",'शालादर्पण कार्मिक DATA'!B34)","v":""},{"$nulls":5},{"$f":"IF('शालादर्पण कार्मिक DATA'!J34=\"\",\"\",'शालादर्पण कार्मिक DATA'!J34)","v":""}]
[{"$f":"IF(कार्मिक_विवरण[NAME]=\"\",\"\",ROWS($A$2:A33))","v":""},{"$f":"IF('शालादर्पण कार्मिक DATA'!A35=\"\",\"\",'शालादर्पण कार्मिक DATA'!A35)","v":""},{"$f":"UPPER(IF('शालादर्पण कार्मिक DATA'!F35=\"\",\"\",'शालादर्पण कार्मिक DATA'!F35))","v":""},{"$f":"IF('शालादर्पण कार्मिक DATA'!E35=\"\",\"\",'शालादर्पण कार्मिक DATA'!E35)","v":""},{"$f":"IF('शालादर्पण कार्मिक DATA'!K35=\"\",\"\",'शालादर्पण कार्मिक DATA'!K35)","v":""},{"$f":"IF('शालादर्पण कार्मिक DATA'!B35=\"\",\"\",'शालादर्पण कार्मिक DATA'!B35)","v":""},{"$nulls":5},{"$f":"IF('शालादर्पण कार्मिक DATA'!J35=\"\",\"\",'शालादर्पण कार्मिक DATA'!J35)","v":""}]
[{"$f":"IF(कार्मिक_विवरण[NAME]=\"\",\"\",ROWS($A$2:A34))","v":""},{"$f":"IF('शालादर्पण कार्मिक DATA'!A36=\"\",\"\",'शालादर्पण कार्मिक DATA'!A36)","v":""},{"$f":"UPPER(IF('शालादर्पण कार्मिक DATA'!F36=\"\",\"\",'शालादर्पण कार्मिक DATA'!F36))","v":""},{"$f":"IF('शालादर्पण कार्मिक DATA'!E36=\"\",\"\",'शालादर्पण कार्मिक DATA'!E36)","v":""},{"$f":"IF('शालादर्पण कार्मिक DATA'!K36=\"\",\"\",'शालादर्पण कार्मिक DATA'!K36)","v":""},{"$f":"IF('शालादर्पण कार्मिक DATA'!B36=\"\",\"\",'शालादर्पण कार्मिक DATA'!B36)","v":""},{"$nulls":5},{"$f":"IF('शालादर्पण कार्मिक DATA'!J36=\"\",\"\",'शालादर्पण कार्मिक DATA'!J36)","v":""}]
[{"$f":"IF(कार्मिक_विवरण[NAME]=\"\",\"\",ROWS($A$2:A35))","v":""},{"$f":"IF('शालादर्पण कार्मिक DATA'!A37=\"\",\"\",'शालादर्पण कार्मिक DATA'!A37)","v":""},{"$f":"UPPER(IF('शालादर्पण कार्मिक DATA'!F37=\"\",\"\",'शालादर्पण कार्मिक DATA'!F37))","v":""},{"$f":"IF('शालादर्पण कार्मिक DATA'!E37=\"\",\"\",'शालादर्पण कार्मिक DATA'!E37)","v":""},{"$f":"IF('शालादर्पण कार्मिक DATA'!K37=\"\",\"\",'शालादर्पण कार्मिक DATA'!K37)","v":""},{"$f":"IF('शालादर्पण कार्मिक DATA'!B37=\"\",\"\",'शालादर्पण कार्मिक DATA'!B37)","v":""},{"$nulls":5},{"$f":"IF('शालादर्पण कार्मिक DATA'!J37=\"\",\"\",'शालादर्पण कार्मिक DATA'!J37)","v":""}]
[{"$f":"IF(कार्मिक_विवरण[NAME]=\"\",\"\",ROWS($A$2:A36))","v":""},{"$f":"IF('शालादर्पण कार्मिक DATA'!A38=\"\",\"\",'शालादर्पण कार्मिक DATA'!A38)","v":""},{"$f":"UPPER(IF('शालादर्पण कार्मिक DATA'!F38=\"\",\"\",'शालादर्पण कार्मिक DATA'!F38))","v":""},{"$f":"IF('शालादर्पण कार्मिक DATA'!E38=\"\",\"\",'शालादर्पण कार्मिक DATA'!E38)","v":""},{"$f":"IF('शालादर्पण कार्मिक DATA'!K38=\"\",\"\",'शालादर्पण कार्मिक DATA'!K38)","v":""},{"$f":"IF('शालादर्पण कार्मिक DATA'!B38=\"\",\"\",'शालादर्पण कार्मिक DATA'!B38)","v":""},{"$nulls":5},{"$f":"IF('शालादर्पण कार्मिक DATA'!J38=\"\",\"\",'शालादर्पण कार्मिक DATA'!J38)","v":""}]
[{"$f":"IF(कार्मिक_विवरण[NAME]=\"\",\"\",ROWS($A$2:A37))","v":""},{"$f":"IF('शालादर्पण कार्मिक DATA'!A39=\"\",\"\",'शालादर्पण कार्मिक DATA'!A39)","v":""},{"$f":"UPPER(IF('शालादर्पण कार्मिक DATA'!F39=\"\",\"\",'शालादर्पण कार्मिक DATA'!F39))","v":""},{"$f":"IF('शालादर्पण कार्मिक DATA'!E39=\"\",\"\",'शालादर्पण कार्मिक DATA'!E39)","v":""},{"$f":"IF('शालादर्पण कार्मिक DATA'!K39=\"\",\"\",'शालादर्पण कार्मिक DATA'!K39)","v":""},{"$f":"IF('शालादर्पण कार्मिक DATA'!B39=\"\",\"\",'शालादर्पण कार्मिक DATA'!B39)","v":""},{"$nulls":5},{"$f":"IF('शालादर्पण कार्मिक DATA'!J39=\"\",\"\",'शालादर्पण कार्मिक DATA'!J39)","v":""}]
[{"$f":"IF(कार्मिक_विवरण[NAME]=\"\",\"\",ROWS($A$2:A38))","v":""},{"$f":"IF('शालादर्पण कार्मिक DATA'!A40=\"\",\"\",'शालादर्पण कार्मिक DATA'!A40)","v":""},{"$f":"UPPER(IF('शालादर्पण कार्मिक DATA'!F40=\"\",\"\",'शालादर्पण कार्मिक DATA'!F40))","v":""},{"$f":"IF('शालादर्पण कार्मिक DATA'!E40=\"\",\"\",'शालादर्पण कार्मिक DATA'!E40)","v":""},{"$f":"IF('शालादर्पण कार्मिक DATA'!K40=\"\",\"\",'शालादर्पण कार्मिक DATA'!K40)","v":""},{"$f":"IF('शालादर्पण कार्मिक DATA'!B40=\"\",\"\",'शालादर्पण कार्मिक DATA'!B40)","v":""},{"$nulls":5},{"$f":"IF('शालादर्पण कार्मिक DATA'!J40=\"\",\"\",'शालादर्पण कार्मिक DATA'!J40)","v":""}]
[{"$f":"IF(कार्मिक_विवरण[NAME]=\"\",\"\",ROWS($A$2:A39))","v":""},{"$f":"IF('शालादर्पण कार्मिक DATA'!A41=\"\",\"\",'शालादर्पण कार्मिक DATA'!A41)","v":""},{"$f":"UPPER(IF('शालादर्पण कार्मिक DATA'!F41=\"\",\"\",'शालादर्पण कार्मिक DATA'!F41))","v":""},{"$f":"IF('शालादर्पण कार्मिक DATA'!E41=\"\",\"\",'शालादर्पण कार्मिक DATA'!E41)","v":""},{"$f":"IF('शालादर्पण कार्मिक DATA'!K41=\"\",\"\",'शालादर्पण कार्मिक DATA'!K41)","v":""},{"$f":"IF('शालादर्पण कार्मिक DATA'!B41=\"\",\"\",'शालादर्पण कार्मिक DATA'!B41)","v":""},{"$nulls":5},{"$f":"IF('शालादर्पण कार्मिक DATA'!J41=\"\",\"\",'शालादर्पण कार्मिक DATA'!J41)","v":""}]
[{"$f":"IF(कार्मिक_विवरण[NAME]=\"\",\"\",ROWS($A$2:A40))","v":""},{"$f":"IF('शालादर्पण कार्मिक DATA'!A42=\"\",\"\",'शालादर्पण कार्मिक DATA'!A42)","v":""},{"$f":"UPPER(IF('शालादर्पण कार्मिक DATA'!F42=\"\",\"\",'शालादर्पण कार्मिक DATA'!F42))","v":""},{"$f":"IF('शालादर्पण कार्मिक DATA'!E42=\"\",\"\",'शालादर्पण कार्मिक DATA'!E42)","v":""},{"$f":"IF('शालादर्पण कार्मिक DATA'!K42=\"\",\"\",'शालादर्पण कार्मिक DATA'!K42)","v":""},{"$f":"IF('शालादर्पण कार्मिक DATA'!B42=\"\",\"\",'शालादर्पण कार्मिक DATA'!B42)","v":""},{"$nulls":5},{"$f":"IF('शालादर्पण कार्मिक DATA'!J42=\"\",\"\",'शालादर्पण कार्मिक DATA'!J42)","v":""}]
[{"$f":"IF(कार्मिक_विवरण[NAME]=\"\",\"\",ROWS($A$2:A41))","v":""},{"$f":"IF('शालादर्पण कार्मिक DATA'!A43=\"\",\"\",'शालादर्पण कार्मिक DATA'!A43)","v":""},{"$f":"UPPER(IF('शालादर्पण कार्मिक DATA'!F43=\"\",\"\",'शालादर्पण कार्मिक DATA'!F43))","v":""},{"$f":"IF('शालादर्पण कार्मिक DATA'!E43=\"\",\"\",'शालादर्पण कार्मिक DATA'!E43)","v":""},{"$f":"IF('शालादर्पण कार्मिक DATA'!K43=\"\",\"\",'शालादर्पण कार्मिक DATA'!K43)","v":""},{"$f":"IF('शालादर्पण कार्मिक DATA'!B43=\"\",\"\",'शालादर्पण कार्मिक DATA'!B43)","v":""},{"$nulls":5},{"$f":"IF('शालादर्पण कार्मिक DATA'!J43=\"\",\"\",'शालादर्पण कार्मिक DATA'!J43)","v":""}]
[{"$f":"IF(कार्मिक_विवरण[NAME]=\"\",\"\",ROWS($A$2:A42))","v":""},{"$f":"IF('शालादर्पण कार्मिक DATA'!A44=\"\",\"\",'शालादर्पण कार्मिक DATA'!A44)","v":""},{"$f":"UPPER(IF('शालादर्पण कार्मिक DATA'!F44=\"\",\"\",'शालादर्पण कार्मिक DATA'!F44))","v":""},{"$f":"IF('शालादर्पण कार्मिक DATA'!E44=\"\",\"\",'शालादर्पण कार्मिक DATA'!E44)","v":""},{"$f":"IF('शालादर्पण कार्मिक DATA'!K44=\"\",\"\",'शालादर्पण कार्मिक DATA'!K44)","v":""},{"$f":"IF('शालादर्पण कार्मिक DATA'!B44=\"\",\"\",'शालादर्पण कार्मिक DATA'!B44)","v":""},{"$nulls":5},{"$f":"IF('शालादर्पण कार्मिक DATA'!J44=\"\",\"\",'शालादर्पण कार्मिक DATA'!J44)","v":""}]
[{"$f":"IF(कार्मिक_विवरण[NAME]=\"\",\"\",ROWS($A$2:A43))","v":""},{"$f":"IF('शालादर्पण कार्मिक DATA'!A45=\"\",\"\",'शालादर्पण कार्मिक DATA'!A45)","v":""},{"$f":"UPPER(IF('शालादर्पण कार्मिक DATA'!F45=\"\",\"\",'शालादर्पण कार्मिक DATA'!F45))","v":""},{"$f":"IF('शालादर्पण कार्मिक DATA'!E45=\"\",\"\",'शालादर्पण कार्मिक DATA'!E45)","v":""},{"$f":"IF('शालादर्पण कार्मिक DATA'!K45=\"\",\"\",'शालादर्पण कार्मिक DATA'!K45)","v":""},{"$f":"IF('शालादर्पण कार्मिक DATA'!B45=\"\",\"\",'शालादर्पण कार्मिक DATA'!B45)","v":""},{"$nulls":5},{"$f":"IF('शालादर्पण कार्मिक DATA'!J45=\"\",\"\",'शालादर्पण कार्मिक DATA'!J45)","v":""}]
[{"$f":"IF(कार्मिक_विवरण[NAME]=\"\",\"\",ROWS($A$2:A44))","v":""},{"$f":"IF('शालादर्पण कार्मिक DATA'!A46=\"\",\"\",'शालादर्पण कार्मिक DATA'!A46)","v":""},{"$f":"UPPER(IF('शालादर्पण कार्मिक DATA'!F46=\"\",\"\",'शालादर्पण कार्मिक DATA'!F46))","v":""},{"$f":"IF('शालादर्पण कार्मिक DATA'!E46=\"\",\"\",'शालादर्पण कार्मिक DATA'!E46)","v":""},{"$f":"IF('शालादर्पण कार्मिक DATA'!K46=\"\",\"\",'शालादर्पण कार्मिक DATA'!K46)","v":""},{"$f":"IF('शालादर्पण कार्मिक DATA'!B46=\"\",\"\",'शालादर्पण कार्मिक DATA'!B46)","v":""},{"$nulls":5},{"$f":"IF('शालादर्पण कार्मिक DATA'!J46=\"\",\"\",'शालादर्पण कार्मिक DATA'!J46)","v":""}]
[{"$f":"IF(कार्मिक_विवरण[NAME]=\"\",\"\",ROWS($A$2:A45))","v":""},{"$f":"IF('शालादर्पण कार्मिक DATA'!A47=\"\",\"\",'शालादर्पण कार्मिक DATA'!A47)","v":""},{"$f":"UPPER(IF('शालादर्पण कार्मिक DATA'!F47=\"\",\"\",'शालादर्पण कार्मिक DATA'!F47))","v":""},{"$f":"IF('शालादर्पण कार्मिक DATA'!E47=\"\",\"\",'शालादर्पण कार्मिक DATA'!E47)","v":""},{"$f":"IF('शालादर्पण कार्मिक DATA'!K47=\"\",\"\",'शालादर्पण कार्मिक DATA'!K47)","v":""},{"$f":"IF('शालादर्पण कार्मिक DATA'!B47=\"\",\"\",'शालादर्पण कार्मिक DATA'!B47)","v":""},{"$nulls":5},{"$f":"IF('शालादर्पण कार्मिक DATA'!J47=\"\",\"\",'शालादर्पण कार्मिक DATA'!J47)","v":""}]
[{"$f":"IF(कार्मिक_विवरण[NAME]=\"\",\"\",ROWS($A$2:A46))","v":""},{"$f":"IF('शालादर्पण कार्मिक DATA'!A48=\"\",\"\",'शालादर्पण कार्मिक DATA'!A48)","v":""},{"$f":"UPPER(IF('शालादर्पण कार्मिक DATA'!F48=\"\",\"\",'शालादर्पण कार्मिक DATA'!F48))","v":""},{"$f":"IF('शालादर्पण कार्मिक DATA'!E48=\"\",\"\",'शालादर्पण कार्मिक DATA'!E48)","v":""},{"$f":"IF('शालादर्पण कार्मिक DATA'!K48=\"\",\"\",'शालादर्पण कार्मिक DATA'!K48)","v":""},{"$f":"IF('शालादर्पण कार्मिक DATA'!B48=\"\",\"\",'शालादर्पण कार्मिक DATA'!B48)","v":""},{"$nulls":5},{"$f":"IF('शालादर्पण कार्मिक DATA'!J48=\"\",\"\",'शालादर्पण कार्मिक DATA'!J48)","v":""}]
[{"$f":"IF(कार्मिक_विवरण[NAME]=\"\",\"\",ROWS($A$2:A47))","v":""},{"$f":"IF('शालादर्पण कार्मिक DATA'!A49=\"\",\"\",'शालादर्पण कार्मिक DATA'!A49)","v":""},{"$f":"UPPER(IF('शालादर्पण कार्मिक DATA'!F49=\"\",\"\",'शालादर्पण कार्मिक DATA'!F49))","v":""},{"$f":"IF('शालादर्पण कार्मिक DATA'!E49=\"\",\"\",'शालादर्पण कार्मिक DATA'!E49)","v":""},{"$f":"IF('शालादर्पण कार्मिक DATA'!K49=\"\",\"\",'शालादर्पण कार्मिक DATA'!K49)","v":""},{"$f":"IF('शालादर्पण कार्मिक DATA'!B49=\"\",\"\",'शालादर्पण कार्मिक DATA'!B49)","v":""},{"$nulls":5},{"$f":"IF('शालादर्पण कार्मिक DATA'!J49=\"\",\"\",'शालादर्पण कार्मिक DATA'!J49)","v":""}]
[{"$f":"IF(कार्मिक_विवरण[NAME]=\"\",\"\",ROWS($A$2:A48))","v":""},{"$f":"IF('शालादर्पण कार्मिक DATA'!A50=\"\",\"\",'शालादर्पण कार्मिक DATA'!A50)","v":""},{"$f":"UPPER(IF('शालादर्पण कार्मिक DATA'!F50=\"\",\"\",'शालादर्पण कार्मिक DATA'!F50))","v":""},{"$f":"IF('शालादर्पण कार्मिक DATA'!E50=\"\",\"\",'शालादर्पण कार्मिक DATA'!E50)","v":""},{"$f":"IF('शालादर्पण कार्मिक DATA'!K50=\"\",\"\",'शालादर्पण कार्मिक DATA'!K50)","v":""},{"$f":"IF('शालादर्पण कार्मिक DATA'!B50=\"\",\"\",'शालादर्पण कार्मिक DATA'!B50)","v":""},{"$nulls":5},{"$f":"IF('शालादर्पण कार्मिक DATA'!J50=\"\",\"\",'शालादर्पण कार्मिक DATA'!J50)","v":""}]
[{"$f":"IF(कार्मिक_विवरण[NAME]=\"\",\"\",ROWS($A$2:A49))","v":""},{"$f":"IF('शालादर्पण कार्मिक DATA'!A51=\"\",\"\",'शालादर्पण कार्मिक DATA'!A51)","v":""},{"$f":"UPPER(IF('शालादर्पण कार्मिक DATA'!F51=\"\",\"\",'शालादर्पण कार्मिक DATA'!F51))","v":""},{"$f":"IF('शालादर्पण कार्मिक DATA'!E51=\"\",\"\",'शालादर्पण कार्मिक DATA'!E51)","v":""},{"$f":"IF('शालादर्पण कार्मिक DATA'!K51=\"\",\"\",'शालादर्पण कार्मिक DATA'!K51)","v":""},{"$f":"IF('शालादर्पण कार्मिक DATA'!B51=\"\",\"\",'शालादर्पण कार्मिक DATA'!B51)","v":""},{"$nulls":5},{"$f":"IF('शालादर्पण कार्मिक DATA'!J51=\"\",\"\",'शालादर्पण कार्मिक DATA'!J51)","v":""}]
[{"$f":"IF(कार्मिक_विवरण[NAME]=\"\",\"\",ROWS($A$2:A50))","v":""},{"$f":"IF('शालादर्पण कार्मिक DATA'!A52=\"\",\"\",'शालादर्पण कार्मिक DATA'!A52)","v":""},{"$f":"UPPER(IF('शालादर्पण कार्मिक DATA'!F52=\"\",\"\",'शालादर्पण कार्मिक DATA'!F52))","v":""},{"$f":"IF('शालादर्पण कार्मिक DATA'!E52=\"\",\"\",'शालादर्पण कार्मिक DATA'!E52)","v":""},{"$f":"IF('शालादर्पण कार्मिक DATA'!K52=\"\",\"\",'शालादर्पण कार्मिक DATA'!K52)","v":""},{"$f":"IF('शालादर्पण कार्मिक DATA'!B52=\"\",\"\",'शालादर्पण कार्मिक DATA'!B52)","v":""},{"$nulls":5},{"$f":"IF('शालादर्पण कार्मिक DATA'!J52=\"\",\"\",'शालादर्पण कार्मिक DATA'!J52)","v":""}]
[{"$f":"IF(कार्मिक_विवरण[NAME]=\"\",\"\",ROWS($A$2:A51))","v":""},{"$f":"IF('शालादर्पण कार्मिक DATA'!A53=\"\",\"\",'शालादर्पण कार्मिक DATA'!A53)","v":""},{"$f":"UPPER(IF('शालादर्पण कार्मिक DATA'!F53=\"\",\"\",'शालादर्पण कार्मिक DATA'!F53))","v":""},{"$f":"IF('शालादर्पण कार्मिक DATA'!E53=\"\",\"\",'शालादर्पण कार्मिक DATA'!E53)","v":""},{"$f":"IF('शालादर्पण कार्मिक DATA'!K53=\"\",\"\",'शालादर्पण कार्मिक DATA'!K53)","v":""},{"$f":"IF('शालादर्पण कार्मिक DATA'!B53=\"\",\"\",'शालादर्पण कार्मिक DATA'!B53)","v":""},{"$nulls":5},{"$f":"IF('शालादर्पण कार्मिक DATA'!J53=\"\",\"\",'शालादर्पण कार्मिक DATA'!J53)","v":""}]
[{"$f":"IF(कार्मिक_विवरण[NAME]=\"\",\"\",ROWS($A$2:A52))","v":""},{"$f":"IF('शालादर्पण कार्मिक DATA'!A54=\"\",\"\",'शालादर्पण कार्मिक DATA'!A54)","v":""},{"$f":"UPPER(IF('शालादर्पण कार्मिक DATA'!F54=\"\",\"\",'शालादर्पण कार्मिक DATA'!F54))","v":""},{"$f":"IF('शालादर्पण कार्मिक DATA'!E54=\"\",\"\",'शालादर्पण कार्मिक DATA'!E54)","v":""},{"$f":"IF('शालादर्पण कार्मिक DATA'!K54=\"\",\"\",'शालादर्पण कार्मिक DATA'!K54)","v":""},{"$f":"IF('शालादर्पण कार्मिक DATA'!B54=\"\",\"\",'शालादर्पण कार्मिक DATA'!B54)","v":""},{"$nulls":5},{"$f":"IF('शालादर्पण कार्मिक DATA'!J54=\"\",\"\",'शालादर्पण कार्मिक DATA'!J54)","v":""}]
[{"$f":"IF(कार्मिक_विवरण[NAME]=\"\",\"\",ROWS($A$2:A53))","v":""},{"$f":"IF('शालादर्पण कार्मिक DATA'!A55=\"\",\"\",'शालादर्पण कार्मिक DATA'!A55)","v":""},{"$f":"UPPER(IF('शालादर्पण कार्मिक DATA'!F55=\"\",\"\",'शालादर्पण कार्मिक DATA'!F55))","v":""},{"$f":"IF('शालादर्पण कार्मिक DATA'!E55=\"\",\"\",'शालादर्पण कार्मिक DATA'!E55)","v":""},{"$f":"IF('शालादर्पण कार्मिक DATA'!K55=\"\",\"\",'शालादर्पण कार्मिक DATA'!K55)","v":""},{"$f":"IF('शालादर्पण कार्मिक DATA'!B55=\"\",\"\",'शालादर्पण कार्मिक DATA'!B55)","v":""},{"$nulls":5},{"$f":"IF('शालादर्पण कार्मिक DATA'!J55=\"\",\"\",'शालादर्पण कार्मिक DATA'!J55)","v":""}]
[{"$f":"IF(कार्मिक_विवरण[NAME]=\"\",\"\",ROWS($A$2:A54))","v":""},{"$f":"IF('शालादर्पण कार्मिक DATA'!A56=\"\",\"\",'शालादर्पण कार्मिक DATA'!A56)","v":""},{"$f":"UPPER(IF('शालादर्पण कार्मिक DATA'!F56=\"\",\"\",'शालादर्पण कार्मिक DATA'!F56))","v":""},{"$f":"IF('शालादर्पण कार्मिक DATA'!E56=\"\",\"\",'शालादर्पण कार्मिक DATA'!E56)","v":""},{"$f":"IF('शालादर्पण कार्मिक DATA'!K56=\"\",\"\",'शालादर्पण कार्मिक DATA'!K56)","v":""},{"$f":"IF('शालादर्पण कार्मिक DATA'!B56=\"\",\"\",'शालादर्पण कार्मिक DATA'!B56)","v":""},{"$nulls":5},{"$f":"IF('शालादर्पण कार्मिक DATA'!J56=\"\",\"\",'शालादर्पण कार्मिक DATA'!J56)","v":""}]
[{"$f":"IF(कार्मिक_विवरण[NAME]=\"\",\"\",ROWS($A$2:A55))","v":""},{"$f":"IF('शालादर्पण कार्मिक DATA'!A57=\"\",\"\",'शालादर्पण कार्मिक DATA'!A57)","v":""},{"$f":"UPPER(IF('शालादर्पण कार्मिक DATA'!F57=\"\",\"\",'शालादर्पण कार्मिक DATA'!F57))","v":""},{"$f":"IF('शालादर्पण कार्मिक DATA'!E57=\"\",\"\",'शालादर्पण कार्मिक DATA'!E57)","v":""},{"$f":"IF('शालादर्पण कार्मिक DATA'!K57=\"\",\"\",'शालादर्पण कार्मिक DATA'!K57)","v":""},{"$f":"IF('शालादर्पण कार्मिक DATA'!B57=\"\",\"\",'शालादर्पण कार्मिक DATA'!B57)","v":""},{"$nulls":5},{"$f":"IF('शालादर्पण कार्मिक DATA'!J57=\"\",\"\",'शालादर्पण कार्मिक DATA'!J57)","v":""}]
[{"$f":"IF(कार्मिक_विवरण[NAME]=\"\",\"\",ROWS($A$2:A56))","v":""},{"$f":"IF('शालादर्पण कार्मिक DATA'!A58=\"\",\"\",'शालादर्पण कार्मिक DATA'!A58)","v":""},{"$f":"UPPER(IF('शालादर्पण कार्मिक DATA'!F58=\"\",\"\",'शालादर्पण कार्मिक DATA'!F58))","v":""},{"$f":"IF('शालादर्पण कार्मिक DATA'!E58=\"\",\"\",'शालादर्पण कार्मिक DATA'!E58)","v":""},{"$f":"IF('शालादर्पण कार्मिक DATA'!K58=\"\",\"\",'शालादर्पण कार्मिक DATA'!K58)","v":""},{"$f":"IF('शालादर्पण कार्मिक DATA'!B58=\"\",\"\",'शालादर्पण कार्मिक DATA'!B58)","v":""},{"$nulls":5},{"$f":"IF('शालादर्पण कार्मिक DATA'!J58=\"\",\"\",'शालादर्पण कार्मिक DATA'!J58)","v":""}]
[{"$f":"IF(कार्मिक_विवरण[NAME]=\"\",\"\",ROWS($A$2:A57))","v":""},{"$f":"IF('शालादर्पण कार्मिक DATA'!A59=\"\",\"\",'शालादर्पण कार्मिक DATA'!A59)","v":""},{"$f":"UPPER(IF('शालादर्पण कार्मिक DATA'!F59=\"\",\"\",'शालादर्पण कार्मिक DATA'!F59))","v":""},{"$f":"IF('शालादर्पण कार्मिक DATA'!E59=\"\",\"\",'शालादर्पण कार्मिक DATA'!E59)","v":""},{"$f":"IF('शालादर्पण कार्मिक DATA'!K59=\"\",\"\",'शालादर्पण कार्मिक DATA'!K59)","v":""},{"$f":"IF('शालादर्पण कार्मिक DATA'!B59=\"\",\"\",'शालादर्पण कार्मिक DATA'!B59)","v":""},{"$nulls":5},{"$f":"IF('शालादर्पण कार्मिक DATA'!J59=\"\",\"\",'शालादर्पण कार्मिक DATA'!J59)","v":""}]
[{"$f":"IF(कार्मिक_विवरण[NAME]=\"\",\"\",ROWS($A$2:A58))","v":""},{"$f":"IF('शालादर्पण कार्मिक DATA'!A60=\"\",\"\",'शालादर्पण कार्मिक DATA'!A60)","v":""},{"$f":"UPPER(IF('शालादर्पण कार्मिक DATA'!F60=\"\",\"\",'शालादर्पण कार्मिक DATA'!F60))","v":""},{"$f":"IF('शालादर्पण कार्मिक DATA'!E60=\"\",\"\",'शालादर्पण कार्मिक DATA'!E60)","v":""},{"$f":"IF('शालादर्पण कार्मिक DATA'!K60=\"\",\"\",'शालादर्पण कार्मिक DATA'!K60)","v":""},{"$f":"IF('शालादर्पण कार्मिक DATA'!B60=\"\",\"\",'शालादर्पण कार्मिक DATA'!B60)","v":""},{"$nulls":5},{"$f":"IF('शालादर्पण कार्मिक DATA'!J60=\"\",\"\",'शालादर्पण कार्मिक DATA'!J60)","v":""}]
[{"$f":"IF(कार्मिक_विवरण[NAME]=\"\",\"\",ROWS($A$2:A59))","v":""},{"$f":"IF('शालादर्पण कार्मिक DATA'!A61=\"\",\"\",'शालादर्पण कार्मिक DATA'!A61)","v":""},{"$f":"UPPER(IF('शालादर्पण कार्मिक DATA'!F61=\"\",\"\",'शालादर्पण कार्मिक DATA'!F61))","v":""},{"$f":"IF('शालादर्पण कार्मिक DATA'!E61=\"\",\"\",'शालादर्पण कार्मिक DATA'!E61)","v":""},{"$f":"IF('शालादर्पण कार्मिक DATA'!K61=\"\",\"\",'शालादर्पण कार्मिक DATA'!K61)","v":""},{"$f":"IF('शालादर्पण कार्मिक DATA'!B61=\"\",\"\",'शालादर्पण कार्मिक DATA'!B61)","v":""},{"$nulls":5},{"$f":"IF('शालादर्पण कार्मिक DATA'!J61=\"\",\"\",'शालादर्पण कार्मिक DATA'!J61)","v":""}]
[{"$f":"IF(कार्मिक_विवरण[NAME]=\"\",\"\",ROWS($A$2:A60))","v":""},{"$f":"IF('शालादर्पण कार्मिक DATA'!A62=\"\",\"\",'शालादर्पण कार्मिक DATA'!A62)","v":""},{"$f":"UPPER(IF('शालादर्पण कार्मिक DATA'!F62=\"\",\"\",'शालादर्पण कार्मिक DATA'!F62))","v":""},{"$f":"IF('शालादर्पण कार्मिक DATA'!E62=\"\",\"\",'शालादर्पण कार्मिक DATA'!E62)","v":""},{"$f":"IF('शालादर्पण कार्मिक DATA'!K62=\"\",\"\",'शालादर्पण कार्मिक DATA'!K62)","v":""},{"$f":"IF('शालादर्पण कार्मिक DATA'!B62=\"\",\"\",'शालादर्पण कार्मिक DATA'!B62)","v":""},{"$nulls":5},{"$f":"IF('शालादर्पण कार्मिक DATA'!J62=\"\",\"\",'शालादर्पण कार्मिक DATA'!J62)","v":""}]
[{"$f":"IF(कार्मिक_विवरण[NAME]=\"\",\"\",ROWS($A$2:A61))","v":""},{"$f":"IF('शालादर्पण कार्मिक DATA'!A63=\"\",\"\",'शालादर्पण कार्मिक DATA'!A63)","v":""},{"$f":"UPPER(IF('शालादर्पण कार्मिक DATA'!F63=\"\",\"\",'शालादर्पण कार्मिक DATA'!F63))","v":""},{"$f":"IF('शालादर्पण कार्मिक DATA'!E63=\"\",\"\",'शालादर्पण कार्मिक DATA'!E63)","v":""},{"$f":"IF('शालादर्पण कार्मिक DATA'!K63=\"\",\"\",'शालादर्पण कार्मिक DATA'!K63)","v":""},{"$f":"IF('शालादर्पण कार्मिक DATA'!B63=\"\",\"\",'शालादर्पण कार्मिक DATA'!B63)","v":""},{"$nulls":5},{"$f":"IF('शालादर्पण कार्मिक DATA'!J63=\"\",\"\",'शालादर्पण कार्मिक DATA'!J63)","v":""}]
[{"$f":"IF(कार्मिक_विवरण[NAME]=\"\",\"\",ROWS($A$2:A62))","v":""},{"$f":"IF('शालादर्पण कार्मिक DATA'!A64=\"\",\"\",'शालादर्पण कार्मिक DATA'!A64)","v":""},{"$f":"UPPER(IF('शालादर्पण कार्मिक DATA'!F64=\"\",\"\",'शालादर्पण कार्मिक DATA'!F64))","v":""},{"$f":"IF('शालादर्पण कार्मिक DATA'!E64=\"\",\"\",'शालादर्पण कार्मिक DATA'!E64)","v":""},{"$f":"IF('शालादर्पण कार्मिक DATA'!K64=\"\",\"\",'शालादर्पण कार्मिक DATA'!K64)","v":""},{"$f":"IF('शालादर्पण कार्मिक DATA'!B64=\"\",\"\",'शालादर्पण कार्मिक DATA'!B64)","v":""},{"$nulls":5},{"$f":"IF('शालादर्पण कार्मिक DATA'!J64=\"\",\"\",'शालादर्पण कार्मिक DATA'!J64)","v":""}]
[{"$f":"IF(कार्मिक_विवरण[NAME]=\"\",\"\",ROWS($A$2:A63))","v":""},{"$f":"IF('शालादर्पण कार्मिक DATA'!A65=\"\",\"\",'शालादर्पण कार्मिक DATA'!A65)","v":""},{"$f":"UPPER(IF('शालादर्पण कार्मिक DATA'!F65=\"\",\"\",'शालादर्पण कार्मिक DATA'!F65))","v":""},{"$f":"IF('शालादर्पण कार्मिक DATA'!E65=\"\",\"\",'शालादर्पण कार्मिक DATA'!E65)","v":""},{"$f":"IF('शालादर्पण कार्मिक DATA'!K65=\"\",\"\",'शालादर्पण कार्मिक DATA'!K65)","v":""},{"$f":"IF('शालादर्पण कार्मिक DATA'!B65=\"\",\"\",'शालादर्पण कार्मिक DATA'!B65)","v":""},{"$nulls":5},{"$f":"IF('शालादर्पण कार्मिक DATA'!J65=\"\",\"\",'शालादर्पण कार्मिक DATA'!J65)","v":""}]
[{"$f":"IF(कार्मिक_विवरण[NAME]=\"\",\"\",ROWS($A$2:A64))","v":""},{"$f":"IF('शालादर्पण कार्मिक DATA'!A66=\"\",\"\",'शालादर्पण कार्मिक DATA'!A66)","v":""},{"$f":"UPPER(IF('शालादर्पण कार्मिक DATA'!F66=\"\",\"\",'शालादर्पण कार्मिक DATA'!F66))","v":""},{"$f":"IF('शालादर्पण कार्मिक DATA'!E66=\"\",\"\",'शालादर्पण कार्मिक DATA'!E66)","v":""},{"$f":"IF('शालादर्पण कार्मिक DATA'!K66=\"\",\"\",'शालादर्पण कार्मिक DATA'!K66)","v":""},{"$f":"IF('शालादर्पण कार्मिक DATA'!B66=\"\",\"\",'शालादर्पण कार्मिक DATA'!B66)","v":""},{"$nulls":5},{"$f":"IF('शालादर्पण कार्मिक DATA'!J66=\"\",\"\",'शालादर्पण कार्मिक DATA'!J66)","v":""}]
[{"$f":"IF(कार्मिक_विवरण[NAME]=\"\",\"\",ROWS($A$2:A65))","v":""},{"$f":"IF('शालादर्पण कार्मिक DATA'!A67=\"\",\"\",'शालादर्पण कार्मिक DATA'!A67)","v":""},{"$f":"UPPER(IF('शालादर्पण कार्मिक DATA'!F67=\"\",\"\",'शालादर्पण कार्मिक DATA'!F67))","v":""},{"$f":"IF('शालादर्पण कार्मिक DATA'!E67=\"\",\"\",'शालादर्पण कार्मिक DATA'!E67)","v":""},{"$f":"IF('शालादर्पण कार्मिक DATA'!K67=\"\",\"\",'शालादर्पण कार्मिक DATA'!K67)","v":""},{"$f":"IF('शालादर्पण कार्मिक DATA'!B67=\"\",\"\",'शालादर्पण कार्मिक DATA'!B67)","v":""},{"$nulls":5},{"$f":"IF('शालादर्पण कार्मिक DATA'!J67=\"\",\"\",'शालादर्पण कार्मिक DATA'!J67)","v":""}]
[{"$f":"IF(कार्मिक_विवरण[NAME]=\"\",\"\",ROWS($A$2:A66))","v":""},{"$f":"IF('शालादर्पण कार्मिक DATA'!A68=\"\",\"\",'शालादर्पण कार्मिक DATA'!A68)","v":""},{"$f":"UPPER(IF('शालादर्पण कार्मिक DATA'!F68=\"\",\"\",'शालादर्पण कार्मिक DATA'!F68))","v":""},{"$f":"IF('शालादर्पण कार्मिक DATA'!E68=\"\",\"\",'शालादर्पण कार्मिक DATA'!E68)","v":""},{"$f":"IF('शालादर्पण कार्मिक DATA'!K68=\"\",\"\",'शालादर्पण कार्मिक DATA'!K68)","v":""},{"$f":"IF('शालादर्पण कार्मिक DATA'!B68=\"\",\"\",'शालादर्पण कार्मिक DATA'!B68)","v":""},{"$nulls":5},{"$f":"IF('शालादर्पण कार्मिक DATA'!J68=\"\",\"\",'शालादर्पण कार्मिक DATA'!J68)","v":""}]
[{"$f":"IF(कार्मिक_विवरण[NAME]=\"\",\"\",ROWS($A$2:A67))","v":""},{"$f":"IF('शालादर्पण कार्मिक DATA'!A69=\"\",\"\",'शालादर्पण कार्मिक DATA'!A69)","v":""},{"$f":"UPPER(IF('शालादर्पण कार्मिक DATA'!F69=\"\",\"\",'शालादर्पण कार्मिक DATA'!F69))","v":""},{"$f":"IF('शालादर्पण कार्मिक DATA'!E69=\"\",\"\",'शालादर्पण कार्मिक DATA'!E69)","v":""},{"$f":"IF('शालादर्पण कार्मिक DATA'!K69=\"\",\"\",'शालादर्पण कार्मिक DATA'!K69)","v":""},{"$f":"IF('शालादर्पण कार्मिक DATA'!B69=\"\",\"\",'शालादर्पण कार्मिक DATA'!B69)","v":""},{"$nulls":5},{"$f":"IF('शालादर्पण कार्मिक DATA'!J69=\"\",\"\",'शालादर्पण कार्मिक DATA'!J69)","v":""}]
[{"$f":"IF(कार्मिक_विवरण[NAME]=\"\",\"\",ROWS($A$2:A68))","v":""},{"$f":"IF('शालादर्पण कार्मिक DATA'!A70=\"\",\"\",'शालादर्पण कार्मिक DATA'!A70)","v":""},{"$f":"UPPER(IF('शालादर्पण कार्मिक DATA'!F70=\"\",\"\",'शालादर्पण कार्मिक DATA'!F70))","v":""},{"$f":"IF('शालादर्पण कार्मिक DATA'!E70=\"\",\"\",'शालादर्पण कार्मिक DATA'!E70)","v":""},{"$f":"IF('शालादर्पण कार्मिक DATA'!K70=\"\",\"\",'शालादर्पण कार्मिक DATA'!K70)","v":""},{"$f":"IF('शालादर्पण कार्मिक DATA'!B70=\"\",\"\",'शालादर्पण कार्मिक DATA'!B70)","v":""},{"$nulls":5},{"$f":"IF('शालादर्पण कार्मिक DATA'!J70=\"\",\"\",'शालादर्पण कार्मिक DATA'!J70)","v":""}]
[{"$f":"IF(कार्मिक_विवरण[NAME]=\"\",\"\",ROWS($A$2:A69))","v":""},{"$f":"IF('शालादर्पण कार्मिक DATA'!A71=\"\",\"\",'शालादर्पण कार्मिक DATA'!A71)","v":""},{"$f":"UPPER(IF('शालादर्पण कार्मिक DATA'!F71=\"\",\"\",'शालादर्पण कार्मिक DATA'!F71))","v":""},{"$f":"IF('शालादर्पण कार्मिक DATA'!E71=\"\",\"\",'शालादर्पण कार्मिक DATA'!E71)","v":""},{"$f":"IF('शालादर्पण कार्मिक DATA'!K71=\"\",\"\",'शालादर्पण कार्मिक DATA'!K71)","v":""},{"$f":"IF('शालादर्पण कार्मिक DATA'!B71=\"\",\"\",'शालादर्पण कार्मिक DATA'!B71)","v":""},{"$nulls":5},{"$f":"IF('शालादर्पण कार्मिक DATA'!J71=\"\",\"\",'शालादर्पण कार्मिक DATA'!J71)","v":""}]
[{"$f":"IF(कार्मिक_विवरण[NAME]=\"\",\"\",ROWS($A$2:A70))","v":""},{"$f":"IF('शालादर्पण कार्मिक DATA'!A72=\"\",\"\",'शालादर्पण कार्मिक DATA'!A72)","v":""},{"$f":"UPPER(IF('शालादर्पण कार्मिक DATA'!F72=\"\",\"\",'शालादर्पण कार्मिक DATA'!F72))","v":""},{"$f":"IF('शालादर्पण कार्मिक DATA'!E72=\"\",\"\",'शालादर्पण कार्मिक DATA'!E72)","v":""},{"$f":"IF('शालादर्पण कार्मिक DATA'!K72=\"\",\"\",'शालादर्पण कार्मिक DATA'!K72)","v":""},{"$f":"IF('शालादर्पण कार्मिक DATA'!B72=\"\",\"\",'शालादर्पण कार्मिक DATA'!B72)","v":""},{"$nulls":5},{"$f":"IF('शालादर्पण कार्मिक DATA'!J72=\"\",\"\",'शालादर्पण कार्मिक DATA'!J72)","v":""}]
[{"$f":"IF(कार्मिक_विवरण[NAME]=\"\",\"\",ROWS($A$2:A71))","v":""},{"$f":"IF('शालादर्पण कार्मिक DATA'!A73=\"\",\"\",'शालादर्पण कार्मिक DATA'!A73)","v":""},{"$f":"UPPER(IF('शालादर्पण कार्मिक DATA'!F73=\"\",\"\",'शालादर्पण कार्मिक DATA'!F73))","v":""},{"$f":"IF('शालादर्पण कार्मिक DATA'!E73=\"\",\"\",'शालादर्पण कार्मिक DATA'!E73)","v":""},{"$f":"IF('शालादर्पण कार्मिक DATA'!K73=\"\",\"\",'शालादर्पण कार्मिक DATA'!K73)","v":""},{"$f":"IF('शालादर्पण कार्मिक DATA'!B73=\"\",\"\",'शालादर्पण कार्मिक DATA'!B73)","v":""},{"$nulls":5},{"$f":"IF('शालादर्पण कार्मिक DATA'!J73=\"\",\"\",'शालादर्पण कार्मिक DATA'!J73)","v":""}]
[{"$f":"IF(कार्मिक_विवरण[NAME]=\"\",\"\",ROWS($A$2:A72))","v":""},{"$f":"IF('शालादर्पण कार्मिक DATA'!A74=\"\",\"\",'शालादर्पण कार्मिक DATA'!A74)","v":""},{"$f":"UPPER(IF('शालादर्पण कार्मिक DATA'!F74=\"\",\"\",'शालादर्पण कार्मिक DATA'!F74))","v":""},{"$f":"IF('शालादर्पण कार्मिक DATA'!E74=\"\",\"\",'शालादर्पण कार्मिक DATA'!E74)","v":""},{"$f":"IF('शालादर्पण कार्मिक DATA'!K74=\"\",\"\",'शालादर्पण कार्मिक DATA'!K74)","v":""},{"$f":"IF('शालादर्पण कार्मिक DATA'!B74=\"\",\"\",'शालादर्पण कार्मिक DATA'!B74)","v":""},{"$nulls":5},{"$f":"IF('शालादर्पण कार्मिक DATA'!J74=\"\",\"\",'शालादर्पण कार्मिक DATA'!J74)","v":""}]
[{"$f":"IF(कार्मिक_विवरण[NAME]=\"\",\"\",ROWS($A$2:A73))","v":""},{"$f":"IF('शालादर्पण कार्मिक DATA'!A75=\"\",\"\",'शालादर्पण कार्मिक DATA'!A75)","v":""},{"$f":"UPPER(IF('शालादर्पण कार्मिक DATA'!F75=\"\",\"\",'शालादर्पण कार्मिक DATA'!F75))","v":""},{"$f":"IF('शालादर्पण कार्मिक DATA'!E75=\"\",\"\",'शालादर्पण कार्मिक DATA'!E75)","v":""},{"$f":"IF('शालादर्पण कार्मिक DATA'!K75=\"\",\"\",'शालादर्पण कार्मिक DATA'!K75)","v":""},{"$f":"IF('शालादर्पण कार्मिक DATA'!B75=\"\",\"\",'शालादर्पण कार्मिक DATA'!B75)","v":""},{"$nulls":5},{"$f":"IF('शालादर्पण कार्मिक DATA'!J75=\"\",\"\",'शालादर्पण कार्मिक DATA'!J75)","v":""}]
[{"$f":"IF(कार्मिक_विवरण[NAME]=\"\",\"\",ROWS($A$2:A74))","v":""},{"$f":"IF('शालादर्पण कार्मिक DATA'!A76=\"\",\"\",'शालादर्पण कार्मिक DATA'!A76)","v":""},{"$f":"UPPER(IF('शालादर्पण कार्मिक DATA'!F76=\"\",\"\",'शालादर्पण कार्मिक DATA'!F76))","v":""},{"$f":"IF('शालादर्पण कार्मिक DATA'!E76=\"\",\"\",'शालादर्पण कार्मिक DATA'!E76)","v":""},{"$f":"IF('शालादर्पण कार्मिक DATA'!K76=\"\",\"\",'शालादर्पण कार्मिक DATA'!K76)","v":""},{"$f":"IF('शालादर्पण कार्मिक DATA'!B76=\"\",\"\",'शालादर्पण कार्मिक DATA'!B76)","v":""},{"$nulls":5},{"$f":"IF('शालादर्पण कार्मिक DATA'!J76=\"\",\"\",'शालादर्पण कार्मिक DATA'!J76)","v":""}]
[{"$f":"IF(कार्मिक_विवरण[NAME]=\"\",\"\",ROWS($A$2:A75))","v":""},{"$f":"IF('शालादर्पण कार्मिक DATA'!A77=\"\",\"\",'शालादर्पण कार्मिक DATA'!A77)","v":""},{"$f":"UPPER(IF('शालादर्पण कार्मिक DATA'!F77=\"\",\"\",'शालादर्पण कार्मिक DATA'!F77))","v":""},{"$f":"IF('शालादर्पण कार्मिक DATA'!E77=\"\",\"\",'शालादर्पण कार्मिक DATA'!E77)","v":""},{"$f":"IF('शालादर्पण कार्मिक DATA'!K77=\"\",\"\",'शालादर्पण कार्मिक DATA'!K77)","v":""},{"$f":"IF('शालादर्पण कार्मिक DATA'!B77=\"\",\"\",'शालादर्पण कार्मिक DATA'!B77)","v":""},{"$nulls":5},{"$f":"IF('शालादर्पण कार्मिक DATA'!J77=\"\",\"\",'शालादर्पण कार्मिक DATA'!J77)","v":""}]
[{"$f":"IF(कार्मिक_विवरण[NAME]=\"\",\"\",ROWS($A$2:A76))","v":""},{"$f":"IF('शालादर्पण कार्मिक DATA'!A78=\"\",\"\",'शालादर्पण कार्मिक DATA'!A78)","v":""},{"$f":"UPPER(IF('शालादर्पण कार्मिक DATA'!F78=\"\",\"\",'शालादर्पण कार्मिक DATA'!F78))","v":""},{"$f":"IF('शालादर्पण कार्मिक DATA'!E78=\"\",\"\",'शालादर्पण कार्मिक DATA'!E78)","v":""},{"$f":"IF('शालादर्पण कार्मिक DATA'!K78=\"\",\"\",'शालादर्पण कार्मिक DATA'!K78)","v":""},{"$f":"IF('शालादर्पण कार्मिक DATA'!B78=\"\",\"\",'शालादर्पण कार्मिक DATA'!B78)","v":""},{"$nulls":5},{"$f":"IF('शालादर्पण कार्मिक DATA'!J78=\"\",\"\",'शालादर्पण कार्मिक DATA'!J78)","v":""}]
[{"$f":"IF(कार्मिक_विवरण[NAME]=\"\",\"\",ROWS($A$2:A77))","v":""},{"$f":"IF('शालादर्पण कार्मिक DATA'!A79=\"\",\"\",'शालादर्पण कार्मिक DATA'!A79)","v":""},{"$f":"UPPER(IF('शालादर्पण कार्मिक DATA'!F79=\"\",\"\",'शालादर्पण कार्मिक DATA'!F79))","v":""},{"$f":"IF('शालादर्पण कार्मिक DATA'!E79=\"\",\"\",'शालादर्पण कार्मिक DATA'!E79)","v":""},{"$f":"IF('शालादर्पण कार्मिक DATA'!K79=\"\",\"\",'शालादर्पण कार्मिक DATA'!K79)","v":""},{"$f":"IF('शालादर्पण कार्मिक DATA'!B79=\"\",\"\",'शालादर्पण कार्मिक DATA'!B79)","v":""},{"$nulls":5},{"$f":"IF('शालादर्पण कार्मिक DATA'!J79=\"\",\"\",'शालादर्पण कार्मिक DATA'!J79)","v":""}]
[{"$f":"IF(कार्मिक_विवरण[NAME]=\"\",\"\",ROWS($A$2:A78))","v":""},{"$f":"IF('शालादर्पण कार्मिक DATA'!A80=\"\",\"\",'शालादर्पण कार्मिक DATA'!A80)","v":""},{"$f":"UPPER(IF('शालादर्पण कार्मिक DATA'!F80=\"\",\"\",'शालादर्पण कार्मिक DATA'!F80))","v":""},{"$f":"IF('शालादर्पण कार्मिक DATA'!E80=\"\",\"\",'शालादर्पण कार्मिक DATA'!E80)","v":""},{"$f":"IF('शालादर्पण कार्मिक DATA'!K80=\"\",\"\",'शालादर्पण कार्मिक DATA'!K80)","v":""},{"$f":"IF('शालादर्पण कार्मिक DATA'!B80=\"\",\"\",'शालादर्पण कार्मिक DATA'!B80)","v":""},{"$nulls":5},{"$f":"IF('शालादर्पण कार्मिक DATA'!J80=\"\",\"\",'शालादर्पण कार्मिक DATA'!J80)","v":""}]
[{"$f":"IF(कार्मिक_विवरण[NAME]=\"\",\"\",ROWS($A$2:A79))","v":""},{"$f":"IF('शालादर्पण कार्मिक DATA'!A81=\"\",\"\",'शालादर्पण कार्मिक DATA'!A81)","v":""},{"$f":"UPPER(IF('शालादर्पण कार्मिक DATA'!F81=\"\",\"\",'शालादर्पण कार्मिक DATA'!F81))","v":""},{"$f":"IF('शालादर्पण कार्मिक DATA'!E81=\"\",\"\",'शालादर्पण कार्मिक DATA'!E81)","v":""},{"$f":"IF('शालादर्पण कार्मिक DATA'!K81=\"\",\"\",'शालादर्पण कार्मिक DATA'!K81)","v":""},{"$f":"IF('शालादर्पण कार्मिक DATA'!B81=\"\",\"\",'शालादर्पण कार्मिक DATA'!B81)","v":""},{"$nulls":5},{"$f":"IF('शालादर्पण कार्मिक DATA'!J81=\"\",\"\",'शालादर्पण कार्मिक DATA'!J81)","v":""}]
[{"$f":"IF(कार्मिक_विवरण[NAME]=\"\",\"\",ROWS($A$2:A80))","v":""},{"$f":"IF('शालादर्पण कार्मिक DATA'!A82=\"\",\"\",'शालादर्पण कार्मिक DATA'!A82)","v":""},{"$f":"UPPER(IF('शालादर्पण कार्मिक DATA'!F82=\"\",\"\",'शालादर्पण कार्मिक DATA'!F82))","v":""},{"$f":"IF('शालादर्पण कार्मिक DATA'!E82=\"\",\"\",'शालादर्पण कार्मिक DATA'!E82)","v":""},{"$f":"IF('शालादर्पण कार्मिक DATA'!K82=\"\",\"\",'शालादर्पण कार्मिक DATA'!K82)","v":""},{"$f":"IF('शालादर्पण कार्मिक DATA'!B82=\"\",\"\",'शालादर्पण कार्मिक DATA'!B82)","v":""},{"$nulls":5},{"$f":"IF('शालादर्पण कार्मिक DATA'!J82=\"\",\"\",'शालादर्पण कार्मिक DATA'!J82)","v":""}]
[{"$f":"IF(कार्मिक_विवरण[NAME]=\"\",\"\",ROWS($A$2:A81))","v":""},{"$f":"IF('शालादर्पण कार्मिक DATA'!A83=\"\",\"\",'शालादर्पण कार्मिक DATA'!A83)","v":""},{"$f":"UPPER(IF('शालादर्पण कार्मिक DATA'!F83=\"\",\"\",'शालादर्पण कार्मिक DATA'!F83))","v":""},{"$f":"IF('शालादर्पण कार्मिक DATA'!E83=\"\",\"\",'शालादर्पण कार्मिक DATA'!E83)","v":""},{"$f":"IF('शालादर्पण कार्मिक DATA'!K83=\"\",\"\",'शालादर्पण कार्मिक DATA'!K83)","v":""},{"$f":"IF('शालादर्पण कार्मिक DATA'!B83=\"\",\"\",'शालादर्पण कार्मिक DATA'!B83)","v":""},{"$nulls":5},{"$f":"IF('शालादर्पण कार्मिक DATA'!J83=\"\",\"\",'शालादर्पण कार्मिक DATA'!J83)","v":""}]
[{"$f":"IF(कार्मिक_विवरण[NAME]=\"\",\"\",ROWS($A$2:A82))","v":""},{"$f":"IF('शालादर्पण कार्मिक DATA'!A84=\"\",\"\",'शालादर्पण कार्मिक DATA'!A84)","v":""},{"$f":"UPPER(IF('शालादर्पण कार्मिक DATA'!F84=\"\",\"\",'शालादर्पण कार्मिक DATA'!F84))","v":""},{"$f":"IF('शालादर्पण कार्मिक DATA'!E84=\"\",\"\",'शालादर्पण कार्मिक DATA'!E84)","v":""},{"$f":"IF('शालादर्पण कार्मिक DATA'!K84=\"\",\"\",'शालादर्पण कार्मिक DATA'!K84)","v":""},{"$f":"IF('शालादर्पण कार्मिक DATA'!B84=\"\",\"\",'शालादर्पण कार्मिक DATA'!B84)","v":""},{"$nulls":5},{"$f":"IF('शालादर्पण कार्मिक DATA'!J84=\"\",\"\",'शालादर्पण कार्मिक DATA'!J84)","v":""}]
[{"$f":"IF(कार्मिक_विवरण[NAME]=\"\",\"\",ROWS($A$2:A83))","v":""},{"$f":"IF('शालादर्पण कार्मिक DATA'!A85=\"\",\"\",'शालादर्पण कार्मिक DATA'!A85)","v":""},{"$f":"UPPER(IF('शालादर्पण कार्मिक DATA'!F85=\"\",\"\",'शालादर्पण कार्मिक DATA'!F85))","v":""},{"$f":"IF('शालादर्पण कार्मिक DATA'!E85=\"\",\"\",'शालादर्पण कार्मिक DATA'!E85)","v":""},{"$f":"IF('शालादर्पण कार्मिक DATA'!K85=\"\",\"\",'शालादर्पण कार्मिक DATA'!K85)","v":""},{"$f":"IF('शालादर्पण कार्मिक DATA'!B85=\"\",\"\",'शालादर्पण कार्मिक DATA'!B85)","v":""},{"$nulls":5},{"$f":"IF('शालादर्पण कार्मिक DATA'!J85=\"\",\"\",'शालादर्पण कार्मिक DATA'!J85)","v":""}]
[{"$f":"IF(कार्मिक_विवरण[NAME]=\"\",\"\",ROWS($A$2:A84))","v":""},{"$f":"IF('शालादर्पण कार्मिक DATA'!A86=\"\",\"\",'शालादर्पण कार्मिक DATA'!A86)","v":""},{"$f":"UPPER(IF('शालादर्पण कार्मिक DATA'!F86=\"\",\"\",'शालादर्पण कार्मिक DATA'!F86))","v":""},{"$f":"IF('शालादर्पण कार्मिक DATA'!E86=\"\",\"\",'शालादर्पण कार्मिक DATA'!E86)","v":""},{"$f":"IF('शालादर्पण कार्मिक DATA'!K86=\"\",\"\",'शालादर्पण कार्मिक DATA'!K86)","v":""},{"$f":"IF('शालादर्पण कार्मिक DATA'!B86=\"\",\"\",'शालादर्पण कार्मिक DATA'!B86)","v":""},{"$nulls":5},{"$f":"IF('शालादर्पण कार्मिक DATA'!J86=\"\",\"\",'शालादर्पण कार्मिक DATA'!J86)","v":""}]
[{"$f":"IF(कार्मिक_विवरण[NAME]=\"\",\"\",ROWS($A$2:A85))","v":""},{"$f":"IF('शालादर्पण कार्मिक DATA'!A87=\"\",\"\",'शालादर्पण कार्मिक DATA'!A87)","v":""},{"$f":"UPPER(IF('शालादर्पण कार्मिक DATA'!F87=\"\",\"\",'शालादर्पण कार्मिक DATA'!F87))","v":""},{"$f":"IF('शालादर्पण कार्मिक DATA'!E87=\"\",\"\",'शालादर्पण कार्मिक DATA'!E87)","v":""},{"$f":"IF('शालादर्पण कार्मिक DATA'!K87=\"\",\"\",'शालादर्पण कार्मिक DATA'!K87)","v":""},{"$f":"IF('शालादर्पण कार्मिक DATA'!B87=\"\",\"\",'शालादर्पण कार्मिक DATA'!B87)","v":""},{"$nulls":5},{"$f":"IF('शालादर्पण कार्मिक DATA'!J87=\"\",\"\",'शालादर्पण कार्मिक DATA'!J87)","v":""}]
[{"$f":"IF(कार्मिक_विवरण[NAME]=\"\",\"\",ROWS($A$2:A86))","v":""},{"$f":"IF('शालादर्पण कार्मिक DATA'!A88=\"\",\"\",'शालादर्पण कार्मिक DATA'!A88)","v":""},{"$f":"UPPER(IF('शालादर्पण कार्मिक DATA'!F88=\"\",\"\",'शालादर्पण कार्मिक DATA'!F88))","v":""},{"$f":"IF('शालादर्पण कार्मिक DATA'!E88=\"\",\"\",'शालादर्पण कार्मिक DATA'!E88)","v":""},{"$f":"IF('शालादर्पण कार्मिक DATA'!K88=\"\",\"\",'शालादर्पण कार्मिक DATA'!K88)","v":""},{"$f":"IF('शालादर्पण कार्मिक DATA'!B88=\"\",\"\",'शालादर्पण कार्मिक DATA'!B88)","v":""},{"$nulls":5},{"$f":"IF('शालादर्पण कार्मिक DATA'!J88=\"\",\"\",'शालादर्पण कार्मिक DATA'!J88)","v":""}]
[{"$f":"IF(कार्मिक_विवरण[NAME]=\"\",\"\",ROWS($A$2:A87))","v":""},{"$f":"IF('शालादर्पण कार्मिक DATA'!A89=\"\",\"\",'शालादर्पण कार्मिक DATA'!A89)","v":""},{"$f":"UPPER(IF('शालादर्पण कार्मिक DATA'!F89=\"\",\"\",'शालादर्पण कार्मिक DATA'!F89))","v":""},{"$f":"IF('शालादर्पण कार्मिक DATA'!E89=\"\",\"\",'शालादर्पण कार्मिक DATA'!E89)","v":""},{"$f":"IF('शालादर्पण कार्मिक DATA'!K89=\"\",\"\",'शालादर्पण कार्मिक DATA'!K89)","v":""},{"$f":"IF('शालादर्पण कार्मिक DATA'!B89=\"\",\"\",'शालादर्पण कार्मिक DATA'!B89)","v":""},{"$nulls":5},{"$f":"IF('शालादर्पण कार्मिक DATA'!J89=\"\",\"\",'शालादर्पण कार्मिक DATA'!J89)","v":""}]
[{"$f":"IF(कार्मिक_विवरण[NAME]=\"\",\"\",ROWS($A$2:A88))","v":""},{"$f":"IF('शालादर्पण कार्मिक DATA'!A90=\"\",\"\",'शालादर्पण कार्मिक DATA'!A90)","v":""},{"$f":"UPPER(IF('शालादर्पण कार्मिक DATA'!F90=\"\",\"\",'शालादर्पण कार्मिक DATA'!F90))","v":""},{"$f":"IF('शालादर्पण कार्मिक DATA'!E90=\"\",\"\",'शालादर्पण कार्मिक DATA'!E90)","v":""},{"$f":"IF('शालादर्पण कार्मिक DATA'!K90=\"\",\"\",'शालादर्पण कार्मिक DATA'!K90)","v":""},{"$f":"IF('शालादर्पण कार्मिक DATA'!B90=\"\",\"\",'शालादर्पण कार्मिक DATA'!B90)","v":""},{"$nulls":5},{"$f":"IF('शालादर्पण कार्मिक DATA'!J90=\"\",\"\",'शालादर्पण कार्मिक DATA'!J90)","v":""}]
[{"$f":"IF(कार्मिक_विवरण[NAME]=\"\",\"\",ROWS($A$2:A89))","v":""},{"$f":"IF('शालादर्पण कार्मिक DATA'!A91=\"\",\"\",'शालादर्पण कार्मिक DATA'!A91)","v":""},{"$f":"UPPER(IF('शालादर्पण कार्मिक DATA'!F91=\"\",\"\",'शालादर्पण कार्मिक DATA'!F91))","v":""},{"$f":"IF('शालादर्पण कार्मिक DATA'!E91=\"\",\"\",'शालादर्पण कार्मिक DATA'!E91)","v":""},{"$f":"IF('शालादर्पण कार्मिक DATA'!K91=\"\",\"\",'शालादर्पण कार्मिक DATA'!K91)","v":""},{"$f":"IF('शालादर्पण कार्मिक DATA'!B91=\"\",\"\",'शालादर्पण कार्मिक DATA'!B91)","v":""},{"$nulls":5},{"$f":"IF('शालादर्पण कार्मिक DATA'!J91=\"\",\"\",'शालादर्पण कार्मिक DATA'!J91)","v":""}]
[{"$f":"IF(कार्मिक_विवरण[NAME]=\"\",\"\",ROWS($A$2:A90))","v":""},{"$f":"IF('शालादर्पण कार्मिक DATA'!A92=\"\",\"\",'शालादर्पण कार्मिक DATA'!A92)","v":""},{"$f":"UPPER(IF('शालादर्पण कार्मिक DATA'!F92=\"\",\"\",'शालादर्पण कार्मिक DATA'!F92))","v":""},{"$f":"IF('शालादर्पण कार्मिक DATA'!E92=\"\",\"\",'शालादर्पण कार्मिक DATA'!E92)","v":""},{"$f":"IF('शालादर्पण कार्मिक DATA'!K92=\"\",\"\",'शालादर्पण कार्मिक DATA'!K92)","v":""},{"$f":"IF('शालादर्पण कार्मिक DATA'!B92=\"\",\"\",'शालादर्पण कार्मिक DATA'!B92)","v":""},{"$nulls":5},{"$f":"IF('शालादर्पण कार्मिक DATA'!J92=\"\",\"\",'शालादर्पण कार्मिक DATA'!J92)","v":""}]
[{"$f":"IF(कार्मिक_विवरण[NAME]=\"\",\"\",ROWS($A$2:A91))","v":""},{"$f":"IF('शालादर्पण कार्मिक DATA'!A93=\"\",\"\",'शालादर्पण कार्मिक DATA'!A93)","v":""},{"$f":"UPPER(IF('शालादर्पण कार्मिक DATA'!F93=\"\",\"\",'शालादर्पण कार्मिक DATA'!F93))","v":""},{"$f":"IF('शालादर्पण कार्मिक DATA'!E93=\"\",\"\",'शालादर्पण कार्मिक DATA'!E93)","v":""},{"$f":"IF('शालादर्पण कार्मिक DATA'!K93=\"\",\"\",'शालादर्पण कार्मिक DATA'!K93)","v":""},{"$f":"IF('शालादर्पण कार्मिक DATA'!B93=\"\",\"\",'शालादर्पण कार्मिक DATA'!B93)","v":""},{"$nulls":5},{"$f":"IF('शालादर्पण कार्मिक DATA'!J93=\"\",\"\",'शालादर्पण कार्मिक DATA'!J93)","v":""}]
[{"$f":"IF(कार्मिक_विवरण[NAME]=\"\",\"\",ROWS($A$2:A92))","v":""},{"$f":"IF('शालादर्पण कार्मिक DATA'!A94=\"\",\"\",'शालादर्पण कार्मिक DATA'!A94)","v":""},{"$f":"UPPER(IF('शालादर्पण कार्मिक DATA'!F94=\"\",\"\",'शालादर्पण कार्मिक DATA'!F94))","v":""},{"$f":"IF('शालादर्पण कार्मिक DATA'!E94=\"\",\"\",'शालादर्पण कार्मिक DATA'!E94)","v":""},{"$f":"IF('शालादर्पण कार्मिक DATA'!K94=\"\",\"\",'शालादर्पण कार्मिक DATA'!K94)","v":""},{"$f":"IF('शालादर्पण कार्मिक DATA'!B94=\"\",\"\",'शालादर्पण कार्मिक DATA'!B94)","v":""},{"$nulls":5},{"$f":"IF('शालादर्पण कार्मिक DATA'!J94=\"\",\"\",'शालादर्पण कार्मिक DATA'!J94)","v":""}]
[{"$f":"IF(कार्मिक_विवरण[NAME]=\"\",\"\",ROWS($A$2:A93))","v":""},{"$f":"IF('शालादर्पण कार्मिक DATA'!A95=\"\",\"\",'शालादर्पण कार्मिक DATA'!A95)","v":""},{"$f":"UPPER(IF('शालादर्पण कार्मिक DATA'!F95=\"\",\"\",'शालादर्पण कार्मिक DATA'!F95))","v":""},{"$f":"IF('शालादर्पण कार्मिक DATA'!E95=\"\",\"\",'शालादर्पण कार्मिक DATA'!E95)","v":""},{"$f":"IF('शालादर्पण कार्मिक DATA'!K95=\"\",\"\",'शालादर्पण कार्मिक DATA'!K95)","v":""},{"$f":"IF('शालादर्पण कार्मिक DATA'!B95=\"\",\"\",'शालादर्पण कार्मिक DATA'!B95)","v":""},{"$nulls":5},{"$f":"IF('शालादर्पण कार्मिक DATA'!J95=\"\",\"\",'शालादर्पण कार्मिक DATA'!J95)","v":""}]
[{"$f":"IF(कार्मिक_विवरण[NAME]=\"\",\"\",ROWS($A$2:A94))","v":""},{"$f":"IF('शालादर्पण कार्मिक DATA'!A96=\"\",\"\",'शालादर्पण कार्मिक DATA'!A96)","v":""},{"$f":"UPPER(IF('शालादर्पण कार्मिक DATA'!F96=\"\",\"\",'शालादर्पण कार्मिक DATA'!F96))","v":""},{"$f":"IF('शालादर्पण कार्मिक DATA'!E96=\"\",\"\",'शालादर्पण कार्मिक DATA'!E96)","v":""},{"$f":"IF('शालादर्पण कार्मिक DATA'!K96=\"\",\"\",'शालादर्पण कार्मिक DATA'!K96)","v":""},{"$f":"IF('शालादर्पण कार्मिक DATA'!B96=\"\",\"\",'शालादर्पण कार्मिक DATA'!B96)","v":""},{"$nulls":5},{"$f":"IF('शालादर्पण कार्मिक DATA'!J96=\"\",\"\",'शालादर्पण कार्मिक DATA'!J96)","v":""}]
[{"$f":"IF(कार्मिक_विवरण[NAME]=\"\",\"\",ROWS($A$2:A95))","v":""},{"$f":"IF('शालादर्पण कार्मिक DATA'!A97=\"\",\"\",'शालादर्पण कार्मिक DATA'!A97)","v":""},{"$f":"UPPER(IF('शालादर्पण कार्मिक DATA'!F97=\"\",\"\",'शालादर्पण कार्मिक DATA'!F97))","v":""},{"$f":"IF('शालादर्पण कार्मिक DATA'!E97=\"\",\"\",'शालादर्पण कार्मिक DATA'!E97)","v":""},{"$f":"IF('शालादर्पण कार्मिक DATA'!K97=\"\",\"\",'शालादर्पण कार्मिक DATA'!K97)","v":""},{"$f":"IF('शालादर्पण कार्मिक DATA'!B97=\"\",\"\",'शालादर्पण कार्मिक DATA'!B97)","v":""},{"$nulls":5},{"$f":"IF('शालादर्पण कार्मिक DATA'!J97=\"\",\"\",'शालादर्पण कार्मिक DATA'!J97)","v":""}]
[{"$f":"IF(कार्मिक_विवरण[NAME]=\"\",\"\",ROWS($A$2:A96))","v":""},{"$f":"IF('शालादर्पण कार्मिक DATA'!A98=\"\",\"\",'शालादर्पण कार्मिक DATA'!A98)","v":""},{"$f":"UPPER(IF('शालादर्पण कार्मिक DATA'!F98=\"\",\"\",'शालादर्पण कार्मिक DATA'!F98))","v":""},{"$f":"IF('शालादर्पण कार्मिक DATA'!E98=\"\",\"\",'शालादर्पण कार्मिक DATA'!E98)","v":""},{"$f":"IF('शालादर्पण कार्मिक DATA'!K98=\"\",\"\",'शालादर्पण कार्मिक DATA'!K98)","v":""},{"$f":"IF('शालादर्पण कार्मिक DATA'!B98=\"\",\"\",'शालादर्पण कार्मिक DATA'!B98)","v":""},{"$nulls":5},{"$f":"IF('शालादर्पण कार्मिक DATA'!J98=\"\",\"\",'शालादर्पण कार्मिक DATA'!J98)","v":""}]
[{"$f":"IF(कार्मिक_विवरण[NAME]=\"\",\"\",ROWS($A$2:A97))","v":""},{"$f":"IF('शालादर्पण कार्मिक DATA'!A99=\"\",\"\",'शालादर्पण कार्मिक DATA'!A99)","v":""},{"$f":"UPPER(IF('शालादर्पण कार्मिक DATA'!F99=\"\",\"\",'शालादर्पण कार्मिक DATA'!F99))","v":""},{"$f":"IF('शालादर्पण कार्मिक DATA'!E99=\"\",\"\",'शालादर्पण कार्मिक DATA'!E99)","v":""},{"$f":"IF('शालादर्पण कार्मिक DATA'!K99=\"\",\"\",'शालादर्पण कार्मिक DATA'!K99)","v":""},{"$f":"IF('शालादर्पण कार्मिक DATA'!B99=\"\",\"\",'शालादर्पण कार्मिक DATA'!B99)","v":""},{"$nulls":5},{"$f":"IF('शालादर्पण कार्मिक DATA'!J99=\"\",\"\",'शालादर्पण कार्मिक DATA'!J99)","v":""}]
[{"$f":"IF(कार्मिक_विवरण[NAME]=\"\",\"\",ROWS($A$2:A98))","v":""},{"$f":"IF('शालादर्पण कार्मिक DATA'!A100=\"\",\"\",'शालादर्पण कार्मिक DATA'!A100)","v":""},{"$f":"UPPER(IF('शालादर्पण कार्मिक DATA'!F100=\"\",\"\",'शालादर्पण कार्मिक DATA'!F100))","v":""},{"$f":"IF('शालादर्पण कार्मिक DATA'!E100=\"\",\"\",'शालादर्पण कार्मिक DATA'!E100)","v":""},{"$f":"IF('शालादर्पण कार्मिक DATA'!K100=\"\",\"\",'शालादर्पण कार्मिक DATA'!K100)","v":""},{"$f":"IF('शालादर्पण कार्मिक DATA'!B100=\"\",\"\",'शालादर्पण कार्मिक DATA'!B100)","v":""},{"$nulls":5},{"$f":"IF('शालादर्पण कार्मिक DATA'!J100=\"\",\"\",'शालादर्पण कार्मिक DATA'!J100)","v":""}]
[{"$f":"IF(कार्मिक_विवरण[NAME]=\"\",\"\",ROWS($A$2:A99))","v":""},{"$f":"IF('शालादर्पण कार्मिक DATA'!A101=\"\",\"\",'शालादर्पण कार्मिक DATA'!A101)","v":""},{"$f":"UPPER(IF('शालादर्पण कार्मिक DATA'!F101=\"\",\"\",'शालादर्पण कार्मिक DATA'!F101))","v":""},{"$f":"IF('शालादर्पण कार्मिक DATA'!E101=\"\",\"\",'शालादर्पण कार्मिक DATA'!E101)","v":""},{"$f":"IF('शालादर्पण कार्मिक DATA'!K101=\"\",\"\",'शालादर्पण कार्मिक DATA'!K101)","v":""},{"$f":"IF('शालादर्पण कार्मिक DATA'!B101=\"\",\"\",'शालादर्पण कार्मिक DATA'!B101)","v":""},{"$nulls":5},{"$f":"IF('शालादर्पण कार्मिक DATA'!J101=\"\",\"\",'शालादर्पण कार्मिक DATA'!J101)","v":""}]
[{"$f":"IF(कार्मिक_विवरण[NAME]=\"\",\"\",ROWS($A$2:A100))","v":""},{"$f":"IF('शालादर्पण कार्मिक DATA'!A102=\"\",\"\",'शालादर्पण कार्मिक DATA'!A102)","v":""},{"$f":"UPPER(IF('शालादर्पण कार्मिक DATA'!F102=\"\",\"\",'शालादर्पण कार्मिक DATA'!F102))","v":""},{"$f":"IF('शालादर्पण कार्मिक DATA'!E102=\"\",\"\",'शालादर्पण कार्मिक DATA'!E102)","v":""},{"$f":"IF('शालादर्पण कार्मिक DATA'!K102=\"\",\"\",'शालादर्पण कार्मिक DATA'!K102)","v":""},{"$f":"IF('शालादर्पण कार्मिक DATA'!B102=\"\",\"\",'शालादर्पण कार्मिक DATA'!B102)","v":""},{"$nulls":5},{"$f":"IF('शालादर्पण कार्मिक DATA'!J102=\"\",\"\",'शालादर्पण कार्मिक DATA'!J102)","v":""}]
[{"$f":"IF(कार्मिक_विवरण[NAME]=\"\",\"\",ROWS($A$2:A101))","v":""},{"$f":"IF('शालादर्पण कार्मिक DATA'!A103=\"\",\"\",'शालादर्पण कार्मिक DATA'!A103)","v":""},{"$f":"UPPER(IF('शालादर्पण कार्मिक DATA'!F103=\"\",\"\",'शालादर्पण कार्मिक DATA'!F103))","v":""},{"$f":"IF('शालादर्पण कार्मिक DATA'!E103=\"\",\"\",'शालादर्पण कार्मिक DATA'!E103)","v":""},{"$f":"IF('शालादर्पण कार्मिक DATA'!K103=\"\",\"\",'शालादर्पण कार्मिक DATA'!K103)","v":""},{"$f":"IF('शालादर्पण कार्मिक DATA'!B103=\"\",\"\",'शालादर्पण कार्मिक DATA'!B103)","v":""},{"$nulls":5},{"$f":"IF('शालादर्पण कार्मिक DATA'!J103=\"\",\"\",'शालादर्पण कार्मिक DATA'!J103)","v":""}]
[{"$f":"IF(कार्मिक_विवरण[NAME]=\"\",\"\",ROWS($A$2:A102))","v":""},{"$f":"IF('शालादर्पण कार्मिक DATA'!A104=\"\",\"\",'शालादर्पण कार्मिक DATA'!A104)","v":""},{"$f":"UPPER(IF('शालादर्पण कार्मिक DATA'!F104=\"\",\"\",'शालादर्पण कार्मिक DATA'!F104))","v":""},{"$f":"IF('शालादर्पण कार्मिक DATA'!E104=\"\",\"\",'शालादर्पण कार्मिक DATA'!E104)","v":""},{"$f":"IF('शालादर्पण कार्मिक DATA'!K104=\"\",\"\",'शालादर्पण कार्मिक DATA'!K104)","v":""},{"$f":"IF('शालादर्पण कार्मिक DATA'!B104=\"\",\"\",'शालादर्पण कार्मिक DATA'!B104)","v":""},{"$nulls":5},{"$f":"IF('शालादर्पण कार्मिक DATA'!#REF!=\"\",\"\",'शालादर्पण कार्मिक DATA'!#REF!)","v":{"$error":"#REF!"}}]
[{"$f":"IF(कार्मिक_विवरण[NAME]=\"\",\"\",ROWS($A$2:A103))","v":""},{"$f":"IF('शालादर्पण कार्मिक DATA'!A105=\"\",\"\",'शालादर्पण कार्मिक DATA'!A105)","v":""},{"$f":"UPPER(IF('शालादर्पण कार्मिक DATA'!F105=\"\",\"\",'शालादर्पण कार्मिक DATA'!F105))","v":""},{"$f":"IF('शालादर्पण कार्मिक DATA'!E105=\"\",\"\",'शालादर्पण कार्मिक DATA'!E105)","v":""},{"$f":"IF('शालादर्पण कार्मिक DATA'!K105=\"\",\"\",'शालादर्पण कार्मिक DATA'!K105)","v":""},{"$f":"IF('शालादर्पण कार्मिक DATA'!B105=\"\",\"\",'शालादर्पण कार्मिक DATA'!B105)","v":""},{"$nulls":5},{"$f":"IF('शालादर्पण कार्मिक DATA'!#REF!=\"\",\"\",'शालादर्पण कार्मिक DATA'!#REF!)","v":{"$error":"#REF!"}}]
[{"$f":"IF(कार्मिक_विवरण[NAME]=\"\",\"\",ROWS($A$2:A104))","v":""},{"$f":"IF('शालादर्पण कार्मिक DATA'!A106=\"\",\"\",'शालादर्पण कार्मिक DATA'!A106)","v":""},{"$f":"UPPER(IF('शालादर्पण कार्मिक DATA'!F106=\"\",\"\",'शालादर्पण कार्मिक DATA'!F106))","v":""},{"$f":"IF('शालादर्पण कार्मिक DATA'!E106=\"\",\"\",'शालादर्पण कार्मिक DATA'!E106)","v":""},{"$f":"IF('शालादर्पण कार्मिक DATA'!K106=\"\",\"\",'शालादर्पण कार्मिक DATA'!K106)","v":""},{"$f":"IF('शालादर्पण कार्मिक DATA'!B106=\"\",\"\",'शालादर्पण कार्मिक DATA'!B106)","v":""},{"$nulls":5},{"$f":"IF('शालादर्पण कार्मिक DATA'!#REF!=\"\",\"\",'शालादर्पण कार्मिक DATA'!#REF!)","v":{"$error":"#REF!"}}]
[{"$f":"IF(कार्मिक_विवरण[NAME]=\"\",\"\",ROWS($A$2:A105))","v":""},{"$f":"IF('शालादर्पण कार्मिक DATA'!A107=\"\",\"\",'शालादर्पण कार्मिक DATA'!A107)","v":""},{"$f":"UPPER(IF('शालादर्पण कार्मिक DATA'!F107=\"\",\"\",'शालादर्पण कार्मिक DATA'!F107))","v":""},{"$f":"IF('शालादर्पण कार्मिक DATA'!E107=\"\",\"\",'शालादर्पण कार्मिक DATA'!E107)","v":""},{"$f":"IF('शालादर्पण कार्मिक DATA'!K107=\"\",\"\",'शालादर्पण कार्मिक DATA'!K107)","v":""},{"$f":"IF('शालादर्पण कार्मिक DATA'!B107=\"\",\"\",'शालादर्पण कार्मिक DATA'!B107)","v":""},{"$nulls":5},{"$f":"IF('शालादर्पण कार्मिक DATA'!#REF!=\"\",\"\",'शालादर्पण कार्मिक DATA'!#REF!)","v":{"$error":"#REF!"}}]
[{"$f":"IF(कार्मिक_विवरण[NAME]=\"\",\"\",ROWS($A$2:A106))","v":""},{"$f":"IF('शालादर्पण कार्मिक DATA'!A108=\"\",\"\",'शालादर्पण कार्मिक DATA'!A108)","v":""},{"$f":"UPPER(IF('शालादर्पण कार्मिक DATA'!F108=\"\",\"\",'शालादर्पण कार्मिक DATA'!F108))","v":""},{"$f":"IF('शालादर्पण कार्मिक DATA'!E108=\"\",\"\",'शालादर्पण कार्मिक DATA'!E108)","v":""},{"$f":"IF('शालादर्पण कार्मिक DATA'!K108=\"\",\"\",'शालादर्पण कार्मिक DATA'!K108)","v":""},{"$f":"IF('शालादर्पण कार्मिक DATA'!B108=\"\",\"\",'शालादर्पण कार्मिक DATA'!B108)","v":""},{"$nulls":5},{"$f":"IF('शालादर्पण कार्मिक DATA'!#REF!=\"\",\"\",'शालादर्पण कार्मिक DATA'!#REF!)","v":{"$error":"#REF!"}}]
[{"$f":"IF(कार्मिक_विवरण[NAME]=\"\",\"\",ROWS($A$2:A107))","v":""},{"$f":"IF('शालादर्पण कार्मिक DATA'!A109=\"\",\"\",'शालादर्पण कार्मिक DATA'!A109)","v":""},{"$f":"UPPER(IF('शालादर्पण कार्मिक DATA'!F109=\"\",\"\",'शालादर्पण कार्मिक DATA'!F109))","v":""},{"$f":"IF('शालादर्पण कार्मिक DATA'!E109=\"\",\"\",'शालादर्पण कार्मिक DATA'!E109)","v":""},{"$f":"IF('शालादर्पण कार्मिक DATA'!K109=\"\",\"\",'शालादर्पण कार्मिक DATA'!K109)","v":""},{"$f":"IF('शालादर्पण कार्मिक DATA'!B109=\"\",\"\",'शालादर्पण कार्मिक DATA'!B109)","v":""},{"$nulls":5},{"$f":"IF('शालादर्पण कार्मिक DATA'!#REF!=\"\",\"\",'शालादर्पण कार्मिक DATA'!#REF!)","v":{"$error":"#REF!"}}]
[{"$f":"IF(कार्मिक_विवरण[NAME]=\"\",\"\",ROWS($A$2:A108))","v":""},{"$f":"IF('शालादर्पण कार्मिक DATA'!A110=\"\",\"\",'शालादर्पण कार्मिक DATA'!A110)","v":""},{"$f":"UPPER(IF('शालादर्पण कार्मिक DATA'!F110=\"\",\"\",'शालादर्पण कार्मिक DATA'!F110))","v":""},{"$f":"IF('शालादर्पण कार्मिक DATA'!E110=\"\",\"\",'शालादर्पण कार्मिक DATA'!E110)","v":""},{"$f":"IF('शालादर्पण कार्मिक DATA'!K110=\"\",\"\",'शालादर्पण कार्मिक DATA'!K110)","v":""},{"$f":"IF('शालादर्पण कार्मिक DATA'!B110=\"\",\"\",'शालादर्पण कार्मिक DATA'!B110)","v":""},{"$nulls":5},{"$f":"IF('शालादर्पण कार्मिक DATA'!#REF!=\"\",\"\",'शालादर्पण कार्मिक DATA'!#REF!)","v":{"$error":"#REF!"}}]
[{"$f":"IF(कार्मिक_विवरण[NAME]=\"\",\"\",ROWS($A$2:A109))","v":""},{"$f":"IF('शालादर्पण कार्मिक DATA'!A111=\"\",\"\",'शालादर्पण कार्मिक DATA'!A111)","v":""},{"$f":"UPPER(IF('शालादर्पण कार्मिक DATA'!F111=\"\",\"\",'शालादर्पण कार्मिक DATA'!F111))","v":""},{"$f":"IF('शालादर्पण कार्मिक DATA'!E111=\"\",\"\",'शालादर्पण कार्मिक DATA'!E111)","v":""},{"$f":"IF('शालादर्पण कार्मिक DATA'!K111=\"\",\"\",'शालादर्पण कार्मिक DATA'!K111)","v":""},{"$f":"IF('शालादर्पण कार्मिक DATA'!B111=\"\",\"\",'शालादर्पण कार्मिक DATA'!B111)","v":""},{"$nulls":5},{"$f":"IF('शालादर्पण कार्मिक DATA'!#REF!=\"\",\"\",'शालादर्पण कार्मिक DATA'!#REF!)","v":{"$error":"#REF!"}}]
[{"$f":"IF(कार्मिक_विवरण[NAME]=\"\",\"\",ROWS($A$2:A110))","v":""},{"$f":"IF('शालादर्पण कार्मिक DATA'!A112=\"\",\"\",'शालादर्पण कार्मिक DATA'!A112)","v":""},{"$f":"UPPER(IF('शालादर्पण कार्मिक DATA'!F112=\"\",\"\",'शालादर्पण कार्मिक DATA'!F112))","v":""},{"$f":"IF('शालादर्पण कार्मिक DATA'!E112=\"\",\"\",'शालादर्पण कार्मिक DATA'!E112)","v":""},{"$f":"IF('शालादर्पण कार्मिक DATA'!K112=\"\",\"\",'शालादर्पण कार्मिक DATA'!K112)","v":""},{"$f":"IF('शालादर्पण कार्मिक DATA'!B112=\"\",\"\",'शालादर्पण कार्मिक DATA'!B112)","v":""},{"$nulls":5},{"$f":"IF('शालादर्पण कार्मिक DATA'!#REF!=\"\",\"\",'शालादर्पण कार्मिक DATA'!#REF!)","v":{"$error":"#REF!"}}]
[{"$f":"IF(कार्मिक_विवरण[NAME]=\"\",\"\",ROWS($A$2:A111))","v":""},{"$f":"IF('शालादर्पण कार्मिक DATA'!A113=\"\",\"\",'शालादर्पण कार्मिक DATA'!A113)","v":""},{"$f":"UPPER(IF('शालादर्पण कार्मिक DATA'!F113=\"\",\"\",'शालादर्पण कार्मिक DATA'!F113))","v":""},{"$f":"IF('शालादर्पण कार्मिक DATA'!E113=\"\",\"\",'शालादर्पण कार्मिक DATA'!E113)","v":""},{"$f":"IF('शालादर्पण कार्मिक DATA'!K113=\"\",\"\",'शालादर्पण कार्मिक DATA'!K113)","v":""},{"$f":"IF('शालादर्पण कार्मिक DATA'!B113=\"\",\"\",'शालादर्पण कार्मिक DATA'!B113)","v":""},{"$nulls":5},{"$f":"IF('शालादर्पण कार्मिक DATA'!#REF!=\"\",\"\",'शालादर्पण कार्मिक DATA'!#REF!)","v":{"$error":"#REF!"}}]
[{"$f":"IF(कार्मिक_विवरण[NAME]=\"\",\"\",ROWS($A$2:A112))","v":""},{"$f":"IF('शालादर्पण कार्मिक DATA'!A114=\"\",\"\",'शालादर्पण कार्मिक DATA'!A114)","v":""},{"$f":"UPPER(IF('शालादर्पण कार्मिक DATA'!F114=\"\",\"\",'शालादर्पण कार्मिक DATA'!F114))","v":""},{"$f":"IF('शालादर्पण कार्मिक DATA'!E114=\"\",\"\",'शालादर्पण कार्मिक DATA'!E114)","v":""},{"$f":"IF('शालादर्पण कार्मिक DATA'!K114=\"\",\"\",'शालादर्पण कार्मिक DATA'!K114)","v":""},{"$f":"IF('शालादर्पण कार्मिक DATA'!B114=\"\",\"\",'शालादर्पण कार्मिक DATA'!B114)","v":""},{"$nulls":5},{"$f":"IF('शालादर्पण कार्मिक DATA'!#REF!=\"\",\"\",'शालादर्पण कार्मिक DATA'!#REF!)","v":{"$error":"#REF!"}}]
[{"$f":"IF(कार्मिक_विवरण[NAME]=\"\",\"\",ROWS($A$2:A113))","v":""},{"$f":"IF('शालादर्पण कार्मिक DATA'!A115=\"\",\"\",'शालादर्पण कार्मिक DATA'!A115)","v":""},{"$f":"UPPER(IF('शालादर्पण कार्मिक DATA'!F115=\"\",\"\",'शालादर्पण कार्मिक DATA'!F115))","v":""},{"$f":"IF('शालादर्पण कार्मिक DATA'!E115=\"\",\"\",'शालादर्पण कार्मिक DATA'!E115)","v":""},{"$f":"IF('शालादर्पण कार्मिक DATA'!K115=\"\",\"\",'शालादर्पण कार्मिक DATA'!K115)","v":""},{"$f":"IF('शालादर्पण कार्मिक DATA'!B115=\"\",\"\",'शालादर्पण कार्मिक DATA'!B115)","v":""},{"$nulls":5},{"$f":"IF('शालादर्पण कार्मिक DATA'!#REF!=\"\",\"\",'शालादर्पण कार्मिक DATA'!#REF!)","v":{"$error":"#REF!"}}]
[{"$f":"IF(कार्मिक_विवरण[NAME]=\"\",\"\",ROWS($A$2:A114))","v":""},{"$f":"IF('शालादर्पण कार्मिक DATA'!A116=\"\",\"\",'शालादर्पण कार्मिक DATA'!A116)","v":""},{"$f":"UPPER(IF('शालादर्पण कार्मिक DATA'!F116=\"\",\"\",'शालादर्पण कार्मिक DATA'!F116))","v":""},{"$f":"IF('शालादर्पण कार्मिक DATA'!E116=\"\",\"\",'शालादर्पण कार्मिक DATA'!E116)","v":""},{"$f":"IF('शालादर्पण कार्मिक DATA'!K116=\"\",\"\",'शालादर्पण कार्मिक DATA'!K116)","v":""},{"$f":"IF('शालादर्पण कार्मिक DATA'!B116=\"\",\"\",'शालादर्पण कार्मिक DATA'!B116)","v":""},{"$nulls":5},{"$f":"IF('शालादर्पण कार्मिक DATA'!#REF!=\"\",\"\",'शालादर्पण कार्मिक DATA'!#REF!)","v":{"$error":"#REF!"}}]
[{"$f":"IF(कार्मिक_विवरण[NAME]=\"\",\"\",ROWS($A$2:A115))","v":""},{"$f":"IF('शालादर्पण कार्मिक DATA'!A117=\"\",\"\",'शालादर्पण कार्मिक DATA'!A117)","v":""},{"$f":"UPPER(IF('शालादर्पण कार्मिक DATA'!F117=\"\",\"\",'शालादर्पण कार्मिक DATA'!F117))","v":""},{"$f":"IF('शालादर्पण कार्मिक DATA'!E117=\"\",\"\",'शालादर्पण कार्मिक DATA'!E117)","v":""},{"$f":"IF('शालादर्पण कार्मिक DATA'!K117=\"\",\"\",'शालादर्पण कार्मिक DATA'!K117)","v":""},{"$f":"IF('शालादर्पण कार्मिक DATA'!B117=\"\",\"\",'शालादर्पण कार्मिक DATA'!B117)","v":""},{"$nulls":5},{"$f":"IF('शालादर्पण कार्मिक DATA'!#REF!=\"\",\"\",'शालादर्पण कार्मिक DATA'!#REF!)","v":{"$error":"#REF!"}}]
[{"$f":"IF(कार्मिक_विवरण[NAME]=\"\",\"\",ROWS($A$2:A116))","v":""},{"$f":"IF('शालादर्पण कार्मिक DATA'!A118=\"\",\"\",'शालादर्पण कार्मिक DATA'!A118)","v":""},{"$f":"UPPER(IF('शालादर्पण कार्मिक DATA'!F118=\"\",\"\",'शालादर्पण कार्मिक DATA'!F118))","v":""},{"$f":"IF('शालादर्पण कार्मिक DATA'!E118=\"\",\"\",'शालादर्पण कार्मिक DATA'!E118)","v":""},{"$f":"IF('शालादर्पण कार्मिक DATA'!K118=\"\",\"\",'शालादर्पण कार्मिक DATA'!K118)","v":""},{"$f":"IF('शालादर्पण कार्मिक DATA'!B118=\"\",\"\",'शालादर्पण कार्मिक DATA'!B118)","v":""},{"$nulls":5},{"$f":"IF('शालादर्पण कार्मिक DATA'!#REF!=\"\",\"\",'शालादर्पण कार्मिक DATA'!#REF!)","v":{"$error":"#REF!"}}]
[{"$f":"IF(कार्मिक_विवरण[NAME]=\"\",\"\",ROWS($A$2:A117))","v":""},{"$f":"IF('शालादर्पण कार्मिक DATA'!A119=\"\",\"\",'शालादर्पण कार्मिक DATA'!A119)","v":""},{"$f":"UPPER(IF('शालादर्पण कार्मिक DATA'!F119=\"\",\"\",'शालादर्पण कार्मिक DATA'!F119))","v":""},{"$f":"IF('शालादर्पण कार्मिक DATA'!E119=\"\",\"\",'शालादर्पण कार्मिक DATA'!E119)","v":""},{"$f":"IF('शालादर्पण कार्मिक DATA'!K119=\"\",\"\",'शालादर्पण कार्मिक DATA'!K119)","v":""},{"$f":"IF('शालादर्पण कार्मिक DATA'!B119=\"\",\"\",'शालादर्पण कार्मिक DATA'!B119)","v":""},{"$nulls":5},{"$f":"IF('शालादर्पण कार्मिक DATA'!#REF!=\"\",\"\",'शालादर्पण कार्मिक DATA'!#REF!)","v":{"$error":"#REF!"}}]
[{"$f":"IF(कार्मिक_विवरण[NAME]=\"\",\"\",ROWS($A$2:A118))","v":""},{"$f":"IF('शालादर्पण कार्मिक DATA'!A120=\"\",\"\",'शालादर्पण कार्मिक DATA'!A120)","v":""},{"$f":"UPPER(IF('शालादर्पण कार्मिक DATA'!F120=\"\",\"\",'शालादर्पण कार्मिक DATA'!F120))","v":""},{"$f":"IF('शालादर्पण कार्मिक DATA'!E120=\"\",\"\",'शालादर्पण कार्मिक DATA'!E120)","v":""},{"$f":"IF('शालादर्पण कार्मिक DATA'!K120=\"\",\"\",'शालादर्पण कार्मिक DATA'!K120)","v":""},{"$f":"IF('शालादर्पण कार्मिक DATA'!B120=\"\",\"\",'शालादर्पण कार्मिक DATA'!B120)","v":""},{"$nulls":5},{"$f":"IF('शालादर्पण कार्मिक DATA'!#REF!=\"\",\"\",'शालादर्पण कार्मिक DATA'!#REF!)","v":{"$error":"#REF!"}}]
[{"$f":"IF(कार्मिक_विवरण[NAME]=\"\",\"\",ROWS($A$2:A119))","v":""},{"$f":"IF('शालादर्पण कार्मिक DATA'!A121=\"\",\"\",'शालादर्पण कार्मिक DATA'!A121)","v":""},{"$f":"UPPER(IF('शालादर्पण कार्मिक DATA'!F121=\"\",\"\",'शालादर्पण कार्मिक DATA'!F121))","v":""},{"$f":"IF('शालादर्पण कार्मिक DATA'!E121=\"\",\"\",'शालादर्पण कार्मिक DATA'!E121)","v":""},{"$f":"IF('शालादर्पण कार्मिक DATA'!K121=\"\",\"\",'शालादर्पण कार्मिक DATA'!K121)","v":""},{"$f":"IF('शालादर्पण कार्मिक DATA'!B121=\"\",\"\",'शालादर्पण कार्मिक DATA'!B121)","v":""},{"$nulls":5},{"$f":"IF('शालादर्पण कार्मिक DATA'!#REF!=\"\",\"\",'शालादर्पण कार्मिक DATA'!#REF!)","v":{"$error":"#REF!"}}]
[{"$f":"IF(कार्मिक_विवरण[NAME]=\"\",\"\",ROWS($A$2:A120))","v":""},{"$f":"IF('शालादर्पण कार्मिक DATA'!A122=\"\",\"\",'शालादर्पण कार्मिक DATA'!A122)","v":""},{"$f":"UPPER(IF('शालादर्पण कार्मिक DATA'!F122=\"\",\"\",'शालादर्पण कार्मिक DATA'!F122))","v":""},{"$f":"IF('शालादर्पण कार्मिक DATA'!E122=\"\",\"\",'शालादर्पण कार्मिक DATA'!E122)","v":""},{"$f":"IF('शालादर्पण कार्मिक DATA'!K122=\"\",\"\",'शालादर्पण कार्मिक DATA'!K122)","v":""},{"$f":"IF('शालादर्पण कार्मिक DATA'!B122=\"\",\"\",'शालादर्पण कार्मिक DATA'!B122)","v":""},{"$nulls":5},{"$f":"IF('शालादर्पण कार्मिक DATA'!#REF!=\"\",\"\",'शालादर्पण कार्मिक DATA'!#REF!)","v":{"$error":"#REF!"}}]
[{"$f":"IF(कार्मिक_विवरण[NAME]=\"\",\"\",ROWS($A$2:A121))","v":""},{"$f":"IF('शालादर्पण कार्मिक DATA'!A123=\"\",\"\",'शालादर्पण कार्मिक DATA'!A123)","v":""},{"$f":"UPPER(IF('शालादर्पण कार्मिक DATA'!F123=\"\",\"\",'शालादर्पण कार्मिक DATA'!F123))","v":""},{"$f":"IF('शालादर्पण कार्मिक DATA'!E123=\"\",\"\",'शालादर्पण कार्मिक DATA'!E123)","v":""},{"$f":"IF('शालादर्पण कार्मिक DATA'!K123=\"\",\"\",'शालादर्पण कार्मिक DATA'!K123)","v":""},{"$f":"IF('शालादर्पण कार्मिक DATA'!B123=\"\",\"\",'शालादर्पण कार्मिक DATA'!B123)","v":""},{"$nulls":5},{"$f":"IF('शालादर्पण कार्मिक DATA'!#REF!=\"\",\"\",'शालादर्पण कार्मिक DATA'!#REF!)","v":{"$error":"#REF!"}}]
[{"$f":"IF(कार्मिक_विवरण[NAME]=\"\",\"\",ROWS($A$2:A122))","v":""},{"$f":"IF('शालादर्पण कार्मिक DATA'!A124=\"\",\"\",'शालादर्पण कार्मिक DATA'!A124)","v":""},{"$f":"UPPER(IF('शालादर्पण कार्मिक DATA'!F124=\"\",\"\",'शालादर्पण कार्मिक DATA'!F124))","v":""},{"$f":"IF('शालादर्पण कार्मिक DATA'!E124=\"\",\"\",'शालादर्पण कार्मिक DATA'!E124)","v":""},{"$f":"IF('शालादर्पण कार्मिक DATA'!K124=\"\",\"\",'शालादर्पण कार्मिक DATA'!K124)","v":""},{"$f":"IF('शालादर्पण कार्मिक DATA'!B124=\"\",\"\",'शालादर्पण कार्मिक DATA'!B124)","v":""},{"$nulls":5},{"$f":"IF('शालादर्पण कार्मिक DATA'!#REF!=\"\",\"\",'शालादर्पण कार्मिक DATA'!#REF!)","v":{"$error":"#REF!"}}]
[{"$f":"IF(कार्मिक_विवरण[NAME]=\"\",\"\",ROWS($A$2:A123))","v":""},{"$f":"IF('शालादर्पण कार्मिक DATA'!A125=\"\",\"\",'शालादर्पण कार्मिक DATA'!A125)","v":""},{"$f":"UPPER(IF('शालादर्पण कार्मिक DATA'!F125=\"\",\"\",'शालादर्पण कार्मिक DATA'!F125))","v":""},{"$f":"IF('शालादर्पण कार्मिक DATA'!E125=\"\",\"\",'शालादर्पण कार्मिक DATA'!E125)","v":""},{"$f":"IF('शालादर्पण कार्मिक DATA'!K125=\"\",\"\",'शालादर्पण कार्मिक DATA'!K125)","v":""},{"$f":"IF('शालादर्पण कार्मिक DATA'!B125=\"\",\"\",'शालादर्पण कार्मिक DATA'!B125)","v":""},{"$nulls":5},{"$f":"IF('शालादर्पण कार्मिक DATA'!#REF!=\"\",\"\",'शालादर्पण कार्मिक DATA'!#REF!)","v":{"$error":"#REF!"}}]
[{"$f":"IF(कार्मिक_विवरण[NAME]=\"\",\"\",ROWS($A$2:A124))","v":""},{"$f":"IF('शालादर्पण कार्मिक DATA'!A126=\"\",\"\",'शालादर्पण कार्मिक DATA'!A126)","v":""},{"$f":"UPPER(IF('शालादर्पण कार्मिक DATA'!F126=\"\",\"\",'शालादर्पण कार्मिक DATA'!F126))","v":""},{"$f":"IF('शालादर्पण कार्मिक DATA'!E126=\"\",\"\",'शालादर्पण कार्मिक DATA'!E126)","v":""},{"$f":"IF('शालादर्पण कार्मिक DATA'!K126=\"\",\"\",'शालादर्पण कार्मिक DATA'!K126)","v":""},{"$f":"IF('शालादर्पण कार्मिक DATA'!B126=\"\",\"\",'शालादर्पण कार्मिक DATA'!B126)","v":""},{"$nulls":5},{"$f":"IF('शालादर्पण कार्मिक DATA'!#REF!=\"\",\"\",'शालादर्पण कार्मिक DATA'!#REF!)","v":{"$error":"#REF!"}}]
[{"$f":"IF(कार्मिक_विवरण[NAME]=\"\",\"\",ROWS($A$2:A125))","v":""},{"$f":"IF('शालादर्पण कार्मिक DATA'!A127=\"\",\"\",'शालादर्पण कार्मिक DATA'!A127)","v":""},{"$f":"UPPER(IF('शालादर्पण कार्मिक DATA'!F127=\"\",\"\",'शालादर्पण कार्मिक DATA'!F127))","v":""},{"$f":"IF('शालादर्पण कार्मिक DATA'!E127=\"\",\"\",'शालादर्पण कार्मिक DATA'!E127)","v":""},{"$f":"IF('शालादर्पण कार्मिक DATA'!K127=\"\",\"\",'शालादर्पण कार्मिक DATA'!K127)","v":""},{"$f":"IF('शालादर्पण कार्मिक DATA'!B127=\"\",\"\",'शालादर्पण कार्मिक DATA'!B127)","v":""},{"$nulls":5},{"$f":"IF('शालादर्पण कार्मिक DATA'!#REF!=\"\",\"\",'शालादर्पण कार्मिक DATA'!#REF!)","v":{"$error":"#REF!"}}]
[{"$f":"IF(कार्मिक_विवरण[NAME]=\"\",\"\",ROWS($A$2:A126))","v":""},{"$f":"IF('शालादर्पण कार्मिक DATA'!A128=\"\",\"\",'शालादर्पण कार्मिक DATA'!A128)","v":""},{"$f":"UPPER(IF('शालादर्पण कार्मिक DATA'!F128=\"\",\"\",'शालादर्पण कार्मिक DATA'!F128))","v":""},{"$f":"IF('शालादर्पण कार्मिक DATA'!E128=\"\",\"\",'शालादर्पण कार्मिक DATA'!E128)","v":""},{"$f":"IF('शालादर्पण कार्मिक DATA'!K128=\"\",\"\",'शालादर्पण कार्मिक DATA'!K128)","v":""},{"$f":"IF('शालादर्पण कार्मिक DATA'!B128=\"\",\"\",'शालादर्पण कार्मिक DATA'!B128)","v":""},{"$nulls":5},{"$f":"IF('शालादर्पण कार्मिक DATA'!#REF!=\"\",\"\",'शालादर्पण कार्मिक DATA'!#REF!)","v":{"$error":"#REF!"}}]
[{"$f":"IF(कार्मिक_विवरण[NAME]=\"\",\"\",ROWS($A$2:A127))","v":""},{"$f":"IF('शालादर्पण कार्मिक DATA'!A129=\"\",\"\",'शालादर्पण कार्मिक DATA'!A129)","v":""},{"$f":"UPPER(IF('शालादर्पण कार्मिक DATA'!F129=\"\",\"\",'शालादर्पण कार्मिक DATA'!F129))","v":""},{"$f":"IF('शालादर्पण कार्मिक DATA'!E129=\"\",\"\",'शालादर्पण कार्मिक DATA'!E129)","v":""},{"$f":"IF('शालादर्पण कार्मिक DATA'!K129=\"\",\"\",'शालादर्पण कार्मिक DATA'!K129)","v":""},{"$f":"IF('शालादर्पण कार्मिक DATA'!B129=\"\",\"\",'शालादर्पण कार्मिक DATA'!B129)","v":""},{"$nulls":5},{"$f":"IF('शालादर्पण कार्मिक DATA'!#REF!=\"\",\"\",'शालादर्पण कार्मिक DATA'!#REF!)","v":{"$error":"#REF!"}}]
[{"$f":"IF(कार्मिक_विवरण[NAME]=\"\",\"\",ROWS($A$2:A128))","v":""},{"$f":"IF('शालादर्पण कार्मिक DATA'!A130=\"\",\"\",'शालादर्पण कार्मिक DATA'!A130)","v":""},{"$f":"UPPER(IF('शालादर्पण कार्मिक DATA'!F130=\"\",\"\",'शालादर्पण कार्मिक DATA'!F130))","v":""},{"$f":"IF('शालादर्पण कार्मिक DATA'!E130=\"\",\"\",'शालादर्पण कार्मिक DATA'!E130)","v":""},{"$f":"IF('शालादर्पण कार्मिक DATA'!K130=\"\",\"\",'शालादर्पण कार्मिक DATA'!K130)","v":""},{"$f":"IF('शालादर्पण कार्मिक DATA'!B130=\"\",\"\",'शालादर्पण कार्मिक DATA'!B130)","v":""},{"$nulls":5},{"$f":"IF('शालादर्पण कार्मिक DATA'!#REF!=\"\",\"\",'शालादर्पण कार्मिक DATA'!#REF!)","v":{"$error":"#REF!"}}]
[{"$f":"IF(कार्मिक_विवरण[NAME]=\"\",\"\",ROWS($A$2:A129))","v":""},{"$f":"IF('शालादर्पण कार्मिक DATA'!A131=\"\",\"\",'शालादर्पण कार्मिक DATA'!A131)","v":""},{"$f":"UPPER(IF('शालादर्पण कार्मिक DATA'!F131=\"\",\"\",'शालादर्पण कार्मिक DATA'!F131))","v":""},{"$f":"IF('शालादर्पण कार्मिक DATA'!E131=\"\",\"\",'शालादर्पण कार्मिक DATA'!E131)","v":""},{"$f":"IF('शालादर्पण कार्मिक DATA'!K131=\"\",\"\",'शालादर्पण कार्मिक DATA'!K131)","v":""},{"$f":"IF('शालादर्पण कार्मिक DATA'!B131=\"\",\"\",'शालादर्पण कार्मिक DATA'!B131)","v":""},{"$nulls":5},{"$f":"IF('शालादर्पण कार्मिक DATA'!#REF!=\"\",\"\",'शालादर्पण कार्मिक DATA'!#REF!)","v":{"$error":"#REF!"}}]
[{"$f":"IF(कार्मिक_विवरण[NAME]=\"\",\"\",ROWS($A$2:A130))","v":""},{"$f":"IF('शालादर्पण कार्मिक DATA'!A132=\"\",\"\",'शालादर्पण कार्मिक DATA'!A132)","v":""},{"$f":"UPPER(IF('शालादर्पण कार्मिक DATA'!F132=\"\",\"\",'शालादर्पण कार्मिक DATA'!F132))","v":""},{"$f":"IF('शालादर्पण कार्मिक DATA'!E132=\"\",\"\",'शालादर्पण कार्मिक DATA'!E132)","v":""},{"$f":"IF('शालादर्पण कार्मिक DATA'!K132=\"\",\"\",'शालादर्पण कार्मिक DATA'!K132)","v":""},{"$f":"IF('शालादर्पण कार्मिक DATA'!B132=\"\",\"\",'शालादर्पण कार्मिक DATA'!B132)","v":""},{"$nulls":5},{"$f":"IF('शालादर्पण कार्मिक DATA'!#REF!=\"\",\"\",'शालादर्पण कार्मिक DATA'!#REF!)","v":{"$error":"#REF!"}}]
[{"$f":"IF(कार्मिक_विवरण[NAME]=\"\",\"\",ROWS($A$2:A131))","v":""},{"$f":"IF('शालादर्पण कार्मिक DATA'!A133=\"\",\"\",'शालादर्पण कार्मिक DATA'!A133)","v":""},{"$f":"UPPER(IF('शालादर्पण कार्मिक DATA'!F133=\"\",\"\",'शालादर्पण कार्मिक DATA'!F133))","v":""},{"$f":"IF('शालादर्पण कार्मिक DATA'!E133=\"\",\"\",'शालादर्पण कार्मिक DATA'!E133)","v":""},{"$f":"IF('शालादर्पण कार्मिक DATA'!K133=\"\",\"\",'शालादर्पण कार्मिक DATA'!K133)","v":""},{"$f":"IF('शालादर्पण कार्मिक DATA'!B133=\"\",\"\",'शालादर्पण कार्मिक DATA'!B133)","v":""},{"$nulls":5},{"$f":"IF('शालादर्पण कार्मिक DATA'!#REF!=\"\",\"\",'शालादर्पण कार्मिक DATA'!#REF!)","v":{"$error":"#REF!"}}]
[{"$f":"IF(कार्मिक_विवरण[NAME]=\"\",\"\",ROWS($A$2:A132))","v":""},{"$f":"IF('शालादर्पण कार्मिक DATA'!A134=\"\",\"\",'शालादर्पण कार्मिक DATA'!A134)","v":""},{"$f":"UPPER(IF('शालादर्पण कार्मिक DATA'!F134=\"\",\"\",'शालादर्पण कार्मिक DATA'!F134))","v":""},{"$f":"IF('शालादर्पण कार्मिक DATA'!E134=\"\",\"\",'शालादर्पण कार्मिक DATA'!E134)","v":""},{"$f":"IF('शालादर्पण कार्मिक DATA'!K134=\"\",\"\",'शालादर्पण कार्मिक DATA'!K134)","v":""},{"$f":"IF('शालादर्पण कार्मिक DATA'!B134=\"\",\"\",'शालादर्पण कार्मिक DATA'!B134)","v":""},{"$nulls":5},{"$f":"IF('शालादर्पण कार्मिक DATA'!#REF!=\"\",\"\",'शालादर्पण कार्मिक DATA'!#REF!)","v":{"$error":"#REF!"}}]
[{"$f":"IF(कार्मिक_विवरण[NAME]=\"\",\"\",ROWS($A$2:A133))","v":""},{"$f":"IF('शालादर्पण कार्मिक DATA'!A135=\"\",\"\",'शालादर्पण कार्मिक DATA'!A135)","v":""},{"$f":"UPPER(IF('शालादर्पण कार्मिक DATA'!F135=\"\",\"\",'शालादर्पण कार्मिक DATA'!F135))","v":""},{"$f":"IF('शालादर्पण कार्मिक DATA'!E135=\"\",\"\",'शालादर्पण कार्मिक DATA'!E135)","v":""},{"$f":"IF('शालादर्पण कार्मिक DATA'!K135=\"\",\"\",'शालादर्पण कार्मिक DATA'!K135)","v":""},{"$f":"IF('शालादर्पण कार्मिक DATA'!B135=\"\",\"\",'शालादर्पण कार्मिक DATA'!B135)","v":""},{"$nulls":5},{"$f":"IF('शालादर्पण कार्मिक DATA'!#REF!=\"\",\"\",'शालादर्पण कार्मिक DATA'!#REF!)","v":{"$error":"#REF!"}}]
[{"$f":"IF(कार्मिक_विवरण[NAME]=\"\",\"\",ROWS($A$2:A134))","v":""},{"$f":"IF('शालादर्पण कार्मिक DATA'!A136=\"\",\"\",'शालादर्पण कार्मिक DATA'!A136)","v":""},{"$f":"UPPER(IF('शालादर्पण कार्मिक DATA'!F136=\"\",\"\",'शालादर्पण कार्मिक DATA'!F136))","v":""},{"$f":"IF('शालादर्पण कार्मिक DATA'!E136=\"\",\"\",'शालादर्पण कार्मिक DATA'!E136)","v":""},{"$f":"IF('शालादर्पण कार्मिक DATA'!K136=\"\",\"\",'शालादर्पण कार्मिक DATA'!K136)","v":""},{"$f":"IF('शालादर्पण कार्मिक DATA'!B136=\"\",\"\",'शालादर्पण कार्मिक DATA'!B136)","v":""},{"$nulls":5},{"$f":"IF('शालादर्पण कार्मिक DATA'!#REF!=\"\",\"\",'शालादर्पण कार्मिक DATA'!#REF!)","v":{"$error":"#REF!"}}]
[{"$f":"IF(कार्मिक_विवरण[NAME]=\"\",\"\",ROWS($A$2:A135))","v":""},{"$f":"IF('शालादर्पण कार्मिक DATA'!A137=\"\",\"\",'शालादर्पण कार्मिक DATA'!A137)","v":""},{"$f":"UPPER(IF('शालादर्पण कार्मिक DATA'!F137=\"\",\"\",'शालादर्पण कार्मिक DATA'!F137))","v":""},{"$f":"IF('शालादर्पण कार्मिक DATA'!E137=\"\",\"\",'शालादर्पण कार्मिक DATA'!E137)","v":""},{"$f":"IF('शालादर्पण कार्मिक DATA'!K137=\"\",\"\",'शालादर्पण कार्मिक DATA'!K137)","v":""},{"$f":"IF('शालादर्पण कार्मिक DATA'!B137=\"\",\"\",'शालादर्पण कार्मिक DATA'!B137)","v":""},{"$nulls":5},{"$f":"IF('शालादर्पण कार्मिक DATA'!#REF!=\"\",\"\",'शालादर्पण कार्मिक DATA'!#REF!)","v":{"$error":"#REF!"}}]
[{"$f":"IF(कार्मिक_विवरण[NAME]=\"\",\"\",ROWS($A$2:A136))","v":""},{"$f":"IF('शालादर्पण कार्मिक DATA'!A138=\"\",\"\",'शालादर्पण कार्मिक DATA'!A138)","v":""},{"$f":"UPPER(IF('शालादर्पण कार्मिक DATA'!F138=\"\",\"\",'शालादर्पण कार्मिक DATA'!F138))","v":""},{"$f":"IF('शालादर्पण कार्मिक DATA'!E138=\"\",\"\",'शालादर्पण कार्मिक DATA'!E138)","v":""},{"$f":"IF('शालादर्पण कार्मिक DATA'!K138=\"\",\"\",'शालादर्पण कार्मिक DATA'!K138)","v":""},{"$f":"IF('शालादर्पण कार्मिक DATA'!B138=\"\",\"\",'शालादर्पण कार्मिक DATA'!B138)","v":""},{"$nulls":5},{"$f":"IF('शालादर्पण कार्मिक DATA'!#REF!=\"\",\"\",'शालादर्पण कार्मिक DATA'!#REF!)","v":{"$error":"#REF!"}}]
[{"$f":"IF(कार्मिक_विवरण[NAME]=\"\",\"\",ROWS($A$2:A137))","v":""},{"$f":"IF('शालादर्पण कार्मिक DATA'!A139=\"\",\"\",'शालादर्पण कार्मिक DATA'!A139)","v":""},{"$f":"UPPER(IF('शालादर्पण कार्मिक DATA'!F139=\"\",\"\",'शालादर्पण कार्मिक DATA'!F139))","v":""},{"$f":"IF('शालादर्पण कार्मिक DATA'!E139=\"\",\"\",'शालादर्पण कार्मिक DATA'!E139)","v":""},{"$f":"IF('शालादर्पण कार्मिक DATA'!K139=\"\",\"\",'शालादर्पण कार्मिक DATA'!K139)","v":""},{"$f":"IF('शालादर्पण कार्मिक DATA'!B139=\"\",\"\",'शालादर्पण कार्मिक DATA'!B139)","v":""},{"$nulls":5},{"$f":"IF('शालादर्पण कार्मिक DATA'!#REF!=\"\",\"\",'शालादर्पण कार्मिक DATA'!#REF!)","v":{"$error":"#REF!"}}]
[{"$f":"IF(कार्मिक_विवरण[NAME]=\"\",\"\",ROWS($A$2:A138))","v":""},{"$f":"IF('शालादर्पण कार्मिक DATA'!A140=\"\",\"\",'शालादर्पण कार्मिक DATA'!A140)","v":""},{"$f":"UPPER(IF('शालादर्पण कार्मिक DATA'!F140=\"\",\"\",'शालादर्पण कार्मिक DATA'!F140))","v":""},{"$f":"IF('शालादर्पण कार्मिक DATA'!E140=\"\",\"\",'शालादर्पण कार्मिक DATA'!E140)","v":""},{"$f":"IF('शालादर्पण कार्मिक DATA'!K140=\"\",\"\",'शालादर्पण कार्मिक DATA'!K140)","v":""},{"$f":"IF('शालादर्पण कार्मिक DATA'!B140=\"\",\"\",'शालादर्पण कार्मिक DATA'!B140)","v":""},{"$nulls":5},{"$f":"IF('शालादर्पण कार्मिक DATA'!#REF!=\"\",\"\",'शालादर्पण कार्मिक DATA'!#REF!)","v":{"$error":"#REF!"}}]
[{"$f":"IF(कार्मिक_विवरण[NAME]=\"\",\"\",ROWS($A$2:A139))","v":""},{"$f":"IF('शालादर्पण कार्मिक DATA'!A141=\"\",\"\",'शालादर्पण कार्मिक DATA'!A141)","v":""},{"$f":"UPPER(IF('शालादर्पण कार्मिक DATA'!F141=\"\",\"\",'शालादर्पण कार्मिक DATA'!F141))","v":""},{"$f":"IF('शालादर्पण कार्मिक DATA'!E141=\"\",\"\",'शालादर्पण कार्मिक DATA'!E141)","v":""},{"$f":"IF('शालादर्पण कार्मिक DATA'!K141=\"\",\"\",'शालादर्पण कार्मिक DATA'!K141)","v":""},{"$f":"IF('शालादर्पण कार्मिक DATA'!B141=\"\",\"\",'शालादर्पण कार्मिक DATA'!B141)","v":""},{"$nulls":5},{"$f":"IF('शालादर्पण कार्मिक DATA'!#REF!=\"\",\"\",'शालादर्पण कार्मिक DATA'!#REF!)","v":{"$error":"#REF!"}}]
[{"$f":"IF(कार्मिक_विवरण[NAME]=\"\",\"\",ROWS($A$2:A140))","v":""},{"$f":"IF('शालादर्पण कार्मिक DATA'!A142=\"\",\"\",'शालादर्पण कार्मिक DATA'!A142)","v":""},{"$f":"UPPER(IF('शालादर्पण कार्मिक DATA'!F142=\"\",\"\",'शालादर्पण कार्मिक DATA'!F142))","v":""},{"$f":"IF('शालादर्पण कार्मिक DATA'!E142=\"\",\"\",'शालादर्पण कार्मिक DATA'!E142)","v":""},{"$f":"IF('शालादर्पण कार्मिक DATA'!K142=\"\",\"\",'शालादर्पण कार्मिक DATA'!K142)","v":""},{"$f":"IF('शालादर्पण कार्मिक DATA'!B142=\"\",\"\",'शालादर्पण कार्मिक DATA'!B142)","v":""},{"$nulls":5},{"$f":"IF('शालादर्पण कार्मिक DATA'!#REF!=\"\",\"\",'शालादर्पण कार्मिक DATA'!#REF!)","v":{"$error":"#REF!"}}]
[{"$f":"IF(कार्मिक_विवरण[NAME]=\"\",\"\",ROWS($A$2:A141))","v":""},{"$f":"IF('शालादर्पण कार्मिक DATA'!A143=\"\",\"\",'शालादर्पण कार्मिक DATA'!A143)","v":""},{"$f":"UPPER(IF('शालादर्पण कार्मिक DATA'!F143=\"\",\"\",'शालादर्पण कार्मिक DATA'!F143))","v":""},{"$f":"IF('शालादर्पण कार्मिक DATA'!E143=\"\",\"\",'शालादर्पण कार्मिक DATA'!E143)","v":""},{"$f":"IF('शालादर्पण कार्मिक DATA'!K143=\"\",\"\",'शालादर्पण कार्मिक DATA'!K143)","v":""},{"$f":"IF('शालादर्पण कार्मिक DATA'!B143=\"\",\"\",'शालादर्पण कार्मिक DATA'!B143)","v":""},{"$nulls":5},{"$f":"IF('शालादर्पण कार्मिक DATA'!#REF!=\"\",\"\",'शालादर्पण कार्मिक DATA'!#REF!)","v":{"$error":"#REF!"}}]
[{"$f":"IF(कार्मिक_विवरण[NAME]=\"\",\"\",ROWS($A$2:A142))","v":""},{"$f":"IF('शालादर्पण कार्मिक DATA'!A144=\"\",\"\",'शालादर्पण कार्मिक DATA'!A144)","v":""},{"$f":"UPPER(IF('शालादर्पण कार्मिक DATA'!F144=\"\",\"\",'शालादर्पण कार्मिक DATA'!F144))","v":""},{"$f":"IF('शालादर्पण कार्मिक DATA'!E144=\"\",\"\",'शालादर्पण कार्मिक DATA'!E144)","v":""},{"$f":"IF('शालादर्पण कार्मिक DATA'!K144=\"\",\"\",'शालादर्पण कार्मिक DATA'!K144)","v":""},{"$f":"IF('शालादर्पण कार्मिक DATA'!B144=\"\",\"\",'शालादर्पण कार्मिक DATA'!B144)","v":""},{"$nulls":5},{"$f":"IF('शालादर्पण कार्मिक DATA'!#REF!=\"\",\"\",'शालादर्पण कार्मिक DATA'!#REF!)","v":{"$error":"#REF!"}}]
[{"$f":"IF(कार्मिक_विवरण[NAME]=\"\",\"\",ROWS($A$2:A143))","v":""},{"$f":"IF('शालादर्पण कार्मिक DATA'!A145=\"\",\"\",'शालादर्पण कार्मिक DATA'!A145)","v":""},{"$f":"UPPER(IF('शालादर्पण कार्मिक DATA'!F145=\"\",\"\",'शालादर्पण कार्मिक DATA'!F145))","v":""},{"$f":"IF('शालादर्पण कार्मिक DATA'!E145=\"\",\"\",'शालादर्पण कार्मिक DATA'!E145)","v":""},{"$f":"IF('शालादर्पण कार्मिक DATA'!K145=\"\",\"\",'शालादर्पण कार्मिक DATA'!K145)","v":""},{"$f":"IF('शालादर्पण कार्मिक DATA'!B145=\"\",\"\",'शालादर्पण कार्मिक DATA'!B145)","v":""},{"$nulls":5},{"$f":"IF('शालादर्पण कार्मिक DATA'!#REF!=\"\",\"\",'शालादर्पण कार्मिक DATA'!#REF!)","v":{"$error":"#REF!"}}]
[{"$f":"IF(कार्मिक_विवरण[NAME]=\"\",\"\",ROWS($A$2:A144))","v":""},{"$f":"IF('शालादर्पण कार्मिक DATA'!A146=\"\",\"\",'शालादर्पण कार्मिक DATA'!A146)","v":""},{"$f":"UPPER(IF('शालादर्पण कार्मिक DATA'!F146=\"\",\"\",'शालादर्पण कार्मिक DATA'!F146))","v":""},{"$f":"IF('शालादर्पण कार्मिक DATA'!E146=\"\",\"\",'शालादर्पण कार्मिक DATA'!E146)","v":""},{"$f":"IF('शालादर्पण कार्मिक DATA'!K146=\"\",\"\",'शालादर्पण कार्मिक DATA'!K146)","v":""},{"$f":"IF('शालादर्पण कार्मिक DATA'!B146=\"\",\"\",'शालादर्पण कार्मिक DATA'!B146)","v":""},{"$nulls":5},{"$f":"IF('शालादर्पण कार्मिक DATA'!#REF!=\"\",\"\",'शालादर्पण कार्मिक DATA'!#REF!)","v":{"$error":"#REF!"}}]
[{"$f":"IF(कार्मिक_विवरण[NAME]=\"\",\"\",ROWS($A$2:A145))","v":""},{"$f":"IF('शालादर्पण कार्मिक DATA'!A147=\"\",\"\",'शालादर्पण कार्मिक DATA'!A147)","v":""},{"$f":"UPPER(IF('शालादर्पण कार्मिक DATA'!F147=\"\",\"\",'शालादर्पण कार्मिक DATA'!F147))","v":""},{"$f":"IF('शालादर्पण कार्मिक DATA'!E147=\"\",\"\",'शालादर्पण कार्मिक DATA'!E147)","v":""},{"$f":"IF('शालादर्पण कार्मिक DATA'!K147=\"\",\"\",'शालादर्पण कार्मिक DATA'!K147)","v":""},{"$f":"IF('शालादर्पण कार्मिक DATA'!B147=\"\",\"\",'शालादर्पण कार्मिक DATA'!B147)","v":""},{"$nulls":5},{"$f":"IF('शालादर्पण कार्मिक DATA'!#REF!=\"\",\"\",'शालादर्पण कार्मिक DATA'!#REF!)","v":{"$error":"#REF!"}}]
[{"$f":"IF(कार्मिक_विवरण[NAME]=\"\",\"\",ROWS($A$2:A146))","v":""},{"$f":"IF('शालादर्पण कार्मिक DATA'!A148=\"\",\"\",'शालादर्पण कार्मिक DATA'!A148)","v":""},{"$f":"UPPER(IF('शालादर्पण कार्मिक DATA'!F148=\"\",\"\",'शालादर्पण कार्मिक DATA'!F148))","v":""},{"$f":"IF('शालादर्पण कार्मिक DATA'!E148=\"\",\"\",'शालादर्पण कार्मिक DATA'!E148)","v":""},{"$f":"IF('शालादर्पण कार्मिक DATA'!K148=\"\",\"\",'शालादर्पण कार्मिक DATA'!K148)","v":""},{"$f":"IF('शालादर्पण कार्मिक DATA'!B148=\"\",\"\",'शालादर्पण कार्मिक DATA'!B148)","v":""},{"$nulls":5},{"$f":"IF('शालादर्पण कार्मिक DATA'!#REF!=\"\",\"\",'शालादर्पण कार्मिक DATA'!#REF!)","v":{"$error":"#REF!"}}]
[{"$f":"IF(कार्मिक_विवरण[NAME]=\"\",\"\",ROWS($A$2:A147))","v":""},{"$f":"IF('शालादर्पण कार्मिक DATA'!A149=\"\",\"\",'शालादर्पण कार्मिक DATA'!A149)","v":""},{"$f":"UPPER(IF('शालादर्पण कार्मिक DATA'!F149=\"\",\"\",'शालादर्पण कार्मिक DATA'!F149))","v":""},{"$f":"IF('शालादर्पण कार्मिक DATA'!E149=\"\",\"\",'शालादर्पण कार्मिक DATA'!E149)","v":""},{"$f":"IF('शालादर्पण कार्मिक DATA'!K149=\"\",\"\",'शालादर्पण कार्मिक DATA'!K149)","v":""},{"$f":"IF('शालादर्पण कार्मिक DATA'!B149=\"\",\"\",'शालादर्पण कार्मिक DATA'!B149)","v":""},{"$nulls":5},{"$f":"IF('शालादर्पण कार्मिक DATA'!#REF!=\"\",\"\",'शालादर्पण कार्मिक DATA'!#REF!)","v":{"$error":"#REF!"}}]
[{"$f":"IF(कार्मिक_विवरण[NAME]=\"\",\"\",ROWS($A$2:A148))","v":""},{"$f":"IF('शालादर्पण कार्मिक DATA'!A150=\"\",\"\",'शालादर्पण कार्मिक DATA'!A150)","v":""},{"$f":"UPPER(IF('शालादर्पण कार्मिक DATA'!F150=\"\",\"\",'शालादर्पण कार्मिक DATA'!F150))","v":""},{"$f":"IF('शालादर्पण कार्मिक DATA'!E150=\"\",\"\",'शालादर्पण कार्मिक DATA'!E150)","v":""},{"$f":"IF('शालादर्पण कार्मिक DATA'!K150=\"\",\"\",'शालादर्पण कार्मिक DATA'!K150)","v":""},{"$f":"IF('शालादर्पण कार्मिक DATA'!B150=\"\",\"\",'शालादर्पण कार्मिक DATA'!B150)","v":""},{"$nulls":5},{"$f":"IF('शालादर्पण कार्मिक DATA'!#REF!=\"\",\"\",'शालादर्पण कार्मिक DATA'!#REF!)","v":{"$error":"#REF!"}}]
[{"$f":"IF(कार्मिक_विवरण[NAME]=\"\",\"\",ROWS($A$2:A149))","v":""},{"$f":"IF('शालादर्पण कार्मिक DATA'!A151=\"\",\"\",'शालादर्पण कार्मिक DATA'!A151)","v":""},{"$f":"UPPER(IF('शालादर्पण कार्मिक DATA'!F151=\"\",\"\",'शालादर्पण कार्मिक DATA'!F151))","v":""},{"$f":"IF('शालादर्पण कार्मिक DATA'!E151=\"\",\"\",'शालादर्पण कार्मिक DATA'!E151)","v":""},{"$f":"IF('शालादर्पण कार्मिक DATA'!K151=\"\",\"\",'शालादर्पण कार्मिक DATA'!K151)","v":""},{"$f":"IF('शालादर्पण कार्मिक DATA'!B151=\"\",\"\",'शालादर्पण कार्मिक DATA'!B151)","v":""},{"$nulls":5},{"$f":"IF('शालादर्पण कार्मिक DATA'!#REF!=\"\",\"\",'शालादर्पण कार्मिक DATA'!#REF!)","v":{"$error":"#REF!"}}]
[{"$f":"IF(कार्मिक_विवरण[NAME]=\"\",\"\",ROWS($A$2:A150))","v":""},{"$f":"IF('शालादर्पण कार्मिक DATA'!A152=\"\",\"\",'शालादर्पण कार्मिक DATA'!A152)","v":""},{"$f":"UPPER(IF('शालादर्पण कार्मिक DATA'!F152=\"\",\"\",'शालादर्पण कार्मिक DATA'!F152))","v":""},{"$f":"IF('शालादर्पण कार्मिक DATA'!E152=\"\",\"\",'शालादर्पण कार्मिक DATA'!E152)","v":""},{"$f":"IF('शालादर्पण कार्मिक DATA'!K152=\"\",\"\",'शालादर्पण कार्मिक DATA'!K152)","v":""},{"$f":"IF('शालादर्पण कार्मिक DATA'!B152=\"\",\"\",'शालादर्पण कार्मिक DATA'!B152)","v":""},{"$nulls":5},{"$f":"IF('शालादर्पण कार्मिक DATA'!#REF!=\"\",\"\",'शालादर्पण कार्मिक DATA'!#REF!)","v":{"$error":"#REF!"}}]
[{"$f":"IF(कार्मिक_विवरण[NAME]=\"\",\"\",ROWS($A$2:A151))","v":""},{"$f":"IF('शालादर्पण कार्मिक DATA'!A153=\"\",\"\",'शालादर्पण कार्मिक DATA'!A153)","v":""},{"$f":"UPPER(IF('शालादर्पण कार्मिक DATA'!F153=\"\",\"\",'शालादर्पण कार्मिक DATA'!F153))","v":""},{"$f":"IF('शालादर्पण कार्मिक DATA'!E153=\"\",\"\",'शालादर्पण कार्मिक DATA'!E153)","v":""},{"$f":"IF('शालादर्पण कार्मिक DATA'!K153=\"\",\"\",'शालादर्पण कार्मिक DATA'!K153)","v":""},{"$f":"IF('शालादर्पण कार्मिक DATA'!B153=\"\",\"\",'शालादर्पण कार्मिक DATA'!B153)","v":""},{"$nulls":5},{"$f":"IF('शालादर्पण कार्मिक DATA'!#REF!=\"\",\"\",'शालादर्पण कार्मिक DATA'!#REF!)","v":{"$error":"#REF!"}}]
[{"$f":"IF(कार्मिक_विवरण[NAME]=\"\",\"\",ROWS($A$2:A152))","v":""},{"$f":"IF('शालादर्पण कार्मिक DATA'!A154=\"\",\"\",'शालादर्पण कार्मिक DATA'!A154)","v":""},{"$f":"UPPER(IF('शालादर्पण कार्मिक DATA'!F154=\"\",\"\",'शालादर्पण कार्मिक DATA'!F154))","v":""},{"$f":"IF('शालादर्पण कार्मिक DATA'!E154=\"\",\"\",'शालादर्पण कार्मिक DATA'!E154)","v":""},{"$f":"IF('शालादर्पण कार्मिक DATA'!K154=\"\",\"\",'शालादर्पण कार्मिक DATA'!K154)","v":""},{"$f":"IF('शालादर्पण कार्मिक DATA'!B154=\"\",\"\",'शालादर्पण कार्मिक DATA'!B154)","v":""},{"$nulls":5},{"$f":"IF('शालादर्पण कार्मिक DATA'!#REF!=\"\",\"\",'शालादर्पण कार्मिक DATA'!#REF!)","v":{"$error":"#REF!"}}]
[{"$f":"IF(कार्मिक_विवरण[NAME]=\"\",\"\",ROWS($A$2:A153))","v":""},{"$f":"IF('शालादर्पण कार्मिक DATA'!A155=\"\",\"\",'शालादर्पण कार्मिक DATA'!A155)","v":""},{"$f":"UPPER(IF('शालादर्पण कार्मिक DATA'!F155=\"\",\"\",'शालादर्पण कार्मिक DATA'!F155))","v":""},{"$f":"IF('शालादर्पण कार्मिक DATA'!E155=\"\",\"\",'शालादर्पण कार्मिक DATA'!E155)","v":""},{"$f":"IF('शालादर्पण कार्मिक DATA'!K155=\"\",\"\",'शालादर्पण कार्मिक DATA'!K155)","v":""},{"$f":"IF('शालादर्पण कार्मिक DATA'!B155=\"\",\"\",'शालादर्पण कार्मिक DATA'!B155)","v":""},{"$nulls":5},{"$f":"IF('शालादर्पण कार्मिक DATA'!#REF!=\"\",\"\",'शालादर्पण कार्मिक DATA'!#REF!)","v":{"$error":"#REF!"}}]
[{"$f":"IF(कार्मिक_विवरण[NAME]=\"\",\"\",ROWS($A$2:A154))","v":""},{"$f":"IF('शालादर्पण कार्मिक DATA'!A156=\"\",\"\",'शालादर्पण कार्मिक DATA'!A156)","v":""},{"$f":"UPPER(IF('शालादर्पण कार्मिक DATA'!F156=\"\",\"\",'शालादर्पण कार्मिक DATA'!F156))","v":""},{"$f":"IF('शालादर्पण कार्मिक DATA'!E156=\"\",\"\",'शालादर्पण कार्मिक DATA'!E156)","v":""},{"$f":"IF('शालादर्पण कार्मिक DATA'!K156=\"\",\"\",'शालादर्पण कार्मिक DATA'!K156)","v":""},{"$f":"IF('शालादर्पण कार्मिक DATA'!B156=\"\",\"\",'शालादर्पण कार्मिक DATA'!B156)","v":""},{"$nulls":5},{"$f":"IF('शालादर्पण कार्मिक DATA'!#REF!=\"\",\"\",'शालादर्पण कार्मिक DATA'!#REF!)","v":{"$error":"#REF!"}}]
[{"$f":"IF(कार्मिक_विवरण[NAME]=\"\",\"\",ROWS($A$2:A155))","v":""},{"$f":"IF('शालादर्पण कार्मिक DATA'!A157=\"\",\"\",'शालादर्पण कार्मिक DATA'!A157)","v":""},{"$f":"UPPER(IF('शालादर्पण कार्मिक DATA'!F157=\"\",\"\",'शालादर्पण कार्मिक DATA'!F157))","v":""},{"$f":"IF('शालादर्पण कार्मिक DATA'!E157=\"\",\"\",'शालादर्पण कार्मिक DATA'!E157)","v":""},{"$f":"IF('शालादर्पण कार्मिक DATA'!K157=\"\",\"\",'शालादर्पण कार्मिक DATA'!K157)","v":""},{"$f":"IF('शालादर्पण कार्मिक DATA'!B157=\"\",\"\",'शालादर्पण कार्मिक DATA'!B157)","v":""},{"$nulls":5},{"$f":"IF('शालादर्पण कार्मिक DATA'!#REF!=\"\",\"\",'शालादर्पण कार्मिक DATA'!#REF!)","v":{"$error":"#REF!"}}]
[{"$f":"IF(कार्मिक_विवरण[NAME]=\"\",\"\",ROWS($A$2:A156))","v":""},{"$f":"IF('शालादर्पण कार्मिक DATA'!A158=\"\",\"\",'शालादर्पण कार्मिक DATA'!A158)","v":""},{"$f":"UPPER(IF('शालादर्पण कार्मिक DATA'!F158=\"\",\"\",'शालादर्पण कार्मिक DATA'!F158))","v":""},{"$f":"IF('शालादर्पण कार्मिक DATA'!E158=\"\",\"\",'शालादर्पण कार्मिक DATA'!E158)","v":""},{"$f":"IF('शालादर्पण कार्मिक DATA'!K158=\"\",\"\",'शालादर्पण कार्मिक DATA'!K158)","v":""},{"$f":"IF('शालादर्पण कार्मिक DATA'!B158=\"\",\"\",'शालादर्पण कार्मिक DATA'!B158)","v":""},{"$nulls":5},{"$f":"IF('शालादर्पण कार्मिक DATA'!#REF!=\"\",\"\",'शालादर्पण कार्मिक DATA'!#REF!)","v":{"$error":"#REF!"}}]
[{"$f":"IF(कार्मिक_विवरण[NAME]=\"\",\"\",ROWS($A$2:A157))","v":""},{"$f":"IF('शालादर्पण कार्मिक DATA'!A159=\"\",\"\",'शालादर्पण कार्मिक DATA'!A159)","v":""},{"$f":"UPPER(IF('शालादर्पण कार्मिक DATA'!F159=\"\",\"\",'शालादर्पण कार्मिक DATA'!F159))","v":""},{"$f":"IF('शालादर्पण कार्मिक DATA'!E159=\"\",\"\",'शालादर्पण कार्मिक DATA'!E159)","v":""},{"$f":"IF('शालादर्पण कार्मिक DATA'!K159=\"\",\"\",'शालादर्पण कार्मिक DATA'!K159)","v":""},{"$f":"IF('शालादर्पण कार्मिक DATA'!B159=\"\",\"\",'शालादर्पण कार्मिक DATA'!B159)","v":""},{"$nulls":5},{"$f":"IF('शालादर्पण कार्मिक DATA'!#REF!=\"\",\"\",'शालादर्पण कार्मिक DATA'!#REF!)","v":{"$error":"#REF!"}}]
[{"$f":"IF(कार्मिक_विवरण[NAME]=\"\",\"\",ROWS($A$2:A158))","v":""},{"$f":"IF('शालादर्पण कार्मिक DATA'!A160=\"\",\"\",'शालादर्पण कार्मिक DATA'!A160)","v":""},{"$f":"UPPER(IF('शालादर्पण कार्मिक DATA'!F160=\"\",\"\",'शालादर्पण कार्मिक DATA'!F160))","v":""},{"$f":"IF('शालादर्पण कार्मिक DATA'!E160=\"\",\"\",'शालादर्पण कार्मिक DATA'!E160)","v":""},{"$f":"IF('शालादर्पण कार्मिक DATA'!K160=\"\",\"\",'शालादर्पण कार्मिक DATA'!K160)","v":""},{"$f":"IF('शालादर्पण कार्मिक DATA'!B160=\"\",\"\",'शालादर्पण कार्मिक DATA'!B160)","v":""},{"$nulls":5},{"$f":"IF('शालादर्पण कार्मिक DATA'!#REF!=\"\",\"\",'शालादर्पण कार्मिक DATA'!#REF!)","v":{"$error":"#REF!"}}]
[{"$f":"IF(कार्मिक_विवरण[NAME]=\"\",\"\",ROWS($A$2:A159))","v":""},{"$f":"IF('शालादर्पण कार्मिक DATA'!A161=\"\",\"\",'शालादर्पण कार्मिक DATA'!A161)","v":""},{"$f":"UPPER(IF('शालादर्पण कार्मिक DATA'!F161=\"\",\"\",'शालादर्पण कार्मिक DATA'!F161))","v":""},{"$f":"IF('शालादर्पण कार्मिक DATA'!E161=\"\",\"\",'शालादर्पण कार्मिक DATA'!E161)","v":""},{"$f":"IF('शालादर्पण कार्मिक DATA'!K161=\"\",\"\",'शालादर्पण कार्मिक DATA'!K161)","v":""},{"$f":"IF('शालादर्पण कार्मिक DATA'!B161=\"\",\"\",'शालादर्पण कार्मिक DATA'!B161)","v":""},{"$nulls":5},{"$f":"IF('शालादर्पण कार्मिक DATA'!#REF!=\"\",\"\",'शालादर्पण कार्मिक DATA'!#REF!)","v":{"$error":"#REF!"}}]
[{"$f":"IF(कार्मिक_विवरण[NAME]=\"\",\"\",ROWS($A$2:A160))","v":""},{"$f":"IF('शालादर्पण कार्मिक DATA'!A162=\"\",\"\",'शालादर्पण कार्मिक DATA'!A162)","v":""},{"$f":"UPPER(IF('शालादर्पण कार्मिक DATA'!F162=\"\",\"\",'शालादर्पण कार्मिक DATA'!F162))","v":""},{"$f":"IF('शालादर्पण कार्मिक DATA'!E162=\"\",\"\",'शालादर्पण कार्मिक DATA'!E162)","v":""},{"$f":"IF('शालादर्पण कार्मिक DATA'!K162=\"\",\"\",'शालादर्पण कार्मिक DATA'!K162)","v":""},{"$f":"IF('शालादर्पण कार्मिक DATA'!B162=\"\",\"\",'शालादर्पण कार्मिक DATA'!B162)","v":""},{"$nulls":5},{"$f":"IF('शालादर्पण कार्मिक DATA'!#REF!=\"\",\"\",'शालादर्पण कार्मिक DATA'!#REF!)","v":{"$error":"#REF!"}}]
[{"$f":"IF(कार्मिक_विवरण[NAME]=\"\",\"\",ROWS($A$2:A161))","v":""},{"$f":"IF('शालादर्पण कार्मिक DATA'!A163=\"\",\"\",'शालादर्पण कार्मिक DATA'!A163)","v":""},{"$f":"UPPER(IF('शालादर्पण कार्मिक DATA'!F163=\"\",\"\",'शालादर्पण कार्मिक DATA'!F163))","v":""},{"$f":"IF('शालादर्पण कार्मिक DATA'!E163=\"\",\"\",'शालादर्पण कार्मिक DATA'!E163)","v":""},{"$f":"IF('शालादर्पण कार्मिक DATA'!K163=\"\",\"\",'शालादर्पण कार्मिक DATA'!K163)","v":""},{"$f":"IF('शालादर्पण कार्मिक DATA'!B163=\"\",\"\",'शालादर्पण कार्मिक DATA'!B163)","v":""},{"$nulls":5},{"$f":"IF('शालादर्पण कार्मिक DATA'!#REF!=\"\",\"\",'शालादर्पण कार्मिक DATA'!#REF!)","v":{"$error":"#REF!"}}]
[{"$f":"IF(कार्मिक_विवरण[NAME]=\"\",\"\",ROWS($A$2:A162))","v":""},{"$f":"IF('शालादर्पण कार्मिक DATA'!A164=\"\",\"\",'शालादर्पण कार्मिक DATA'!A164)","v":""},{"$f":"UPPER(IF('शालादर्पण कार्मिक DATA'!F164=\"\",\"\",'शालादर्पण कार्मिक DATA'!F164))","v":""},{"$f":"IF('शालादर्पण कार्मिक DATA'!E164=\"\",\"\",'शालादर्पण कार्मिक DATA'!E164)","v":""},{"$f":"IF('शालादर्पण कार्मिक DATA'!K164=\"\",\"\",'शालादर्पण कार्मिक DATA'!K164)","v":""},{"$f":"IF('शालादर्पण कार्मिक DATA'!B164=\"\",\"\",'शालादर्पण कार्मिक DATA'!B164)","v":""},{"$nulls":5},{"$f":"IF('शालादर्पण कार्मिक DATA'!#REF!=\"\",\"\",'शालादर्पण कार्मिक DATA'!#REF!)","v":{"$error":"#REF!"}}]
[{"$f":"IF(कार्मिक_विवरण[NAME]=\"\",\"\",ROWS($A$2:A163))","v":""},{"$f":"IF('शालादर्पण कार्मिक DATA'!A165=\"\",\"\",'शालादर्पण कार्मिक DATA'!A165)","v":""},{"$f":"UPPER(IF('शालादर्पण कार्मिक DATA'!F165=\"\",\"\",'शालादर्पण कार्मिक DATA'!F165))","v":""},{"$f":"IF('शालादर्पण कार्मिक DATA'!E165=\"\",\"\",'शालादर्पण कार्मिक DATA'!E165)","v":""},{"$f":"IF('शालादर्पण कार्मिक DATA'!K165=\"\",\"\",'शालादर्पण कार्मिक DATA'!K165)","v":""},{"$f":"IF('शालादर्पण कार्मिक DATA'!B165=\"\",\"\",'शालादर्पण कार्मिक DATA'!B165)","v":""},{"$nulls":5},{"$f":"IF('शालादर्पण कार्मिक DATA'!#REF!=\"\",\"\",'शालादर्पण कार्मिक DATA'!#REF!)","v":{"$error":"#REF!"}}]
[{"$f":"IF(कार्मिक_विवरण[NAME]=\"\",\"\",ROWS($A$2:A164))","v":""},{"$f":"IF('शालादर्पण कार्मिक DATA'!A166=\"\",\"\",'शालादर्पण कार्मिक DATA'!A166)","v":""},{"$f":"UPPER(IF('शालादर्पण कार्मिक DATA'!F166=\"\",\"\",'शालादर्पण कार्मिक DATA'!F166))","v":""},{"$f":"IF('शालादर्पण कार्मिक DATA'!E166=\"\",\"\",'शालादर्पण कार्मिक DATA'!E166)","v":""},{"$f":"IF('शालादर्पण कार्मिक DATA'!K166=\"\",\"\",'शालादर्पण कार्मिक DATA'!K166)","v":""},{"$f":"IF('शालादर्पण कार्मिक DATA'!B166=\"\",\"\",'शालादर्पण कार्मिक DATA'!B166)","v":""},{"$nulls":5},{"$f":"IF('शालादर्पण कार्मिक DATA'!#REF!=\"\",\"\",'शालादर्पण कार्मिक DATA'!#REF!)","v":{"$error":"#REF!"}}]
[{"$f":"IF(कार्मिक_विवरण[NAME]=\"\",\"\",ROWS($A$2:A165))","v":""},{"$f":"IF('शालादर्पण कार्मिक DATA'!A167=\"\",\"\",'शालादर्पण कार्मिक DATA'!A167)","v":""},{"$f":"UPPER(IF('शालादर्पण कार्मिक DATA'!F167=\"\",\"\",'शालादर्पण कार्मिक DATA'!F167))","v":""},{"$f":"IF('शालादर्पण कार्मिक DATA'!E167=\"\",\"\",'शालादर्पण कार्मिक DATA'!E167)","v":""},{"$f":"IF('शालादर्पण कार्मिक DATA'!K167=\"\",\"\",'शालादर्पण कार्मिक DATA'!K167)","v":""},{"$f":"IF('शालादर्पण कार्मिक DATA'!B167=\"\",\"\",'शालादर्पण कार्मिक DATA'!B167)","v":""},{"$nulls":5},{"$f":"IF('शालादर्पण कार्मिक DATA'!#REF!=\"\",\"\",'शालादर्पण कार्मिक DATA'!#REF!)","v":{"$error":"#REF!"}}]
[{"$f":"IF(कार्मिक_विवरण[NAME]=\"\",\"\",ROWS($A$2:A166))","v":""},{"$f":"IF('शालादर्पण कार्मिक DATA'!A168=\"\",\"\",'शालादर्पण कार्मिक DATA'!A168)","v":""},{"$f":"UPPER(IF('शालादर्पण कार्मिक DATA'!F168=\"\",\"\",'शालादर्पण कार्मिक DATA'!F168))","v":""},{"$f":"IF('शालादर्पण कार्मिक DATA'!E168=\"\",\"\",'शालादर्पण कार्मिक DATA'!E168)","v":""},{"$f":"IF('शालादर्पण कार्मिक DATA'!K168=\"\",\"\",'शालादर्पण कार्मिक DATA'!K168)","v":""},{"$f":"IF('शालादर्पण कार्मिक DATA'!B168=\"\",\"\",'शालादर्पण कार्मिक DATA'!B168)","v":""},{"$nulls":5},{"$f":"IF('शालादर्पण कार्मिक DATA'!#REF!=\"\",\"\",'शालादर्पण कार्मिक DATA'!#REF!)","v":{"$error":"#REF!"}}]
[{"$f":"IF(कार्मिक_विवरण[NAME]=\"\",\"\",ROWS($A$2:A167))","v":""},{"$f":"IF('शालादर्पण कार्मिक DATA'!A169=\"\",\"\",'शालादर्पण कार्मिक DATA'!A169)","v":""},{"$f":"UPPER(IF('शालादर्पण कार्मिक DATA'!F169=\"\",\"\",'शालादर्पण कार्मिक DATA'!F169))","v":""},{"$f":"IF('शालादर्पण कार्मिक DATA'!E169=\"\",\"\",'शालादर्पण कार्मिक DATA'!E169)","v":""},{"$f":"IF('शालादर्पण कार्मिक DATA'!K169=\"\",\"\",'शालादर्पण कार्मिक DATA'!K169)","v":""},{"$f":"IF('शालादर्पण कार्मिक DATA'!B169=\"\",\"\",'शालादर्पण कार्मिक DATA'!B169)","v":""},{"$nulls":5},{"$f":"IF('शालादर्पण कार्मिक DATA'!#REF!=\"\",\"\",'शालादर्पण कार्मिक DATA'!#REF!)","v":{"$error":"#REF!"}}]
[{"$f":"IF(कार्मिक_विवरण[NAME]=\"\",\"\",ROWS($A$2:A168))","v":""},{"$f":"IF('शालादर्पण कार्मिक DATA'!A170=\"\",\"\",'शालादर्पण कार्मिक DATA'!A170)","v":""},{"$f":"UPPER(IF('शालादर्पण कार्मिक DATA'!F170=\"\",\"\",'शालादर्पण कार्मिक DATA'!F170))","v":""},{"$f":"IF('शालादर्पण कार्मिक DATA'!E170=\"\",\"\",'शालादर्पण कार्मिक DATA'!E170)","v":""},{"$f":"IF('शालादर्पण कार्मिक DATA'!K170=\"\",\"\",'शालादर्पण कार्मिक DATA'!K170)","v":""},{"$f":"IF('शालादर्पण कार्मिक DATA'!B170=\"\",\"\",'शालादर्पण कार्मिक DATA'!B170)","v":""},{"$nulls":5},{"$f":"IF('शालादर्पण कार्मिक DATA'!#REF!=\"\",\"\",'शालादर्पण कार्मिक DATA'!#REF!)","v":{"$error":"#REF!"}}]
[{"$f":"IF(कार्मिक_विवरण[NAME]=\"\",\"\",ROWS($A$2:A169))","v":""},{"$f":"IF('शालादर्पण कार्मिक DATA'!A171=\"\",\"\",'शालादर्पण कार्मिक DATA'!A171)","v":""},{"$f":"UPPER(IF('शालादर्पण कार्मिक DATA'!F171=\"\",\"\",'शालादर्पण कार्मिक DATA'!F171))","v":""},{"$f":"IF('शालादर्पण कार्मिक DATA'!E171=\"\",\"\",'शालादर्पण कार्मिक DATA'!E171)","v":""},{"$f":"IF('शालादर्पण कार्मिक DATA'!K171=\"\",\"\",'शालादर्पण कार्मिक DATA'!K171)","v":""},{"$f":"IF('शालादर्पण कार्मिक DATA'!B171=\"\",\"\",'शालादर्पण कार्मिक DATA'!B171)","v":""},{"$nulls":5},{"$f":"IF('शालादर्पण कार्मिक DATA'!#REF!=\"\",\"\",'शालादर्पण कार्मिक DATA'!#REF!)","v":{"$error":"#REF!"}}]
[{"$f":"IF(कार्मिक_विवरण[NAME]=\"\",\"\",ROWS($A$2:A170))","v":""},{"$f":"IF('शालादर्पण कार्मिक DATA'!A172=\"\",\"\",'शालादर्पण कार्मिक DATA'!A172)","v":""},{"$f":"UPPER(IF('शालादर्पण कार्मिक DATA'!F172=\"\",\"\",'शालादर्पण कार्मिक DATA'!F172))","v":""},{"$f":"IF('शालादर्पण कार्मिक DATA'!E172=\"\",\"\",'शालादर्पण कार्मिक DATA'!E172)","v":""},{"$f":"IF('शालादर्पण कार्मिक DATA'!K172=\"\",\"\",'शालादर्पण कार्मिक DATA'!K172)","v":""},{"$f":"IF('शालादर्पण कार्मिक DATA'!B172=\"\",\"\",'शालादर्पण कार्मिक DATA'!B172)","v":""},{"$nulls":5},{"$f":"IF('शालादर्पण कार्मिक DATA'!#REF!=\"\",\"\",'शालादर्पण कार्मिक DATA'!#REF!)","v":{"$error":"#REF!"}}]
[{"$f":"IF(कार्मिक_विवरण[NAME]=\"\",\"\",ROWS($A$2:A171))","v":""},{"$f":"IF('शालादर्पण कार्मिक DATA'!A173=\"\",\"\",'शालादर्पण कार्मिक DATA'!A173)","v":""},{"$f":"UPPER(IF('शालादर्पण कार्मिक DATA'!F173=\"\",\"\",'शालादर्पण कार्मिक DATA'!F173))","v":""},{"$f":"IF('शालादर्पण कार्मिक DATA'!E173=\"\",\"\",'शालादर्पण कार्मिक DATA'!E173)","v":""},{"$f":"IF('शालादर्पण कार्मिक DATA'!K173=\"\",\"\",'शालादर्पण कार्मिक DATA'!K173)","v":""},{"$f":"IF('शालादर्पण कार्मिक DATA'!B173=\"\",\"\",'शालादर्पण कार्मिक DATA'!B173)","v":""},{"$nulls":5},{"$f":"IF('शालादर्पण कार्मिक DATA'!#REF!=\"\",\"\",'शालादर्पण कार्मिक DATA'!#REF!)","v":{"$error":"#REF!"}}]
[{"$f":"IF(कार्मिक_विवरण[NAME]=\"\",\"\",ROWS($A$2:A172))","v":""},{"$f":"IF('शालादर्पण कार्मिक DATA'!A174=\"\",\"\",'शालादर्पण कार्मिक DATA'!A174)","v":""},{"$f":"UPPER(IF('शालादर्पण कार्मिक DATA'!F174=\"\",\"\",'शालादर्पण कार्मिक DATA'!F174))","v":""},{"$f":"IF('शालादर्पण कार्मिक DATA'!E174=\"\",\"\",'शालादर्पण कार्मिक DATA'!E174)","v":""},{"$f":"IF('शालादर्पण कार्मिक DATA'!K174=\"\",\"\",'शालादर्पण कार्मिक DATA'!K174)","v":""},{"$f":"IF('शालादर्पण कार्मिक DATA'!B174=\"\",\"\",'शालादर्पण कार्मिक DATA'!B174)","v":""},{"$nulls":5},{"$f":"IF('शालादर्पण कार्मिक DATA'!#REF!=\"\",\"\",'शालादर्पण कार्मिक DATA'!#REF!)","v":{"$error":"#REF!"}}]
[{"$f":"IF(कार्मिक_विवरण[NAME]=\"\",\"\",ROWS($A$2:A173))","v":""},{"$f":"IF('शालादर्पण कार्मिक DATA'!A175=\"\",\"\",'शालादर्पण कार्मिक DATA'!A175)","v":""},{"$f":"UPPER(IF('शालादर्पण कार्मिक DATA'!F175=\"\",\"\",'शालादर्पण कार्मिक DATA'!F175))","v":""},{"$f":"IF('शालादर्पण कार्मिक DATA'!E175=\"\",\"\",'शालादर्पण कार्मिक DATA'!E175)","v":""},{"$f":"IF('शालादर्पण कार्मिक DATA'!K175=\"\",\"\",'शालादर्पण कार्मिक DATA'!K175)","v":""},{"$f":"IF('शालादर्पण कार्मिक DATA'!B175=\"\",\"\",'शालादर्पण कार्मिक DATA'!B175)","v":""},{"$nulls":5},{"$f":"IF('शालादर्पण कार्मिक DATA'!#REF!=\"\",\"\",'शालादर्पण कार्मिक DATA'!#REF!)","v":{"$error":"#REF!"}}]
[{"$f":"IF(कार्मिक_विवरण[NAME]=\"\",\"\",ROWS($A$2:A174))","v":""},{"$f":"IF('शालादर्पण कार्मिक DATA'!A176=\"\",\"\",'शालादर्पण कार्मिक DATA'!A176)","v":""},{"$f":"UPPER(IF('शालादर्पण कार्मिक DATA'!F176=\"\",\"\",'शालादर्पण कार्मिक DATA'!F176))","v":""},{"$f":"IF('शालादर्पण कार्मिक DATA'!E176=\"\",\"\",'शालादर्पण कार्मिक DATA'!E176)","v":""},{"$f":"IF('शालादर्पण कार्मिक DATA'!K176=\"\",\"\",'शालादर्पण कार्मिक DATA'!K176)","v":""},{"$f":"IF('शालादर्पण कार्मिक DATA'!B176=\"\",\"\",'शालादर्पण कार्मिक DATA'!B176)","v":""},{"$nulls":5},{"$f":"IF('शालादर्पण कार्मिक DATA'!#REF!=\"\",\"\",'शालादर्पण कार्मिक DATA'!#REF!)","v":{"$error":"#REF!"}}]
[{"$f":"IF(कार्मिक_विवरण[NAME]=\"\",\"\",ROWS($A$2:A175))","v":""},{"$f":"IF('शालादर्पण कार्मिक DATA'!A177=\"\",\"\",'शालादर्पण कार्मिक DATA'!A177)","v":""},{"$f":"UPPER(IF('शालादर्पण कार्मिक DATA'!F177=\"\",\"\",'शालादर्पण कार्मिक DATA'!F177))","v":""},{"$f":"IF('शालादर्पण कार्मिक DATA'!E177=\"\",\"\",'शालादर्पण कार्मिक DATA'!E177)","v":""},{"$f":"IF('शालादर्पण कार्मिक DATA'!K177=\"\",\"\",'शालादर्पण कार्मिक DATA'!K177)","v":""},{"$f":"IF('शालादर्पण कार्मिक DATA'!B177=\"\",\"\",'शालादर्पण कार्मिक DATA'!B177)","v":""},{"$nulls":5},{"$f":"IF('शालादर्पण कार्मिक DATA'!#REF!=\"\",\"\",'शालादर्पण कार्मिक DATA'!#REF!)","v":{"$error":"#REF!"}}]
[{"$f":"IF(कार्मिक_विवरण[NAME]=\"\",\"\",ROWS($A$2:A176))","v":""},{"$f":"IF('शालादर्पण कार्मिक DATA'!A178=\"\",\"\",'शालादर्पण कार्मिक DATA'!A178)","v":""},{"$f":"UPPER(IF('शालादर्पण कार्मिक DATA'!F178=\"\",\"\",'शालादर्पण कार्मिक DATA'!F178))","v":""},{"$f":"IF('शालादर्पण कार्मिक DATA'!E178=\"\",\"\",'शालादर्पण कार्मिक DATA'!E178)","v":""},{"$f":"IF('शालादर्पण कार्मिक DATA'!K178=\"\",\"\",'शालादर्पण कार्मिक DATA'!K178)","v":""},{"$f":"IF('शालादर्पण कार्मिक DATA'!B178=\"\",\"\",'शालादर्पण कार्मिक DATA'!B178)","v":""},{"$nulls":5},{"$f":"IF('शालादर्पण कार्मिक DATA'!#REF!=\"\",\"\",'शालादर्पण कार्मिक DATA'!#REF!)","v":{"$error":"#REF!"}}]
[{"$f":"IF(कार्मिक_विवरण[NAME]=\"\",\"\",ROWS($A$2:A177))","v":""},{"$f":"IF('शालादर्पण कार्मिक DATA'!A179=\"\",\"\",'शालादर्पण कार्मिक DATA'!A179)","v":""},{"$f":"UPPER(IF('शालादर्पण कार्मिक DATA'!F179=\"\",\"\",'शालादर्पण कार्मिक DATA'!F179))","v":""},{"$f":"IF('शालादर्पण कार्मिक DATA'!E179=\"\",\"\",'शालादर्पण कार्मिक DATA'!E179)","v":""},{"$f":"IF('शालादर्पण कार्मिक DATA'!K179=\"\",\"\",'शालादर्पण कार्मिक DATA'!K179)","v":""},{"$f":"IF('शालादर्पण कार्मिक DATA'!B179=\"\",\"\",'शालादर्पण कार्मिक DATA'!B179)","v":""},{"$nulls":5},{"$f":"IF('शालादर्पण कार्मिक DATA'!#REF!=\"\",\"\",'शालादर्पण कार्मिक DATA'!#REF!)","v":{"$error":"#REF!"}}]
[{"$f":"IF(कार्मिक_विवरण[NAME]=\"\",\"\",ROWS($A$2:A178))","v":""},{"$f":"IF('शालादर्पण कार्मिक DATA'!A180=\"\",\"\",'शालादर्पण कार्मिक DATA'!A180)","v":""},{"$f":"UPPER(IF('शालादर्पण कार्मिक DATA'!F180=\"\",\"\",'शालादर्पण कार्मिक DATA'!F180))","v":""},{"$f":"IF('शालादर्पण कार्मिक DATA'!E180=\"\",\"\",'शालादर्पण कार्मिक DATA'!E180)","v":""},{"$f":"IF('शालादर्पण कार्मिक DATA'!K180=\"\",\"\",'शालादर्पण कार्मिक DATA'!K180)","v":""},{"$f":"IF('शालादर्पण कार्मिक DATA'!B180=\"\",\"\",'शालादर्पण कार्मिक DATA'!B180)","v":""},{"$nulls":5},{"$f":"IF('शालादर्पण कार्मिक DATA'!#REF!=\"\",\"\",'शालादर्पण कार्मिक DATA'!#REF!)","v":{"$error":"#REF!"}}]
[{"$f":"IF(कार्मिक_विवरण[NAME]=\"\",\"\",ROWS($A$2:A179))","v":""},{"$f":"IF('शालादर्पण कार्मिक DATA'!A181=\"\",\"\",'शालादर्पण कार्मिक DATA'!A181)","v":""},{"$f":"UPPER(IF('शालादर्पण कार्मिक DATA'!F181=\"\",\"\",'शालादर्पण कार्मिक DATA'!F181))","v":""},{"$f":"IF('शालादर्पण कार्मिक DATA'!E181=\"\",\"\",'शालादर्पण कार्मिक DATA'!E181)","v":""},{"$f":"IF('शालादर्पण कार्मिक DATA'!K181=\"\",\"\",'शालादर्पण कार्मिक DATA'!K181)","v":""},{"$f":"IF('शालादर्पण कार्मिक DATA'!B181=\"\",\"\",'शालादर्पण कार्मिक DATA'!B181)","v":""},{"$nulls":5},{"$f":"IF('शालादर्पण कार्मिक DATA'!#REF!=\"\",\"\",'शालादर्पण कार्मिक DATA'!#REF!)","v":{"$error":"#REF!"}}]
[{"$f":"IF(कार्मिक_विवरण[NAME]=\"\",\"\",ROWS($A$2:A180))","v":""},{"$f":"IF('शालादर्पण कार्मिक DATA'!A182=\"\",\"\",'शालादर्पण कार्मिक DATA'!A182)","v":""},{"$f":"UPPER(IF('शालादर्पण कार्मिक DATA'!F182=\"\",\"\",'शालादर्पण कार्मिक DATA'!F182))","v":""},{"$f":"IF('शालादर्पण कार्मिक DATA'!E182=\"\",\"\",'शालादर्पण कार्मिक DATA'!E182)","v":""},{"$f":"IF('शालादर्पण कार्मिक DATA'!K182=\"\",\"\",'शालादर्पण कार्मिक DATA'!K182)","v":""},{"$f":"IF('शालादर्पण कार्मिक DATA'!B182=\"\",\"\",'शालादर्पण कार्मिक DATA'!B182)","v":""},{"$nulls":5},{"$f":"IF('शालादर्पण कार्मिक DATA'!#REF!=\"\",\"\",'शालादर्पण कार्मिक DATA'!#REF!)","v":{"$error":"#REF!"}}]
[{"$f":"IF(कार्मिक_विवरण[NAME]=\"\",\"\",ROWS($A$2:A181))","v":""},{"$f":"IF('शालादर्पण कार्मिक DATA'!A183=\"\",\"\",'शालादर्पण कार्मिक DATA'!A183)","v":""},{"$f":"UPPER(IF('शालादर्पण कार्मिक DATA'!F183=\"\",\"\",'शालादर्पण कार्मिक DATA'!F183))","v":""},{"$f":"IF('शालादर्पण कार्मिक DATA'!E183=\"\",\"\",'शालादर्पण कार्मिक DATA'!E183)","v":""},{"$f":"IF('शालादर्पण कार्मिक DATA'!K183=\"\",\"\",'शालादर्पण कार्मिक DATA'!K183)","v":""},{"$f":"IF('शालादर्पण कार्मिक DATA'!B183=\"\",\"\",'शालादर्पण कार्मिक DATA'!B183)","v":""},{"$nulls":5},{"$f":"IF('शालादर्पण कार्मिक DATA'!#REF!=\"\",\"\",'शालादर्पण कार्मिक DATA'!#REF!)","v":{"$error":"#REF!"}}]
[{"$f":"IF(कार्मिक_विवरण[NAME]=\"\",\"\",ROWS($A$2:A182))","v":""},{"$f":"IF('शालादर्पण कार्मिक DATA'!A184=\"\",\"\",'शालादर्पण कार्मिक DATA'!A184)","v":""},{"$f":"UPPER(IF('शालादर्पण कार्मिक DATA'!F184=\"\",\"\",'शालादर्पण कार्मिक DATA'!F184))","v":""},{"$f":"IF('शालादर्पण कार्मिक DATA'!E184=\"\",\"\",'शालादर्पण कार्मिक DATA'!E184)","v":""},{"$f":"IF('शालादर्पण कार्मिक DATA'!K184=\"\",\"\",'शालादर्पण कार्मिक DATA'!K184)","v":""},{"$f":"IF('शालादर्पण कार्मिक DATA'!B184=\"\",\"\",'शालादर्पण कार्मिक DATA'!B184)","v":""},{"$nulls":5},{"$f":"IF('शालादर्पण कार्मिक DATA'!#REF!=\"\",\"\",'शालादर्पण कार्मिक DATA'!#REF!)","v":{"$error":"#REF!"}}]
[{"$f":"IF(कार्मिक_विवरण[NAME]=\"\",\"\",ROWS($A$2:A183))","v":""},{"$f":"IF('शालादर्पण कार्मिक DATA'!A185=\"\",\"\",'शालादर्पण कार्मिक DATA'!A185)","v":""},{"$f":"UPPER(IF('शालादर्पण कार्मिक DATA'!F185=\"\",\"\",'शालादर्पण कार्मिक DATA'!F185))","v":""},{"$f":"IF('शालादर्पण कार्मिक DATA'!E185=\"\",\"\",'शालादर्पण कार्मिक DATA'!E185)","v":""},{"$f":"IF('शालादर्पण कार्मिक DATA'!K185=\"\",\"\",'शालादर्पण कार्मिक DATA'!K185)","v":""},{"$f":"IF('शालादर्पण कार्मिक DATA'!B185=\"\",\"\",'शालादर्पण कार्मिक DATA'!B185)","v":""},{"$nulls":5},{"$f":"IF('शालादर्पण कार्मिक DATA'!#REF!=\"\",\"\",'शालादर्पण कार्मिक DATA'!#REF!)","v":{"$error":"#REF!"}}]
[{"$f":"IF(कार्मिक_विवरण[NAME]=\"\",\"\",ROWS($A$2:A184))","v":""},{"$f":"IF('शालादर्पण कार्मिक DATA'!A186=\"\",\"\",'शालादर्पण कार्मिक DATA'!A186)","v":""},{"$f":"UPPER(IF('शालादर्पण कार्मिक DATA'!F186=\"\",\"\",'शालादर्पण कार्मिक DATA'!F186))","v":""},{"$f":"IF('शालादर्पण कार्मिक DATA'!E186=\"\",\"\",'शालादर्पण कार्मिक DATA'!E186)","v":""},{"$f":"IF('शालादर्पण कार्मिक DATA'!K186=\"\",\"\",'शालादर्पण कार्मिक DATA'!K186)","v":""},{"$f":"IF('शालादर्पण कार्मिक DATA'!B186=\"\",\"\",'शालादर्पण कार्मिक DATA'!B186)","v":""},{"$nulls":5},{"$f":"IF('शालादर्पण कार्मिक DATA'!#REF!=\"\",\"\",'शालादर्पण कार्मिक DATA'!#REF!)","v":{"$error":"#REF!"}}]
[{"$f":"IF(कार्मिक_विवरण[NAME]=\"\",\"\",ROWS($A$2:A185))","v":""},{"$f":"IF('शालादर्पण कार्मिक DATA'!A187=\"\",\"\",'शालादर्पण कार्मिक DATA'!A187)","v":""},{"$f":"UPPER(IF('शालादर्पण कार्मिक DATA'!F187=\"\",\"\",'शालादर्पण कार्मिक DATA'!F187))","v":""},{"$f":"IF('शालादर्पण कार्मिक DATA'!E187=\"\",\"\",'शालादर्पण कार्मिक DATA'!E187)","v":""},{"$f":"IF('शालादर्पण कार्मिक DATA'!K187=\"\",\"\",'शालादर्पण कार्मिक DATA'!K187)","v":""},{"$f":"IF('शालादर्पण कार्मिक DATA'!B187=\"\",\"\",'शालादर्पण कार्मिक DATA'!B187)","v":""},{"$nulls":5},{"$f":"IF('शालादर्पण कार्मिक DATA'!#REF!=\"\",\"\",'शालादर्पण कार्मिक DATA'!#REF!)","v":{"$error":"#REF!"}}]
[{"$f":"IF(कार्मिक_विवरण[NAME]=\"\",\"\",ROWS($A$2:A186))","v":""},{"$f":"IF('शालादर्पण कार्मिक DATA'!A188=\"\",\"\",'शालादर्पण कार्मिक DATA'!A188)","v":""},{"$f":"UPPER(IF('शालादर्पण कार्मिक DATA'!F188=\"\",\"\",'शालादर्पण कार्मिक DATA'!F188))","v":""},{"$f":"IF('शालादर्पण कार्मिक DATA'!E188=\"\",\"\",'शालादर्पण कार्मिक DATA'!E188)","v":""},{"$f":"IF('शालादर्पण कार्मिक DATA'!K188=\"\",\"\",'शालादर्पण कार्मिक DATA'!K188)","v":""},{"$f":"IF('शालादर्पण कार्मिक DATA'!B188=\"\",\"\",'शालादर्पण कार्मिक DATA'!B188)","v":""},{"$nulls":5},{"$f":"IF('शालादर्पण कार्मिक DATA'!#REF!=\"\",\"\",'शालादर्पण कार्मिक DATA'!#REF!)","v":{"$error":"#REF!"}}]
[{"$f":"IF(कार्मिक_विवरण[NAME]=\"\",\"\",ROWS($A$2:A187))","v":""},{"$f":"IF('शालादर्पण कार्मिक DATA'!A189=\"\",\"\",'शालादर्पण कार्मिक DATA'!A189)","v":""},{"$f":"UPPER(IF('शालादर्पण कार्मिक DATA'!F189=\"\",\"\",'शालादर्पण कार्मिक DATA'!F189))","v":""},{"$f":"IF('शालादर्पण कार्मिक DATA'!E189=\"\",\"\",'शालादर्पण कार्मिक DATA'!E189)","v":""},{"$f":"IF('शालादर्पण कार्मिक DATA'!K189=\"\",\"\",'शालादर्पण कार्मिक DATA'!K189)","v":""},{"$f":"IF('शालादर्पण कार्मिक DATA'!B189=\"\",\"\",'शालादर्पण कार्मिक DATA'!B189)","v":""},{"$nulls":5},{"$f":"IF('शालादर्पण कार्मिक DATA'!#REF!=\"\",\"\",'शालादर्पण कार्मिक DATA'!#REF!)","v":{"$error":"#REF!"}}]
[{"$f":"IF(कार्मिक_विवरण[NAME]=\"\",\"\",ROWS($A$2:A188))","v":""},{"$f":"IF('शालादर्पण कार्मिक DATA'!A190=\"\",\"\",'शालादर्पण कार्मिक DATA'!A190)","v":""},{"$f":"UPPER(IF('शालादर्पण कार्मिक DATA'!F190=\"\",\"\",'शालादर्पण कार्मिक DATA'!F190))","v":""},{"$f":"IF('शालादर्पण कार्मिक DATA'!E190=\"\",\"\",'शालादर्पण कार्मिक DATA'!E190)","v":""},{"$f":"IF('शालादर्पण कार्मिक DATA'!K190=\"\",\"\",'शालादर्पण कार्मिक DATA'!K190)","v":""},{"$f":"IF('शालादर्पण कार्मिक DATA'!B190=\"\",\"\",'शालादर्पण कार्मिक DATA'!B190)","v":""},{"$nulls":5},{"$f":"IF('शालादर्पण कार्मिक DATA'!#REF!=\"\",\"\",'शालादर्पण कार्मिक DATA'!#REF!)","v":{"$error":"#REF!"}}]
[{"$f":"IF(कार्मिक_विवरण[NAME]=\"\",\"\",ROWS($A$2:A189))","v":""},{"$f":"IF('शालादर्पण कार्मिक DATA'!A191=\"\",\"\",'शालादर्पण कार्मिक DATA'!A191)","v":""},{"$f":"UPPER(IF('शालादर्पण कार्मिक DATA'!F191=\"\",\"\",'शालादर्पण कार्मिक DATA'!F191))","v":""},{"$f":"IF('शालादर्पण कार्मिक DATA'!E191=\"\",\"\",'शालादर्पण कार्मिक DATA'!E191)","v":""},{"$f":"IF('शालादर्पण कार्मिक DATA'!K191=\"\",\"\",'शालादर्पण कार्मिक DATA'!K191)","v":""},{"$f":"IF('शालादर्पण कार्मिक DATA'!B191=\"\",\"\",'शालादर्पण कार्मिक DATA'!B191)","v":""},{"$nulls":5},{"$f":"IF('शालादर्पण कार्मिक DATA'!#REF!=\"\",\"\",'शालादर्पण कार्मिक DATA'!#REF!)","v":{"$error":"#REF!"}}]
[{"$f":"IF(कार्मिक_विवरण[NAME]=\"\",\"\",ROWS($A$2:A190))","v":""},{"$f":"IF('शालादर्पण कार्मिक DATA'!A192=\"\",\"\",'शालादर्पण कार्मिक DATA'!A192)","v":""},{"$f":"UPPER(IF('शालादर्पण कार्मिक DATA'!F192=\"\",\"\",'शालादर्पण कार्मिक DATA'!F192))","v":""},{"$f":"IF('शालादर्पण कार्मिक DATA'!E192=\"\",\"\",'शालादर्पण कार्मिक DATA'!E192)","v":""},{"$f":"IF('शालादर्पण कार्मिक DATA'!K192=\"\",\"\",'शालादर्पण कार्मिक DATA'!K192)","v":""},{"$f":"IF('शालादर्पण कार्मिक DATA'!B192=\"\",\"\",'शालादर्पण कार्मिक DATA'!B192)","v":""},{"$nulls":5},{"$f":"IF('शालादर्पण कार्मिक DATA'!#REF!=\"\",\"\",'शालादर्पण कार्मिक DATA'!#REF!)","v":{"$error":"#REF!"}}]
[{"$f":"IF(कार्मिक_विवरण[NAME]=\"\",\"\",ROWS($A$2:A191))","v":""},{"$f":"IF('शालादर्पण कार्मिक DATA'!A193=\"\",\"\",'शालादर्पण कार्मिक DATA'!A193)","v":""},{"$f":"UPPER(IF('शालादर्पण कार्मिक DATA'!F193=\"\",\"\",'शालादर्पण कार्मिक DATA'!F193))","v":""},{"$f":"IF('शालादर्पण कार्मिक DATA'!E193=\"\",\"\",'शालादर्पण कार्मिक DATA'!E193)","v":""},{"$f":"IF('शालादर्पण कार्मिक DATA'!K193=\"\",\"\",'शालादर्पण कार्मिक DATA'!K193)","v":""},{"$f":"IF('शालादर्पण कार्मिक DATA'!B193=\"\",\"\",'शालादर्पण कार्मिक DATA'!B193)","v":""},{"$nulls":5},{"$f":"IF('शालादर्पण कार्मिक DATA'!#REF!=\"\",\"\",'शालादर्पण कार्मिक DATA'!#REF!)","v":{"$error":"#REF!"}}]
[{"$f":"IF(कार्मिक_विवरण[NAME]=\"\",\"\",ROWS($A$2:A192))","v":""},{"$f":"IF('शालादर्पण कार्मिक DATA'!A194=\"\",\"\",'शालादर्पण कार्मिक DATA'!A194)","v":""},{"$f":"UPPER(IF('शालादर्पण कार्मिक DATA'!F194=\"\",\"\",'शालादर्पण कार्मिक DATA'!F194))","v":""},{"$f":"IF('शालादर्पण कार्मिक DATA'!E194=\"\",\"\",'शालादर्पण कार्मिक DATA'!E194)","v":""},{"$f":"IF('शालादर्पण कार्मिक DATA'!K194=\"\",\"\",'शालादर्पण कार्मिक DATA'!K194)","v":""},{"$f":"IF('शालादर्पण कार्मिक DATA'!B194=\"\",\"\",'शालादर्पण कार्मिक DATA'!B194)","v":""},{"$nulls":5},{"$f":"IF('शालादर्पण कार्मिक DATA'!#REF!=\"\",\"\",'शालादर्पण कार्मिक DATA'!#REF!)","v":{"$error":"#REF!"}}]
[{"$f":"IF(कार्मिक_विवरण[NAME]=\"\",\"\",ROWS($A$2:A193))","v":""},{"$f":"IF('शालादर्पण कार्मिक DATA'!A195=\"\",\"\",'शालादर्पण कार्मिक DATA'!A195)","v":""},{"$f":"UPPER(IF('शालादर्पण कार्मिक DATA'!F195=\"\",\"\",'शालादर्पण कार्मिक DATA'!F195))","v":""},{"$f":"IF('शालादर्पण कार्मिक DATA'!E195=\"\",\"\",'शालादर्पण कार्मिक DATA'!E195)","v":""},{"$f":"IF('शालादर्पण कार्मिक DATA'!K195=\"\",\"\",'शालादर्पण कार्मिक DATA'!K195)","v":""},{"$f":"IF('शालादर्पण कार्मिक DATA'!B195=\"\",\"\",'शालादर्पण कार्मिक DATA'!B195)","v":""},{"$nulls":5},{"$f":"IF('शालादर्पण कार्मिक DATA'!#REF!=\"\",\"\",'शालादर्पण कार्मिक DATA'!#REF!)","v":{"$error":"#REF!"}}]
[{"$f":"IF(कार्मिक_विवरण[NAME]=\"\",\"\",ROWS($A$2:A194))","v":""},{"$f":"IF('शालादर्पण कार्मिक DATA'!A196=\"\",\"\",'शालादर्पण कार्मिक DATA'!A196)","v":""},{"$f":"UPPER(IF('शालादर्पण कार्मिक DATA'!F196=\"\",\"\",'शालादर्पण कार्मिक DATA'!F196))","v":""},{"$f":"IF('शालादर्पण कार्मिक DATA'!E196=\"\",\"\",'शालादर्पण कार्मिक DATA'!E196)","v":""},{"$f":"IF('शालादर्पण कार्मिक DATA'!K196=\"\",\"\",'शालादर्पण कार्मिक DATA'!K196)","v":""},{"$f":"IF('शालादर्पण कार्मिक DATA'!B196=\"\",\"\",'शालादर्पण कार्मिक DATA'!B196)","v":""},{"$nulls":5},{"$f":"IF('शालादर्पण कार्मिक DATA'!#REF!=\"\",\"\",'शालादर्पण कार्मिक DATA'!#REF!)","v":{"$error":"#REF!"}}]
[{"$f":"IF(कार्मिक_विवरण[NAME]=\"\",\"\",ROWS($A$2:A195))","v":""},{"$f":"IF('शालादर्पण कार्मिक DATA'!A197=\"\",\"\",'शालादर्पण कार्मिक DATA'!A197)","v":""},{"$f":"UPPER(IF('शालादर्पण कार्मिक DATA'!F197=\"\",\"\",'शालादर्पण कार्मिक DATA'!F197))","v":""},{"$f":"IF('शालादर्पण कार्मिक DATA'!E197=\"\",\"\",'शालादर्पण कार्मिक DATA'!E197)","v":""},{"$f":"IF('शालादर्पण कार्मिक DATA'!K197=\"\",\"\",'शालादर्पण कार्मिक DATA'!K197)","v":""},{"$f":"IF('शालादर्पण कार्मिक DATA'!B197=\"\",\"\",'शालादर्पण कार्मिक DATA'!B197)","v":""},{"$nulls":5},{"$f":"IF('शालादर्पण कार्मिक DATA'!#REF!=\"\",\"\",'शालादर्पण कार्मिक DATA'!#REF!)","v":{"$error":"#REF!"}}]
[{"$f":"IF(कार्मिक_विवरण[NAME]=\"\",\"\",ROWS($A$2:A196))","v":""},{"$f":"IF('शालादर्पण कार्मिक DATA'!A198=\"\",\"\",'शालादर्पण कार्मिक DATA'!A198)","v":""},{"$f":"UPPER(IF('शालादर्पण कार्मिक DATA'!F198=\"\",\"\",'शालादर्पण कार्मिक DATA'!F198))","v":""},{"$f":"IF('शालादर्पण कार्मिक DATA'!E198=\"\",\"\",'शालादर्पण कार्मिक DATA'!E198)","v":""},{"$f":"IF('शालादर्पण कार्मिक DATA'!K198=\"\",\"\",'शालादर्पण कार्मिक DATA'!K198)","v":""},{"$f":"IF('शालादर्पण कार्मिक DATA'!B198=\"\",\"\",'शालादर्पण कार्मिक DATA'!B198)","v":""},{"$nulls":5},{"$f":"IF('शालादर्पण कार्मिक DATA'!#REF!=\"\",\"\",'शालादर्पण कार्मिक DATA'!#REF!)","v":{"$error":"#REF!"}}]
[{"$f":"IF(कार्मिक_विवरण[NAME]=\"\",\"\",ROWS($A$2:A197))","v":""},{"$f":"IF('शालादर्पण कार्मिक DATA'!A199=\"\",\"\",'शालादर्पण कार्मिक DATA'!A199)","v":""},{"$f":"UPPER(IF('शालादर्पण कार्मिक DATA'!F199=\"\",\"\",'शालादर्पण कार्मिक DATA'!F199))","v":""},{"$f":"IF('शालादर्पण कार्मिक DATA'!E199=\"\",\"\",'शालादर्पण कार्मिक DATA'!E199)","v":""},{"$f":"IF('शालादर्पण कार्मिक DATA'!K199=\"\",\"\",'शालादर्पण कार्मिक DATA'!K199)","v":""},{"$f":"IF('शालादर्पण कार्मिक DATA'!B199=\"\",\"\",'शालादर्पण कार्मिक DATA'!B199)","v":""},{"$nulls":5},{"$f":"IF('शालादर्पण कार्मिक DATA'!#REF!=\"\",\"\",'शालादर्पण कार्मिक DATA'!#REF!)","v":{"$error":"#REF!"}}]
[{"$f":"IF(कार्मिक_विवरण[NAME]=\"\",\"\",ROWS($A$2:A198))","v":""},{"$f":"IF('शालादर्पण कार्मिक DATA'!A200=\"\",\"\",'शालादर्पण कार्मिक DATA'!A200)","v":""},{"$f":"UPPER(IF('शालादर्पण कार्मिक DATA'!F200=\"\",\"\",'शालादर्पण कार्मिक DATA'!F200))","v":""},{"$f":"IF('शालादर्पण कार्मिक DATA'!E200=\"\",\"\",'शालादर्पण कार्मिक DATA'!E200)","v":""},{"$f":"IF('शालादर्पण कार्मिक DATA'!K200=\"\",\"\",'शालादर्पण कार्मिक DATA'!K200)","v":""},{"$f":"IF('शालादर्पण कार्मिक DATA'!B200=\"\",\"\",'शालादर्पण कार्मिक DATA'!B200)","v":""},{"$nulls":5},{"$f":"IF('शालादर्पण कार्मिक DATA'!#REF!=\"\",\"\",'शालादर्पण कार्मिक DATA'!#REF!)","v":{"$error":"#REF!"}}]
[{"$f":"IF(कार्मिक_विवरण[NAME]=\"\",\"\",ROWS($A$2:A199))","v":""},{"$f":"IF('शालादर्पण कार्मिक DATA'!A201=\"\",\"\",'शालादर्पण कार्मिक DATA'!A201)","v":""},{"$f":"UPPER(IF('शालादर्पण कार्मिक DATA'!F201=\"\",\"\",'शालादर्पण कार्मिक DATA'!F201))","v":""},{"$f":"IF('शालादर्पण कार्मिक DATA'!E201=\"\",\"\",'शालादर्पण कार्मिक DATA'!E201)","v":""},{"$f":"IF('शालादर्पण कार्मिक DATA'!K201=\"\",\"\",'शालादर्पण कार्मिक DATA'!K201)","v":""},{"$f":"IF('शालादर्पण कार्मिक DATA'!B201=\"\",\"\",'शालादर्पण कार्मिक DATA'!B201)","v":""},{"$nulls":5},{"$f":"IF('शालादर्पण कार्मिक DATA'!#REF!=\"\",\"\",'शालादर्पण कार्मिक DATA'!#REF!)","v":{"$error":"#REF!"}}]
[{"$f":"IF(कार्मिक_विवरण[NAME]=\"\",\"\",ROWS($A$2:A200))","v":""},{"$f":"IF('शालादर्पण कार्मिक DATA'!A202=\"\",\"\",'शालादर्पण कार्मिक DATA'!A202)","v":""},{"$f":"UPPER(IF('शालादर्पण कार्मिक DATA'!F202=\"\",\"\",'शालादर्पण कार्मिक DATA'!F202))","v":""},{"$f":"IF('शालादर्पण कार्मिक DATA'!E202=\"\",\"\",'शालादर्पण कार्मिक DATA'!E202)","v":""},{"$f":"IF('शालादर्पण कार्मिक DATA'!K202=\"\",\"\",'शालादर्पण कार्मिक DATA'!K202)","v":""},{"$f":"IF('शालादर्पण कार्मिक DATA'!B202=\"\",\"\",'शालादर्पण कार्मिक DATA'!B202)","v":""},{"$nulls":5},{"$f":"IF('शालादर्पण कार्मिक DATA'!#REF!=\"\",\"\",'शालादर्पण कार्मिक DATA'!#REF!)","v":{"$error":"#REF!"}}]
[{"$f":"IF(कार्मिक_विवरण[NAME]=\"\",\"\",ROWS($A$2:A201))","v":""},{"$f":"IF('शालादर्पण कार्मिक DATA'!A203=\"\",\"\",'शालादर्पण कार्मिक DATA'!A203)","v":""},{"$f":"UPPER(IF('शालादर्पण कार्मिक DATA'!F203=\"\",\"\",'शालादर्पण कार्मिक DATA'!F203))","v":""},{"$f":"IF('शालादर्पण कार्मिक DATA'!E203=\"\",\"\",'शालादर्पण कार्मिक DATA'!E203)","v":""},{"$f":"IF('शालादर्पण कार्मिक DATA'!K203=\"\",\"\",'शालादर्पण कार्मिक DATA'!K203)","v":""},{"$f":"IF('शालादर्पण कार्मिक DATA'!B203=\"\",\"\",'शालादर्पण कार्मिक DATA'!B203)","v":""},{"$nulls":5},{"$f":"IF('शालादर्पण कार्मिक DATA'!#REF!=\"\",\"\",'शालादर्पण कार्मिक DATA'!#REF!)","v":{"$error":"#REF!"}}]
[{"$f":"IF(कार्मिक_विवरण[NAME]=\"\",\"\",ROWS($A$2:A202))","v":""},{"$f":"IF('शालादर्पण कार्मिक DATA'!A204=\"\",\"\",'शालादर्पण कार्मिक DATA'!A204)","v":""},{"$f":"UPPER(IF('शालादर्पण कार्मिक DATA'!F204=\"\",\"\",'शालादर्पण कार्मिक DATA'!F204))","v":""},{"$f":"IF('शालादर्पण कार्मिक DATA'!E204=\"\",\"\",'शालादर्पण कार्मिक DATA'!E204)","v":""},{"$f":"IF('शालादर्पण कार्मिक DATA'!K204=\"\",\"\",'शालादर्पण कार्मिक DATA'!K204)","v":""},{"$f":"IF('शालादर्पण कार्मिक DATA'!B204=\"\",\"\",'शालादर्पण कार्मिक DATA'!B204)","v":""},{"$nulls":5},{"$f":"IF('शालादर्पण कार्मिक DATA'!#REF!=\"\",\"\",'शालादर्पण कार्मिक DATA'!#REF!)","v":{"$error":"#REF!"}}]
[{"$f":"IF(कार्मिक_विवरण[NAME]=\"\",\"\",ROWS($A$2:A203))","v":""},{"$f":"IF('शालादर्पण कार्मिक DATA'!A205=\"\",\"\",'शालादर्पण कार्मिक DATA'!A205)","v":""},{"$f":"UPPER(IF('शालादर्पण कार्मिक DATA'!F205=\"\",\"\",'शालादर्पण कार्मिक DATA'!F205))","v":""},{"$f":"IF('शालादर्पण कार्मिक DATA'!E205=\"\",\"\",'शालादर्पण कार्मिक DATA'!E205)","v":""},{"$f":"IF('शालादर्पण कार्मिक DATA'!K205=\"\",\"\",'शालादर्पण कार्मिक DATA'!K205)","v":""},{"$f":"IF('शालादर्पण कार्मिक DATA'!B205=\"\",\"\",'शालादर्पण कार्मिक DATA'!B205)","v":""},{"$nulls":5},{"$f":"IF('शालादर्पण कार्मिक DATA'!#REF!=\"\",\"\",'शालादर्पण कार्मिक DATA'!#REF!)","v":{"$error":"#REF!"}}]
[{"$f":"IF(कार्मिक_विवरण[NAME]=\"\",\"\",ROWS($A$2:A204))","v":""},{"$f":"IF('शालादर्पण कार्मिक DATA'!A206=\"\",\"\",'शालादर्पण कार्मिक DATA'!A206)","v":""},{"$f":"UPPER(IF('शालादर्पण कार्मिक DATA'!F206=\"\",\"\",'शालादर्पण कार्मिक DATA'!F206))","v":""},{"$f":"IF('शालादर्पण कार्मिक DATA'!E206=\"\",\"\",'शालादर्पण कार्मिक DATA'!E206)","v":""},{"$f":"IF('शालादर्पण कार्मिक DATA'!K206=\"\",\"\",'शालादर्पण कार्मिक DATA'!K206)","v":""},{"$f":"IF('शालादर्पण कार्मिक DATA'!B206=\"\",\"\",'शालादर्पण कार्मिक DATA'!B206)","v":""},{"$nulls":5},{"$f":"IF('शालादर्पण कार्मिक DATA'!#REF!=\"\",\"\",'शालादर्पण कार्मिक DATA'!#REF!)","v":{"$error":"#REF!"}}]
[{"$f":"IF(कार्मिक_विवरण[NAME]=\"\",\"\",ROWS($A$2:A205))","v":""},{"$f":"IF('शालादर्पण कार्मिक DATA'!A207=\"\",\"\",'शालादर्पण कार्मिक DATA'!A207)","v":""},{"$f":"UPPER(IF('शालादर्पण कार्मिक DATA'!F207=\"\",\"\",'शालादर्पण कार्मिक DATA'!F207))","v":""},{"$f":"IF('शालादर्पण कार्मिक DATA'!E207=\"\",\"\",'शालादर्पण कार्मिक DATA'!E207)","v":""},{"$f":"IF('शालादर्पण कार्मिक DATA'!K207=\"\",\"\",'शालादर्पण कार्मिक DATA'!K207)","v":""},{"$f":"IF('शालादर्पण कार्मिक DATA'!B207=\"\",\"\",'शालादर्पण कार्मिक DATA'!B207)","v":""},{"$nulls":5},{"$f":"IF('शालादर्पण कार्मिक DATA'!#REF!=\"\",\"\",'शालादर्पण कार्मिक DATA'!#REF!)","v":{"$error":"#REF!"}}]
[{"$f":"IF(कार्मिक_विवरण[NAME]=\"\",\"\",ROWS($A$2:A206))","v":""},{"$f":"IF('शालादर्पण कार्मिक DATA'!A208=\"\",\"\",'शालादर्पण कार्मिक DATA'!A208)","v":""},{"$f":"UPPER(IF('शालादर्पण कार्मिक DATA'!F208=\"\",\"\",'शालादर्पण कार्मिक DATA'!F208))","v":""},{"$f":"IF('शालादर्पण कार्मिक DATA'!E208=\"\",\"\",'शालादर्पण कार्मिक DATA'!E208)","v":""},{"$f":"IF('शालादर्पण कार्मिक DATA'!K208=\"\",\"\",'शालादर्पण कार्मिक DATA'!K208)","v":""},{"$f":"IF('शालादर्पण कार्मिक DATA'!B208=\"\",\"\",'शालादर्पण कार्मिक DATA'!B208)","v":""},{"$nulls":5},{"$f":"IF('शालादर्पण कार्मिक DATA'!#REF!=\"\",\"\",'शालादर्पण कार्मिक DATA'!#REF!)","v":{"$error":"#REF!"}}]
[{"$f":"IF(कार्मिक_विवरण[NAME]=\"\",\"\",ROWS($A$2:A207))","v":""},{"$f":"IF('शालादर्पण कार्मिक DATA'!A209=\"\",\"\",'शालादर्पण कार्मिक DATA'!A209)","v":""},{"$f":"UPPER(IF('शालादर्पण कार्मिक DATA'!F209=\"\",\"\",'शालादर्पण कार्मिक DATA'!F209))","v":""},{"$f":"IF('शालादर्पण कार्मिक DATA'!E209=\"\",\"\",'शालादर्पण कार्मिक DATA'!E209)","v":""},{"$f":"IF('शालादर्पण कार्मिक DATA'!K209=\"\",\"\",'शालादर्पण कार्मिक DATA'!K209)","v":""},{"$f":"IF('शालादर्पण कार्मिक DATA'!B209=\"\",\"\",'शालादर्पण कार्मिक DATA'!B209)","v":""},{"$nulls":5},{"$f":"IF('शालादर्पण कार्मिक DATA'!#REF!=\"\",\"\",'शालादर्पण कार्मिक DATA'!#REF!)","v":{"$error":"#REF!"}}]
[{"$f":"IF(कार्मिक_विवरण[NAME]=\"\",\"\",ROWS($A$2:A208))","v":""},{"$f":"IF('शालादर्पण कार्मिक DATA'!A210=\"\",\"\",'शालादर्पण कार्मिक DATA'!A210)","v":""},{"$f":"UPPER(IF('शालादर्पण कार्मिक DATA'!F210=\"\",\"\",'शालादर्पण कार्मिक DATA'!F210))","v":""},{"$f":"IF('शालादर्पण कार्मिक DATA'!E210=\"\",\"\",'शालादर्पण कार्मिक DATA'!E210)","v":""},{"$f":"IF('शालादर्पण कार्मिक DATA'!K210=\"\",\"\",'शालादर्पण कार्मिक DATA'!K210)","v":""},{"$f":"IF('शालादर्पण कार्मिक DATA'!B210=\"\",\"\",'शालादर्पण कार्मिक DATA'!B210)","v":""},{"$nulls":5},{"$f":"IF('शालादर्पण कार्मिक DATA'!#REF!=\"\",\"\",'शालादर्पण कार्मिक DATA'!#REF!)","v":{"$error":"#REF!"}}]
[{"$f":"IF(कार्मिक_विवरण[NAME]=\"\",\"\",ROWS($A$2:A209))","v":""},{"$f":"IF('शालादर्पण कार्मिक DATA'!A211=\"\",\"\",'शालादर्पण कार्मिक DATA'!A211)","v":""},{"$f":"UPPER(IF('शालादर्पण कार्मिक DATA'!F211=\"\",\"\",'शालादर्पण कार्मिक DATA'!F211))","v":""},{"$f":"IF('शालादर्पण कार्मिक DATA'!E211=\"\",\"\",'शालादर्पण कार्मिक DATA'!E211)","v":""},{"$f":"IF('शालादर्पण कार्मिक DATA'!K211=\"\",\"\",'शालादर्पण कार्मिक DATA'!K211)","v":""},{"$f":"IF('शालादर्पण कार्मिक DATA'!B211=\"\",\"\",'शालादर्पण कार्मिक DATA'!B211)","v":""},{"$nulls":5},{"$f":"IF('शालादर्पण कार्मिक DATA'!#REF!=\"\",\"\",'शालादर्पण कार्मिक DATA'!#REF!)","v":{"$error":"#REF!"}}]
[{"$f":"IF(कार्मिक_विवरण[NAME]=\"\",\"\",ROWS($A$2:A210))","v":""},{"$f":"IF('शालादर्पण कार्मिक DATA'!A212=\"\",\"\",'शालादर्पण कार्मिक DATA'!A212)","v":""},{"$f":"UPPER(IF('शालादर्पण कार्मिक DATA'!F212=\"\",\"\",'शालादर्पण कार्मिक DATA'!F212))","v":""},{"$f":"IF('शालादर्पण कार्मिक DATA'!E212=\"\",\"\",'शालादर्पण कार्मिक DATA'!E212)","v":""},{"$f":"IF('शालादर्पण कार्मिक DATA'!K212=\"\",\"\",'शालादर्पण कार्मिक DATA'!K212)","v":""},{"$f":"IF('शालादर्पण कार्मिक DATA'!B212=\"\",\"\",'शालादर्पण कार्मिक DATA'!B212)","v":""},{"$nulls":5},{"$f":"IF('शालादर्पण कार्मिक DATA'!#REF!=\"\",\"\",'शालादर्पण कार्मिक DATA'!#REF!)","v":{"$error":"#REF!"}}]
[{"$f":"IF(कार्मिक_विवरण[NAME]=\"\",\"\",ROWS($A$2:A211))","v":""},{"$f":"IF('शालादर्पण कार्मिक DATA'!A213=\"\",\"\",'शालादर्पण कार्मिक DATA'!A213)","v":""},{"$f":"UPPER(IF('शालादर्पण कार्मिक DATA'!F213=\"\",\"\",'शालादर्पण कार्मिक DATA'!F213))","v":""},{"$f":"IF('शालादर्पण कार्मिक DATA'!E213=\"\",\"\",'शालादर्पण कार्मिक DATA'!E213)","v":""},{"$f":"IF('शालादर्पण कार्मिक DATA'!K213=\"\",\"\",'शालादर्पण कार्मिक DATA'!K213)","v":""},{"$f":"IF('शालादर्पण कार्मिक DATA'!B213=\"\",\"\",'शालादर्पण कार्मिक DATA'!B213)","v":""},{"$nulls":5},{"$f":"IF('शालादर्पण कार्मिक DATA'!#REF!=\"\",\"\",'शालादर्पण कार्मिक DATA'!#REF!)","v":{"$error":"#REF!"}}]
[{"$f":"IF(कार्मिक_विवरण[NAME]=\"\",\"\",ROWS($A$2:A212))","v":""},{"$f":"IF('शालादर्पण कार्मिक DATA'!A214=\"\",\"\",'शालादर्पण कार्मिक DATA'!A214)","v":""},{"$f":"UPPER(IF('शालादर्पण कार्मिक DATA'!F214=\"\",\"\",'शालादर्पण कार्मिक DATA'!F214))","v":""},{"$f":"IF('शालादर्पण कार्मिक DATA'!E214=\"\",\"\",'शालादर्पण कार्मिक DATA'!E214)","v":""},{"$f":"IF('शालादर्पण कार्मिक DATA'!K214=\"\",\"\",'शालादर्पण कार्मिक DATA'!K214)","v":""},{"$f":"IF('शालादर्पण कार्मिक DATA'!B214=\"\",\"\",'शालादर्पण कार्मिक DATA'!B214)","v":""},{"$nulls":5},{"$f":"IF('शालादर्पण कार्मिक DATA'!#REF!=\"\",\"\",'शालादर्पण कार्मिक DATA'!#REF!)","v":{"$error":"#REF!"}}]
[{"$f":"IF(कार्मिक_विवरण[NAME]=\"\",\"\",ROWS($A$2:A213))","v":""},{"$f":"IF('शालादर्पण कार्मिक DATA'!A215=\"\",\"\",'शालादर्पण कार्मिक DATA'!A215)","v":""},{"$f":"UPPER(IF('शालादर्पण कार्मिक DATA'!F215=\"\",\"\",'शालादर्पण कार्मिक DATA'!F215))","v":""},{"$f":"IF('शालादर्पण कार्मिक DATA'!E215=\"\",\"\",'शालादर्पण कार्मिक DATA'!E215)","v":""},{"$f":"IF('शालादर्पण कार्मिक DATA'!K215=\"\",\"\",'शालादर्पण कार्मिक DATA'!K215)","v":""},{"$f":"IF('शालादर्पण कार्मिक DATA'!B215=\"\",\"\",'शालादर्पण कार्मिक DATA'!B215)","v":""},{"$nulls":5},{"$f":"IF('शालादर्पण कार्मिक DATA'!#REF!=\"\",\"\",'शालादर्पण कार्मिक DATA'!#REF!)","v":{"$error":"#REF!"}}]
[{"$f":"IF(कार्मिक_विवरण[NAME]=\"\",\"\",ROWS($A$2:A214))","v":""},{"$f":"IF('शालादर्पण कार्मिक DATA'!A216=\"\",\"\",'शालादर्पण कार्मिक DATA'!A216)","v":""},{"$f":"UPPER(IF('शालादर्पण कार्मिक DATA'!F216=\"\",\"\",'शालादर्पण कार्मिक DATA'!F216))","v":""},{"$f":"IF('शालादर्पण कार्मिक DATA'!E216=\"\",\"\",'शालादर्पण कार्मिक DATA'!E216)","v":""},{"$f":"IF('शालादर्पण कार्मिक DATA'!K216=\"\",\"\",'शालादर्पण कार्मिक DATA'!K216)","v":""},{"$f":"IF('शालादर्पण कार्मिक DATA'!B216=\"\",\"\",'शालादर्पण कार्मिक DATA'!B216)","v":""},{"$nulls":5},{"$f":"IF('शालादर्पण कार्मिक DATA'!#REF!=\"\",\"\",'शालादर्पण कार्मिक DATA'!#REF!)","v":{"$error":"#REF!"}}]
[{"$f":"IF(कार्मिक_विवरण[NAME]=\"\",\"\",ROWS($A$2:A215))","v":""},{"$f":"IF('शालादर्पण कार्मिक DATA'!A217=\"\",\"\",'शालादर्पण कार्मिक DATA'!A217)","v":""},{"$f":"UPPER(IF('शालादर्पण कार्मिक DATA'!F217=\"\",\"\",'शालादर्पण कार्मिक DATA'!F217))","v":""},{"$f":"IF('शालादर्पण कार्मिक DATA'!E217=\"\",\"\",'शालादर्पण कार्मिक DATA'!E217)","v":""},{"$f":"IF('शालादर्पण कार्मिक DATA'!K217=\"\",\"\",'शालादर्पण कार्मिक DATA'!K217)","v":""},{"$f":"IF('शालादर्पण कार्मिक DATA'!B217=\"\",\"\",'शालादर्पण कार्मिक DATA'!B217)","v":""},{"$nulls":5},{"$f":"IF('शालादर्पण कार्मिक DATA'!#REF!=\"\",\"\",'शालादर्पण कार्मिक DATA'!#REF!)","v":{"$error":"#REF!"}}]
[{"$f":"IF(कार्मिक_विवरण[NAME]=\"\",\"\",ROWS($A$2:A216))","v":""},{"$f":"IF('शालादर्पण कार्मिक DATA'!A218=\"\",\"\",'शालादर्पण कार्मिक DATA'!A218)","v":""},{"$f":"UPPER(IF('शालादर्पण कार्मिक DATA'!F218=\"\",\"\",'शालादर्पण कार्मिक DATA'!F218))","v":""},{"$f":"IF('शालादर्पण कार्मिक DATA'!E218=\"\",\"\",'शालादर्पण कार्मिक DATA'!E218)","v":""},{"$f":"IF('शालादर्पण कार्मिक DATA'!K218=\"\",\"\",'शालादर्पण कार्मिक DATA'!K218)","v":""},{"$f":"IF('शालादर्पण कार्मिक DATA'!B218=\"\",\"\",'शालादर्पण कार्मिक DATA'!B218)","v":""},{"$nulls":5},{"$f":"IF('शालादर्पण कार्मिक DATA'!#REF!=\"\",\"\",'शालादर्पण कार्मिक DATA'!#REF!)","v":{"$error":"#REF!"}}]
[{"$f":"IF(कार्मिक_विवरण[NAME]=\"\",\"\",ROWS($A$2:A217))","v":""},{"$f":"IF('शालादर्पण कार्मिक DATA'!A219=\"\",\"\",'शालादर्पण कार्मिक DATA'!A219)","v":""},{"$f":"UPPER(IF('शालादर्पण कार्मिक DATA'!F219=\"\",\"\",'शालादर्पण कार्मिक DATA'!F219))","v":""},{"$f":"IF('शालादर्पण कार्मिक DATA'!E219=\"\",\"\",'शालादर्पण कार्मिक DATA'!E219)","v":""},{"$f":"IF('शालादर्पण कार्मिक DATA'!K219=\"\",\"\",'शालादर्पण कार्मिक DATA'!K219)","v":""},{"$f":"IF('शालादर्पण कार्मिक DATA'!B219=\"\",\"\",'शालादर्पण कार्मिक DATA'!B219)","v":""},{"$nulls":5},{"$f":"IF('शालादर्पण कार्मिक DATA'!#REF!=\"\",\"\",'शालादर्पण कार्मिक DATA'!#REF!)","v":{"$error":"#REF!"}}]
[{"$f":"IF(कार्मिक_विवरण[NAME]=\"\",\"\",ROWS($A$2:A218))","v":""},{"$f":"IF('शालादर्पण कार्मिक DATA'!A220=\"\",\"\",'शालादर्पण कार्मिक DATA'!A220)","v":""},{"$f":"UPPER(IF('शालादर्पण कार्मिक DATA'!F220=\"\",\"\",'शालादर्पण कार्मिक DATA'!F220))","v":""},{"$f":"IF('शालादर्पण कार्मिक DATA'!E220=\"\",\"\",'शालादर्पण कार्मिक DATA'!E220)","v":""},{"$f":"IF('शालादर्पण कार्मिक DATA'!K220=\"\",\"\",'शालादर्पण कार्मिक DATA'!K220)","v":""},{"$f":"IF('शालादर्पण कार्मिक DATA'!B220=\"\",\"\",'शालादर्पण कार्मिक DATA'!B220)","v":""},{"$nulls":5},{"$f":"IF('शालादर्पण कार्मिक DATA'!#REF!=\"\",\"\",'शालादर्पण कार्मिक DATA'!#REF!)","v":{"$error":"#REF!"}}]
[{"$f":"IF(कार्मिक_विवरण[NAME]=\"\",\"\",ROWS($A$2:A219))","v":""},{"$f":"IF('शालादर्पण कार्मिक DATA'!A221=\"\",\"\",'शालादर्पण कार्मिक DATA'!A221)","v":""},{"$f":"UPPER(IF('शालादर्पण कार्मिक DATA'!F221=\"\",\"\",'शालादर्पण कार्मिक DATA'!F221))","v":""},{"$f":"IF('शालादर्पण कार्मिक DATA'!E221=\"\",\"\",'शालादर्पण कार्मिक DATA'!E221)","v":""},{"$f":"IF('शालादर्पण कार्मिक DATA'!K221=\"\",\"\",'शालादर्पण कार्मिक DATA'!K221)","v":""},{"$f":"IF('शालादर्पण कार्मिक DATA'!B221=\"\",\"\",'शालादर्पण कार्मिक DATA'!B221)","v":""},{"$nulls":5},{"$f":"IF('शालादर्पण कार्मिक DATA'!#REF!=\"\",\"\",'शालादर्पण कार्मिक DATA'!#REF!)","v":{"$error":"#REF!"}}]
[{"$f":"IF(कार्मिक_विवरण[NAME]=\"\",\"\",ROWS($A$2:A220))","v":""},{"$f":"IF('शालादर्पण कार्मिक DATA'!A222=\"\",\"\",'शालादर्पण कार्मिक DATA'!A222)","v":""},{"$f":"UPPER(IF('शालादर्पण कार्मिक DATA'!F222=\"\",\"\",'शालादर्पण कार्मिक DATA'!F222))","v":""},{"$f":"IF('शालादर्पण कार्मिक DATA'!E222=\"\",\"\",'शालादर्पण कार्मिक DATA'!E222)","v":""},{"$f":"IF('शालादर्पण कार्मिक DATA'!K222=\"\",\"\",'शालादर्पण कार्मिक DATA'!K222)","v":""},{"$f":"IF('शालादर्पण कार्मिक DATA'!B222=\"\",\"\",'शालादर्पण कार्मिक DATA'!B222)","v":""},{"$nulls":5},{"$f":"IF('शालादर्पण कार्मिक DATA'!#REF!=\"\",\"\",'शालादर्पण कार्मिक DATA'!#REF!)","v":{"$error":"#REF!"}}]
[{"$f":"IF(कार्मिक_विवरण[NAME]=\"\",\"\",ROWS($A$2:A221))","v":""},{"$f":"IF('शालादर्पण कार्मिक DATA'!A223=\"\",\"\",'शालादर्पण कार्मिक DATA'!A223)","v":""},{"$f":"UPPER(IF('शालादर्पण कार्मिक DATA'!F223=\"\",\"\",'शालादर्पण कार्मिक DATA'!F223))","v":""},{"$f":"IF('शालादर्पण कार्मिक DATA'!E223=\"\",\"\",'शालादर्पण कार्मिक DATA'!E223)","v":""},{"$f":"IF('शालादर्पण कार्मिक DATA'!K223=\"\",\"\",'शालादर्पण कार्मिक DATA'!K223)","v":""},{"$f":"IF('शालादर्पण कार्मिक DATA'!B223=\"\",\"\",'शालादर्पण कार्मिक DATA'!B223)","v":""},{"$nulls":5},{"$f":"IF('शालादर्पण कार्मिक DATA'!#REF!=\"\",\"\",'शालादर्पण कार्मिक DATA'!#REF!)","v":{"$error":"#REF!"}}]
[{"$f":"IF(कार्मिक_विवरण[NAME]=\"\",\"\",ROWS($A$2:A222))","v":""},{"$f":"IF('शालादर्पण कार्मिक DATA'!A224=\"\",\"\",'शालादर्पण कार्मिक DATA'!A224)","v":""},{"$f":"UPPER(IF('शालादर्पण कार्मिक DATA'!F224=\"\",\"\",'शालादर्पण कार्मिक DATA'!F224))","v":""},{"$f":"IF('शालादर्पण कार्मिक DATA'!E224=\"\",\"\",'शालादर्पण कार्मिक DATA'!E224)","v":""},{"$f":"IF('शालादर्पण कार्मिक DATA'!K224=\"\",\"\",'शालादर्पण कार्मिक DATA'!K224)","v":""},{"$f":"IF('शालादर्पण कार्मिक DATA'!B224=\"\",\"\",'शालादर्पण कार्मिक DATA'!B224)","v":""},{"$nulls":5},{"$f":"IF('शालादर्पण कार्मिक DATA'!#REF!=\"\",\"\",'शालादर्पण कार्मिक DATA'!#REF!)","v":{"$error":"#REF!"}}]
[{"$f":"IF(कार्मिक_विवरण[NAME]=\"\",\"\",ROWS($A$2:A223))","v":""},{"$f":"IF('शालादर्पण कार्मिक DATA'!A225=\"\",\"\",'शालादर्पण कार्मिक DATA'!A225)","v":""},{"$f":"UPPER(IF('शालादर्पण कार्मिक DATA'!F225=\"\",\"\",'शालादर्पण कार्मिक DATA'!F225))","v":""},{"$f":"IF('शालादर्पण कार्मिक DATA'!E225=\"\",\"\",'शालादर्पण कार्मिक DATA'!E225)","v":""},{"$f":"IF('शालादर्पण कार्मिक DATA'!K225=\"\",\"\",'शालादर्पण कार्मिक DATA'!K225)","v":""},{"$f":"IF('शालादर्पण कार्मिक DATA'!B225=\"\",\"\",'शालादर्पण कार्मिक DATA'!B225)","v":""},{"$nulls":5},{"$f":"IF('शालादर्पण कार्मिक DATA'!#REF!=\"\",\"\",'शालादर्पण कार्मिक DATA'!#REF!)","v":{"$error":"#REF!"}}]
[{"$f":"IF(कार्मिक_विवरण[NAME]=\"\",\"\",ROWS($A$2:A224))","v":""},{"$f":"IF('शालादर्पण कार्मिक DATA'!A226=\"\",\"\",'शालादर्पण कार्मिक DATA'!A226)","v":""},{"$f":"UPPER(IF('शालादर्पण कार्मिक DATA'!F226=\"\",\"\",'शालादर्पण कार्मिक DATA'!F226))","v":""},{"$f":"IF('शालादर्पण कार्मिक DATA'!E226=\"\",\"\",'शालादर्पण कार्मिक DATA'!E226)","v":""},{"$f":"IF('शालादर्पण कार्मिक DATA'!K226=\"\",\"\",'शालादर्पण कार्मिक DATA'!K226)","v":""},{"$f":"IF('शालादर्पण कार्मिक DATA'!B226=\"\",\"\",'शालादर्पण कार्मिक DATA'!B226)","v":""},{"$nulls":5},{"$f":"IF('शालादर्पण कार्मिक DATA'!#REF!=\"\",\"\",'शालादर्पण कार्मिक DATA'!#REF!)","v":{"$error":"#REF!"}}]
[{"$f":"IF(कार्मिक_विवरण[NAME]=\"\",\"\",ROWS($A$2:A225))","v":""},{"$f":"IF('शालादर्पण कार्मिक DATA'!A227=\"\",\"\",'शालादर्पण कार्मिक DATA'!A227)","v":""},{"$f":"UPPER(IF('शालादर्पण कार्मिक DATA'!F227=\"\",\"\",'शालादर्पण कार्मिक DATA'!F227))","v":""},{"$f":"IF('शालादर्पण कार्मिक DATA'!E227=\"\",\"\",'शालादर्पण कार्मिक DATA'!E227)","v":""},{"$f":"IF('शालादर्पण कार्मिक DATA'!K227=\"\",\"\",'शालादर्पण कार्मिक DATA'!K227)","v":""},{"$f":"IF('शालादर्पण कार्मिक DATA'!B227=\"\",\"\",'शालादर्पण कार्मिक DATA'!B227)","v":""},{"$nulls":5},{"$f":"IF('शालादर्पण कार्मिक DATA'!#REF!=\"\",\"\",'शालादर्पण कार्मिक DATA'!#REF!)","v":{"$error":"#REF!"}}]
[{"$f":"IF(कार्मिक_विवरण[NAME]=\"\",\"\",ROWS($A$2:A226))","v":""},{"$f":"IF('शालादर्पण कार्मिक DATA'!A228=\"\",\"\",'शालादर्पण कार्मिक DATA'!A228)","v":""},{"$f":"UPPER(IF('शालादर्पण कार्मिक DATA'!F228=\"\",\"\",'शालादर्पण कार्मिक DATA'!F228))","v":""},{"$f":"IF('शालादर्पण कार्मिक DATA'!E228=\"\",\"\",'शालादर्पण कार्मिक DATA'!E228)","v":""},{"$f":"IF('शालादर्पण कार्मिक DATA'!K228=\"\",\"\",'शालादर्पण कार्मिक DATA'!K228)","v":""},{"$f":"IF('शालादर्पण कार्मिक DATA'!B228=\"\",\"\",'शालादर्पण कार्मिक DATA'!B228)","v":""},{"$nulls":5},{"$f":"IF('शालादर्पण कार्मिक DATA'!#REF!=\"\",\"\",'शालादर्पण कार्मिक DATA'!#REF!)","v":{"$error":"#REF!"}}]
[{"$f":"IF(कार्मिक_विवरण[NAME]=\"\",\"\",ROWS($A$2:A227))","v":""},{"$f":"IF('शालादर्पण कार्मिक DATA'!A229=\"\",\"\",'शालादर्पण कार्मिक DATA'!A229)","v":""},{"$f":"UPPER(IF('शालादर्पण कार्मिक DATA'!F229=\"\",\"\",'शालादर्पण कार्मिक DATA'!F229))","v":""},{"$f":"IF('शालादर्पण कार्मिक DATA'!E229=\"\",\"\",'शालादर्पण कार्मिक DATA'!E229)","v":""},{"$f":"IF('शालादर्पण कार्मिक DATA'!K229=\"\",\"\",'शालादर्पण कार्मिक DATA'!K229)","v":""},{"$f":"IF('शालादर्पण कार्मिक DATA'!B229=\"\",\"\",'शालादर्पण कार्मिक DATA'!B229)","v":""},{"$nulls":5},{"$f":"IF('शालादर्पण कार्मिक DATA'!#REF!=\"\",\"\",'शालादर्पण कार्मिक DATA'!#REF!)","v":{"$error":"#REF!"}}]
[{"$f":"IF(कार्मिक_विवरण[NAME]=\"\",\"\",ROWS($A$2:A228))","v":""},{"$f":"IF('शालादर्पण कार्मिक DATA'!A230=\"\",\"\",'शालादर्पण कार्मिक DATA'!A230)","v":""},{"$f":"UPPER(IF('शालादर्पण कार्मिक DATA'!F230=\"\",\"\",'शालादर्पण कार्मिक DATA'!F230))","v":""},{"$f":"IF('शालादर्पण कार्मिक DATA'!E230=\"\",\"\",'शालादर्पण कार्मिक DATA'!E230)","v":""},{"$f":"IF('शालादर्पण कार्मिक DATA'!K230=\"\",\"\",'शालादर्पण कार्मिक DATA'!K230)","v":""},{"$f":"IF('शालादर्पण कार्मिक DATA'!B230=\"\",\"\",'शालादर्पण कार्मिक DATA'!B230)","v":""},{"$nulls":5},{"$f":"IF('शालादर्पण कार्मिक DATA'!#REF!=\"\",\"\",'शालादर्पण कार्मिक DATA'!#REF!)","v":{"$error":"#REF!"}}]
[{"$f":"IF(कार्मिक_विवरण[NAME]=\"\",\"\",ROWS($A$2:A229))","v":""},{"$f":"IF('शालादर्पण कार्मिक DATA'!A231=\"\",\"\",'शालादर्पण कार्मिक DATA'!A231)","v":""},{"$f":"UPPER(IF('शालादर्पण कार्मिक DATA'!F231=\"\",\"\",'शालादर्पण कार्मिक DATA'!F231))","v":""},{"$f":"IF('शालादर्पण कार्मिक DATA'!E231=\"\",\"\",'शालादर्पण कार्मिक DATA'!E231)","v":""},{"$f":"IF('शालादर्पण कार्मिक DATA'!K231=\"\",\"\",'शालादर्पण कार्मिक DATA'!K231)","v":""},{"$f":"IF('शालादर्पण कार्मिक DATA'!B231=\"\",\"\",'शालादर्पण कार्मिक DATA'!B231)","v":""},{"$nulls":5},{"$f":"IF('शालादर्पण कार्मिक DATA'!#REF!=\"\",\"\",'शालादर्पण कार्मिक DATA'!#REF!)","v":{"$error":"#REF!"}}]
[{"$f":"IF(कार्मिक_विवरण[NAME]=\"\",\"\",ROWS($A$2:A230))","v":""},{"$f":"IF('शालादर्पण कार्मिक DATA'!A232=\"\",\"\",'शालादर्पण कार्मिक DATA'!A232)","v":""},{"$f":"UPPER(IF('शालादर्पण कार्मिक DATA'!F232=\"\",\"\",'शालादर्पण कार्मिक DATA'!F232))","v":""},{"$f":"IF('शालादर्पण कार्मिक DATA'!E232=\"\",\"\",'शालादर्पण कार्मिक DATA'!E232)","v":""},{"$f":"IF('शालादर्पण कार्मिक DATA'!K232=\"\",\"\",'शालादर्पण कार्मिक DATA'!K232)","v":""},{"$f":"IF('शालादर्पण कार्मिक DATA'!B232=\"\",\"\",'शालादर्पण कार्मिक DATA'!B232)","v":""},{"$nulls":5},{"$f":"IF('शालादर्पण कार्मिक DATA'!#REF!=\"\",\"\",'शालादर्पण कार्मिक DATA'!#REF!)","v":{"$error":"#REF!"}}]
[{"$f":"IF(कार्मिक_विवरण[NAME]=\"\",\"\",ROWS($A$2:A231))","v":""},{"$f":"IF('शालादर्पण कार्मिक DATA'!A233=\"\",\"\",'शालादर्पण कार्मिक DATA'!A233)","v":""},{"$f":"UPPER(IF('शालादर्पण कार्मिक DATA'!F233=\"\",\"\",'शालादर्पण कार्मिक DATA'!F233))","v":""},{"$f":"IF('शालादर्पण कार्मिक DATA'!E233=\"\",\"\",'शालादर्पण कार्मिक DATA'!E233)","v":""},{"$f":"IF('शालादर्पण कार्मिक DATA'!K233=\"\",\"\",'शालादर्पण कार्मिक DATA'!K233)","v":""},{"$f":"IF('शालादर्पण कार्मिक DATA'!B233=\"\",\"\",'शालादर्पण कार्मिक DATA'!B233)","v":""},{"$nulls":5},{"$f":"IF('शालादर्पण कार्मिक DATA'!#REF!=\"\",\"\",'शालादर्पण कार्मिक DATA'!#REF!)","v":{"$error":"#REF!"}}]
[{"$f":"IF(कार्मिक_विवरण[NAME]=\"\",\"\",ROWS($A$2:A232))","v":""},{"$f":"IF('शालादर्पण कार्मिक DATA'!A234=\"\",\"\",'शालादर्पण कार्मिक DATA'!A234)","v":""},{"$f":"UPPER(IF('शालादर्पण कार्मिक DATA'!F234=\"\",\"\",'शालादर्पण कार्मिक DATA'!F234))","v":""},{"$f":"IF('शालादर्पण कार्मिक DATA'!E234=\"\",\"\",'शालादर्पण कार्मिक DATA'!E234)","v":""},{"$f":"IF('शालादर्पण कार्मिक DATA'!K234=\"\",\"\",'शालादर्पण कार्मिक DATA'!K234)","v":""},{"$f":"IF('शालादर्पण कार्मिक DATA'!B234=\"\",\"\",'शालादर्पण कार्मिक DATA'!B234)","v":""},{"$nulls":5},{"$f":"IF('शालादर्पण कार्मिक DATA'!#REF!=\"\",\"\",'शालादर्पण कार्मिक DATA'!#REF!)","v":{"$error":"#REF!"}}]
[{"$f":"IF(कार्मिक_विवरण[NAME]=\"\",\"\",ROWS($A$2:A233))","v":""},{"$f":"IF('शालादर्पण कार्मिक DATA'!A235=\"\",\"\",'शालादर्पण कार्मिक DATA'!A235)","v":""},{"$f":"UPPER(IF('शालादर्पण कार्मिक DATA'!F235=\"\",\"\",'शालादर्पण कार्मिक DATA'!F235))","v":""},{"$f":"IF('शालादर्पण कार्मिक DATA'!E235=\"\",\"\",'शालादर्पण कार्मिक DATA'!E235)","v":""},{"$f":"IF('शालादर्पण कार्मिक DATA'!K235=\"\",\"\",'शालादर्पण कार्मिक DATA'!K235)","v":""},{"$f":"IF('शालादर्पण कार्मिक DATA'!B235=\"\",\"\",'शालादर्पण कार्मिक DATA'!B235)","v":""},{"$nulls":5},{"$f":"IF('शालादर्पण कार्मिक DATA'!#REF!=\"\",\"\",'शालादर्पण कार्मिक DATA'!#REF!)","v":{"$error":"#REF!"}}]
[{"$f":"IF(कार्मिक_विवरण[NAME]=\"\",\"\",ROWS($A$2:A234))","v":""},{"$f":"IF('शालादर्पण कार्मिक DATA'!A236=\"\",\"\",'शालादर्पण कार्मिक DATA'!A236)","v":""},{"$f":"UPPER(IF('शालादर्पण कार्मिक DATA'!F236=\"\",\"\",'शालादर्पण कार्मिक DATA'!F236))","v":""},{"$f":"IF('शालादर्पण कार्मिक DATA'!E236=\"\",\"\",'शालादर्पण कार्मिक DATA'!E236)","v":""},{"$f":"IF('शालादर्पण कार्मिक DATA'!K236=\"\",\"\",'शालादर्पण कार्मिक DATA'!K236)","v":""},{"$f":"IF('शालादर्पण कार्मिक DATA'!B236=\"\",\"\",'शालादर्पण कार्मिक DATA'!B236)","v":""},{"$nulls":5},{"$f":"IF('शालादर्पण कार्मिक DATA'!#REF!=\"\",\"\",'शालादर्पण कार्मिक DATA'!#REF!)","v":{"$error":"#REF!"}}]
[{"$f":"IF(कार्मिक_विवरण[NAME]=\"\",\"\",ROWS($A$2:A235))","v":""},{"$f":"IF('शालादर्पण कार्मिक DATA'!A237=\"\",\"\",'शालादर्पण कार्मिक DATA'!A237)","v":""},{"$f":"UPPER(IF('शालादर्पण कार्मिक DATA'!F237=\"\",\"\",'शालादर्पण कार्मिक DATA'!F237))","v":""},{"$f":"IF('शालादर्पण कार्मिक DATA'!E237=\"\",\"\",'शालादर्पण कार्मिक DATA'!E237)","v":""},{"$f":"IF('शालादर्पण कार्मिक DATA'!K237=\"\",\"\",'शालादर्पण कार्मिक DATA'!K237)","v":""},{"$f":"IF('शालादर्पण कार्मिक DATA'!B237=\"\",\"\",'शालादर्पण कार्मिक DATA'!B237)","v":""},{"$nulls":5},{"$f":"IF('शालादर्पण कार्मिक DATA'!#REF!=\"\",\"\",'शालादर्पण कार्मिक DATA'!#REF!)","v":{"$error":"#REF!"}}]
[{"$f":"IF(कार्मिक_विवरण[NAME]=\"\",\"\",ROWS($A$2:A236))","v":""},{"$f":"IF('शालादर्पण कार्मिक DATA'!A238=\"\",\"\",'शालादर्पण कार्मिक DATA'!A238)","v":""},{"$f":"UPPER(IF('शालादर्पण कार्मिक DATA'!F238=\"\",\"\",'शालादर्पण कार्मिक DATA'!F238))","v":""},{"$f":"IF('शालादर्पण कार्मिक DATA'!E238=\"\",\"\",'शालादर्पण कार्मिक DATA'!E238)","v":""},{"$f":"IF('शालादर्पण कार्मिक DATA'!K238=\"\",\"\",'शालादर्पण कार्मिक DATA'!K238)","v":""},{"$f":"IF('शालादर्पण कार्मिक DATA'!B238=\"\",\"\",'शालादर्पण कार्मिक DATA'!B238)","v":""},{"$nulls":5},{"$f":"IF('शालादर्पण कार्मिक DATA'!#REF!=\"\",\"\",'शालादर्पण कार्मिक DATA'!#REF!)","v":{"$error":"#REF!"}}]
[{"$f":"IF(कार्मिक_विवरण[NAME]=\"\",\"\",ROWS($A$2:A237))","v":""},{"$f":"IF('शालादर्पण कार्मिक DATA'!A239=\"\",\"\",'शालादर्पण कार्मिक DATA'!A239)","v":""},{"$f":"UPPER(IF('शालादर्पण कार्मिक DATA'!F239=\"\",\"\",'शालादर्पण कार्मिक DATA'!F239))","v":""},{"$f":"IF('शालादर्पण कार्मिक DATA'!E239=\"\",\"\",'शालादर्पण कार्मिक DATA'!E239)","v":""},{"$f":"IF('शालादर्पण कार्मिक DATA'!K239=\"\",\"\",'शालादर्पण कार्मिक DATA'!K239)","v":""},{"$f":"IF('शालादर्पण कार्मिक DATA'!B239=\"\",\"\",'शालादर्पण कार्मिक DATA'!B239)","v":""},{"$nulls":5},{"$f":"IF('शालादर्पण कार्मिक DATA'!#REF!=\"\",\"\",'शालादर्पण कार्मिक DATA'!#REF!)","v":{"$error":"#REF!"}}]
[{"$f":"IF(कार्मिक_विवरण[NAME]=\"\",\"\",ROWS($A$2:A238))","v":""},{"$f":"IF('शालादर्पण कार्मिक DATA'!A240=\"\",\"\",'शालादर्पण कार्मिक DATA'!A240)","v":""},{"$f":"UPPER(IF('शालादर्पण कार्मिक DATA'!F240=\"\",\"\",'शालादर्पण कार्मिक DATA'!F240))","v":""},{"$f":"IF('शालादर्पण कार्मिक DATA'!E240=\"\",\"\",'शालादर्पण कार्मिक DATA'!E240)","v":""},{"$f":"IF('शालादर्पण कार्मिक DATA'!K240=\"\",\"\",'शालादर्पण कार्मिक DATA'!K240)","v":""},{"$f":"IF('शालादर्पण कार्मिक DATA'!B240=\"\",\"\",'शालादर्पण कार्मिक DATA'!B240)","v":""},{"$nulls":5},{"$f":"IF('शालादर्पण कार्मिक DATA'!#REF!=\"\",\"\",'शालादर्पण कार्मिक DATA'!#REF!)","v":{"$error":"#REF!"}}]
[{"$f":"IF(कार्मिक_विवरण[NAME]=\"\",\"\",ROWS($A$2:A239))","v":""},{"$f":"IF('शालादर्पण कार्मिक DATA'!A241=\"\",\"\",'शालादर्पण कार्मिक DATA'!A241)","v":""},{"$f":"UPPER(IF('शालादर्पण कार्मिक DATA'!F241=\"\",\"\",'शालादर्पण कार्मिक DATA'!F241))","v":""},{"$f":"IF('शालादर्पण कार्मिक DATA'!E241=\"\",\"\",'शालादर्पण कार्मिक DATA'!E241)","v":""},{"$f":"IF('शालादर्पण कार्मिक DATA'!K241=\"\",\"\",'शालादर्पण कार्मिक DATA'!K241)","v":""},{"$f":"IF('शालादर्पण कार्मिक DATA'!B241=\"\",\"\",'शालादर्पण कार्मिक DATA'!B241)","v":""},{"$nulls":5},{"$f":"IF('शालादर्पण कार्मिक DATA'!#REF!=\"\",\"\",'शालादर्पण कार्मिक DATA'!#REF!)","v":{"$error":"#REF!"}}]
[{"$f":"IF(कार्मिक_विवरण[NAME]=\"\",\"\",ROWS($A$2:A240))","v":""},{"$f":"IF('शालादर्पण कार्मिक DATA'!A242=\"\",\"\",'शालादर्पण कार्मिक DATA'!A242)","v":""},{"$f":"UPPER(IF('शालादर्पण कार्मिक DATA'!F242=\"\",\"\",'शालादर्पण कार्मिक DATA'!F242))","v":""},{"$f":"IF('शालादर्पण कार्मिक DATA'!E242=\"\",\"\",'शालादर्पण कार्मिक DATA'!E242)","v":""},{"$f":"IF('शालादर्पण कार्मिक DATA'!K242=\"\",\"\",'शालादर्पण कार्मिक DATA'!K242)","v":""},{"$f":"IF('शालादर्पण कार्मिक DATA'!B242=\"\",\"\",'शालादर्पण कार्मिक DATA'!B242)","v":""},{"$nulls":5},{"$f":"IF('शालादर्पण कार्मिक DATA'!#REF!=\"\",\"\",'शालादर्पण कार्मिक DATA'!#REF!)","v":{"$error":"#REF!"}}]
[{"$f":"IF(कार्मिक_विवरण[NAME]=\"\",\"\",ROWS($A$2:A241))","v":""},{"$f":"IF('शालादर्पण कार्मिक DATA'!A243=\"\",\"\",'शालादर्पण कार्मिक DATA'!A243)","v":""},{"$f":"UPPER(IF('शालादर्पण कार्मिक DATA'!F243=\"\",\"\",'शालादर्पण कार्मिक DATA'!F243))","v":""},{"$f":"IF('शालादर्पण कार्मिक DATA'!E243=\"\",\"\",'शालादर्पण कार्मिक DATA'!E243)","v":""},{"$f":"IF('शालादर्पण कार्मिक DATA'!K243=\"\",\"\",'शालादर्पण कार्मिक DATA'!K243)","v":""},{"$f":"IF('शालादर्पण कार्मिक DATA'!B243=\"\",\"\",'शालादर्पण कार्मिक DATA'!B243)","v":""},{"$nulls":5},{"$f":"IF('शालादर्पण कार्मिक DATA'!#REF!=\"\",\"\",'शालादर्पण कार्मिक DATA'!#REF!)","v":{"$error":"#REF!"}}]
[{"$f":"IF(कार्मिक_विवरण[NAME]=\"\",\"\",ROWS($A$2:A242))","v":""},{"$f":"IF('शालादर्पण कार्मिक DATA'!A244=\"\",\"\",'शालादर्पण कार्मिक DATA'!A244)","v":""},{"$f":"UPPER(IF('शालादर्पण कार्मिक DATA'!F244=\"\",\"\",'शालादर्पण कार्मिक DATA'!F244))","v":""},{"$f":"IF('शालादर्पण कार्मिक DATA'!E244=\"\",\"\",'शालादर्पण कार्मिक DATA'!E244)","v":""},{"$f":"IF('शालादर्पण कार्मिक DATA'!K244=\"\",\"\",'शालादर्पण कार्मिक DATA'!K244)","v":""},{"$f":"IF('शालादर्पण कार्मिक DATA'!B244=\"\",\"\",'शालादर्पण कार्मिक DATA'!B244)","v":""},{"$nulls":5},{"$f":"IF('शालादर्पण कार्मिक DATA'!#REF!=\"\",\"\",'शालादर्पण कार्मिक DATA'!#REF!)","v":{"$error":"#REF!"}}]
[{"$f":"IF(कार्मिक_विवरण[NAME]=\"\",\"\",ROWS($A$2:A243))","v":""},{"$f":"IF('शालादर्पण कार्मिक DATA'!A245=\"\",\"\",'शालादर्पण कार्मिक DATA'!A245)","v":""},{"$f":"UPPER(IF('शालादर्पण कार्मिक DATA'!F245=\"\",\"\",'शालादर्पण कार्मिक DATA'!F245))","v":""},{"$f":"IF('शालादर्पण कार्मिक DATA'!E245=\"\",\"\",'शालादर्पण कार्मिक DATA'!E245)","v":""},{"$f":"IF('शालादर्पण कार्मिक DATA'!K245=\"\",\"\",'शालादर्पण कार्मिक DATA'!K245)","v":""},{"$f":"IF('शालादर्पण कार्मिक DATA'!B245=\"\",\"\",'शालादर्पण कार्मिक DATA'!B245)","v":""},{"$nulls":5},{"$f":"IF('शालादर्पण कार्मिक DATA'!#REF!=\"\",\"\",'शालादर्पण कार्मिक DATA'!#REF!)","v":{"$error":"#REF!"}}]
[{"$f":"IF(कार्मिक_विवरण[NAME]=\"\",\"\",ROWS($A$2:A244))","v":""},{"$f":"IF('शालादर्पण कार्मिक DATA'!A246=\"\",\"\",'शालादर्पण कार्मिक DATA'!A246)","v":""},{"$f":"UPPER(IF('शालादर्पण कार्मिक DATA'!F246=\"\",\"\",'शालादर्पण कार्मिक DATA'!F246))","v":""},{"$f":"IF('शालादर्पण कार्मिक DATA'!E246=\"\",\"\",'शालादर्पण कार्मिक DATA'!E246)","v":""},{"$f":"IF('शालादर्पण कार्मिक DATA'!K246=\"\",\"\",'शालादर्पण कार्मिक DATA'!K246)","v":""},{"$f":"IF('शालादर्पण कार्मिक DATA'!B246=\"\",\"\",'शालादर्पण कार्मिक DATA'!B246)","v":""},{"$nulls":5},{"$f":"IF('शालादर्पण कार्मिक DATA'!#REF!=\"\",\"\",'शालादर्पण कार्मिक DATA'!#REF!)","v":{"$error":"#REF!"}}]
[{"$f":"IF(कार्मिक_विवरण[NAME]=\"\",\"\",ROWS($A$2:A245))","v":""},{"$f":"IF('शालादर्पण कार्मिक DATA'!A247=\"\",\"\",'शालादर्पण कार्मिक DATA'!A247)","v":""},{"$f":"UPPER(IF('शालादर्पण कार्मिक DATA'!F247=\"\",\"\",'शालादर्पण कार्मिक DATA'!F247))","v":""},{"$f":"IF('शालादर्पण कार्मिक DATA'!E247=\"\",\"\",'शालादर्पण कार्मिक DATA'!E247)","v":""},{"$f":"IF('शालादर्पण कार्मिक DATA'!K247=\"\",\"\",'शालादर्पण कार्मिक DATA'!K247)","v":""},{"$f":"IF('शालादर्पण कार्मिक DATA'!B247=\"\",\"\",'शालादर्पण कार्मिक DATA'!B247)","v":""},{"$nulls":5},{"$f":"IF('शालादर्पण कार्मिक DATA'!#REF!=\"\",\"\",'शालादर्पण कार्मिक DATA'!#REF!)","v":{"$error":"#REF!"}}]
[{"$f":"IF(कार्मिक_विवरण[NAME]=\"\",\"\",ROWS($A$2:A246))","v":""},{"$f":"IF('शालादर्पण कार्मिक DATA'!A248=\"\",\"\",'शालादर्पण कार्मिक DATA'!A248)","v":""},{"$f":"UPPER(IF('शालादर्पण कार्मिक DATA'!F248=\"\",\"\",'शालादर्पण कार्मिक DATA'!F248))","v":""},{"$f":"IF('शालादर्पण कार्मिक DATA'!E248=\"\",\"\",'शालादर्पण कार्मिक DATA'!E248)","v":""},{"$f":"IF('शालादर्पण कार्मिक DATA'!K248=\"\",\"\",'शालादर्पण कार्मिक DATA'!K248)","v":""},{"$f":"IF('शालादर्पण कार्मिक DATA'!B248=\"\",\"\",'शालादर्पण कार्मिक DATA'!B248)","v":""},{"$nulls":5},{"$f":"IF('शालादर्पण कार्मिक DATA'!#REF!=\"\",\"\",'शालादर्पण कार्मिक DATA'!#REF!)","v":{"$error":"#REF!"}}]
[{"$f":"IF(कार्मिक_विवरण[NAME]=\"\",\"\",ROWS($A$2:A247))","v":""},{"$f":"IF('शालादर्पण कार्मिक DATA'!A249=\"\",\"\",'शालादर्पण कार्मिक DATA'!A249)","v":""},{"$f":"UPPER(IF('शालादर्पण कार्मिक DATA'!F249=\"\",\"\",'शालादर्पण कार्मिक DATA'!F249))","v":""},{"$f":"IF('शालादर्पण कार्मिक DATA'!E249=\"\",\"\",'शालादर्पण कार्मिक DATA'!E249)","v":""},{"$f":"IF('शालादर्पण कार्मिक DATA'!K249=\"\",\"\",'शालादर्पण कार्मिक DATA'!K249)","v":""},{"$f":"IF('शालादर्पण कार्मिक DATA'!B249=\"\",\"\",'शालादर्पण कार्मिक DATA'!B249)","v":""},{"$nulls":5},{"$f":"IF('शालादर्पण कार्मिक DATA'!#REF!=\"\",\"\",'शालादर्पण कार्मिक DATA'!#REF!)","v":{"$error":"#REF!"}}]
[{"$f":"IF(कार्मिक_विवरण[NAME]=\"\",\"\",ROWS($A$2:A248))","v":""},{"$f":"IF('शालादर्पण कार्मिक DATA'!A250=\"\",\"\",'शालादर्पण कार्मिक DATA'!A250)","v":""},{"$f":"UPPER(IF('शालादर्पण कार्मिक DATA'!F250=\"\",\"\",'शालादर्पण कार्मिक DATA'!F250))","v":""},{"$f":"IF('शालादर्पण कार्मिक DATA'!E250=\"\",\"\",'शालादर्पण कार्मिक DATA'!E250)","v":""},{"$f":"IF('शालादर्पण कार्मिक DATA'!K250=\"\",\"\",'शालादर्पण कार्मिक DATA'!K250)","v":""},{"$f":"IF('शालादर्पण कार्मिक DATA'!B250=\"\",\"\",'शालादर्पण कार्मिक DATA'!B250)","v":""},{"$nulls":5},{"$f":"IF('शालादर्पण कार्मिक DATA'!#REF!=\"\",\"\",'शालादर्पण कार्मिक DATA'!#REF!)","v":{"$error":"#REF!"}}]
[{"$f":"IF(कार्मिक_विवरण[NAME]=\"\",\"\",ROWS($A$2:A249))","v":""},{"$f":"IF('शालादर्पण कार्मिक DATA'!A251=\"\",\"\",'शालादर्पण कार्मिक DATA'!A251)","v":""},{"$f":"UPPER(IF('शालादर्पण कार्मिक DATA'!F251=\"\",\"\",'शालादर्पण कार्मिक DATA'!F251))","v":""},{"$f":"IF('शालादर्पण कार्मिक DATA'!E251=\"\",\"\",'शालादर्पण कार्मिक DATA'!E251)","v":""},{"$f":"IF('शालादर्पण कार्मिक DATA'!K251=\"\",\"\",'शालादर्पण कार्मिक DATA'!K251)","v":""},{"$f":"IF('शालादर्पण कार्मिक DATA'!B251=\"\",\"\",'शालादर्पण कार्मिक DATA'!B251)","v":""},{"$nulls":5},{"$f":"IF('शालादर्पण कार्मिक DATA'!#REF!=\"\",\"\",'शालादर्पण कार्मिक DATA'!#REF!)","v":{"$error":"#REF!"}}]
[{"$f":"IF(कार्मिक_विवरण[NAME]=\"\",\"\",ROWS($A$2:A250))","v":""},{"$f":"IF('शालादर्पण कार्मिक DATA'!A252=\"\",\"\",'शालादर्पण कार्मिक DATA'!A252)","v":""},{"$f":"UPPER(IF('शालादर्पण कार्मिक DATA'!F252=\"\",\"\",'शालादर्पण कार्मिक DATA'!F252))","v":""},{"$f":"IF('शालादर्पण कार्मिक DATA'!E252=\"\",\"\",'शालादर्पण कार्मिक DATA'!E252)","v":""},{"$f":"IF('शालादर्पण कार्मिक DATA'!K252=\"\",\"\",'शालादर्पण कार्मिक DATA'!K252)","v":""},{"$f":"IF('शालादर्पण कार्मिक DATA'!B252=\"\",\"\",'शालादर्पण कार्मिक DATA'!B252)","v":""},{"$nulls":5},{"$f":"IF('शालादर्पण कार्मिक DATA'!#REF!=\"\",\"\",'शालादर्पण कार्मिक DATA'!#REF!)","v":{"$error":"#REF!"}}]
[{"$f":"IF(कार्मिक_विवरण[NAME]=\"\",\"\",ROWS($A$2:A251))","v":""},{"$f":"IF('शालादर्पण कार्मिक DATA'!A253=\"\",\"\",'शालादर्पण कार्मिक DATA'!A253)","v":""},{"$f":"UPPER(IF('शालादर्पण कार्मिक DATA'!F253=\"\",\"\",'शालादर्पण कार्मिक DATA'!F253))","v":""},{"$f":"IF('शालादर्पण कार्मिक DATA'!E253=\"\",\"\",'शालादर्पण कार्मिक DATA'!E253)","v":""},{"$f":"IF('शालादर्पण कार्मिक DATA'!K253=\"\",\"\",'शालादर्पण कार्मिक DATA'!K253)","v":""},{"$f":"IF('शालादर्पण कार्मिक DATA'!B253=\"\",\"\",'शालादर्पण कार्मिक DATA'!B253)","v":""},{"$nulls":5},{"$f":"IF('शालादर्पण कार्मिक DATA'!#REF!=\"\",\"\",'शालादर्पण कार्मिक DATA'!#REF!)","v":{"$error":"#REF!"}}]
[{"$f":"IF(कार्मिक_विवरण[NAME]=\"\",\"\",ROWS($A$2:A252))","v":""},{"$f":"IF('शालादर्पण कार्मिक DATA'!A254=\"\",\"\",'शालादर्पण कार्मिक DATA'!A254)","v":""},{"$f":"UPPER(IF('शालादर्पण कार्मिक DATA'!F254=\"\",\"\",'शालादर्पण कार्मिक DATA'!F254))","v":""},{"$f":"IF('शालादर्पण कार्मिक DATA'!E254=\"\",\"\",'शालादर्पण कार्मिक DATA'!E254)","v":""},{"$f":"IF('शालादर्पण कार्मिक DATA'!K254=\"\",\"\",'शालादर्पण कार्मिक DATA'!K254)","v":""},{"$f":"IF('शालादर्पण कार्मिक DATA'!B254=\"\",\"\",'शालादर्पण कार्मिक DATA'!B254)","v":""},{"$nulls":5},{"$f":"IF('शालादर्पण कार्मिक DATA'!#REF!=\"\",\"\",'शालादर्पण कार्मिक DATA'!#REF!)","v":{"$error":"#REF!"}}]
[{"$f":"IF(कार्मिक_विवरण[NAME]=\"\",\"\",ROWS($A$2:A253))","v":""},{"$f":"IF('शालादर्पण कार्मिक DATA'!A255=\"\",\"\",'शालादर्पण कार्मिक DATA'!A255)","v":""},{"$f":"UPPER(IF('शालादर्पण कार्मिक DATA'!F255=\"\",\"\",'शालादर्पण कार्मिक DATA'!F255))","v":""},{"$f":"IF('शालादर्पण कार्मिक DATA'!E255=\"\",\"\",'शालादर्पण कार्मिक DATA'!E255)","v":""},{"$f":"IF('शालादर्पण कार्मिक DATA'!K255=\"\",\"\",'शालादर्पण कार्मिक DATA'!K255)","v":""},{"$f":"IF('शालादर्पण कार्मिक DATA'!B255=\"\",\"\",'शालादर्पण कार्मिक DATA'!B255)","v":""},{"$nulls":5},{"$f":"IF('शालादर्पण कार्मिक DATA'!#REF!=\"\",\"\",'शालादर्पण कार्मिक DATA'!#REF!)","v":{"$error":"#REF!"}}]
[{"$f":"IF(कार्मिक_विवरण[NAME]=\"\",\"\",ROWS($A$2:A254))","v":""},{"$f":"IF('शालादर्पण कार्मिक DATA'!A256=\"\",\"\",'शालादर्पण कार्मिक DATA'!A256)","v":""},{"$f":"UPPER(IF('शालादर्पण कार्मिक DATA'!F256=\"\",\"\",'शालादर्पण कार्मिक DATA'!F256))","v":""},{"$f":"IF('शालादर्पण कार्मिक DATA'!E256=\"\",\"\",'शालादर्पण कार्मिक DATA'!E256)","v":""},{"$f":"IF('शालादर्पण कार्मिक DATA'!K256=\"\",\"\",'शालादर्पण कार्मिक DATA'!K256)","v":""},{"$f":"IF('शालादर्पण कार्मिक DATA'!B256=\"\",\"\",'शालादर्पण कार्मिक DATA'!B256)","v":""},{"$nulls":5},{"$f":"IF('शालादर्पण कार्मिक DATA'!#REF!=\"\",\"\",'शालादर्पण कार्मिक DATA'!#REF!)","v":{"$error":"#REF!"}}]
[{"$f":"IF(कार्मिक_विवरण[NAME]=\"\",\"\",ROWS($A$2:A255))","v":""},{"$f":"IF('शालादर्पण कार्मिक DATA'!A257=\"\",\"\",'शालादर्पण कार्मिक DATA'!A257)","v":""},{"$f":"UPPER(IF('शालादर्पण कार्मिक DATA'!F257=\"\",\"\",'शालादर्पण कार्मिक DATA'!F257))","v":""},{"$f":"IF('शालादर्पण कार्मिक DATA'!E257=\"\",\"\",'शालादर्पण कार्मिक DATA'!E257)","v":""},{"$f":"IF('शालादर्पण कार्मिक DATA'!K257=\"\",\"\",'शालादर्पण कार्मिक DATA'!K257)","v":""},{"$f":"IF('शालादर्पण कार्मिक DATA'!B257=\"\",\"\",'शालादर्पण कार्मिक DATA'!B257)","v":""},{"$nulls":5},{"$f":"IF('शालादर्पण कार्मिक DATA'!#REF!=\"\",\"\",'शालादर्पण कार्मिक DATA'!#REF!)","v":{"$error":"#REF!"}}]
[{"$f":"IF(कार्मिक_विवरण[NAME]=\"\",\"\",ROWS($A$2:A256))","v":""},{"$f":"IF('शालादर्पण कार्मिक DATA'!A258=\"\",\"\",'शालादर्पण कार्मिक DATA'!A258)","v":""},{"$f":"UPPER(IF('शालादर्पण कार्मिक DATA'!F258=\"\",\"\",'शालादर्पण कार्मिक DATA'!F258))","v":""},{"$f":"IF('शालादर्पण कार्मिक DATA'!E258=\"\",\"\",'शालादर्पण कार्मिक DATA'!E258)","v":""},{"$f":"IF('शालादर्पण कार्मिक DATA'!K258=\"\",\"\",'शालादर्पण कार्मिक DATA'!K258)","v":""},{"$f":"IF('शालादर्पण कार्मिक DATA'!B258=\"\",\"\",'शालादर्पण कार्मिक DATA'!B258)","v":""},{"$nulls":5},{"$f":"IF('शालादर्पण कार्मिक DATA'!#REF!=\"\",\"\",'शालादर्पण कार्मिक DATA'!#REF!)","v":{"$error":"#REF!"}}]
[{"$f":"IF(कार्मिक_विवरण[NAME]=\"\",\"\",ROWS($A$2:A257))","v":""},{"$f":"IF('शालादर्पण कार्मिक DATA'!A259=\"\",\"\",'शालादर्पण कार्मिक DATA'!A259)","v":""},{"$f":"UPPER(IF('शालादर्पण कार्मिक DATA'!F259=\"\",\"\",'शालादर्पण कार्मिक DATA'!F259))","v":""},{"$f":"IF('शालादर्पण कार्मिक DATA'!E259=\"\",\"\",'शालादर्पण कार्मिक DATA'!E259)","v":""},{"$f":"IF('शालादर्पण कार्मिक DATA'!K259=\"\",\"\",'शालादर्पण कार्मिक DATA'!K259)","v":""},{"$f":"IF('शालादर्पण कार्मिक DATA'!B259=\"\",\"\",'शालादर्पण कार्मिक DATA'!B259)","v":""},{"$nulls":5},{"$f":"IF('शालादर्पण कार्मिक DATA'!#REF!=\"\",\"\",'शालादर्पण कार्मिक DATA'!#REF!)","v":{"$error":"#REF!"}}]
[{"$f":"IF(कार्मिक_विवरण[NAME]=\"\",\"\",ROWS($A$2:A258))","v":""},{"$f":"IF('शालादर्पण कार्मिक DATA'!A260=\"\",\"\",'शालादर्पण कार्मिक DATA'!A260)","v":""},{"$f":"UPPER(IF('शालादर्पण कार्मिक DATA'!F260=\"\",\"\",'शालादर्पण कार्मिक DATA'!F260))","v":""},{"$f":"IF('शालादर्पण कार्मिक DATA'!E260=\"\",\"\",'शालादर्पण कार्मिक DATA'!E260)","v":""},{"$f":"IF('शालादर्पण कार्मिक DATA'!K260=\"\",\"\",'शालादर्पण कार्मिक DATA'!K260)","v":""},{"$f":"IF('शालादर्पण कार्मिक DATA'!B260=\"\",\"\",'शालादर्पण कार्मिक DATA'!B260)","v":""},{"$nulls":5},{"$f":"IF('शालादर्पण कार्मिक DATA'!#REF!=\"\",\"\",'शालादर्पण कार्मिक DATA'!#REF!)","v":{"$error":"#REF!"}}]
[{"$f":"IF(कार्मिक_विवरण[NAME]=\"\",\"\",ROWS($A$2:A259))","v":""},{"$f":"IF('शालादर्पण कार्मिक DATA'!A261=\"\",\"\",'शालादर्पण कार्मिक DATA'!A261)","v":""},{"$f":"UPPER(IF('शालादर्पण कार्मिक DATA'!F261=\"\",\"\",'शालादर्पण कार्मिक DATA'!F261))","v":""},{"$f":"IF('शालादर्पण कार्मिक DATA'!E261=\"\",\"\",'शालादर्पण कार्मिक DATA'!E261)","v":""},{"$f":"IF('शालादर्पण कार्मिक DATA'!K261=\"\",\"\",'शालादर्पण कार्मिक DATA'!K261)","v":""},{"$f":"IF('शालादर्पण कार्मिक DATA'!B261=\"\",\"\",'शालादर्पण कार्मिक DATA'!B261)","v":""},{"$nulls":5},{"$f":"IF('शालादर्पण कार्मिक DATA'!#REF!=\"\",\"\",'शालादर्पण कार्मिक DATA'!#REF!)","v":{"$error":"#REF!"}}]
[{"$f":"IF(कार्मिक_विवरण[NAME]=\"\",\"\",ROWS($A$2:A260))","v":""},{"$f":"IF('शालादर्पण कार्मिक DATA'!A262=\"\",\"\",'शालादर्पण कार्मिक DATA'!A262)","v":""},{"$f":"UPPER(IF('शालादर्पण कार्मिक DATA'!F262=\"\",\"\",'शालादर्पण कार्मिक DATA'!F262))","v":""},{"$f":"IF('शालादर्पण कार्मिक DATA'!E262=\"\",\"\",'शालादर्पण कार्मिक DATA'!E262)","v":""},{"$f":"IF('शालादर्पण कार्मिक DATA'!K262=\"\",\"\",'शालादर्पण कार्मिक DATA'!K262)","v":""},{"$f":"IF('शालादर्पण कार्मिक DATA'!B262=\"\",\"\",'शालादर्पण कार्मिक DATA'!B262)","v":""},{"$nulls":5},{"$f":"IF('शालादर्पण कार्मिक DATA'!#REF!=\"\",\"\",'शालादर्पण कार्मिक DATA'!#REF!)","v":{"$error":"#REF!"}}]
[{"$f":"IF(कार्मिक_विवरण[NAME]=\"\",\"\",ROWS($A$2:A261))","v":""},{"$f":"IF('शालादर्पण कार्मिक DATA'!A263=\"\",\"\",'शालादर्पण कार्मिक DATA'!A263)","v":""},{"$f":"UPPER(IF('शालादर्पण कार्मिक DATA'!F263=\"\",\"\",'शालादर्पण कार्मिक DATA'!F263))","v":""},{"$f":"IF('शालादर्पण कार्मिक DATA'!E263=\"\",\"\",'शालादर्पण कार्मिक DATA'!E263)","v":""},{"$f":"IF('शालादर्पण कार्मिक DATA'!K263=\"\",\"\",'शालादर्पण कार्मिक DATA'!K263)","v":""},{"$f":"IF('शालादर्पण कार्मिक DATA'!B263=\"\",\"\",'शालादर्पण कार्मिक DATA'!B263)","v":""},{"$nulls":5},{"$f":"IF('शालादर्पण कार्मिक DATA'!#REF!=\"\",\"\",'शालादर्पण कार्मिक DATA'!#REF!)","v":{"$error":"#REF!"}}]
[{"$f":"IF(कार्मिक_विवरण[NAME]=\"\",\"\",ROWS($A$2:A262))","v":""},{"$f":"IF('शालादर्पण कार्मिक DATA'!A264=\"\",\"\",'शालादर्पण कार्मिक DATA'!A264)","v":""},{"$f":"UPPER(IF('शालादर्पण कार्मिक DATA'!F264=\"\",\"\",'शालादर्पण कार्मिक DATA'!F264))","v":""},{"$f":"IF('शालादर्पण कार्मिक DATA'!E264=\"\",\"\",'शालादर्पण कार्मिक DATA'!E264)","v":""},{"$f":"IF('शालादर्पण कार्मिक DATA'!K264=\"\",\"\",'शालादर्पण कार्मिक DATA'!K264)","v":""},{"$f":"IF('शालादर्पण कार्मिक DATA'!B264=\"\",\"\",'शालादर्पण कार्मिक DATA'!B264)","v":""},{"$nulls":5},{"$f":"IF('शालादर्पण कार्मिक DATA'!#REF!=\"\",\"\",'शालादर्पण कार्मिक DATA'!#REF!)","v":{"$error":"#REF!"}}]
[{"$f":"IF(कार्मिक_विवरण[NAME]=\"\",\"\",ROWS($A$2:A263))","v":""},{"$f":"IF('शालादर्पण कार्मिक DATA'!A265=\"\",\"\",'शालादर्पण कार्मिक DATA'!A265)","v":""},{"$f":"UPPER(IF('शालादर्पण कार्मिक DATA'!F265=\"\",\"\",'शालादर्पण कार्मिक DATA'!F265))","v":""},{"$f":"IF('शालादर्पण कार्मिक DATA'!E265=\"\",\"\",'शालादर्पण कार्मिक DATA'!E265)","v":""},{"$f":"IF('शालादर्पण कार्मिक DATA'!K265=\"\",\"\",'शालादर्पण कार्मिक DATA'!K265)","v":""},{"$f":"IF('शालादर्पण कार्मिक DATA'!B265=\"\",\"\",'शालादर्पण कार्मिक DATA'!B265)","v":""},{"$nulls":5},{"$f":"IF('शालादर्पण कार्मिक DATA'!#REF!=\"\",\"\",'शालादर्पण कार्मिक DATA'!#REF!)","v":{"$error":"#REF!"}}]
[{"$f":"IF(कार्मिक_विवरण[NAME]=\"\",\"\",ROWS($A$2:A264))","v":""},{"$f":"IF('शालादर्पण कार्मिक DATA'!A266=\"\",\"\",'शालादर्पण कार्मिक DATA'!A266)","v":""},{"$f":"UPPER(IF('शालादर्पण कार्मिक DATA'!F266=\"\",\"\",'शालादर्पण कार्मिक DATA'!F266))","v":""},{"$f":"IF('शालादर्पण कार्मिक DATA'!E266=\"\",\"\",'शालादर्पण कार्मिक DATA'!E266)","v":""},{"$f":"IF('शालादर्पण कार्मिक DATA'!K266=\"\",\"\",'शालादर्पण कार्मिक DATA'!K266)","v":""},{"$f":"IF('शालादर्पण कार्मिक DATA'!B266=\"\",\"\",'शालादर्पण कार्मिक DATA'!B266)","v":""},{"$nulls":5},{"$f":"IF('शालादर्पण कार्मिक DATA'!#REF!=\"\",\"\",'शालादर्पण कार्मिक DATA'!#REF!)","v":{"$error":"#REF!"}}]
[{"$f":"IF(कार्मिक_विवरण[NAME]=\"\",\"\",ROWS($A$2:A265))","v":""},{"$f":"IF('शालादर्पण कार्मिक DATA'!A267=\"\",\"\",'शालादर्पण कार्मिक DATA'!A267)","v":""},{"$f":"UPPER(IF('शालादर्पण कार्मिक DATA'!F267=\"\",\"\",'शालादर्पण कार्मिक DATA'!F267))","v":""},{"$f":"IF('शालादर्पण कार्मिक DATA'!E267=\"\",\"\",'शालादर्पण कार्मिक DATA'!E267)","v":""},{"$f":"IF('शालादर्पण कार्मिक DATA'!K267=\"\",\"\",'शालादर्पण कार्मिक DATA'!K267)","v":""},{"$f":"IF('शालादर्पण कार्मिक DATA'!B267=\"\",\"\",'शालादर्पण कार्मिक DATA'!B267)","v":""},{"$nulls":5},{"$f":"IF('शालादर्पण कार्मिक DATA'!#REF!=\"\",\"\",'शालादर्पण कार्मिक DATA'!#REF!)","v":{"$error":"#REF!"}}]
[{"$f":"IF(कार्मिक_विवरण[NAME]=\"\",\"\",ROWS($A$2:A266))","v":""},{"$f":"IF('शालादर्पण कार्मिक DATA'!A268=\"\",\"\",'शालादर्पण कार्मिक DATA'!A268)","v":""},{"$f":"UPPER(IF('शालादर्पण कार्मिक DATA'!F268=\"\",\"\",'शालादर्पण कार्मिक DATA'!F268))","v":""},{"$f":"IF('शालादर्पण कार्मिक DATA'!E268=\"\",\"\",'शालादर्पण कार्मिक DATA'!E268)","v":""},{"$f":"IF('शालादर्पण कार्मिक DATA'!K268=\"\",\"\",'शालादर्पण कार्मिक DATA'!K268)","v":""},{"$f":"IF('शालादर्पण कार्मिक DATA'!B268=\"\",\"\",'शालादर्पण कार्मिक DATA'!B268)","v":""},{"$nulls":5},{"$f":"IF('शालादर्पण कार्मिक DATA'!#REF!=\"\",\"\",'शालादर्पण कार्मिक DATA'!#REF!)","v":{"$error":"#REF!"}}]
[{"$f":"IF(कार्मिक_विवरण[NAME]=\"\",\"\",ROWS($A$2:A267))","v":""},{"$f":"IF('शालादर्पण कार्मिक DATA'!A269=\"\",\"\",'शालादर्पण कार्मिक DATA'!A269)","v":""},{"$f":"UPPER(IF('शालादर्पण कार्मिक DATA'!F269=\"\",\"\",'शालादर्पण कार्मिक DATA'!F269))","v":""},{"$f":"IF('शालादर्पण कार्मिक DATA'!E269=\"\",\"\",'शालादर्पण कार्मिक DATA'!E269)","v":""},{"$f":"IF('शालादर्पण कार्मिक DATA'!K269=\"\",\"\",'शालादर्पण कार्मिक DATA'!K269)","v":""},{"$f":"IF('शालादर्पण कार्मिक DATA'!B269=\"\",\"\",'शालादर्पण कार्मिक DATA'!B269)","v":""},{"$nulls":5},{"$f":"IF('शालादर्पण कार्मिक DATA'!#REF!=\"\",\"\",'शालादर्पण कार्मिक DATA'!#REF!)","v":{"$error":"#REF!"}}]
[{"$f":"IF(कार्मिक_विवरण[NAME]=\"\",\"\",ROWS($A$2:A268))","v":""},{"$f":"IF('शालादर्पण कार्मिक DATA'!A270=\"\",\"\",'शालादर्पण कार्मिक DATA'!A270)","v":""},{"$f":"UPPER(IF('शालादर्पण कार्मिक DATA'!F270=\"\",\"\",'शालादर्पण कार्मिक DATA'!F270))","v":""},{"$f":"IF('शालादर्पण कार्मिक DATA'!E270=\"\",\"\",'शालादर्पण कार्मिक DATA'!E270)","v":""},{"$f":"IF('शालादर्पण कार्मिक DATA'!K270=\"\",\"\",'शालादर्पण कार्मिक DATA'!K270)","v":""},{"$f":"IF('शालादर्पण कार्मिक DATA'!B270=\"\",\"\",'शालादर्पण कार्मिक DATA'!B270)","v":""},{"$nulls":5},{"$f":"IF('शालादर्पण कार्मिक DATA'!#REF!=\"\",\"\",'शालादर्पण कार्मिक DATA'!#REF!)","v":{"$error":"#REF!"}}]
[{"$f":"IF(कार्मिक_विवरण[NAME]=\"\",\"\",ROWS($A$2:A269))","v":""},{"$f":"IF('शालादर्पण कार्मिक DATA'!A271=\"\",\"\",'शालादर्पण कार्मिक DATA'!A271)","v":""},{"$f":"UPPER(IF('शालादर्पण कार्मिक DATA'!F271=\"\",\"\",'शालादर्पण कार्मिक DATA'!F271))","v":""},{"$f":"IF('शालादर्पण कार्मिक DATA'!E271=\"\",\"\",'शालादर्पण कार्मिक DATA'!E271)","v":""},{"$f":"IF('शालादर्पण कार्मिक DATA'!K271=\"\",\"\",'शालादर्पण कार्मिक DATA'!K271)","v":""},{"$f":"IF('शालादर्पण कार्मिक DATA'!B271=\"\",\"\",'शालादर्पण कार्मिक DATA'!B271)","v":""},{"$nulls":5},{"$f":"IF('शालादर्पण कार्मिक DATA'!#REF!=\"\",\"\",'शालादर्पण कार्मिक DATA'!#REF!)","v":{"$error":"#REF!"}}]
[{"$f":"IF(कार्मिक_विवरण[NAME]=\"\",\"\",ROWS($A$2:A270))","v":""},{"$f":"IF('शालादर्पण कार्मिक DATA'!A272=\"\",\"\",'शालादर्पण कार्मिक DATA'!A272)","v":""},{"$f":"UPPER(IF('शालादर्पण कार्मिक DATA'!F272=\"\",\"\",'शालादर्पण कार्मिक DATA'!F272))","v":""},{"$f":"IF('शालादर्पण कार्मिक DATA'!E272=\"\",\"\",'शालादर्पण कार्मिक DATA'!E272)","v":""},{"$f":"IF('शालादर्पण कार्मिक DATA'!K272=\"\",\"\",'शालादर्पण कार्मिक DATA'!K272)","v":""},{"$f":"IF('शालादर्पण कार्मिक DATA'!B272=\"\",\"\",'शालादर्पण कार्मिक DATA'!B272)","v":""},{"$nulls":5},{"$f":"IF('शालादर्पण कार्मिक DATA'!#REF!=\"\",\"\",'शालादर्पण कार्मिक DATA'!#REF!)","v":{"$error":"#REF!"}}]
[{"$f":"IF(कार्मिक_विवरण[NAME]=\"\",\"\",ROWS($A$2:A271))","v":""},{"$f":"IF('शालादर्पण कार्मिक DATA'!A273=\"\",\"\",'शालादर्पण कार्मिक DATA'!A273)","v":""},{"$f":"UPPER(IF('शालादर्पण कार्मिक DATA'!F273=\"\",\"\",'शालादर्पण कार्मिक DATA'!F273))","v":""},{"$f":"IF('शालादर्पण कार्मिक DATA'!E273=\"\",\"\",'शालादर्पण कार्मिक DATA'!E273)","v":""},{"$f":"IF('शालादर्पण कार्मिक DATA'!K273=\"\",\"\",'शालादर्पण कार्मिक DATA'!K273)","v":""},{"$f":"IF('शालादर्पण कार्मिक DATA'!B273=\"\",\"\",'शालादर्पण कार्मिक DATA'!B273)","v":""},{"$nulls":5},{"$f":"IF('शालादर्पण कार्मिक DATA'!#REF!=\"\",\"\",'शालादर्पण कार्मिक DATA'!#REF!)","v":{"$error":"#REF!"}}]
[{"$f":"IF(कार्मिक_विवरण[NAME]=\"\",\"\",ROWS($A$2:A272))","v":""},{"$f":"IF('शालादर्पण कार्मिक DATA'!A274=\"\",\"\",'शालादर्पण कार्मिक DATA'!A274)","v":""},{"$f":"UPPER(IF('शालादर्पण कार्मिक DATA'!F274=\"\",\"\",'शालादर्पण कार्मिक DATA'!F274))","v":""},{"$f":"IF('शालादर्पण कार्मिक DATA'!E274=\"\",\"\",'शालादर्पण कार्मिक DATA'!E274)","v":""},{"$f":"IF('शालादर्पण कार्मिक DATA'!K274=\"\",\"\",'शालादर्पण कार्मिक DATA'!K274)","v":""},{"$f":"IF('शालादर्पण कार्मिक DATA'!B274=\"\",\"\",'शालादर्पण कार्मिक DATA'!B274)","v":""},{"$nulls":5},{"$f":"IF('शालादर्पण कार्मिक DATA'!#REF!=\"\",\"\",'शालादर्पण कार्मिक DATA'!#REF!)","v":{"$error":"#REF!"}}]
[{"$f":"IF(कार्मिक_विवरण[NAME]=\"\",\"\",ROWS($A$2:A273))","v":""},{"$f":"IF('शालादर्पण कार्मिक DATA'!A275=\"\",\"\",'शालादर्पण कार्मिक DATA'!A275)","v":""},{"$f":"UPPER(IF('शालादर्पण कार्मिक DATA'!F275=\"\",\"\",'शालादर्पण कार्मिक DATA'!F275))","v":""},{"$f":"IF('शालादर्पण कार्मिक DATA'!E275=\"\",\"\",'शालादर्पण कार्मिक DATA'!E275)","v":""},{"$f":"IF('शालादर्पण कार्मिक DATA'!K275=\"\",\"\",'शालादर्पण कार्मिक DATA'!K275)","v":""},{"$f":"IF('शालादर्पण कार्मिक DATA'!B275=\"\",\"\",'शालादर्पण कार्मिक DATA'!B275)","v":""},{"$nulls":5},{"$f":"IF('शालादर्पण कार्मिक DATA'!#REF!=\"\",\"\",'शालादर्पण कार्मिक DATA'!#REF!)","v":{"$error":"#REF!"}}]
[{"$f":"IF(कार्मिक_विवरण[NAME]=\"\",\"\",ROWS($A$2:A274))","v":""},{"$f":"IF('शालादर्पण कार्मिक DATA'!A276=\"\",\"\",'शालादर्पण कार्मिक DATA'!A276)","v":""},{"$f":"UPPER(IF('शालादर्पण कार्मिक DATA'!F276=\"\",\"\",'शालादर्पण कार्मिक DATA'!F276))","v":""},{"$f":"IF('शालादर्पण कार्मिक DATA'!E276=\"\",\"\",'शालादर्पण कार्मिक DATA'!E276)","v":""},{"$f":"IF('शालादर्पण कार्मिक DATA'!K276=\"\",\"\",'शालादर्पण कार्मिक DATA'!K276)","v":""},{"$f":"IF('शालादर्पण कार्मिक DATA'!B276=\"\",\"\",'शालादर्पण कार्मिक DATA'!B276)","v":""},{"$nulls":5},{"$f":"IF('शालादर्पण कार्मिक DATA'!#REF!=\"\",\"\",'शालादर्पण कार्मिक DATA'!#REF!)","v":{"$error":"#REF!"}}]
[{"$f":"IF(कार्मिक_विवरण[NAME]=\"\",\"\",ROWS($A$2:A275))","v":""},{"$f":"IF('शालादर्पण कार्मिक DATA'!A277=\"\",\"\",'शालादर्पण कार्मिक DATA'!A277)","v":""},{"$f":"UPPER(IF('शालादर्पण कार्मिक DATA'!F277=\"\",\"\",'शालादर्पण कार्मिक DATA'!F277))","v":""},{"$f":"IF('शालादर्पण कार्मिक DATA'!E277=\"\",\"\",'शालादर्पण कार्मिक DATA'!E277)","v":""},{"$f":"IF('शालादर्पण कार्मिक DATA'!K277=\"\",\"\",'शालादर्पण कार्मिक DATA'!K277)","v":""},{"$f":"IF('शालादर्पण कार्मिक DATA'!B277=\"\",\"\",'शालादर्पण कार्मिक DATA'!B277)","v":""},{"$nulls":5},{"$f":"IF('शालादर्पण कार्मिक DATA'!#REF!=\"\",\"\",'शालादर्पण कार्मिक DATA'!#REF!)","v":{"$error":"#REF!"}}]
[{"$f":"IF(कार्मिक_विवरण[NAME]=\"\",\"\",ROWS($A$2:A276))","v":""},{"$f":"IF('शालादर्पण कार्मिक DATA'!A278=\"\",\"\",'शालादर्पण कार्मिक DATA'!A278)","v":""},{"$f":"UPPER(IF('शालादर्पण कार्मिक DATA'!F278=\"\",\"\",'शालादर्पण कार्मिक DATA'!F278))","v":""},{"$f":"IF('शालादर्पण कार्मिक DATA'!E278=\"\",\"\",'शालादर्पण कार्मिक DATA'!E278)","v":""},{"$f":"IF('शालादर्पण कार्मिक DATA'!K278=\"\",\"\",'शालादर्पण कार्मिक DATA'!K278)","v":""},{"$f":"IF('शालादर्पण कार्मिक DATA'!B278=\"\",\"\",'शालादर्पण कार्मिक DATA'!B278)","v":""},{"$nulls":5},{"$f":"IF('शालादर्पण कार्मिक DATA'!#REF!=\"\",\"\",'शालादर्पण कार्मिक DATA'!#REF!)","v":{"$error":"#REF!"}}]
[{"$f":"IF(कार्मिक_विवरण[NAME]=\"\",\"\",ROWS($A$2:A277))","v":""},{"$f":"IF('शालादर्पण कार्मिक DATA'!A279=\"\",\"\",'शालादर्पण कार्मिक DATA'!A279)","v":""},{"$f":"UPPER(IF('शालादर्पण कार्मिक DATA'!F279=\"\",\"\",'शालादर्पण कार्मिक DATA'!F279))","v":""},{"$f":"IF('शालादर्पण कार्मिक DATA'!E279=\"\",\"\",'शालादर्पण कार्मिक DATA'!E279)","v":""},{"$f":"IF('शालादर्पण कार्मिक DATA'!K279=\"\",\"\",'शालादर्पण कार्मिक DATA'!K279)","v":""},{"$f":"IF('शालादर्पण कार्मिक DATA'!B279=\"\",\"\",'शालादर्पण कार्मिक DATA'!B279)","v":""},{"$nulls":5},{"$f":"IF('शालादर्पण कार्मिक DATA'!#REF!=\"\",\"\",'शालादर्पण कार्मिक DATA'!#REF!)","v":{"$error":"#REF!"}}]
[{"$f":"IF(कार्मिक_विवरण[NAME]=\"\",\"\",ROWS($A$2:A278))","v":""},{"$f":"IF('शालादर्पण कार्मिक DATA'!A280=\"\",\"\",'शालादर्पण कार्मिक DATA'!A280)","v":""},{"$f":"UPPER(IF('शालादर्पण कार्मिक DATA'!F280=\"\",\"\",'शालादर्पण कार्मिक DATA'!F280))","v":""},{"$f":"IF('शालादर्पण कार्मिक DATA'!E280=\"\",\"\",'शालादर्पण कार्मिक DATA'!E280)","v":""},{"$f":"IF('शालादर्पण कार्मिक DATA'!K280=\"\",\"\",'शालादर्पण कार्मिक DATA'!K280)","v":""},{"$f":"IF('शालादर्पण कार्मिक DATA'!B280=\"\",\"\",'शालादर्पण कार्मिक DATA'!B280)","v":""},{"$nulls":5},{"$f":"IF('शालादर्पण कार्मिक DATA'!#REF!=\"\",\"\",'शालादर्पण कार्मिक DATA'!#REF!)","v":{"$error":"#REF!"}}]
[{"$f":"IF(कार्मिक_विवरण[NAME]=\"\",\"\",ROWS($A$2:A279))","v":""},{"$f":"IF('शालादर्पण कार्मिक DATA'!A281=\"\",\"\",'शालादर्पण कार्मिक DATA'!A281)","v":""},{"$f":"UPPER(IF('शालादर्पण कार्मिक DATA'!F281=\"\",\"\",'शालादर्पण कार्मिक DATA'!F281))","v":""},{"$f":"IF('शालादर्पण कार्मिक DATA'!E281=\"\",\"\",'शालादर्पण कार्मिक DATA'!E281)","v":""},{"$f":"IF('शालादर्पण कार्मिक DATA'!K281=\"\",\"\",'शालादर्पण कार्मिक DATA'!K281)","v":""},{"$f":"IF('शालादर्पण कार्मिक DATA'!B281=\"\",\"\",'शालादर्पण कार्मिक DATA'!B281)","v":""},{"$nulls":5},{"$f":"IF('शालादर्पण कार्मिक DATA'!#REF!=\"\",\"\",'शालादर्पण कार्मिक DATA'!#REF!)","v":{"$error":"#REF!"}}]
[{"$f":"IF(कार्मिक_विवरण[NAME]=\"\",\"\",ROWS($A$2:A280))","v":""},{"$f":"IF('शालादर्पण कार्मिक DATA'!A282=\"\",\"\",'शालादर्पण कार्मिक DATA'!A282)","v":""},{"$f":"UPPER(IF('शालादर्पण कार्मिक DATA'!F282=\"\",\"\",'शालादर्पण कार्मिक DATA'!F282))","v":""},{"$f":"IF('शालादर्पण कार्मिक DATA'!E282=\"\",\"\",'शालादर्पण कार्मिक DATA'!E282)","v":""},{"$f":"IF('शालादर्पण कार्मिक DATA'!K282=\"\",\"\",'शालादर्पण कार्मिक DATA'!K282)","v":""},{"$f":"IF('शालादर्पण कार्मिक DATA'!B282=\"\",\"\",'शालादर्पण कार्मिक DATA'!B282)","v":""},{"$nulls":5},{"$f":"IF('शालादर्पण कार्मिक DATA'!#REF!=\"\",\"\",'शालादर्पण कार्मिक DATA'!#REF!)","v":{"$error":"#REF!"}}]
[{"$f":"IF(कार्मिक_विवरण[NAME]=\"\",\"\",ROWS($A$2:A281))","v":""},{"$f":"IF('शालादर्पण कार्मिक DATA'!A283=\"\",\"\",'शालादर्पण कार्मिक DATA'!A283)","v":""},{"$f":"UPPER(IF('शालादर्पण कार्मिक DATA'!F283=\"\",\"\",'शालादर्पण कार्मिक DATA'!F283))","v":""},{"$f":"IF('शालादर्पण कार्मिक DATA'!E283=\"\",\"\",'शालादर्पण कार्मिक DATA'!E283)","v":""},{"$f":"IF('शालादर्पण कार्मिक DATA'!K283=\"\",\"\",'शालादर्पण कार्मिक DATA'!K283)","v":""},{"$f":"IF('शालादर्पण कार्मिक DATA'!B283=\"\",\"\",'शालादर्पण कार्मिक DATA'!B283)","v":""},{"$nulls":5},{"$f":"IF('शालादर्पण कार्मिक DATA'!#REF!=\"\",\"\",'शालादर्पण कार्मिक DATA'!#REF!)","v":{"$error":"#REF!"}}]
[{"$f":"IF(कार्मिक_विवरण[NAME]=\"\",\"\",ROWS($A$2:A282))","v":""},{"$f":"IF('शालादर्पण कार्मिक DATA'!A284=\"\",\"\",'शालादर्पण कार्मिक DATA'!A284)","v":""},{"$f":"UPPER(IF('शालादर्पण कार्मिक DATA'!F284=\"\",\"\",'शालादर्पण कार्मिक DATA'!F284))","v":""},{"$f":"IF('शालादर्पण कार्मिक DATA'!E284=\"\",\"\",'शालादर्पण कार्मिक DATA'!E284)","v":""},{"$f":"IF('शालादर्पण कार्मिक DATA'!K284=\"\",\"\",'शालादर्पण कार्मिक DATA'!K284)","v":""},{"$f":"IF('शालादर्पण कार्मिक DATA'!B284=\"\",\"\",'शालादर्पण कार्मिक DATA'!B284)","v":""},{"$nulls":5},{"$f":"IF('शालादर्पण कार्मिक DATA'!#REF!=\"\",\"\",'शालादर्पण कार्मिक DATA'!#REF!)","v":{"$error":"#REF!"}}]
[{"$f":"IF(कार्मिक_विवरण[NAME]=\"\",\"\",ROWS($A$2:A283))","v":""},{"$f":"IF('शालादर्पण कार्मिक DATA'!A285=\"\",\"\",'शालादर्पण कार्मिक DATA'!A285)","v":""},{"$f":"UPPER(IF('शालादर्पण कार्मिक DATA'!F285=\"\",\"\",'शालादर्पण कार्मिक DATA'!F285))","v":""},{"$f":"IF('शालादर्पण कार्मिक DATA'!E285=\"\",\"\",'शालादर्पण कार्मिक DATA'!E285)","v":""},{"$f":"IF('शालादर्पण कार्मिक DATA'!K285=\"\",\"\",'शालादर्पण कार्मिक DATA'!K285)","v":""},{"$f":"IF('शालादर्पण कार्मिक DATA'!B285=\"\",\"\",'शालादर्पण कार्मिक DATA'!B285)","v":""},{"$nulls":5},{"$f":"IF('शालादर्पण कार्मिक DATA'!#REF!=\"\",\"\",'शालादर्पण कार्मिक DATA'!#REF!)","v":{"$error":"#REF!"}}]
[{"$f":"IF(कार्मिक_विवरण[NAME]=\"\",\"\",ROWS($A$2:A284))","v":""},{"$f":"IF('शालादर्पण कार्मिक DATA'!A286=\"\",\"\",'शालादर्पण कार्मिक DATA'!A286)","v":""},{"$f":"UPPER(IF('शालादर्पण कार्मिक DATA'!F286=\"\",\"\",'शालादर्पण कार्मिक DATA'!F286))","v":""},{"$f":"IF('शालादर्पण कार्मिक DATA'!E286=\"\",\"\",'शालादर्पण कार्मिक DATA'!E286)","v":""},{"$f":"IF('शालादर्पण कार्मिक DATA'!K286=\"\",\"\",'शालादर्पण कार्मिक DATA'!K286)","v":""},{"$f":"IF('शालादर्पण कार्मिक DATA'!B286=\"\",\"\",'शालादर्पण कार्मिक DATA'!B286)","v":""},{"$nulls":5},{"$f":"IF('शालादर्पण कार्मिक DATA'!#REF!=\"\",\"\",'शालादर्पण कार्मिक DATA'!#REF!)","v":{"$error":"#REF!"}}]
[{"$f":"IF(कार्मिक_विवरण[NAME]=\"\",\"\",ROWS($A$2:A285))","v":""},{"$f":"IF('शालादर्पण कार्मिक DATA'!A287=\"\",\"\",'शालादर्पण कार्मिक DATA'!A287)","v":""},{"$f":"UPPER(IF('शालादर्पण कार्मिक DATA'!F287=\"\",\"\",'शालादर्पण कार्मिक DATA'!F287))","v":""},{"$f":"IF('शालादर्पण कार्मिक DATA'!E287=\"\",\"\",'शालादर्पण कार्मिक DATA'!E287)","v":""},{"$f":"IF('शालादर्पण कार्मिक DATA'!K287=\"\",\"\",'शालादर्पण कार्मिक DATA'!K287)","v":""},{"$f":"IF('शालादर्पण कार्मिक DATA'!B287=\"\",\"\",'शालादर्पण कार्मिक DATA'!B287)","v":""},{"$nulls":5},{"$f":"IF('शालादर्पण कार्मिक DATA'!#REF!=\"\",\"\",'शालादर्पण कार्मिक DATA'!#REF!)","v":{"$error":"#REF!"}}]
[{"$f":"IF(कार्मिक_विवरण[NAME]=\"\",\"\",ROWS($A$2:A286))","v":""},{"$f":"IF('शालादर्पण कार्मिक DATA'!A288=\"\",\"\",'शालादर्पण कार्मिक DATA'!A288)","v":""},{"$f":"UPPER(IF('शालादर्पण कार्मिक DATA'!F288=\"\",\"\",'शालादर्पण कार्मिक DATA'!F288))","v":""},{"$f":"IF('शालादर्पण कार्मिक DATA'!E288=\"\",\"\",'शालादर्पण कार्मिक DATA'!E288)","v":""},{"$f":"IF('शालादर्पण कार्मिक DATA'!K288=\"\",\"\",'शालादर्पण कार्मिक DATA'!K288)","v":""},{"$f":"IF('शालादर्पण कार्मिक DATA'!B288=\"\",\"\",'शालादर्पण कार्मिक DATA'!B288)","v":""},{"$nulls":5},{"$f":"IF('शालादर्पण कार्मिक DATA'!#REF!=\"\",\"\",'शालादर्पण कार्मिक DATA'!#REF!)","v":{"$error":"#REF!"}}]
[{"$f":"IF(कार्मिक_विवरण[NAME]=\"\",\"\",ROWS($A$2:A287))","v":""},{"$f":"IF('शालादर्पण कार्मिक DATA'!A289=\"\",\"\",'शालादर्पण कार्मिक DATA'!A289)","v":""},{"$f":"UPPER(IF('शालादर्पण कार्मिक DATA'!F289=\"\",\"\",'शालादर्पण कार्मिक DATA'!F289))","v":""},{"$f":"IF('शालादर्पण कार्मिक DATA'!E289=\"\",\"\",'शालादर्पण कार्मिक DATA'!E289)","v":""},{"$f":"IF('शालादर्पण कार्मिक DATA'!K289=\"\",\"\",'शालादर्पण कार्मिक DATA'!K289)","v":""},{"$f":"IF('शालादर्पण कार्मिक DATA'!B289=\"\",\"\",'शालादर्पण कार्मिक DATA'!B289)","v":""},{"$nulls":5},{"$f":"IF('शालादर्पण कार्मिक DATA'!#REF!=\"\",\"\",'शालादर्पण कार्मिक DATA'!#REF!)","v":{"$error":"#REF!"}}]
[{"$f":"IF(कार्मिक_विवरण[NAME]=\"\",\"\",ROWS($A$2:A288))","v":""},{"$f":"IF('शालादर्पण कार्मिक DATA'!A290=\"\",\"\",'शालादर्पण कार्मिक DATA'!A290)","v":""},{"$f":"UPPER(IF('शालादर्पण कार्मिक DATA'!F290=\"\",\"\",'शालादर्पण कार्मिक DATA'!F290))","v":""},{"$f":"IF('शालादर्पण कार्मिक DATA'!E290=\"\",\"\",'शालादर्पण कार्मिक DATA'!E290)","v":""},{"$f":"IF('शालादर्पण कार्मिक DATA'!K290=\"\",\"\",'शालादर्पण कार्मिक DATA'!K290)","v":""},{"$f":"IF('शालादर्पण कार्मिक DATA'!B290=\"\",\"\",'शालादर्पण कार्मिक DATA'!B290)","v":""},{"$nulls":5},{"$f":"IF('शालादर्पण कार्मिक DATA'!#REF!=\"\",\"\",'शालादर्पण कार्मिक DATA'!#REF!)","v":{"$error":"#REF!"}}]
[{"$f":"IF(कार्मिक_विवरण[NAME]=\"\",\"\",ROWS($A$2:A289))","v":""},{"$f":"IF('शालादर्पण कार्मिक DATA'!A291=\"\",\"\",'शालादर्पण कार्मिक DATA'!A291)","v":""},{"$f":"UPPER(IF('शालादर्पण कार्मिक DATA'!F291=\"\",\"\",'शालादर्पण कार्मिक DATA'!F291))","v":""},{"$f":"IF('शालादर्पण कार्मिक DATA'!E291=\"\",\"\",'शालादर्पण कार्मिक DATA'!E291)","v":""},{"$f":"IF('शालादर्पण कार्मिक DATA'!K291=\"\",\"\",'शालादर्पण कार्मिक DATA'!K291)","v":""},{"$f":"IF('शालादर्पण कार्मिक DATA'!B291=\"\",\"\",'शालादर्पण कार्मिक DATA'!B291)","v":""},{"$nulls":5},{"$f":"IF('शालादर्पण कार्मिक DATA'!#REF!=\"\",\"\",'शालादर्पण कार्मिक DATA'!#REF!)","v":{"$error":"#REF!"}}]
[{"$f":"IF(कार्मिक_विवरण[NAME]=\"\",\"\",ROWS($A$2:A290))","v":""},{"$f":"IF('शालादर्पण कार्मिक DATA'!A292=\"\",\"\",'शालादर्पण कार्मिक DATA'!A292)","v":""},{"$f":"UPPER(IF('शालादर्पण कार्मिक DATA'!F292=\"\",\"\",'शालादर्पण कार्मिक DATA'!F292))","v":""},{"$f":"IF('शालादर्पण कार्मिक DATA'!E292=\"\",\"\",'शालादर्पण कार्मिक DATA'!E292)","v":""},{"$f":"IF('शालादर्पण कार्मिक DATA'!K292=\"\",\"\",'शालादर्पण कार्मिक DATA'!K292)","v":""},{"$f":"IF('शालादर्पण कार्मिक DATA'!B292=\"\",\"\",'शालादर्पण कार्मिक DATA'!B292)","v":""},{"$nulls":5},{"$f":"IF('शालादर्पण कार्मिक DATA'!#REF!=\"\",\"\",'शालादर्पण कार्मिक DATA'!#REF!)","v":{"$error":"#REF!"}}]
[{"$f":"IF(कार्मिक_विवरण[NAME]=\"\",\"\",ROWS($A$2:A291))","v":""},{"$f":"IF('शालादर्पण कार्मिक DATA'!A293=\"\",\"\",'शालादर्पण कार्मिक DATA'!A293)","v":""},{"$f":"UPPER(IF('शालादर्पण कार्मिक DATA'!F293=\"\",\"\",'शालादर्पण कार्मिक DATA'!F293))","v":""},{"$f":"IF('शालादर्पण कार्मिक DATA'!E293=\"\",\"\",'शालादर्पण कार्मिक DATA'!E293)","v":""},{"$f":"IF('शालादर्पण कार्मिक DATA'!K293=\"\",\"\",'शालादर्पण कार्मिक DATA'!K293)","v":""},{"$f":"IF('शालादर्पण कार्मिक DATA'!B293=\"\",\"\",'शालादर्पण कार्मिक DATA'!B293)","v":""},{"$nulls":5},{"$f":"IF('शालादर्पण कार्मिक DATA'!#REF!=\"\",\"\",'शालादर्पण कार्मिक DATA'!#REF!)","v":{"$error":"#REF!"}}]
[{"$f":"IF(कार्मिक_विवरण[NAME]=\"\",\"\",ROWS($A$2:A292))","v":""},{"$f":"IF('शालादर्पण कार्मिक DATA'!A294=\"\",\"\",'शालादर्पण कार्मिक DATA'!A294)","v":""},{"$f":"UPPER(IF('शालादर्पण कार्मिक DATA'!F294=\"\",\"\",'शालादर्पण कार्मिक DATA'!F294))","v":""},{"$f":"IF('शालादर्पण कार्मिक DATA'!E294=\"\",\"\",'शालादर्पण कार्मिक DATA'!E294)","v":""},{"$f":"IF('शालादर्पण कार्मिक DATA'!K294=\"\",\"\",'शालादर्पण कार्मिक DATA'!K294)","v":""},{"$f":"IF('शालादर्पण कार्मिक DATA'!B294=\"\",\"\",'शालादर्पण कार्मिक DATA'!B294)","v":""},{"$nulls":5},{"$f":"IF('शालादर्पण कार्मिक DATA'!#REF!=\"\",\"\",'शालादर्पण कार्मिक DATA'!#REF!)","v":{"$error":"#REF!"}}]
[{"$f":"IF(कार्मिक_विवरण[NAME]=\"\",\"\",ROWS($A$2:A293))","v":""},{"$f":"IF('शालादर्पण कार्मिक DATA'!A295=\"\",\"\",'शालादर्पण कार्मिक DATA'!A295)","v":""},{"$f":"UPPER(IF('शालादर्पण कार्मिक DATA'!F295=\"\",\"\",'शालादर्पण कार्मिक DATA'!F295))","v":""},{"$f":"IF('शालादर्पण कार्मिक DATA'!E295=\"\",\"\",'शालादर्पण कार्मिक DATA'!E295)","v":""},{"$f":"IF('शालादर्पण कार्मिक DATA'!K295=\"\",\"\",'शालादर्पण कार्मिक DATA'!K295)","v":""},{"$f":"IF('शालादर्पण कार्मिक DATA'!B295=\"\",\"\",'शालादर्पण कार्मिक DATA'!B295)","v":""},{"$nulls":5},{"$f":"IF('शालादर्पण कार्मिक DATA'!#REF!=\"\",\"\",'शालादर्पण कार्मिक DATA'!#REF!)","v":{"$error":"#REF!"}}]
[{"$f":"IF(कार्मिक_विवरण[NAME]=\"\",\"\",ROWS($A$2:A294))","v":""},{"$f":"IF('शालादर्पण कार्मिक DATA'!A296=\"\",\"\",'शालादर्पण कार्मिक DATA'!A296)","v":""},{"$f":"UPPER(IF('शालादर्पण कार्मिक DATA'!F296=\"\",\"\",'शालादर्पण कार्मिक DATA'!F296))","v":""},{"$f":"IF('शालादर्पण कार्मिक DATA'!E296=\"\",\"\",'शालादर्पण कार्मिक DATA'!E296)","v":""},{"$f":"IF('शालादर्पण कार्मिक DATA'!K296=\"\",\"\",'शालादर्पण कार्मिक DATA'!K296)","v":""},{"$f":"IF('शालादर्पण कार्मिक DATA'!B296=\"\",\"\",'शालादर्पण कार्मिक DATA'!B296)","v":""},{"$nulls":5},{"$f":"IF('शालादर्पण कार्मिक DATA'!#REF!=\"\",\"\",'शालादर्पण कार्मिक DATA'!#REF!)","v":{"$error":"#REF!"}}]
[{"$f":"IF(कार्मिक_विवरण[NAME]=\"\",\"\",ROWS($A$2:A295))","v":""},{"$f":"IF('शालादर्पण कार्मिक DATA'!A297=\"\",\"\",'शालादर्पण कार्मिक DATA'!A297)","v":""},{"$f":"UPPER(IF('शालादर्पण कार्मिक DATA'!F297=\"\",\"\",'शालादर्पण कार्मिक DATA'!F297))","v":""},{"$f":"IF('शालादर्पण कार्मिक DATA'!E297=\"\",\"\",'शालादर्पण कार्मिक DATA'!E297)","v":""},{"$f":"IF('शालादर्पण कार्मिक DATA'!K297=\"\",\"\",'शालादर्पण कार्मिक DATA'!K297)","v":""},{"$f":"IF('शालादर्पण कार्मिक DATA'!B297=\"\",\"\",'शालादर्पण कार्मिक DATA'!B297)","v":""},{"$nulls":5},{"$f":"IF('शालादर्पण कार्मिक DATA'!#REF!=\"\",\"\",'शालादर्पण कार्मिक DATA'!#REF!)","v":{"$error":"#REF!"}}]
[{"$f":"IF(कार्मिक_विवरण[NAME]=\"\",\"\",ROWS($A$2:A296))","v":""},{"$f":"IF('शालादर्पण कार्मिक DATA'!A298=\"\",\"\",'शालादर्पण कार्मिक DATA'!A298)","v":""},{"$f":"UPPER(IF('शालादर्पण कार्मिक DATA'!F298=\"\",\"\",'शालादर्पण कार्मिक DATA'!F298))","v":""},{"$f":"IF('शालादर्पण कार्मिक DATA'!E298=\"\",\"\",'शालादर्पण कार्मिक DATA'!E298)","v":""},{"$f":"IF('शालादर्पण कार्मिक DATA'!K298=\"\",\"\",'शालादर्पण कार्मिक DATA'!K298)","v":""},{"$f":"IF('शालादर्पण कार्मिक DATA'!B298=\"\",\"\",'शालादर्पण कार्मिक DATA'!B298)","v":""},{"$nulls":5},{"$f":"IF('शालादर्पण कार्मिक DATA'!#REF!=\"\",\"\",'शालादर्पण कार्मिक DATA'!#REF!)","v":{"$error":"#REF!"}}]
[{"$f":"IF(कार्मिक_विवरण[NAME]=\"\",\"\",ROWS($A$2:A297))","v":""},{"$f":"IF('शालादर्पण कार्मिक DATA'!A299=\"\",\"\",'शालादर्पण कार्मिक DATA'!A299)","v":""},{"$f":"UPPER(IF('शालादर्पण कार्मिक DATA'!F299=\"\",\"\",'शालादर्पण कार्मिक DATA'!F299))","v":""},{"$f":"IF('शालादर्पण कार्मिक DATA'!E299=\"\",\"\",'शालादर्पण कार्मिक DATA'!E299)","v":""},{"$f":"IF('शालादर्पण कार्मिक DATA'!K299=\"\",\"\",'शालादर्पण कार्मिक DATA'!K299)","v":""},{"$f":"IF('शालादर्पण कार्मिक DATA'!B299=\"\",\"\",'शालादर्पण कार्मिक DATA'!B299)","v":""},{"$nulls":5},{"$f":"IF('शालादर्पण कार्मिक DATA'!#REF!=\"\",\"\",'शालादर्पण कार्मिक DATA'!#REF!)","v":{"$error":"#REF!"}}]

{"sheet":"बिल और T.V.न.","index":4,"n_rows":26,"n_cols":6,"rows_kept":26,"merged":[[0,0,0,5],[1,0,1,5],[2,0,2,5]]}
["MADE BY:-भागीरथ मल कलवानियाँ कोलिया  MOB. NO 982879204"]
[{"$f":"'कार्मिक विवरण'!A2","v":"राजकीय उच्च माध्यमिक विद्यालय डसाणा खुर्द,मौलासर,नागौर"}]
["BILL NO. AND TV NO.DETAIL"]
["क्र.सं.","माह का नाम","बिल नं.","DATE","टी.वी. नं.","DATE"]
[1,"APR",3,"2023-05-07",15843,"2023-05-13"]
[2,"MAY",9,"2023-05-08",22151,"2023-05-14"]
[3,"JUN",11,"2023-05-09",33751,"2023-05-15"]
[4,"JUL",17,"2023-05-10",45857,"2023-05-16"]
[5,"AUG",20,"2023-05-11",54785,"2023-05-17"]
[6,"SEP",22,"2023-05-12",65093,"2023-05-18"]
[7,"OCT",27,"2023-05-13",74203,"2023-05-19"]
[8,"NOV",31,"2023-05-14",87547,"2023-05-20"]
[9,"DEC",33,"2023-05-15",98298,"2023-05-21"]
[10,"JAN",36,"2023-05-16",108163,"2023-05-22"]
[11,"FEB",41,"2023-05-17",123382,"2023-05-23"]
[12,"MAR",null,"2023-05-18",null,"2023-05-24"]
[12,null,null,"2023-05-19",null,"2023-05-25"]
[12,null,null,"2023-05-20",null,"2023-05-26"]
[12,null,null,"2023-05-21",null,"2023-05-27"]
[12,null,null,"2023-05-22",null,"2023-05-28"]
[12,null,null,"2023-05-23",null,"2023-05-29"]
[12,{"$nulls":4},"2023-05-30"]
[12,{"$nulls":4},"2023-05-31"]
[12,{"$nulls":4},"2023-06-01"]
[12,{"$nulls":4},"2023-06-02"]
[12,{"$nulls":4},"2023-06-03"]

{"sheet":"भते","index":5,"n_rows":104,"n_cols":11,"rows_kept":104,"merged":[[0,0,0,10],[1,0,1,10],[2,0,2,10]]}
["MADE BY:-भागीरथ मल कलवानियाँ कोलिया  MOB. NO 982879204"]
[{"$f":"'कार्मिक विवरण'!A2","v":"राजकीय उच्च माध्यमिक विद्यालय डसाणा खुर्द,मौलासर,नागौर"}]
["ALLOWANCES DETAIL "]
["S.NO","NAME","APRIL MONTH मूल वेतन","अवकाश वेतन ","विशेष वेतन","विकलांग भत्ता","शहरी भत्ता ","अन्य 1","अन्य 2","अन्य 3","योग 1"]
[{"$f":"IF(भते[NAME]=\"\",\"\",ROWS($A$2:A2))","v":1},{"$f":"IF('शालादर्पण कार्मिक DATA'!A4=\"\",\"\",'शालादर्पण कार्मिक DATA'!A4)","v":"A"},69200,{"$nulls":7},{"$f":"SUM(C5:J5)","v":69200}]
[{"$f":"IF(भते[NAME]=\"\",\"\",ROWS($A$2:A3))","v":2},{"$f":"IF('शालादर्पण कार्मिक DATA'!A5=\"\",\"\",'शालादर्पण कार्मिक DATA'!A5)","v":"B"},67200,{"$nulls":7},{"$f":"SUM(C6:J6)","v":67200}]
[{"$f":"IF(भते[NAME]=\"\",\"\",ROWS($A$2:A4))","v":3},{"$f":"IF('शालादर्पण कार्मिक DATA'!A6=\"\",\"\",'शालादर्पण कार्मिक DATA'!A6)","v":"C"},26500,{"$nulls":7},26500]
[{"$f":"IF(भते[NAME]=\"\",\"\",ROWS($A$2:A5))","v":4},{"$f":"IF('शालादर्पण कार्मिक DATA'!A7=\"\",\"\",'शालादर्पण कार्मिक DATA'!A7)","v":"D"},41300,{"$nulls":7},41300]
[{"$f":"IF(भते[NAME]=\"\",\"\",ROWS($A$2:A6))","v":5},{"$f":"IF('शालादर्पण कार्मिक DATA'!A8=\"\",\"\",'शालादर्पण कार्मिक DATA'!A8)","v":"E"},61300,{"$nulls":7},61300]
[{"$f":"IF(भते[NAME]=\"\",\"\",ROWS($A$2:A7))","v":6},{"$f":"IF('शालादर्पण कार्मिक DATA'!A9=\"\",\"\",'शालादर्पण कार्मिक DATA'!A9)","v":"F"},45100,{"$nulls":7},45100]
[{"$f":"IF(भते[NAME]=\"\",\"\",ROWS($A$2:A8))","v":7},{"$f":"IF('शालादर्पण कार्मिक DATA'!A10=\"\",\"\",'शालादर्पण कार्मिक DATA'!A10)","v":"G"},18200,{"$nulls":4},150,null,null,18350]
[{"$f":"IF(भते[NAME]=\"\",\"\",ROWS($A$2:A9))","v":8},{"$f":"IF('शालादर्पण कार्मिक DATA'!A11=\"\",\"\",'शालादर्पण कार्मिक DATA'!A11)","v":"H"},35800,{"$nulls":7},35800]
[{"$f":"IF(भते[NAME]=\"\",\"\",ROWS($A$2:A10))","v":9},{"$f":"IF('शालादर्पण कार्मिक DATA'!A12=\"\",\"\",'शालादर्पण कार्मिक DATA'!A12)","v":"I"},39100,{"$nulls":7},39100]
[{"$f":"IF(भते[NAME]=\"\",\"\",ROWS($A$2:A11))","v":10},{"$f":"IF('शालादर्पण कार्मिक DATA'!A13=\"\",\"\",'शालादर्पण कार्मिक DATA'!A13)","v":"J"},42500,{"$nulls":7},42500]
[{"$f":"IF(भते[NAME]=\"\",\"\",ROWS($A$2:A12))","v":11},{"$f":"IF('शालादर्पण कार्मिक DATA'!A14=\"\",\"\",'शालादर्पण कार्मिक DATA'!A14)","v":"K"},43800,{"$nulls":7},43800]
[{"$f":"IF(भते[NAME]=\"\",\"\",ROWS($A$2:A13))","v":12},{"$f":"IF('शालादर्पण कार्मिक DATA'!A15=\"\",\"\",'शालादर्पण कार्मिक DATA'!A15)","v":"L"},14600,{"$nulls":7},14600]
[{"$f":"IF(भते[NAME]=\"\",\"\",ROWS($A$2:A14))","v":13},{"$f":"IF('शालादर्पण कार्मिक DATA'!A16=\"\",\"\",'शालादर्पण कार्मिक DATA'!A16)","v":"M"},{"$nulls":8},0]
[{"$f":"IF(भते[NAME]=\"\",\"\",ROWS($A$2:A15))","v":14},{"$f":"IF('शालादर्पण कार्मिक DATA'!A17=\"\",\"\",'शालादर्पण कार्मिक DATA'!A17)","v":"N"},{"$nulls":8},0]
[{"$f":"IF(भते[NAME]=\"\",\"\",ROWS($A$2:A16))","v":15},{"$f":"IF('शालादर्पण कार्मिक DATA'!A18=\"\",\"\",'शालादर्पण कार्मिक DATA'!A18)","v":"O"},{"$nulls":8},0]
[{"$f":"IF(भते[NAME]=\"\",\"\",ROWS($A$2:A17))","v":16},{"$f":"IF('शालादर्पण कार्मिक DATA'!A19=\"\",\"\",'शालादर्पण कार्मिक DATA'!A19)","v":"P"},{"$nulls":8},0]
[{"$f":"IF(भते[NAME]=\"\",\"\",ROWS($A$2:A18))","v":17},{"$f":"IF('शालादर्पण कार्मिक DATA'!A20=\"\",\"\",'शालादर्पण कार्मिक DATA'!A20)","v":"Q"},{"$nulls":8},0]
[{"$f":"IF(भते[NAME]=\"\",\"\",ROWS($A$2:A19))","v":18},{"$f":"IF('शालादर्पण कार्मिक DATA'!A21=\"\",\"\",'शालादर्पण कार्मिक DATA'!A21)","v":"R"},{"$nulls":8},0]
[{"$f":"IF(भते[NAME]=\"\",\"\",ROWS($A$2:A20))","v":19},{"$f":"IF('शालादर्पण कार्मिक DATA'!A22=\"\",\"\",'शालादर्पण कार्मिक DATA'!A22)","v":"S"},{"$nulls":8},0]
[{"$f":"IF(भते[NAME]=\"\",\"\",ROWS($A$2:A21))","v":20},{"$f":"IF('शालादर्पण कार्मिक DATA'!A23=\"\",\"\",'शालादर्पण कार्मिक DATA'!A23)","v":"T"},{"$nulls":8},0]
[{"$f":"IF(भते[NAME]=\"\",\"\",ROWS($A$2:A22))","v":21},{"$f":"IF('शालादर्पण कार्मिक DATA'!A24=\"\",\"\",'शालादर्पण कार्मिक DATA'!A24)","v":"U"},{"$nulls":8},0]
[{"$f":"IF(भते[NAME]=\"\",\"\",ROWS($A$2:A23))","v":22},{"$f":"IF('शालादर्पण कार्मिक DATA'!A25=\"\",\"\",'शालादर्पण कार्मिक DATA'!A25)","v":"V"},{"$nulls":8},0]
[{"$f":"IF(भते[NAME]=\"\",\"\",ROWS($A$2:A24))","v":23},{"$f":"IF('शालादर्पण कार्मिक DATA'!A26=\"\",\"\",'शालादर्पण कार्मिक DATA'!A26)","v":"W"},{"$nulls":8},0]
[{"$f":"IF(भते[NAME]=\"\",\"\",ROWS($A$2:A25))","v":24},{"$f":"IF('शालादर्पण कार्मिक DATA'!A27=\"\",\"\",'शालादर्पण कार्मिक DATA'!A27)","v":"X"},{"$nulls":8},0]
[{"$f":"IF(भते[NAME]=\"\",\"\",ROWS($A$2:A26))","v":25},{"$f":"IF('शालादर्पण कार्मिक DATA'!A28=\"\",\"\",'शालादर्पण कार्मिक DATA'!A28)","v":"Z"},{"$nulls":8},0]
[{"$f":"IF(भते[NAME]=\"\",\"\",ROWS($A$2:A27))","v":""},{"$f":"IF('शालादर्पण कार्मिक DATA'!A29=\"\",\"\",'शालादर्पण कार्मिक DATA'!A29)","v":""},{"$nulls":8},0]
[{"$f":"IF(भते[NAME]=\"\",\"\",ROWS($A$2:A28))","v":""},{"$f":"IF('शालादर्पण कार्मिक DATA'!A30=\"\",\"\",'शालादर्पण कार्मिक DATA'!A30)","v":""},{"$nulls":8},0]
[{"$f":"IF(भते[NAME]=\"\",\"\",ROWS($A$2:A29))","v":""},{"$f":"IF('शालादर्पण कार्मिक DATA'!A31=\"\",\"\",'शालादर्पण कार्मिक DATA'!A31)","v":""},{"$nulls":8},0]
[{"$f":"IF(भते[NAME]=\"\",\"\",ROWS($A$2:A30))","v":""},{"$f":"IF('शालादर्पण कार्मिक DATA'!A32=\"\",\"\",'शालादर्पण कार्मिक DATA'!A32)","v":""},{"$nulls":8},0]
[{"$f":"IF(भते[NAME]=\"\",\"\",ROWS($A$2:A31))","v":""},{"$f":"IF('शालादर्पण कार्मिक DATA'!A33=\"\",\"\",'शालादर्पण कार्मिक DATA'!A33)","v":""},{"$nulls":8},0]
[{"$f":"IF(भते[NAME]=\"\",\"\",ROWS($A$2:A32))","v":""},{"$f":"IF('शालादर्पण कार्मिक DATA'!A34=\"\",\"\",'शालादर्पण कार्मिक DATA'!A34)","v":""},{"$nulls":8},0]
[{"$f":"IF(भते[NAME]=\"\",\"\",ROWS($A$2:A33))","v":""},{"$f":"IF('शालादर्पण कार्मिक DATA'!A35=\"\",\"\",'शालादर्पण कार्मिक DATA'!A35)","v":""},{"$nulls":8},0]
[{"$f":"IF(भते[NAME]=\"\",\"\",ROWS($A$2:A34))","v":""},{"$f":"IF('शालादर्पण कार्मिक DATA'!A36=\"\",\"\",'शालादर्पण कार्मिक DATA'!A36)","v":""},{"$nulls":8},0]
[{"$f":"IF(भते[NAME]=\"\",\"\",ROWS($A$2:A35))","v":""},{"$f":"IF('शालादर्पण कार्मिक DATA'!A37=\"\",\"\",'शालादर्पण कार्मिक DATA'!A37)","v":""},{"$nulls":8},0]
[{"$f":"IF(भते[NAME]=\"\",\"\",ROWS($A$2:A36))","v":""},{"$f":"IF('शालादर्पण कार्मिक DATA'!A38=\"\",\"\",'शालादर्पण कार्मिक DATA'!A38)","v":""},{"$nulls":8},0]
[{"$f":"IF(भते[NAME]=\"\",\"\",ROWS($A$2:A37))","v":""},{"$f":"IF('शालादर्पण कार्मिक DATA'!A39=\"\",\"\",'शालादर्पण कार्मिक DATA'!A39)","v":""},{"$nulls":8},0]
[{"$f":"IF(भते[NAME]=\"\",\"\",ROWS($A$2:A38))","v":""},{"$f":"IF('शालादर्पण कार्मिक DATA'!A40=\"\",\"\",'शालादर्पण कार्मिक DATA'!A40)","v":""},{"$nulls":8},0]
[{"$f":"IF(भते[NAME]=\"\",\"\",ROWS($A$2:A39))","v":""},{"$f":"IF('शालादर्पण कार्मिक DATA'!A41=\"\",\"\",'शालादर्पण कार्मिक DATA'!A41)","v":""},{"$nulls":8},0]
[{"$f":"IF(भते[NAME]=\"\",\"\",ROWS($A$2:A40))","v":""},{"$f":"IF('शालादर्पण कार्मिक DATA'!A42=\"\",\"\",'शालादर्पण कार्मिक DATA'!A42)","v":""},{"$nulls":8},0]
[{"$f":"IF(भते[NAME]=\"\",\"\",ROWS($A$2:A41))","v":""},{"$f":"IF('शालादर्पण कार्मिक DATA'!A43=\"\",\"\",'शालादर्पण कार्मिक DATA'!A43)","v":""},{"$nulls":8},0]
[{"$f":"IF(भते[NAME]=\"\",\"\",ROWS($A$2:A42))","v":""},{"$f":"IF('शालादर्पण कार्मिक DATA'!A44=\"\",\"\",'शालादर्पण कार्मिक DATA'!A44)","v":""},{"$nulls":8},0]
[{"$f":"IF(भते[NAME]=\"\",\"\",ROWS($A$2:A43))","v":""},{"$f":"IF('शालादर्पण कार्मिक DATA'!A45=\"\",\"\",'शालादर्पण कार्मिक DATA'!A45)","v":""},{"$nulls":8},0]
[{"$f":"IF(भते[NAME]=\"\",\"\",ROWS($A$2:A44))","v":""},{"$f":"IF('शालादर्पण कार्मिक DATA'!A46=\"\",\"\",'शालादर्पण कार्मिक DATA'!A46)","v":""},{"$nulls":8},0]
[{"$f":"IF(भते[NAME]=\"\",\"\",ROWS($A$2:A45))","v":""},{"$f":"IF('शालादर्पण कार्मिक DATA'!A47=\"\",\"\",'शालादर्पण कार्मिक DATA'!A47)","v":""},{"$nulls":8},0]
[{"$f":"IF(भते[NAME]=\"\",\"\",ROWS($A$2:A46))","v":""},{"$f":"IF('शालादर्पण कार्मिक DATA'!A48=\"\",\"\",'शालादर्पण कार्मिक DATA'!A48)","v":""},{"$nulls":8},0]
[{"$f":"IF(भते[NAME]=\"\",\"\",ROWS($A$2:A47))","v":""},{"$f":"IF('शालादर्पण कार्मिक DATA'!A49=\"\",\"\",'शालादर्पण कार्मिक DATA'!A49)","v":""},{"$nulls":8},0]
[{"$f":"IF(भते[NAME]=\"\",\"\",ROWS($A$2:A48))","v":""},{"$f":"IF('शालादर्पण कार्मिक DATA'!A50=\"\",\"\",'शालादर्पण कार्मिक DATA'!A50)","v":""},{"$nulls":8},0]
[{"$f":"IF(भते[NAME]=\"\",\"\",ROWS($A$2:A49))","v":""},{"$f":"IF('शालादर्पण कार्मिक DATA'!A51=\"\",\"\",'शालादर्पण कार्मिक DATA'!A51)","v":""},{"$nulls":8},0]
[{"$f":"IF(भते[NAME]=\"\",\"\",ROWS($A$2:A50))","v":""},{"$f":"IF('शालादर्पण कार्मिक DATA'!A52=\"\",\"\",'शालादर्पण कार्मिक DATA'!A52)","v":""},{"$nulls":8},0]
[{"$f":"IF(भते[NAME]=\"\",\"\",ROWS($A$2:A51))","v":""},{"$f":"IF('शालादर्पण कार्मिक DATA'!A53=\"\",\"\",'शालादर्पण कार्मिक DATA'!A53)","v":""},{"$nulls":8},0]
[{"$f":"IF(भते[NAME]=\"\",\"\",ROWS($A$2:A52))","v":""},{"$f":"IF('शालादर्पण कार्मिक DATA'!A54=\"\",\"\",'शालादर्पण कार्मिक DATA'!A54)","v":""},{"$nulls":8},0]
[{"$f":"IF(भते[NAME]=\"\",\"\",ROWS($A$2:A53))","v":""},{"$f":"IF('शालादर्पण कार्मिक DATA'!A55=\"\",\"\",'शालादर्पण कार्मिक DATA'!A55)","v":""},{"$nulls":8},0]
[{"$f":"IF(भते[NAME]=\"\",\"\",ROWS($A$2:A54))","v":""},{"$f":"IF('शालादर्पण कार्मिक DATA'!A56=\"\",\"\",'शालादर्पण कार्मिक DATA'!A56)","v":""},{"$nulls":8},0]
[{"$f":"IF(भते[NAME]=\"\",\"\",ROWS($A$2:A55))","v":""},{"$f":"IF('शालादर्पण कार्मिक DATA'!A57=\"\",\"\",'शालादर्पण कार्मिक DATA'!A57)","v":""},{"$nulls":8},0]
[{"$f":"IF(भते[NAME]=\"\",\"\",ROWS($A$2:A56))","v":""},{"$f":"IF('शालादर्पण कार्मिक DATA'!A58=\"\",\"\",'शालादर्पण कार्मिक DATA'!A58)","v":""},{"$nulls":8},0]
[{"$f":"IF(भते[NAME]=\"\",\"\",ROWS($A$2:A57))","v":""},{"$f":"IF('शालादर्पण कार्मिक DATA'!A59=\"\",\"\",'शालादर्पण कार्मिक DATA'!A59)","v":""},{"$nulls":8},0]
[{"$f":"IF(भते[NAME]=\"\",\"\",ROWS($A$2:A58))","v":""},{"$f":"IF('शालादर्पण कार्मिक DATA'!A60=\"\",\"\",'शालादर्पण कार्मिक DATA'!A60)","v":""},{"$nulls":8},0]
[{"$f":"IF(भते[NAME]=\"\",\"\",ROWS($A$2:A59))","v":""},{"$f":"IF('शालादर्पण कार्मिक DATA'!A61=\"\",\"\",'शालादर्पण कार्मिक DATA'!A61)","v":""},{"$nulls":8},0]
[{"$f":"IF(भते[NAME]=\"\",\"\",ROWS($A$2:A60))","v":""},{"$f":"IF('शालादर्पण कार्मिक DATA'!A62=\"\",\"\",'शालादर्पण कार्मिक DATA'!A62)","v":""},{"$nulls":8},0]
[{"$f":"IF(भते[NAME]=\"\",\"\",ROWS($A$2:A61))","v":""},{"$f":"IF('शालादर्पण कार्मिक DATA'!A63=\"\",\"\",'शालादर्पण कार्मिक DATA'!A63)","v":""},{"$nulls":8},0]
[{"$f":"IF(भते[NAME]=\"\",\"\",ROWS($A$2:A62))","v":""},{"$f":"IF('शालादर्पण कार्मिक DATA'!A64=\"\",\"\",'शालादर्पण कार्मिक DATA'!A64)","v":""},{"$nulls":8},0]
[{"$f":"IF(भते[NAME]=\"\",\"\",ROWS($A$2:A63))","v":""},{"$f":"IF('शालादर्पण कार्मिक DATA'!A65=\"\",\"\",'शालादर्पण कार्मिक DATA'!A65)","v":""},{"$nulls":8},0]
[{"$f":"IF(भते[NAME]=\"\",\"\",ROWS($A$2:A64))","v":""},{"$f":"IF('शालादर्पण कार्मिक DATA'!A66=\"\",\"\",'शालादर्पण कार्मिक DATA'!A66)","v":""},{"$nulls":8},0]
[{"$f":"IF(भते[NAME]=\"\",\"\",ROWS($A$2:A65))","v":""},{"$f":"IF('शालादर्पण कार्मिक DATA'!A67=\"\",\"\",'शालादर्पण कार्मिक DATA'!A67)","v":""},{"$nulls":8},0]
[{"$f":"IF(भते[NAME]=\"\",\"\",ROWS($A$2:A66))","v":""},{"$f":"IF('शालादर्पण कार्मिक DATA'!A68=\"\",\"\",'शालादर्पण कार्मिक DATA'!A68)","v":""},{"$nulls":8},0]
[{"$f":"IF(भते[NAME]=\"\",\"\",ROWS($A$2:A67))","v":""},{"$f":"IF('शालादर्पण कार्मिक DATA'!A69=\"\",\"\",'शालादर्पण कार्मिक DATA'!A69)","v":""},{"$nulls":8},{"$f":"SUM(C70:J70)","v":0}]
[{"$f":"IF(भते[NAME]=\"\",\"\",ROWS($A$2:A68))","v":""},{"$f":"IF('शालादर्पण कार्मिक DATA'!A70=\"\",\"\",'शालादर्पण कार्मिक DATA'!A70)","v":""},{"$nulls":8},0]
[{"$f":"IF(भते[NAME]=\"\",\"\",ROWS($A$2:A69))","v":""},{"$f":"IF('शालादर्पण कार्मिक DATA'!A71=\"\",\"\",'शालादर्पण कार्मिक DATA'!A71)","v":""},{"$nulls":8},0]
[{"$f":"IF(भते[NAME]=\"\",\"\",ROWS($A$2:A70))","v":""},{"$f":"IF('शालादर्पण कार्मिक DATA'!A72=\"\",\"\",'शालादर्पण कार्मिक DATA'!A72)","v":""},{"$nulls":8},0]
[{"$f":"IF(भते[NAME]=\"\",\"\",ROWS($A$2:A71))","v":""},{"$f":"IF('शालादर्पण कार्मिक DATA'!A73=\"\",\"\",'शालादर्पण कार्मिक DATA'!A73)","v":""},{"$nulls":8},0]
[{"$f":"IF(भते[NAME]=\"\",\"\",ROWS($A$2:A72))","v":""},{"$f":"IF('शालादर्पण कार्मिक DATA'!A74=\"\",\"\",'शालादर्पण कार्मिक DATA'!A74)","v":""},{"$nulls":8},0]
[{"$f":"IF(भते[NAME]=\"\",\"\",ROWS($A$2:A73))","v":""},{"$f":"IF('शालादर्पण कार्मिक DATA'!A75=\"\",\"\",'शालादर्पण कार्मिक DATA'!A75)","v":""},{"$nulls":8},0]
[{"$f":"IF(भते[NAME]=\"\",\"\",ROWS($A$2:A74))","v":""},{"$f":"IF('शालादर्पण कार्मिक DATA'!A76=\"\",\"\",'शालादर्पण कार्मिक DATA'!A76)","v":""},{"$nulls":8},0]
[{"$f":"IF(भते[NAME]=\"\",\"\",ROWS($A$2:A75))","v":""},{"$f":"IF('शालादर्पण कार्मिक DATA'!A77=\"\",\"\",'शालादर्पण कार्मिक DATA'!A77)","v":""},{"$nulls":8},0]
[{"$f":"IF(भते[NAME]=\"\",\"\",ROWS($A$2:A76))","v":""},{"$f":"IF('शालादर्पण कार्मिक DATA'!A78=\"\",\"\",'शालादर्पण कार्मिक DATA'!A78)","v":""},{"$nulls":8},0]
[{"$f":"IF(भते[NAME]=\"\",\"\",ROWS($A$2:A77))","v":""},{"$f":"IF('शालादर्पण कार्मिक DATA'!A79=\"\",\"\",'शालादर्पण कार्मिक DATA'!A79)","v":""},{"$nulls":8},0]
[{"$f":"IF(भते[NAME]=\"\",\"\",ROWS($A$2:A78))","v":""},{"$f":"IF('शालादर्पण कार्मिक DATA'!A80=\"\",\"\",'शालादर्पण कार्मिक DATA'!A80)","v":""},{"$nulls":8},0]
[{"$f":"IF(भते[NAME]=\"\",\"\",ROWS($A$2:A79))","v":""},{"$f":"IF('शालादर्पण कार्मिक DATA'!A81=\"\",\"\",'शालादर्पण कार्मिक DATA'!A81)","v":""},{"$nulls":8},0]
[{"$f":"IF(भते[NAME]=\"\",\"\",ROWS($A$2:A80))","v":""},{"$f":"IF('शालादर्पण कार्मिक DATA'!A82=\"\",\"\",'शालादर्पण कार्मिक DATA'!A82)","v":""},{"$nulls":8},0]
[{"$f":"IF(भते[NAME]=\"\",\"\",ROWS($A$2:A81))","v":""},{"$f":"IF('शालादर्पण कार्मिक DATA'!A83=\"\",\"\",'शालादर्पण कार्मिक DATA'!A83)","v":""},{"$nulls":8},0]
[{"$f":"IF(भते[NAME]=\"\",\"\",ROWS($A$2:A82))","v":""},{"$f":"IF('शालादर्पण कार्मिक DATA'!A84=\"\",\"\",'शालादर्पण कार्मिक DATA'!A84)","v":""},{"$nulls":8},0]
[{"$f":"IF(भते[NAME]=\"\",\"\",ROWS($A$2:A83))","v":""},{"$f":"IF('शालादर्पण कार्मिक DATA'!A85=\"\",\"\",'शालादर्पण कार्मिक DATA'!A85)","v":""},{"$nulls":8},0]
[{"$f":"IF(भते[NAME]=\"\",\"\",ROWS($A$2:A84))","v":""},{"$f":"IF('शालादर्पण कार्मिक DATA'!A86=\"\",\"\",'शालादर्पण कार्मिक DATA'!A86)","v":""},{"$nulls":8},0]
[{"$f":"IF(भते[NAME]=\"\",\"\",ROWS($A$2:A85))","v":""},{"$f":"IF('शालादर्पण कार्मिक DATA'!A87=\"\",\"\",'शालादर्पण कार्मिक DATA'!A87)","v":""},{"$nulls":8},0]
[{"$f":"IF(भते[NAME]=\"\",\"\",ROWS($A$2:A86))","v":""},{"$f":"IF('शालादर्पण कार्मिक DATA'!A88=\"\",\"\",'शालादर्पण कार्मिक DATA'!A88)","v":""},{"$nulls":8},0]
[{"$f":"IF(भते[NAME]=\"\",\"\",ROWS($A$2:A87))","v":""},{"$f":"IF('शालादर्पण कार्मिक DATA'!A89=\"\",\"\",'शालादर्पण कार्मिक DATA'!A89)","v":""},{"$nulls":8},0]
[{"$f":"IF(भते[NAME]=\"\",\"\",ROWS($A$2:A88))","v":""},{"$f":"IF('शालादर्पण कार्मिक DATA'!A90=\"\",\"\",'शालादर्पण कार्मिक DATA'!A90)","v":""},{"$nulls":8},0]
[{"$f":"IF(भते[NAME]=\"\",\"\",ROWS($A$2:A89))","v":""},{"$f":"IF('शालादर्पण कार्मिक DATA'!A91=\"\",\"\",'शालादर्पण कार्मिक DATA'!A91)","v":""},{"$nulls":8},0]
[{"$f":"IF(भते[NAME]=\"\",\"\",ROWS($A$2:A90))","v":""},{"$f":"IF('शालादर्पण कार्मिक DATA'!A92=\"\",\"\",'शालादर्पण कार्मिक DATA'!A92)","v":""},{"$nulls":8},0]
[{"$f":"IF(भते[NAME]=\"\",\"\",ROWS($A$2:A91))","v":""},{"$f":"IF('शालादर्पण कार्मिक DATA'!A93=\"\",\"\",'शालादर्पण कार्मिक DATA'!A93)","v":""},{"$nulls":8},0]
[{"$f":"IF(भते[NAME]=\"\",\"\",ROWS($A$2:A92))","v":""},{"$f":"IF('शालादर्पण कार्मिक DATA'!A94=\"\",\"\",'शालादर्पण कार्मिक DATA'!A94)","v":""},{"$nulls":8},0]
[{"$f":"IF(भते[NAME]=\"\",\"\",ROWS($A$2:A93))","v":""},{"$f":"IF('शालादर्पण कार्मिक DATA'!A95=\"\",\"\",'शालादर्पण कार्मिक DATA'!A95)","v":""},{"$nulls":8},0]
[{"$f":"IF(भते[NAME]=\"\",\"\",ROWS($A$2:A94))","v":""},{"$f":"IF('शालादर्पण कार्मिक DATA'!A96=\"\",\"\",'शालादर्पण कार्मिक DATA'!A96)","v":""},{"$nulls":8},0]
[{"$f":"IF(भते[NAME]=\"\",\"\",ROWS($A$2:A95))","v":""},{"$f":"IF('शालादर्पण कार्मिक DATA'!A97=\"\",\"\",'शालादर्पण कार्मिक DATA'!A97)","v":""},{"$nulls":8},0]
[{"$f":"IF(भते[NAME]=\"\",\"\",ROWS($A$2:A96))","v":""},{"$f":"IF('शालादर्पण कार्मिक DATA'!A98=\"\",\"\",'शालादर्पण कार्मिक DATA'!A98)","v":""},{"$nulls":8},0]
[{"$f":"IF(भते[NAME]=\"\",\"\",ROWS($A$2:A97))","v":""},{"$f":"IF('शालादर्पण कार्मिक DATA'!A99=\"\",\"\",'शालादर्पण कार्मिक DATA'!A99)","v":""},{"$nulls":8},0]
[{"$f":"IF(भते[NAME]=\"\",\"\",ROWS($A$2:A98))","v":""},{"$f":"IF('शालादर्पण कार्मिक DATA'!A100=\"\",\"\",'शालादर्पण कार्मिक DATA'!A100)","v":""},{"$nulls":8},0]
[{"$f":"IF(भते[NAME]=\"\",\"\",ROWS($A$2:A99))","v":""},{"$f":"IF('शालादर्पण कार्मिक DATA'!A101=\"\",\"\",'शालादर्पण कार्मिक DATA'!A101)","v":""},{"$nulls":8},0]
[{"$f":"IF(भते[NAME]=\"\",\"\",ROWS($A$2:A100))","v":""},{"$f":"IF('शालादर्पण कार्मिक DATA'!A102=\"\",\"\",'शालादर्पण कार्मिक DATA'!A102)","v":""},{"$nulls":8},0]
[{"$f":"IF(भते[NAME]=\"\",\"\",ROWS($A$2:A101))","v":""},{"$f":"IF('शालादर्पण कार्मिक DATA'!A103=\"\",\"\",'शालादर्पण कार्मिक DATA'!A103)","v":""},{"$nulls":8},0]

{"sheet":"कटोतियाँ","index":6,"n_rows":104,"n_cols":15,"rows_kept":104,"merged":[[0,0,0,14],[1,0,1,14],[2,0,2,14]]}
["MADE BY:-भागीरथ मल कलवानियाँ कोलिया  MOB. NO 982879204"]
[{"$f":"'कार्मिक विवरण'!$A$2","v":"राजकीय उच्च माध्यमिक विद्यालय डसाणा खुर्द,मौलासर,नागौर"}]
["DEDUCTION DETAIL"]
["क्र.सं.","नाम","GPF/GPF2004","GPF Loan","SI","SI Loan","ITAX","RPMF/RGHS","LIC","OTHER","GIS","अन्य 1","अन्य 2","अन्य 3","योग 2"]
[{"$f":"IF(कटोतियाँ[नाम]=\"\",\"\",ROWS($A$2:A2))","v":1},{"$f":"IF('शालादर्पण कार्मिक DATA'!A4=\"\",\"\",'शालादर्पण कार्मिक DATA'!A4)","v":"A"},4200,0,5000,0,7000,875,0,0,null,0,0,0,{"$f":"SUM(C5:N5)","v":17075}]
[{"$f":"IF(कटोतियाँ[नाम]=\"\",\"\",ROWS($A$2:A3))","v":2},{"$f":"IF('शालादर्पण कार्मिक DATA'!A5=\"\",\"\",'शालादर्पण कार्मिक DATA'!A5)","v":"B"},4200,0,5000,0,4000,875,0,0,0,0,0,0,{"$f":"SUM(C6:N6)","v":14075}]
[{"$f":"IF(कटोतियाँ[नाम]=\"\",\"\",ROWS($A$2:A4))","v":3},{"$f":"IF('शालादर्पण कार्मिक DATA'!A6=\"\",\"\",'शालादर्पण कार्मिक DATA'!A6)","v":"C"},0,0,null,0,0,0,0,0,220,0,0,0,220]
[{"$f":"IF(कटोतियाँ[नाम]=\"\",\"\",ROWS($A$2:A5))","v":4},{"$f":"IF('शालादर्पण कार्मिक DATA'!A7=\"\",\"\",'शालादर्पण कार्मिक DATA'!A7)","v":"D"},null,null,3000,{"$nulls":5},220,{"$nulls":3},3220]
[{"$f":"IF(कटोतियाँ[नाम]=\"\",\"\",ROWS($A$2:A6))","v":5},{"$f":"IF('शालादर्पण कार्मिक DATA'!A8=\"\",\"\",'शालादर्पण कार्मिक DATA'!A8)","v":"E"},3575,null,3000,6000,1000,875,1171,null,220,{"$nulls":3},15841]
[{"$f":"IF(कटोतियाँ[नाम]=\"\",\"\",ROWS($A$2:A7))","v":6},{"$f":"IF('शालादर्पण कार्मिक DATA'!A9=\"\",\"\",'शालादर्पण कार्मिक DATA'!A9)","v":"F"},null,null,3000,null,500,{"$nulls":7},3500]
[{"$f":"IF(कटोतियाँ[नाम]=\"\",\"\",ROWS($A$2:A8))","v":7},{"$f":"IF('शालादर्पण कार्मिक DATA'!A10=\"\",\"\",'शालादर्पण कार्मिक DATA'!A10)","v":"G"},null,null,2200,{"$nulls":9},2200]
[{"$f":"IF(कटोतियाँ[नाम]=\"\",\"\",ROWS($A$2:A9))","v":8},{"$f":"IF('शालादर्पण कार्मिक DATA'!A11=\"\",\"\",'शालादर्पण कार्मिक DATA'!A11)","v":"H"},null,null,3000,{"$nulls":9},3000]
[{"$f":"IF(कटोतियाँ[नाम]=\"\",\"\",ROWS($A$2:A10))","v":9},{"$f":"IF('शालादर्पण कार्मिक DATA'!A12=\"\",\"\",'शालादर्पण कार्मिक DATA'!A12)","v":"I"},null,null,3000,{"$nulls":9},3000]
[{"$f":"IF(कटोतियाँ[नाम]=\"\",\"\",ROWS($A$2:A11))","v":10},{"$f":"IF('शालादर्पण कार्मिक DATA'!A13=\"\",\"\",'शालादर्पण कार्मिक DATA'!A13)","v":"J"},null,null,5000,{"$nulls":9},5000]
[{"$f":"IF(कटोतियाँ[नाम]=\"\",\"\",ROWS($A$2:A12))","v":11},{"$f":"IF('शालादर्पण कार्मिक DATA'!A14=\"\",\"\",'शालादर्पण कार्मिक DATA'!A14)","v":"K"},null,null,5000,{"$nulls":9},5000]
[{"$f":"IF(कटोतियाँ[नाम]=\"\",\"\",ROWS($A$2:A13))","v":12},{"$f":"IF('शालादर्पण कार्मिक DATA'!A15=\"\",\"\",'शालादर्पण कार्मिक DATA'!A15)","v":"L"},null,null,0,{"$nulls":9},0]
[{"$f":"IF(कटोतियाँ[नाम]=\"\",\"\",ROWS($A$2:A14))","v":13},{"$f":"IF('शालादर्पण कार्मिक DATA'!A16=\"\",\"\",'शालादर्पण कार्मिक DATA'!A16)","v":"M"},{"$nulls":12},0]
[{"$f":"IF(कटोतियाँ[नाम]=\"\",\"\",ROWS($A$2:A15))","v":14},{"$f":"IF('शालादर्पण कार्मिक DATA'!A17=\"\",\"\",'शालादर्पण कार्मिक DATA'!A17)","v":"N"},{"$nulls":12},0]
[{"$f":"IF(कटोतियाँ[नाम]=\"\",\"\",ROWS($A$2:A16))","v":15},{"$f":"IF('शालादर्पण कार्मिक DATA'!A18=\"\",\"\",'शालादर्पण कार्मिक DATA'!A18)","v":"O"},{"$nulls":12},0]
[{"$f":"IF(कटोतियाँ[नाम]=\"\",\"\",ROWS($A$2:A17))","v":16},{"$f":"IF('शालादर्पण कार्मिक DATA'!A19=\"\",\"\",'शालादर्पण कार्मिक DATA'!A19)","v":"P"},{"$nulls":12},0]
[{"$f":"IF(कटोतियाँ[नाम]=\"\",\"\",ROWS($A$2:A18))","v":17},{"$f":"IF('शालादर्पण कार्मिक DATA'!A20=\"\",\"\",'शालादर्पण कार्मिक DATA'!A20)","v":"Q"},{"$nulls":12},0]
[{"$f":"IF(कटोतियाँ[नाम]=\"\",\"\",ROWS($A$2:A19))","v":18},{"$f":"IF('शालादर्पण कार्मिक DATA'!A21=\"\",\"\",'शालादर्पण कार्मिक DATA'!A21)","v":"R"},{"$nulls":12},0]
[{"$f":"IF(कटोतियाँ[नाम]=\"\",\"\",ROWS($A$2:A20))","v":19},{"$f":"IF('शालादर्पण कार्मिक DATA'!A22=\"\",\"\",'शालादर्पण कार्मिक DATA'!A22)","v":"S"},{"$nulls":12},0]
[{"$f":"IF(कटोतियाँ[नाम]=\"\",\"\",ROWS($A$2:A21))","v":20},{"$f":"IF('शालादर्पण कार्मिक DATA'!A23=\"\",\"\",'शालादर्पण कार्मिक DATA'!A23)","v":"T"},{"$nulls":12},0]
[{"$f":"IF(कटोतियाँ[नाम]=\"\",\"\",ROWS($A$2:A22))","v":21},{"$f":"IF('शालादर्पण कार्मिक DATA'!A24=\"\",\"\",'शालादर्पण कार्मिक DATA'!A24)","v":"U"},{"$nulls":12},0]
[{"$f":"IF(कटोतियाँ[नाम]=\"\",\"\",ROWS($A$2:A23))","v":22},{"$f":"IF('शालादर्पण कार्मिक DATA'!A25=\"\",\"\",'शालादर्पण कार्मिक DATA'!A25)","v":"V"},{"$nulls":12},0]
[{"$f":"IF(कटोतियाँ[नाम]=\"\",\"\",ROWS($A$2:A24))","v":23},{"$f":"IF('शालादर्पण कार्मिक DATA'!A26=\"\",\"\",'शालादर्पण कार्मिक DATA'!A26)","v":"W"},{"$nulls":12},0]
[{"$f":"IF(कटोतियाँ[नाम]=\"\",\"\",ROWS($A$2:A25))","v":24},{"$f":"IF('शालादर्पण कार्मिक DATA'!A27=\"\",\"\",'शालादर्पण कार्मिक DATA'!A27)","v":"X"},{"$nulls":12},0]
[{"$f":"IF(कटोतियाँ[नाम]=\"\",\"\",ROWS($A$2:A26))","v":25},{"$f":"IF('शालादर्पण कार्मिक DATA'!A28=\"\",\"\",'शालादर्पण कार्मिक DATA'!A28)","v":"Z"},{"$nulls":12},0]
[{"$f":"IF(कटोतियाँ[नाम]=\"\",\"\",ROWS($A$2:A27))","v":""},{"$f":"IF('शालादर्पण कार्मिक DATA'!A29=\"\",\"\",'शालादर्पण कार्मिक DATA'!A29)","v":""},{"$nulls":12},0]
[{"$f":"IF(कटोतियाँ[नाम]=\"\",\"\",ROWS($A$2:A28))","v":""},{"$f":"IF('शालादर्पण कार्मिक DATA'!A30=\"\",\"\",'शालादर्पण कार्मिक DATA'!A30)","v":""},{"$nulls":12},0]
[{"$f":"IF(कटोतियाँ[नाम]=\"\",\"\",ROWS($A$2:A29))","v":""},{"$f":"IF('शालादर्पण कार्मिक DATA'!A31=\"\",\"\",'शालादर्पण कार्मिक DATA'!A31)","v":""},{"$nulls":12},0]
[{"$f":"IF(कटोतियाँ[नाम]=\"\",\"\",ROWS($A$2:A30))","v":""},{"$f":"IF('शालादर्पण कार्मिक DATA'!A32=\"\",\"\",'शालादर्पण कार्मिक DATA'!A32)","v":""},{"$nulls":12},0]
[{"$f":"IF(कटोतियाँ[नाम]=\"\",\"\",ROWS($A$2:A31))","v":""},{"$f":"IF('शालादर्पण कार्मिक DATA'!A33=\"\",\"\",'शालादर्पण कार्मिक DATA'!A33)","v":""},{"$nulls":12},0]
[{"$f":"IF(कटोतियाँ[नाम]=\"\",\"\",ROWS($A$2:A32))","v":""},{"$f":"IF('शालादर्पण कार्मिक DATA'!A34=\"\",\"\",'शालादर्पण कार्मिक DATA'!A34)","v":""},{"$nulls":12},0]
[{"$f":"IF(कटोतियाँ[नाम]=\"\",\"\",ROWS($A$2:A33))","v":""},{"$f":"IF('शालादर्पण कार्मिक DATA'!A35=\"\",\"\",'शालादर्पण कार्मिक DATA'!A35)","v":""},{"$nulls":12},0]
[{"$f":"IF(कटोतियाँ[नाम]=\"\",\"\",ROWS($A$2:A34))","v":""},{"$f":"IF('शालादर्पण कार्मिक DATA'!A36=\"\",\"\",'शालादर्पण कार्मिक DATA'!A36)","v":""},{"$nulls":12},0]
[{"$f":"IF(कटोतियाँ[नाम]=\"\",\"\",ROWS($A$2:A35))","v":""},{"$f":"IF('शालादर्पण कार्मिक DATA'!A37=\"\",\"\",'शालादर्पण कार्मिक DATA'!A37)","v":""},{"$nulls":12},0]
[{"$f":"IF(कटोतियाँ[नाम]=\"\",\"\",ROWS($A$2:A36))","v":""},{"$f":"IF('शालादर्पण कार्मिक DATA'!A38=\"\",\"\",'शालादर्पण कार्मिक DATA'!A38)","v":""},{"$nulls":12},0]
[{"$f":"IF(कटोतियाँ[नाम]=\"\",\"\",ROWS($A$2:A37))","v":""},{"$f":"IF('शालादर्पण कार्मिक DATA'!A39=\"\",\"\",'शालादर्पण कार्मिक DATA'!A39)","v":""},{"$nulls":12},0]
[{"$f":"IF(कटोतियाँ[नाम]=\"\",\"\",ROWS($A$2:A38))","v":""},{"$f":"IF('शालादर्पण कार्मिक DATA'!A40=\"\",\"\",'शालादर्पण कार्मिक DATA'!A40)","v":""},{"$nulls":12},0]
[{"$f":"IF(कटोतियाँ[नाम]=\"\",\"\",ROWS($A$2:A39))","v":""},{"$f":"IF('शालादर्पण कार्मिक DATA'!A41=\"\",\"\",'शालादर्पण कार्मिक DATA'!A41)","v":""},{"$nulls":12},0]
[{"$f":"IF(कटोतियाँ[नाम]=\"\",\"\",ROWS($A$2:A40))","v":""},{"$f":"IF('शालादर्पण कार्मिक DATA'!A42=\"\",\"\",'शालादर्पण कार्मिक DATA'!A42)","v":""},{"$nulls":12},0]
[{"$f":"IF(कटोतियाँ[नाम]=\"\",\"\",ROWS($A$2:A41))","v":""},{"$f":"IF('शालादर्पण कार्मिक DATA'!A43=\"\",\"\",'शालादर्पण कार्मिक DATA'!A43)","v":""},{"$nulls":12},0]
[{"$f":"IF(कटोतियाँ[नाम]=\"\",\"\",ROWS($A$2:A42))","v":""},{"$f":"IF('शालादर्पण कार्मिक DATA'!A44=\"\",\"\",'शालादर्पण कार्मिक DATA'!A44)","v":""},{"$nulls":12},0]
[{"$f":"IF(कटोतियाँ[नाम]=\"\",\"\",ROWS($A$2:A43))","v":""},{"$f":"IF('शालादर्पण कार्मिक DATA'!A45=\"\",\"\",'शालादर्पण कार्मिक DATA'!A45)","v":""},{"$nulls":12},0]
[{"$f":"IF(कटोतियाँ[नाम]=\"\",\"\",ROWS($A$2:A44))","v":""},{"$f":"IF('शालादर्पण कार्मिक DATA'!A46=\"\",\"\",'शालादर्पण कार्मिक DATA'!A46)","v":""},{"$nulls":12},0]
[{"$f":"IF(कटोतियाँ[नाम]=\"\",\"\",ROWS($A$2:A45))","v":""},{"$f":"IF('शालादर्पण कार्मिक DATA'!A47=\"\",\"\",'शालादर्पण कार्मिक DATA'!A47)","v":""},{"$nulls":12},0]
[{"$f":"IF(कटोतियाँ[नाम]=\"\",\"\",ROWS($A$2:A46))","v":""},{"$f":"IF('शालादर्पण कार्मिक DATA'!A48=\"\",\"\",'शालादर्पण कार्मिक DATA'!A48)","v":""},{"$nulls":12},0]
[{"$f":"IF(कटोतियाँ[नाम]=\"\",\"\",ROWS($A$2:A47))","v":""},{"$f":"IF('शालादर्पण कार्मिक DATA'!A49=\"\",\"\",'शालादर्पण कार्मिक DATA'!A49)","v":""},{"$nulls":12},0]
[{"$f":"IF(कटोतियाँ[नाम]=\"\",\"\",ROWS($A$2:A48))","v":""},{"$f":"IF('शालादर्पण कार्मिक DATA'!A50=\"\",\"\",'शालादर्पण कार्मिक DATA'!A50)","v":""},{"$nulls":12},0]
[{"$f":"IF(कटोतियाँ[नाम]=\"\",\"\",ROWS($A$2:A49))","v":""},{"$f":"IF('शालादर्पण कार्मिक DATA'!A51=\"\",\"\",'शालादर्पण कार्मिक DATA'!A51)","v":""},{"$nulls":12},0]
[{"$f":"IF(कटोतियाँ[नाम]=\"\",\"\",ROWS($A$2:A50))","v":""},{"$f":"IF('शालादर्पण कार्मिक DATA'!A52=\"\",\"\",'शालादर्पण कार्मिक DATA'!A52)","v":""},{"$nulls":12},0]
[{"$f":"IF(कटोतियाँ[नाम]=\"\",\"\",ROWS($A$2:A51))","v":""},{"$f":"IF('शालादर्पण कार्मिक DATA'!A53=\"\",\"\",'शालादर्पण कार्मिक DATA'!A53)","v":""},{"$nulls":12},0]
[{"$f":"IF(कटोतियाँ[नाम]=\"\",\"\",ROWS($A$2:A52))","v":""},{"$f":"IF('शालादर्पण कार्मिक DATA'!A54=\"\",\"\",'शालादर्पण कार्मिक DATA'!A54)","v":""},{"$nulls":12},0]
[{"$f":"IF(कटोतियाँ[नाम]=\"\",\"\",ROWS($A$2:A53))","v":""},{"$f":"IF('शालादर्पण कार्मिक DATA'!A55=\"\",\"\",'शालादर्पण कार्मिक DATA'!A55)","v":""},{"$nulls":12},0]
[{"$f":"IF(कटोतियाँ[नाम]=\"\",\"\",ROWS($A$2:A54))","v":""},{"$f":"IF('शालादर्पण कार्मिक DATA'!A56=\"\",\"\",'शालादर्पण कार्मिक DATA'!A56)","v":""},{"$nulls":12},0]
[{"$f":"IF(कटोतियाँ[नाम]=\"\",\"\",ROWS($A$2:A55))","v":""},{"$f":"IF('शालादर्पण कार्मिक DATA'!A57=\"\",\"\",'शालादर्पण कार्मिक DATA'!A57)","v":""},{"$nulls":12},0]
[{"$f":"IF(कटोतियाँ[नाम]=\"\",\"\",ROWS($A$2:A56))","v":""},{"$f":"IF('शालादर्पण कार्मिक DATA'!A58=\"\",\"\",'शालादर्पण कार्मिक DATA'!A58)","v":""},{"$nulls":12},0]
[{"$f":"IF(कटोतियाँ[नाम]=\"\",\"\",ROWS($A$2:A57))","v":""},{"$f":"IF('शालादर्पण कार्मिक DATA'!A59=\"\",\"\",'शालादर्पण कार्मिक DATA'!A59)","v":""},{"$nulls":12},0]
[{"$f":"IF(कटोतियाँ[नाम]=\"\",\"\",ROWS($A$2:A58))","v":""},{"$f":"IF('शालादर्पण कार्मिक DATA'!A60=\"\",\"\",'शालादर्पण कार्मिक DATA'!A60)","v":""},{"$nulls":12},0]
[{"$f":"IF(कटोतियाँ[नाम]=\"\",\"\",ROWS($A$2:A59))","v":""},{"$f":"IF('शालादर्पण कार्मिक DATA'!A61=\"\",\"\",'शालादर्पण कार्मिक DATA'!A61)","v":""},{"$nulls":12},0]
[{"$f":"IF(कटोतियाँ[नाम]=\"\",\"\",ROWS($A$2:A60))","v":""},{"$f":"IF('शालादर्पण कार्मिक DATA'!A62=\"\",\"\",'शालादर्पण कार्मिक DATA'!A62)","v":""},{"$nulls":12},0]
[{"$f":"IF(कटोतियाँ[नाम]=\"\",\"\",ROWS($A$2:A61))","v":""},{"$f":"IF('शालादर्पण कार्मिक DATA'!A63=\"\",\"\",'शालादर्पण कार्मिक DATA'!A63)","v":""},{"$nulls":12},0]
[{"$f":"IF(कटोतियाँ[नाम]=\"\",\"\",ROWS($A$2:A62))","v":""},{"$f":"IF('शालादर्पण कार्मिक DATA'!A64=\"\",\"\",'शालादर्पण कार्मिक DATA'!A64)","v":""},{"$nulls":12},0]
[{"$f":"IF(कटोतियाँ[नाम]=\"\",\"\",ROWS($A$2:A63))","v":""},{"$f":"IF('शालादर्पण कार्मिक DATA'!A65=\"\",\"\",'शालादर्पण कार्मिक DATA'!A65)","v":""},{"$nulls":12},0]
[{"$f":"IF(कटोतियाँ[नाम]=\"\",\"\",ROWS($A$2:A64))","v":""},{"$f":"IF('शालादर्पण कार्मिक DATA'!A66=\"\",\"\",'शालादर्पण कार्मिक DATA'!A66)","v":""},{"$nulls":12},0]
[{"$f":"IF(कटोतियाँ[नाम]=\"\",\"\",ROWS($A$2:A65))","v":""},{"$f":"IF('शालादर्पण कार्मिक DATA'!A67=\"\",\"\",'शालादर्पण कार्मिक DATA'!A67)","v":""},{"$nulls":12},0]
[{"$f":"IF(कटोतियाँ[नाम]=\"\",\"\",ROWS($A$2:A66))","v":""},{"$f":"IF('शालादर्पण कार्मिक DATA'!A68=\"\",\"\",'शालादर्पण कार्मिक DATA'!A68)","v":""},{"$nulls":12},0]
[{"$f":"IF(कटोतियाँ[नाम]=\"\",\"\",ROWS($A$2:A67))","v":""},{"$f":"IF('शालादर्पण कार्मिक DATA'!A69=\"\",\"\",'शालादर्पण कार्मिक DATA'!A69)","v":""},{"$nulls":12},{"$f":"SUM(C70:N70)","v":0}]
[{"$f":"IF(कटोतियाँ[नाम]=\"\",\"\",ROWS($A$2:A68))","v":""},{"$f":"IF('शालादर्पण कार्मिक DATA'!A70=\"\",\"\",'शालादर्पण कार्मिक DATA'!A70)","v":""},{"$nulls":12},0]
[{"$f":"IF(कटोतियाँ[नाम]=\"\",\"\",ROWS($A$2:A69))","v":""},{"$f":"IF('शालादर्पण कार्मिक DATA'!A71=\"\",\"\",'शालादर्पण कार्मिक DATA'!A71)","v":""},{"$nulls":12},0]
[{"$f":"IF(कटोतियाँ[नाम]=\"\",\"\",ROWS($A$2:A70))","v":""},{"$f":"IF('शालादर्पण कार्मिक DATA'!A72=\"\",\"\",'शालादर्पण कार्मिक DATA'!A72)","v":""},{"$nulls":12},0]
[{"$f":"IF(कटोतियाँ[नाम]=\"\",\"\",ROWS($A$2:A71))","v":""},{"$f":"IF('शालादर्पण कार्मिक DATA'!A73=\"\",\"\",'शालादर्पण कार्मिक DATA'!A73)","v":""},{"$nulls":12},0]
[{"$f":"IF(कटोतियाँ[नाम]=\"\",\"\",ROWS($A$2:A72))","v":""},{"$f":"IF('शालादर्पण कार्मिक DATA'!A74=\"\",\"\",'शालादर्पण कार्मिक DATA'!A74)","v":""},{"$nulls":12},0]
[{"$f":"IF(कटोतियाँ[नाम]=\"\",\"\",ROWS($A$2:A73))","v":""},{"$f":"IF('शालादर्पण कार्मिक DATA'!A75=\"\",\"\",'शालादर्पण कार्मिक DATA'!A75)","v":""},{"$nulls":12},0]
[{"$f":"IF(कटोतियाँ[नाम]=\"\",\"\",ROWS($A$2:A74))","v":""},{"$f":"IF('शालादर्पण कार्मिक DATA'!A76=\"\",\"\",'शालादर्पण कार्मिक DATA'!A76)","v":""},{"$nulls":12},0]
[{"$f":"IF(कटोतियाँ[नाम]=\"\",\"\",ROWS($A$2:A75))","v":""},{"$f":"IF('शालादर्पण कार्मिक DATA'!A77=\"\",\"\",'शालादर्पण कार्मिक DATA'!A77)","v":""},{"$nulls":12},0]
[{"$f":"IF(कटोतियाँ[नाम]=\"\",\"\",ROWS($A$2:A76))","v":""},{"$f":"IF('शालादर्पण कार्मिक DATA'!A78=\"\",\"\",'शालादर्पण कार्मिक DATA'!A78)","v":""},{"$nulls":12},0]
[{"$f":"IF(कटोतियाँ[नाम]=\"\",\"\",ROWS($A$2:A77))","v":""},{"$f":"IF('शालादर्पण कार्मिक DATA'!A79=\"\",\"\",'शालादर्पण कार्मिक DATA'!A79)","v":""},{"$nulls":12},0]
[{"$f":"IF(कटोतियाँ[नाम]=\"\",\"\",ROWS($A$2:A78))","v":""},{"$f":"IF('शालादर्पण कार्मिक DATA'!A80=\"\",\"\",'शालादर्पण कार्मिक DATA'!A80)","v":""},{"$nulls":12},0]
[{"$f":"IF(कटोतियाँ[नाम]=\"\",\"\",ROWS($A$2:A79))","v":""},{"$f":"IF('शालादर्पण कार्मिक DATA'!A81=\"\",\"\",'शालादर्पण कार्मिक DATA'!A81)","v":""},{"$nulls":12},0]
[{"$f":"IF(कटोतियाँ[नाम]=\"\",\"\",ROWS($A$2:A80))","v":""},{"$f":"IF('शालादर्पण कार्मिक DATA'!A82=\"\",\"\",'शालादर्पण कार्मिक DATA'!A82)","v":""},{"$nulls":12},0]
[{"$f":"IF(कटोतियाँ[नाम]=\"\",\"\",ROWS($A$2:A81))","v":""},{"$f":"IF('शालादर्पण कार्मिक DATA'!A83=\"\",\"\",'शालादर्पण कार्मिक DATA'!A83)","v":""},{"$nulls":12},0]
[{"$f":"IF(कटोतियाँ[नाम]=\"\",\"\",ROWS($A$2:A82))","v":""},{"$f":"IF('शालादर्पण कार्मिक DATA'!A84=\"\",\"\",'शालादर्पण कार्मिक DATA'!A84)","v":""},{"$nulls":12},0]
[{"$f":"IF(कटोतियाँ[नाम]=\"\",\"\",ROWS($A$2:A83))","v":""},{"$f":"IF('शालादर्पण कार्मिक DATA'!A85=\"\",\"\",'शालादर्पण कार्मिक DATA'!A85)","v":""},{"$nulls":12},0]
[{"$f":"IF(कटोतियाँ[नाम]=\"\",\"\",ROWS($A$2:A84))","v":""},{"$f":"IF('शालादर्पण कार्मिक DATA'!A86=\"\",\"\",'शालादर्पण कार्मिक DATA'!A86)","v":""},{"$nulls":12},0]
[{"$f":"IF(कटोतियाँ[नाम]=\"\",\"\",ROWS($A$2:A85))","v":""},{"$f":"IF('शालादर्पण कार्मिक DATA'!A87=\"\",\"\",'शालादर्पण कार्मिक DATA'!A87)","v":""},{"$nulls":12},0]
[{"$f":"IF(कटोतियाँ[नाम]=\"\",\"\",ROWS($A$2:A86))","v":""},{"$f":"IF('शालादर्पण कार्मिक DATA'!A88=\"\",\"\",'शालादर्पण कार्मिक DATA'!A88)","v":""},{"$nulls":12},0]
[{"$f":"IF(कटोतियाँ[नाम]=\"\",\"\",ROWS($A$2:A87))","v":""},{"$f":"IF('शालादर्पण कार्मिक DATA'!A89=\"\",\"\",'शालादर्पण कार्मिक DATA'!A89)","v":""},{"$nulls":12},0]
[{"$f":"IF(कटोतियाँ[नाम]=\"\",\"\",ROWS($A$2:A88))","v":""},{"$f":"IF('शालादर्पण कार्मिक DATA'!A90=\"\",\"\",'शालादर्पण कार्मिक DATA'!A90)","v":""},{"$nulls":12},0]
[{"$f":"IF(कटोतियाँ[नाम]=\"\",\"\",ROWS($A$2:A89))","v":""},{"$f":"IF('शालादर्पण कार्मिक DATA'!A91=\"\",\"\",'शालादर्पण कार्मिक DATA'!A91)","v":""},{"$nulls":12},0]
[{"$f":"IF(कटोतियाँ[नाम]=\"\",\"\",ROWS($A$2:A90))","v":""},{"$f":"IF('शालादर्पण कार्मिक DATA'!A92=\"\",\"\",'शालादर्पण कार्मिक DATA'!A92)","v":""},{"$nulls":12},0]
[{"$f":"IF(कटोतियाँ[नाम]=\"\",\"\",ROWS($A$2:A91))","v":""},{"$f":"IF('शालादर्पण कार्मिक DATA'!A93=\"\",\"\",'शालादर्पण कार्मिक DATA'!A93)","v":""},{"$nulls":12},0]
[{"$f":"IF(कटोतियाँ[नाम]=\"\",\"\",ROWS($A$2:A92))","v":""},{"$f":"IF('शालादर्पण कार्मिक DATA'!A94=\"\",\"\",'शालादर्पण कार्मिक DATA'!A94)","v":""},{"$nulls":12},0]
[{"$f":"IF(कटोतियाँ[नाम]=\"\",\"\",ROWS($A$2:A93))","v":""},{"$f":"IF('शालादर्पण कार्मिक DATA'!A95=\"\",\"\",'शालादर्पण कार्मिक DATA'!A95)","v":""},{"$nulls":12},0]
[{"$f":"IF(कटोतियाँ[नाम]=\"\",\"\",ROWS($A$2:A94))","v":""},{"$f":"IF('शालादर्पण कार्मिक DATA'!A96=\"\",\"\",'शालादर्पण कार्मिक DATA'!A96)","v":""},{"$nulls":12},0]
[{"$f":"IF(कटोतियाँ[नाम]=\"\",\"\",ROWS($A$2:A95))","v":""},{"$f":"IF('शालादर्पण कार्मिक DATA'!A97=\"\",\"\",'शालादर्पण कार्मिक DATA'!A97)","v":""},{"$nulls":12},0]
[{"$f":"IF(कटोतियाँ[नाम]=\"\",\"\",ROWS($A$2:A96))","v":""},{"$f":"IF('शालादर्पण कार्मिक DATA'!A98=\"\",\"\",'शालादर्पण कार्मिक DATA'!A98)","v":""},{"$nulls":12},0]
[{"$f":"IF(कटोतियाँ[नाम]=\"\",\"\",ROWS($A$2:A97))","v":""},{"$f":"IF('शालादर्पण कार्मिक DATA'!A99=\"\",\"\",'शालादर्पण कार्मिक DATA'!A99)","v":""},{"$nulls":12},0]
[{"$f":"IF(कटोतियाँ[नाम]=\"\",\"\",ROWS($A$2:A98))","v":""},{"$f":"IF('शालादर्पण कार्मिक DATA'!A100=\"\",\"\",'शालादर्पण कार्मिक DATA'!A100)","v":""},{"$nulls":12},0]
[{"$f":"IF(कटोतियाँ[नाम]=\"\",\"\",ROWS($A$2:A99))","v":""},{"$f":"IF('शालादर्पण कार्मिक DATA'!A101=\"\",\"\",'शालादर्पण कार्मिक DATA'!A101)","v":""},{"$nulls":12},0]
[{"$f":"IF(कटोतियाँ[नाम]=\"\",\"\",ROWS($A$2:A100))","v":""},{"$f":"IF('शालादर्पण कार्मिक DATA'!A102=\"\",\"\",'शालादर्पण कार्मिक DATA'!A102)","v":""},{"$nulls":12},0]
[{"$f":"IF(कटोतियाँ[नाम]=\"\",\"\",ROWS($A$2:A101))","v":""},{"$f":"IF('शालादर्पण कार्मिक DATA'!A103=\"\",\"\",'शालादर्पण कार्मिक DATA'!A103)","v":""},{"$nulls":12},0]

{"sheet":"EDIT PAY POSTING","index":7,"n_rows":61,"n_cols":33,"rows_kept":61,"merged":[[0,2,0,13],[1,0,1,13],[1,15,2,17],[2,0,2,13],[3,0,3,13],[4,1,4,3],[4,5,4,7],[4,9,4,10],[4,12,4,13],[4,15,4,19],[5,1,5,3],[5,5,5,7],[5,9,5,10],[5,12,5,13],[5,15,5,16],[6,1,6,3],[6,5,6,7],[6,9,6,10],[6,12,6,13],[6,15,7,17],[6,18,7,18],[7,0,7,13],[8,15,8,17],[9,0,13,0],[14,0,14,13],[15,0,15,13],[26,0,26,1],[27,0,27,13],[28,0,28,13],[43,0,43,1],[44,0,44,1],[45,0,45,13],[46,2,46,13],[51,0,51,1],[52,0,52,13],[53,0,54,0],[53,2,53,13],[55,0,55,13],[56,0,56,1],[57,0,57,13],[58,0,58,1],[58,2,58,13],[59,0,59,13],[60,0,60,1],[60,2,60,13]]}
[2023,2024,"MADE BY:-भागीरथ मल कलवानियाँ कोलिया  MOB. NO 982879204",{"$nulls":17},{"$f":"YEAR(TODAY())","v":2024}]
[{"$f":"'कार्मिक विवरण'!A2","v":"राजकीय उच्च माध्यमिक विद्यालय डसाणा खुर्द,मौलासर,नागौर"},{"$nulls":13},{"$f":"VLOOKUP($P$2,कार्मिक_विवरण[],16,0)","v":"No"},1]
["PAY POSTING RAGISTER",{"$nulls":13},{"$f":"VLOOKUP($P$2,कार्मिक_विवरण[],7,0)","v":"No"}]
[]
["नाम-",{"$f":"IFERROR((VLOOKUP($P$2,कार्मिक_विवरण[],2,0)),\"\")","v":"A"},null,null,"पद-",{"$f":"IFERROR(UPPER(VLOOKUP($P$2,कार्मिक_विवरण[],3,0)),\"\")","v":"SENIOR TEACHER (II GR.)"},null,null,"DOB-",{"$f":"IFERROR(VLOOKUP($P$2,कार्मिक_विवरण[],4,0),\"\")","v":"1971-01-21"},null,"पैन नंबर-",{"$f":"IFERROR(VLOOKUP($P$2,कार्मिक_विवरण[],5,0),\"\")","v":"XXXXS1582D"},null,null,"BASIC CHANGE हो तो पीले सेल में मूल वेतन लिखे "]
["EMP. ID-",{"$f":"IFERROR(VLOOKUP($P$2,कार्मिक_विवरण[],6,0),\"\")","v":"RJNA199728012345"},null,null,"SI No.-",{"$f":"IFERROR(VLOOKUP($P$2,कार्मिक_विवरण[],9,0),\"\")","v":1121192},null,null,"GPF No.-",{"$f":"IFERROR(VLOOKUP($P$2,कार्मिक_विवरण[],10,0),\"\")","v":123456},null,"PRAN No.",{"$f":"IFERROR(VLOOKUP($P$2,कार्मिक_विवरण[],11,0),\"\")","v":123654987897},null,null,"DEC-2023",null,73200]
["आधार कार्ड नंबर-",{"$f":"IFERROR(VLOOKUP($P$2,कार्मिक_विवरण[],12,0),\"\")","v":"XXXXXXXX5832"},null,null,"बैंक नाम-",{"$f":"IFERROR(VLOOKUP($P$2,कार्मिक_विवरण[],13,0),\"\")","v":"SBI"},null,null,"IFSC Cod-",{"$f":"IFERROR(VLOOKUP($P$2,कार्मिक_विवरण[],14,0),\"\")","v":"SBIN00"},null,"बैंक A/c-",{"$f":"IFERROR(VLOOKUP($P$2,कार्मिक_विवरण[],15,0),\"\")","v":61118966625},null,null,"समर्पित अवकाश माह",null,null,"राजपत्रित",null,"APR-2022-23","may-2022-23","jun-22-23","july-22-23"]
[]
[{"$f":"$B$5","v":"A"},"Month",{"$f":"V$11&\"-\"&$A$1","v":"APR-2023"},"MAY-2023","JUN-2023","JUL-2023","AUG-2023","SEP-2023","OCT-2023","NOV-2023","DEC-2023",{"$f":"AE$11&\"-\"&RIGHT($B$1,4)","v":"JAN-2024"},{"$f":"AF$11&\"-\"&RIGHT($B$1,4)","v":"FEB-2024"},{"$f":"AG$11&\"-\"&RIGHT($B$1,4)","v":"MAR-2024"},null,"DEC-2023",null,null,"No",null,{"$f":"IFERROR(VLOOKUP(U7,U7:AF7,21,0),U$7)","v":"APR-2022-23"},{"$f":"IFERROR(VLOOKUP(V7,V7:AG7,21,0),V$7)","v":"may-2022-23"},{"$f":"IFERROR(VLOOKUP(W7,W7:AH7,21,0),W$7)","v":"jun-22-23"},{"$f":"IFERROR(VLOOKUP(X7,X7:AH7,21,0),X$7)","v":"july-22-23"}]
["वेतन एवं कटौती का विवरण","DA Rates %",{"$f":"IFERROR(VLOOKUP($A$1,DA,2,0),\"\")","v":42},{"$f":"IFERROR(VLOOKUP($A$1,DA,3,0),\"\")","v":42},{"$f":"IFERROR(VLOOKUP($A$1,DA,4,0),\"\")","v":42},{"$f":"IFERROR(VLOOKUP($A$1,DA,5,0),\"\")","v":42},{"$f":"IFERROR(VLOOKUP($A$1,DA,6,0),\"\")","v":42},{"$f":"IFERROR(VLOOKUP($A$1,DA,7,0),\"\")","v":42},{"$f":"IFERROR(VLOOKUP($A$1,DA,8,0),\"\")","v":42},{"$f":"IFERROR(VLOOKUP($A$1,DA,9,0),\"\")","v":46},{"$f":"IFERROR(VLOOKUP($A$1,DA,10,0),\"\")","v":46},{"$f":"IFERROR(VLOOKUP($A$1,DA,11,0),\"\")","v":46},{"$f":"IFERROR(VLOOKUP($A$1,DA,12,0),\"\")","v":46},{"$f":"IFERROR(VLOOKUP($A$1,DA,13,0),\"\")","v":46},{"$nulls":6},{"$f":"IFERROR(VLOOKUP(U8,U8:AF8,21,0),$U$7)","v":"APR-2022-23"}]
[null,"Bill No.",{"$f":"IFERROR(VLOOKUP(V11,'बिल और T.V.न.'!$B$4:$F$16,2,0),\"\")","v":3},{"$f":"IFERROR(VLOOKUP(W11,'बिल और T.V.न.'!$B$4:$F$16,2,0),\"\")","v":9},{"$f":"IFERROR(VLOOKUP(X11,'बिल और T.V.न.'!$B$4:$F$16,2,0),\"\")","v":11},{"$f":"IFERROR(VLOOKUP(Y11,'बिल और T.V.न.'!$B$4:$F$16,2,0),\"\")","v":17},{"$f":"IFERROR(VLOOKUP(Z11,'बिल और T.V.न.'!$B$4:$F$16,2,0),\"\")","v":20},{"$f":"IFERROR(VLOOKUP(AA11,'बिल और T.V.न.'!$B$4:$F$16,2,0),\"\")","v":22},{"$f":"IFERROR(VLOOKUP(AB11,'बिल और T.V.न.'!$B$4:$F$16,2,0),\"\")","v":27},{"$f":"IFERROR(VLOOKUP(AC11,'बिल और T.V.न.'!$B$4:$F$16,2,0),\"\")","v":31},{"$f":"IFERROR(VLOOKUP(AD11,'बिल और T.V.न.'!$B$4:$F$16,2,0),\"\")","v":33},{"$f":"IFERROR(VLOOKUP(AE11,'बिल और T.V.न.'!$B$4:$F$16,2,0),\"\")","v":36},{"$f":"IFERROR(VLOOKUP(AF11,'बिल और T.V.न.'!$B$4:$F$16,2,0),\"\")","v":41},{"$f":"IFERROR(VLOOKUP(AG11,'बिल और T.V.न.'!$B$4:$F$16,2,0),\"\")","v":0},{"$nulls":6},{"$f":"IFERROR(VLOOKUP(U9,U9:AF9,21,0),$U$7)","v":"APR-2022-23"},"APR","MAY","JUN","JUL","AUG","SEP","OCT","NOV","DEC","JAN","FEB","MAR"]
[null,"DATE",{"$f":"IFERROR(VLOOKUP(V$11,'बिल और T.V.न.'!$B$4:$F$16,3,0),\"\")","v":"2023-05-07"},{"$f":"IFERROR(VLOOKUP(W$11,'बिल और T.V.न.'!$B$4:$F$16,3,0),\"\")","v":"2023-05-08"},{"$f":"IFERROR(VLOOKUP(X$11,'बिल और T.V.न.'!$B$4:$F$16,3,0),\"\")","v":"2023-05-09"},{"$f":"IFERROR(VLOOKUP(Y$11,'बिल और T.V.न.'!$B$4:$F$16,3,0),\"\")","v":"2023-05-10"},{"$f":"IFERROR(VLOOKUP(Z$11,'बिल और T.V.न.'!$B$4:$F$16,3,0),\"\")","v":"2023-05-11"},{"$f":"IFERROR(VLOOKUP(AA$11,'बिल और T.V.न.'!$B$4:$F$16,3,0),\"\")","v":"2023-05-12"},{"$f":"IFERROR(VLOOKUP(AB$11,'बिल और T.V.न.'!$B$4:$F$16,3,0),\"\")","v":"2023-05-13"},{"$f":"IFERROR(VLOOKUP(AC$11,'बिल और T.V.न.'!$B$4:$F$16,3,0),\"\")","v":"2023-05-14"},{"$f":"IFERROR(VLOOKUP(AD$11,'बिल और T.V.न.'!$B$4:$F$16,3,0),\"\")","v":"2023-05-15"},{"$f":"IFERROR(VLOOKUP(AE$11,'बिल और T.V.न.'!$B$4:$F$16,3,0),\"\")","v":"2023-05-16"},{"$f":"IFERROR(VLOOKUP(AF$11,'बिल और T.V.न.'!$B$4:$F$16,3,0),\"\")","v":"2023-05-17"},{"$f":"IFERROR(VLOOKUP(AG$11,'बिल और T.V.न.'!$B$4:$F$16,3,0),\"\")","v":"2023-05-18"},{"$nulls":6},{"$f":"IFERROR(VLOOKUP(U10,U10:AF10,21,0),$U$7)","v":"APR-2022-23"},{"$f":"V$11&\"-\"&$U$1","v":"APR-2024"},"MAY-2024","JUN-2024","JUL-2024","AUG-2024","SEP-2024","OCT-2024","NOV-2024","DEC-2024","JAN-2024","FEB-2024","MAR-2024"]
[null,"TV No.",{"$f":"IFERROR(VLOOKUP(V11,'बिल और T.V.न.'!$B$4:$F$16,4,0),\"\")","v":15843},{"$f":"IFERROR(VLOOKUP(W11,'बिल और T.V.न.'!$B$4:$F$16,4,0),\"\")","v":22151},{"$f":"IFERROR(VLOOKUP(X11,'बिल और T.V.न.'!$B$4:$F$16,4,0),\"\")","v":33751},{"$f":"IFERROR(VLOOKUP(Y11,'बिल और T.V.न.'!$B$4:$F$16,4,0),\"\")","v":45857},{"$f":"IFERROR(VLOOKUP(Z11,'बिल और T.V.न.'!$B$4:$F$16,4,0),\"\")","v":54785},{"$f":"IFERROR(VLOOKUP(AA11,'बिल और T.V.न.'!$B$4:$F$16,4,0),\"\")","v":65093},{"$f":"IFERROR(VLOOKUP(AB11,'बिल और T.V.न.'!$B$4:$F$16,4,0),\"\")","v":74203},{"$f":"IFERROR(VLOOKUP(AC11,'बिल और T.V.न.'!$B$4:$F$16,4,0),\"\")","v":87547},{"$f":"IFERROR(VLOOKUP(AD11,'बिल और T.V.न.'!$B$4:$F$16,4,0),\"\")","v":98298},{"$f":"IFERROR(VLOOKUP(AE11,'बिल और T.V.न.'!$B$4:$F$16,4,0),\"\")","v":108163},{"$f":"IFERROR(VLOOKUP(AF11,'बिल और T.V.न.'!$B$4:$F$16,4,0),\"\")","v":123382},{"$f":"IFERROR(VLOOKUP(AG11,'बिल और T.V.न.'!$B$4:$F$16,4,0),\"\")","v":0},{"$nulls":6},{"$f":"IFERROR(VLOOKUP(U11,U11:U11,21,0),$U$7)","v":"APR-2022-23"},{"$f":"V$11&\"-\"&$A$1","v":"APR-2023"},"MAY-2023","JUN-2023","JUL-2023","AUG-2023","SEP-2023","OCT-2023","NOV-2023","DEC-2023",{"$f":"AE$11&\"-\"&RIGHT($B$1,4)","v":"JAN-2024"},{"$f":"AF$11&\"-\"&RIGHT($B$1,4)","v":"FEB-2024"},{"$f":"AG$11&\"-\"&RIGHT($B$1,4)","v":"MAR-2024"}]
[null,"DATE",{"$f":"IFERROR(VLOOKUP(V11,'बिल और T.V.न.'!$B$4:$F$16,5,0),\"\")","v":"2023-05-13"},{"$f":"IFERROR(VLOOKUP(W11,'बिल और T.V.न.'!$B$4:$F$16,5,0),\"\")","v":"2023-05-14"},{"$f":"IFERROR(VLOOKUP(X11,'बिल और T.V.न.'!$B$4:$F$16,5,0),\"\")","v":"2023-05-15"},{"$f":"IFERROR(VLOOKUP(Y11,'बिल और T.V.न.'!$B$4:$F$16,5,0),\"\")","v":"2023-05-16"},{"$f":"IFERROR(VLOOKUP(Z11,'बिल और T.V.न.'!$B$4:$F$16,5,0),\"\")","v":"2023-05-17"},{"$f":"IFERROR(VLOOKUP(AA11,'बिल और T.V.न.'!$B$4:$F$16,5,0),\"\")","v":"2023-05-18"},{"$f":"IFERROR(VLOOKUP(AB11,'बिल और T.V.न.'!$B$4:$F$16,5,0),\"\")","v":"2023-05-19"},{"$f":"IFERROR(VLOOKUP(AC11,'बिल और T.V.न.'!$B$4:$F$16,5,0),\"\")","v":"2023-05-20"},{"$f":"IFERROR(VLOOKUP(AD11,'बिल और T.V.न.'!$B$4:$F$16,5,0),\"\")","v":"2023-05-21"},{"$f":"IFERROR(VLOOKUP(AE11,'बिल और T.V.न.'!$B$4:$F$16,5,0),\"\")","v":"2023-05-22"},{"$f":"IFERROR(VLOOKUP(AF11,'बिल और T.V.न.'!$B$4:$F$16,5,0),\"\")","v":"2023-05-23"},{"$f":"IFERROR(VLOOKUP(AG11,'बिल और T.V.न.'!$B$4:$F$16,5,0),\"\")","v":"2023-05-24"},{"$nulls":6},{"$f":"IFERROR(VLOOKUP(U12,U12:AF12,21,0),$U$7)","v":"APR-2022-23"},"IFERROR(VLOOKUP($B$1,DA,2,0),\"\")","IFERROR(VLOOKUP($B$1,DA,3,0),\"\")","IFERROR(VLOOKUP($B$1,DA,4,0),\"\")","IFERROR(VLOOKUP($B$1,DA,5,0),\"\")","IFERROR(VLOOKUP($B$1,DA,6,0),\"\")","IFERROR(VLOOKUP($B$1,DA,7,0),\"\")","IFERROR(VLOOKUP($B$1,DA,8,0),\"\")","IFERROR(VLOOKUP($B$1,DA,9,0),\"\")","IFERROR(VLOOKUP($B$1,DA,10,0),\"\")","IFERROR(VLOOKUP($B$1,DA,11,0),\"\")","IFERROR(VLOOKUP($B$1,DA,12,0),\"\")","IFERROR(VLOOKUP($B$1,DA,13,0),\"\")"]
[{"$nulls":21},{"$f":"IFERROR(VLOOKUP($B$1,DA,2,0),\"\")","v":46},{"$f":"IFERROR(VLOOKUP($B$1,DA,3,0),\"\")","v":46},{"$f":"IFERROR(VLOOKUP($B$1,DA,4,0),\"\")","v":46},{"$f":"IFERROR(VLOOKUP($B$1,DA,5,0),\"\")","v":46},{"$f":"IFERROR(VLOOKUP($B$1,DA,6,0),\"\")","v":46},{"$f":"IFERROR(VLOOKUP($B$1,DA,7,0),\"\")","v":46},{"$f":"IFERROR(VLOOKUP($B$1,DA,8,0),\"\")","v":46},{"$f":"IFERROR(VLOOKUP($B$1,DA,9,0),\"\")","v":46},{"$f":"IFERROR(VLOOKUP($B$1,DA,10,0),\"\")","v":46},{"$f":"IFERROR(VLOOKUP($B$1,DA,11,0),\"\")","v":46},{"$f":"IFERROR(VLOOKUP($B$1,DA,12,0),\"\")","v":46},{"$f":"IFERROR(VLOOKUP($B$1,DA,13,0),\"\")","v":46}]
["1. वेतन",{"$nulls":19},"2022-"]
[null,"मूल वेतन",{"$f":"VLOOKUP($P$2,भते[],3,0)","v":69200},{"$f":"IF(D9=$P$6,$R$6,C17)","v":69200},{"$f":"IF(E9=$P$6,$R$6,D17)","v":69200},{"$f":"IF(AND($B$5=VLOOKUP($P$2,कार्मिक_विवरण[],2,0),$O$2=\"YES\"),$E$17,MROUND(E17*1.03,100))","v":71300},{"$f":"IF(G9=$P$6,$R$6,F17)","v":71300},71300,71300,71300,73200,73200,73200,73200,{"$nulls":7},"IFERROR(IF(B11>=M11,0,VLOOKUP($C$7,GPF_Rate,2,0)),\"\")","IFERROR(VLOOKUP($C$7,GPF_Rate,3,0),\"\")"]
[null,"अवकाश वेतन ",{"$f":"VLOOKUP($P$2,भते[],4,0)","v":0},{"$f":"C18","v":0},{"$f":"D18","v":0},0,0,0,0,0,0,0,0,0]
[null,"विशेष वेतन",{"$f":"VLOOKUP($P$2,भते[],5,0)","v":0},{"$f":"C19","v":0},{"$f":"D19","v":0},0,0,0,0,0,0,0,0,0]
[null,"मंहगाई भत्ता",{"$f":"IF($O$2=\"Yes\",0,IF(C17=\"\",\"\",ROUND(C17*C10%,0)))","v":29064},{"$f":"IF($O$2=\"Yes\",0,IF(D17=\"\",\"\",ROUND(D17*D10%,0)))","v":29064},29064,29946,29946,29946,29946,32798,33672,33672,33672,33672]
[null,"मकान किराया भत्ता",{"$f":"IF($O$2=\"Yes\",0,IF(OR(C17=\"\",VLOOKUP($P$2,कार्मिक_विवरण[],8,0)=\"NA\"),0,ROUND(C17*VLOOKUP($P$2,कार्मिक_विवरण[],8,0),0)))","v":6228},{"$f":"IF($O$2=\"Yes\",0,IF(OR(D17=\"\",VLOOKUP($P$2,कार्मिक_विवरण[],8,0)=\"NA\"),0,ROUND(D17*VLOOKUP($P$2,कार्मिक_विवरण[],8,0),0)))","v":6228},{"$f":"IF($O$2=\"Yes\",0,IF(OR(E17=\"\",VLOOKUP($P$2,कार्मिक_विवरण[],8,0)=\"NA\"),0,ROUND(E17*VLOOKUP($P$2,कार्मिक_विवरण[],8,0),0)))","v":6228},{"$f":"IF($O$2=\"Yes\",0,IF(OR(F17=\"\",VLOOKUP($P$2,कार्मिक_विवरण[],8,0)=\"NA\"),0,ROUND(F17*VLOOKUP($P$2,कार्मिक_विवरण[],8,0),0)))","v":6417},{"$f":"IF($O$2=\"Yes\",0,IF(OR(G17=\"\",VLOOKUP($P$2,कार्मिक_विवरण[],8,0)=\"NA\"),0,ROUND(G17*VLOOKUP($P$2,कार्मिक_विवरण[],8,0),0)))","v":6417},{"$f":"IF($O$2=\"Yes\",0,IF(OR(H17=\"\",VLOOKUP($P$2,कार्मिक_विवरण[],8,0)=\"NA\"),0,ROUND(H17*VLOOKUP($P$2,कार्मिक_विवरण[],8,0),0)))","v":6417},{"$f":"IF($O$2=\"Yes\",0,IF(OR(I17=\"\",VLOOKUP($P$2,कार्मिक_विवरण[],8,0)=\"NA\"),0,ROUND(I17*VLOOKUP($P$2,कार्मिक_विवरण[],8,0),0)))","v":6417},{"$f":"IF($O$2=\"Yes\",0,IF(OR(J17=\"\",VLOOKUP($P$2,कार्मिक_विवरण[],8,0)=\"NA\"),0,ROUND(J17*VLOOKUP($P$2,कार्मिक_विवरण[],8,0),0)))","v":6417},{"$f":"IF($O$2=\"Yes\",0,IF(OR(K17=\"\",VLOOKUP($P$2,कार्मिक_विवरण[],8,0)=\"NA\"),0,ROUND(K17*VLOOKUP($P$2,कार्मिक_विवरण[],8,0),0)))","v":6588},{"$f":"IF($O$2=\"Yes\",0,IF(OR(L17=\"\",VLOOKUP($P$2,कार्मिक_विवरण[],8,0)=\"NA\"),0,ROUND(L17*VLOOKUP($P$2,कार्मिक_विवरण[],8,0),0)))","v":6588},{"$f":"IF($O$2=\"Yes\",0,IF(OR(M17=\"\",VLOOKUP($P$2,कार्मिक_विवरण[],8,0)=\"NA\"),0,ROUND(M17*VLOOKUP($P$2,कार्मिक_विवरण[],8,0),0)))","v":6588},{"$f":"IF($O$2=\"Yes\",0,IF(OR(N17=\"\",VLOOKUP($P$2,कार्मिक_विवरण[],8,0)=\"NA\"),0,ROUND(N17*VLOOKUP($P$2,कार्मिक_विवरण[],8,0),0)))","v":6588}]
[null,"विकलांग भत्ता",{"$f":"VLOOKUP($P$2,भते[],6,0)","v":0},{"$f":"C22","v":0},{"$f":"D22","v":0},0,0,{"$f":"G22","v":0},0,0,0,0,0,0]
[null,"शहरी भत्ता ",{"$f":"VLOOKUP($P$2,भते[],7,0)","v":0},{"$f":"C23","v":0},{"$f":"D23","v":0},0,0,0,0,0,0,0,0,0]
[null,"अन्य 1",{"$f":"VLOOKUP($P$2,भते[],8,0)","v":0},{"$f":"C24","v":0},{"$f":"D24","v":0},{"$f":"E24","v":0},0,0,0,0,0,0,0,0]
[null,"अन्य 2",{"$f":"VLOOKUP($P$2,भते[],9,0)","v":0},{"$f":"C25","v":0},{"$f":"D25","v":0},0,0,0,0,0,0,0,0,0]
[null,"अन्य 3",{"$f":"VLOOKUP($P$2,भते[],10,0)","v":0},{"$f":"C26","v":0},{"$f":"D26","v":0},0,0,0,0,0,0,0,0,0]
["योग (1)",null,{"$f":"SUM(C17:C26)","v":104492},{"$f":"SUM(D17:D26)","v":104492},104492,107663,107663,107663,107663,110515,113460,113460,113460,113460]
[]
["(2) माहवार कटौतियां"]
[null,"GPF/GPF2004",{"$f":"VLOOKUP($P$2,कटोतियाँ[],3,0)","v":4200},{"$f":"C30","v":4200},{"$f":"D30","v":4200},{"$f":"E30","v":4200},{"$f":"F30","v":4200},4200,4200,4200,4200,4200,4200,4200]
[null,"GPF Loan",{"$f":"VLOOKUP($P$2,कटोतियाँ[],4,0)","v":0},{"$f":"C31","v":0},{"$f":"D31","v":0},{"$f":"E31","v":0},0,0,0,0,0,0,0,{"$f":"M31","v":0}]
[null,"NPS",{"$f":"IF($O$3=\"No\",0,ROUND(SUM(C17,C20)*10%,0))","v":0},{"$f":"IF($O$3=\"No\",0,ROUND(SUM(D17,D20)*10%,0))","v":0},0,0,0,0,0,0,0,0,0,0]
[null,"SI",{"$f":"VLOOKUP($P$2,कटोतियाँ[],5,0)","v":5000},{"$f":"C33","v":5000},5000,{"$f":"E33","v":5000},5000,5000,5000,5000,5000,5000,5000,5000]
[null,"SI Loan",{"$f":"VLOOKUP($P$2,कटोतियाँ[],6,0)","v":0},0,{"$f":"D34","v":0},0,0,0,0,0,0,0,0,0]
[null,"ITAX",{"$f":"VLOOKUP($P$2,कटोतियाँ[],7,0)","v":7000},7000,{"$f":"D35","v":7000},7000,7000,7000,7000,7000,{"$f":"J35","v":7000},{"$f":"K35","v":7000},{"$f":"L35","v":7000},{"$f":"M35","v":7000}]
[null,"RPMF/RGHS",{"$f":"VLOOKUP($P$2,कटोतियाँ[],8,0)","v":875},875,{"$f":"D36","v":875},{"$f":"E36","v":875},875,875,875,875,875,875,875,875]
[null,"LIC",{"$f":"VLOOKUP($P$2,कटोतियाँ[],9,0)","v":0},0,{"$f":"D37","v":0},0,0,0,0,0,0,0,0,0]
[null,"OTHER",{"$f":"VLOOKUP($P$2,कटोतियाँ[],10,0)","v":0},0,{"$f":"D38","v":0},0,0,0,0,0,0,0,0,0]
[null,"GIS",{"$f":"VLOOKUP($P$2,कटोतियाँ[],11,0)","v":0},0,0,0,0,0,0,0,0,0,0,0]
[null,"हितकारी निधि ",0,0,0,0,0,0,0,0,{"$f":"IF($S$9=\"Yes\",500,250)","v":250},0,0,0]
[null,"अन्य 1",{"$f":"VLOOKUP($P$2,कटोतियाँ[],12,0)","v":0},{"$f":"C41","v":0},{"$f":"D41","v":0},0,0,0,0,0,0,0,0,0]
[null,"अन्य 2",{"$f":"VLOOKUP($P$2,कटोतियाँ[],13,0)","v":0},{"$f":"C42","v":0},{"$f":"D42","v":0},0,0,0,0,{"$f":"I42","v":0},0,0,0,0]
[null,"अन्य 3",{"$f":"VLOOKUP($P$2,कटोतियाँ[],14,0)","v":0},{"$f":"C43","v":0},{"$f":"D43","v":0},0,0,0,0,0,0,0,0,0]
["योग (2)",null,{"$f":"SUM(C30:C43)","v":17075},{"$f":"SUM(D30:D43)","v":17075},17075,17075,17075,17075,17075,17075,17325,17075,17075,17075]
["कुल देय वेतन राशि (1-2)",null,{"$f":"C27-C44","v":87417},{"$f":"D27-D44","v":87417},87417,90588,90588,90588,90588,93440,96135,96385,96385,96385]
[]
["Arrear Type","Bill No. and TV No.","(3) शेष बकाया भुगतान का विवरण"]
["Arrear 1"]
["Arrear 2"]
["Arrear 3"]
["Arrear 4"]
["योग 3",null,{"$f":"SUM(C48:C51)","v":0},{"$f":"SUM(D48:D51)","v":0},0,0,0,0,0,0,0,0,0,0]
[]
["समर्पित या अंतिम उपार्जित अवकाश","Bill No. and TV No.","(4) समर्पित या उपार्जित अवकाश का भुगतान विवरण"]
[null,null,{"$f":"ROUND(IF($P$9=C9,SUM(C17+C20)/2,0),0)","v":0},0,0,0,0,0,0,0,53436,0,0,0]
[]
["कुल प्राप्त वेतन योग माहवार",null,{"$f":"SUM(C45,C52,C55)","v":87417},{"$f":"SUM(D45,D52,D55)","v":87417},87417,90588,90588,90588,90588,93440,149571,96385,96385,96385]
[]
["लिपिक के हस्ताक्षर"]
[]
["DDO के हस्ताक्षर"]

{"sheet":"PRINT PAY POSTING ","index":8,"n_rows":61,"n_cols":14,"rows_kept":61,"merged":[[0,0,0,13],[1,0,1,13],[2,0,2,13],[3,0,3,13],[4,1,4,3],[4,5,4,7],[4,9,4,10],[4,12,4,13],[5,1,5,3],[5,5,5,7],[5,9,5,10],[5,12,5,13],[6,1,6,3],[6,5,6,7],[6,9,6,10],[6,12,6,13],[7,0,7,13],[9,0,13,0],[14,0,14,13],[15,0,15,13],[16,0,25,0],[26,0,26,1],[27,0,27,13],[28,0,28,13],[29,0,42,0],[43,0,43,1],[44,0,44,1],[45,0,45,13],[46,2,46,13],[51,0,51,1],[52,0,52,13],[53,0,54,0],[53,2,53,13],[55,0,55,13],[56,0,56,1],[57,0,57,13],[58,0,58,4],[58,5,58,8],[58,9,58,13],[59,0,59,13],[60,0,60,4],[60,5,60,8],[60,9,60,13]]}
["MADE BY:-भागीरथ मल कलवानियाँ कोलिया  MOB. NO 982879204"]
[{"$f":"'EDIT PAY POSTING'!A2","v":"राजकीय उच्च माध्यमिक विद्यालय डसाणा खुर्द,मौलासर,नागौर"}]
["PAY POSTING RAGISTER"]
[]
["नाम-",{"$f":"'EDIT PAY POSTING'!B5","v":"A"},null,null,"पद-",{"$f":"'EDIT PAY POSTING'!F5","v":"SENIOR TEACHER (II GR.)"},null,null,"DOB-",{"$f":"'EDIT PAY POSTING'!J5","v":"1971-01-21"},null,"पैन नंबर-",{"$f":"'EDIT PAY POSTING'!M5","v":"XXXXS1582D"}]
["EMP. ID-",{"$f":"'EDIT PAY POSTING'!B6","v":"RJNA199728012345"},null,null,"SI No.-",{"$f":"'EDIT PAY POSTING'!F6","v":1121192},null,null,"GPF No.-",{"$f":"'EDIT PAY POSTING'!J6","v":123456},null,"PRAN No.",{"$f":"'EDIT PAY POSTING'!M6","v":123654987897}]
["आधार कार्ड नंबर-",{"$f":"'EDIT PAY POSTING'!B7","v":"XXXXXXXX5832"},null,null,"बैंक नाम-",{"$f":"'EDIT PAY POSTING'!F7","v":"SBI"},null,null,"IFSC Cod-",{"$f":"'EDIT PAY POSTING'!J7","v":"SBIN00"},null,"बैंक A/c-",{"$f":"'EDIT PAY POSTING'!M7","v":61118966625}]
[]
[{"$f":"'EDIT PAY POSTING'!A9","v":"A"},"Month",{"$f":"'EDIT PAY POSTING'!C9","v":"APR-2023"},{"$f":"'EDIT PAY POSTING'!D9","v":"MAY-2023"},{"$f":"'EDIT PAY POSTING'!E9","v":"JUN-2023"},{"$f":"'EDIT PAY POSTING'!F9","v":"JUL-2023"},{"$f":"'EDIT PAY POSTING'!G9","v":"AUG-2023"},{"$f":"'EDIT PAY POSTING'!H9","v":"SEP-2023"},{"$f":"'EDIT PAY POSTING'!I9","v":"OCT-2023"},{"$f":"'EDIT PAY POSTING'!J9","v":"NOV-2023"},{"$f":"'EDIT PAY POSTING'!K9","v":"DEC-2023"},{"$f":"'EDIT PAY POSTING'!L9","v":"JAN-2024"},{"$f":"'EDIT PAY POSTING'!M9","v":"FEB-2024"},{"$f":"'EDIT PAY POSTING'!N9","v":"MAR-2024"}]
["वेतन एवं कटौती का विवरण","DA RATES%",{"$f":"'EDIT PAY POSTING'!C10","v":42},{"$f":"'EDIT PAY POSTING'!D10","v":42},{"$f":"'EDIT PAY POSTING'!E10","v":42},{"$f":"'EDIT PAY POSTING'!F10","v":42},{"$f":"'EDIT PAY POSTING'!G10","v":42},{"$f":"'EDIT PAY POSTING'!H10","v":42},{"$f":"'EDIT PAY POSTING'!I10","v":42},{"$f":"'EDIT PAY POSTING'!J10","v":46},{"$f":"'EDIT PAY POSTING'!K10","v":46},{"$f":"'EDIT PAY POSTING'!L10","v":46},{"$f":"'EDIT PAY POSTING'!M10","v":46},{"$f":"'EDIT PAY POSTING'!N10","v":46}]
[null,"Bill No.",{"$f":"'EDIT PAY POSTING'!C11","v":3},{"$f":"'EDIT PAY POSTING'!D11","v":9},{"$f":"'EDIT PAY POSTING'!E11","v":11},{"$f":"'EDIT PAY POSTING'!F11","v":17},{"$f":"'EDIT PAY POSTING'!G11","v":20},{"$f":"'EDIT PAY POSTING'!H11","v":22},{"$f":"'EDIT PAY POSTING'!I11","v":27},{"$f":"'EDIT PAY POSTING'!J11","v":31},{"$f":"'EDIT PAY POSTING'!K11","v":33},{"$f":"'EDIT PAY POSTING'!L11","v":36},{"$f":"'EDIT PAY POSTING'!M11","v":41},{"$f":"'EDIT PAY POSTING'!N11","v":0}]
[null,"DATE",{"$f":"'EDIT PAY POSTING'!C12","v":"2023-05-07"},{"$f":"'EDIT PAY POSTING'!D12","v":"2023-05-08"},{"$f":"'EDIT PAY POSTING'!E12","v":"2023-05-09"},{"$f":"'EDIT PAY POSTING'!F12","v":"2023-05-10"},{"$f":"'EDIT PAY POSTING'!G12","v":"2023-05-11"},{"$f":"'EDIT PAY POSTING'!H12","v":"2023-05-12"},{"$f":"'EDIT PAY POSTING'!I12","v":"2023-05-13"},{"$f":"'EDIT PAY POSTING'!J12","v":"2023-05-14"},{"$f":"'EDIT PAY POSTING'!K12","v":"2023-05-15"},{"$f":"'EDIT PAY POSTING'!L12","v":"2023-05-16"},{"$f":"'EDIT PAY POSTING'!M12","v":"2023-05-17"},{"$f":"'EDIT PAY POSTING'!N12","v":"2023-05-18"}]
[null,"TV No.",{"$f":"'EDIT PAY POSTING'!C13","v":15843},{"$f":"'EDIT PAY POSTING'!D13","v":22151},{"$f":"'EDIT PAY POSTING'!E13","v":33751},{"$f":"'EDIT PAY POSTING'!F13","v":45857},{"$f":"'EDIT PAY POSTING'!G13","v":54785},{"$f":"'EDIT PAY POSTING'!H13","v":65093},{"$f":"'EDIT PAY POSTING'!I13","v":74203},{"$f":"'EDIT PAY POSTING'!J13","v":87547},{"$f":"'EDIT PAY POSTING'!K13","v":98298},{"$f":"'EDIT PAY POSTING'!L13","v":108163},{"$f":"'EDIT PAY POSTING'!M13","v":123382},{"$f":"'EDIT PAY POSTING'!N13","v":0}]
[null,"DATE",{"$f":"'EDIT PAY POSTING'!C14","v":"2023-05-13"},{"$f":"'EDIT PAY POSTING'!D14","v":"2023-05-14"},{"$f":"'EDIT PAY POSTING'!E14","v":"2023-05-15"},{"$f":"'EDIT PAY POSTING'!F14","v":"2023-05-16"},{"$f":"'EDIT PAY POSTING'!G14","v":"2023-05-17"},{"$f":"'EDIT PAY POSTING'!H14","v":"2023-05-18"},{"$f":"'EDIT PAY POSTING'!I14","v":"2023-05-19"},{"$f":"'EDIT PAY POSTING'!J14","v":"2023-05-20"},{"$f":"'EDIT PAY POSTING'!K14","v":"2023-05-21"},{"$f":"'EDIT PAY POSTING'!L14","v":"2023-05-22"},{"$f":"'EDIT PAY POSTING'!M14","v":"2023-05-23"},{"$f":"'EDIT PAY POSTING'!N14","v":"2023-05-24"}]
[]
["1. वेतन"]
[null,{"$f":"'EDIT PAY POSTING'!B17","v":"मूल वेतन"},{"$f":"'EDIT PAY POSTING'!C17","v":69200},{"$f":"'EDIT PAY POSTING'!D17","v":69200},{"$f":"'EDIT PAY POSTING'!E17","v":69200},{"$f":"'EDIT PAY POSTING'!F17","v":71300},{"$f":"'EDIT PAY POSTING'!G17","v":71300},{"$f":"'EDIT PAY POSTING'!H17","v":71300},{"$f":"'EDIT PAY POSTING'!I17","v":71300},{"$f":"'EDIT PAY POSTING'!J17","v":71300},{"$f":"'EDIT PAY POSTING'!K17","v":73200},{"$f":"'EDIT PAY POSTING'!L17","v":73200},{"$f":"'EDIT PAY POSTING'!M17","v":73200},{"$f":"'EDIT PAY POSTING'!N17","v":73200}]
[null,{"$f":"'EDIT PAY POSTING'!B18","v":"अवकाश वेतन "},{"$f":"'EDIT PAY POSTING'!C18","v":0},{"$f":"'EDIT PAY POSTING'!D18","v":0},{"$f":"'EDIT PAY POSTING'!E18","v":0},{"$f":"'EDIT PAY POSTING'!F18","v":0},{"$f":"'EDIT PAY POSTING'!G18","v":0},{"$f":"'EDIT PAY POSTING'!H18","v":0},{"$f":"'EDIT PAY POSTING'!I18","v":0},{"$f":"'EDIT PAY POSTING'!J18","v":0},{"$f":"'EDIT PAY POSTING'!K18","v":0},{"$f":"'EDIT PAY POSTING'!L18","v":0},{"$f":"'EDIT PAY POSTING'!M18","v":0},{"$f":"'EDIT PAY POSTING'!N18","v":0}]
[null,{"$f":"'EDIT PAY POSTING'!B19","v":"विशेष वेतन"},{"$f":"'EDIT PAY POSTING'!C19","v":0},{"$f":"'EDIT PAY POSTING'!D19","v":0},{"$f":"'EDIT PAY POSTING'!E19","v":0},{"$f":"'EDIT PAY POSTING'!F19","v":0},{"$f":"'EDIT PAY POSTING'!G19","v":0},{"$f":"'EDIT PAY POSTING'!H19","v":0},{"$f":"'EDIT PAY POSTING'!I19","v":0},{"$f":"'EDIT PAY POSTING'!J19","v":0},{"$f":"'EDIT PAY POSTING'!K19","v":0},{"$f":"'EDIT PAY POSTING'!L19","v":0},{"$f":"'EDIT PAY POSTING'!M19","v":0},{"$f":"'EDIT PAY POSTING'!N19","v":0}]
[null,{"$f":"'EDIT PAY POSTING'!B20","v":"मंहगाई भत्ता"},{"$f":"'EDIT PAY POSTING'!C20","v":29064},{"$f":"'EDIT PAY POSTING'!D20","v":29064},{"$f":"'EDIT PAY POSTING'!E20","v":29064},{"$f":"'EDIT PAY POSTING'!F20","v":29946},{"$f":"'EDIT PAY POSTING'!G20","v":29946},{"$f":"'EDIT PAY POSTING'!H20","v":29946},{"$f":"'EDIT PAY POSTING'!I20","v":29946},{"$f":"'EDIT PAY POSTING'!J20","v":32798},{"$f":"'EDIT PAY POSTING'!K20","v":33672},{"$f":"'EDIT PAY POSTING'!L20","v":33672},{"$f":"'EDIT PAY POSTING'!M20","v":33672},{"$f":"'EDIT PAY POSTING'!N20","v":33672}]
[null,{"$f":"'EDIT PAY POSTING'!B21","v":"मकान किराया भत्ता"},{"$f":"'EDIT PAY POSTING'!C21","v":6228},{"$f":"'EDIT PAY POSTING'!D21","v":6228},{"$f":"'EDIT PAY POSTING'!E21","v":6228},{"$f":"'EDIT PAY POSTING'!F21","v":6417},{"$f":"'EDIT PAY POSTING'!G21","v":6417},{"$f":"'EDIT PAY POSTING'!H21","v":6417},{"$f":"'EDIT PAY POSTING'!I21","v":6417},{"$f":"'EDIT PAY POSTING'!J21","v":6417},{"$f":"'EDIT PAY POSTING'!K21","v":6588},{"$f":"'EDIT PAY POSTING'!L21","v":6588},{"$f":"'EDIT PAY POSTING'!M21","v":6588},{"$f":"'EDIT PAY POSTING'!N21","v":6588}]
[null,{"$f":"'EDIT PAY POSTING'!B22","v":"विकलांग भत्ता"},{"$f":"'EDIT PAY POSTING'!C22","v":0},{"$f":"'EDIT PAY POSTING'!D22","v":0},{"$f":"'EDIT PAY POSTING'!E22","v":0},{"$f":"'EDIT PAY POSTING'!F22","v":0},{"$f":"'EDIT PAY POSTING'!G22","v":0},{"$f":"'EDIT PAY POSTING'!H22","v":0},{"$f":"'EDIT PAY POSTING'!I22","v":0},{"$f":"'EDIT PAY POSTING'!J22","v":0},{"$f":"'EDIT PAY POSTING'!K22","v":0},{"$f":"'EDIT PAY POSTING'!L22","v":0},{"$f":"'EDIT PAY POSTING'!M22","v":0},{"$f":"'EDIT PAY POSTING'!N22","v":0}]
[null,{"$f":"'EDIT PAY POSTING'!B23","v":"शहरी भत्ता "},{"$f":"'EDIT PAY POSTING'!C23","v":0},{"$f":"'EDIT PAY POSTING'!D23","v":0},{"$f":"'EDIT PAY POSTING'!E23","v":0},{"$f":"'EDIT PAY POSTING'!F23","v":0},{"$f":"'EDIT PAY POSTING'!G23","v":0},{"$f":"'EDIT PAY POSTING'!H23","v":0},{"$f":"'EDIT PAY POSTING'!I23","v":0},{"$f":"'EDIT PAY POSTING'!J23","v":0},{"$f":"'EDIT PAY POSTING'!K23","v":0},{"$f":"'EDIT PAY POSTING'!L23","v":0},{"$f":"'EDIT PAY POSTING'!M23","v":0},{"$f":"'EDIT PAY POSTING'!N23","v":0}]
[null,{"$f":"'EDIT PAY POSTING'!B24","v":"अन्य 1"},{"$f":"'EDIT PAY POSTING'!C24","v":0},0,{"$f":"'EDIT PAY POSTING'!E24","v":0},{"$f":"'EDIT PAY POSTING'!F24","v":0},{"$f":"'EDIT PAY POSTING'!G24","v":0},{"$f":"'EDIT PAY POSTING'!H24","v":0},{"$f":"'EDIT PAY POSTING'!I24","v":0},{"$f":"'EDIT PAY POSTING'!J24","v":0},{"$f":"'EDIT PAY POSTING'!K24","v":0},{"$f":"'EDIT PAY POSTING'!L24","v":0},{"$f":"'EDIT PAY POSTING'!M24","v":0},{"$f":"'EDIT PAY POSTING'!N24","v":0}]
[null,{"$f":"'EDIT PAY POSTING'!B25","v":"अन्य 2"},{"$f":"'EDIT PAY POSTING'!C25","v":0},{"$f":"'EDIT PAY POSTING'!D25","v":0},{"$f":"'EDIT PAY POSTING'!E25","v":0},{"$f":"'EDIT PAY POSTING'!F25","v":0},{"$f":"'EDIT PAY POSTING'!G25","v":0},{"$f":"'EDIT PAY POSTING'!H25","v":0},{"$f":"'EDIT PAY POSTING'!I25","v":0},{"$f":"'EDIT PAY POSTING'!J25","v":0},{"$f":"'EDIT PAY POSTING'!K25","v":0},{"$f":"'EDIT PAY POSTING'!L25","v":0},{"$f":"'EDIT PAY POSTING'!M25","v":0},{"$f":"'EDIT PAY POSTING'!N25","v":0}]
[null,{"$f":"'EDIT PAY POSTING'!B26","v":"अन्य 3"},{"$f":"'EDIT PAY POSTING'!C26","v":0},{"$f":"'EDIT PAY POSTING'!D26","v":0},{"$f":"'EDIT PAY POSTING'!E26","v":0},{"$f":"'EDIT PAY POSTING'!F26","v":0},{"$f":"'EDIT PAY POSTING'!G26","v":0},{"$f":"'EDIT PAY POSTING'!H26","v":0},{"$f":"'EDIT PAY POSTING'!I26","v":0},{"$f":"'EDIT PAY POSTING'!J26","v":0},{"$f":"'EDIT PAY POSTING'!K26","v":0},{"$f":"'EDIT PAY POSTING'!L26","v":0},{"$f":"'EDIT PAY POSTING'!M26","v":0},{"$f":"'EDIT PAY POSTING'!N26","v":0}]
["योग (अ)",null,{"$f":"SUM(C17:C26)","v":104492},{"$f":"SUM(D17:D26)","v":104492},104492,107663,107663,107663,107663,110515,113460,113460,113460,113460]
[]
["(2)माहवार  कटौतियां"]
[null,"GPF/GPF2004",{"$f":"'EDIT PAY POSTING'!C30","v":4200},4200,{"$f":"'EDIT PAY POSTING'!E30","v":4200},{"$f":"'EDIT PAY POSTING'!F30","v":4200},{"$f":"'EDIT PAY POSTING'!G30","v":4200},{"$f":"'EDIT PAY POSTING'!H30","v":4200},{"$f":"'EDIT PAY POSTING'!I30","v":4200},{"$f":"'EDIT PAY POSTING'!J30","v":4200},{"$f":"'EDIT PAY POSTING'!K30","v":4200},{"$f":"'EDIT PAY POSTING'!L30","v":4200},{"$f":"'EDIT PAY POSTING'!M30","v":4200},{"$f":"'EDIT PAY POSTING'!N30","v":4200}]
[null,"GPF Loan",{"$f":"'EDIT PAY POSTING'!C31","v":0},{"$f":"'EDIT PAY POSTING'!D31","v":0},{"$f":"'EDIT PAY POSTING'!E31","v":0},{"$f":"'EDIT PAY POSTING'!F31","v":0},{"$f":"'EDIT PAY POSTING'!G31","v":0},{"$f":"'EDIT PAY POSTING'!H31","v":0},{"$f":"'EDIT PAY POSTING'!I31","v":0},{"$f":"'EDIT PAY POSTING'!J31","v":0},{"$f":"'EDIT PAY POSTING'!K31","v":0},{"$f":"'EDIT PAY POSTING'!L31","v":0},{"$f":"'EDIT PAY POSTING'!M31","v":0},{"$f":"'EDIT PAY POSTING'!N31","v":0}]
[null,"NPS",{"$f":"'EDIT PAY POSTING'!C32","v":0},{"$f":"'EDIT PAY POSTING'!D32","v":0},{"$f":"'EDIT PAY POSTING'!E32","v":0},{"$f":"'EDIT PAY POSTING'!F32","v":0},{"$f":"'EDIT PAY POSTING'!G32","v":0},{"$f":"'EDIT PAY POSTING'!H32","v":0},{"$f":"'EDIT PAY POSTING'!I32","v":0},{"$f":"'EDIT PAY POSTING'!J32","v":0},{"$f":"'EDIT PAY POSTING'!K32","v":0},{"$f":"'EDIT PAY POSTING'!L32","v":0},{"$f":"'EDIT PAY POSTING'!M32","v":0},{"$f":"'EDIT PAY POSTING'!N32","v":0}]
[null,"SI",{"$f":"'EDIT PAY POSTING'!C33","v":5000},{"$f":"'EDIT PAY POSTING'!D33","v":5000},{"$f":"'EDIT PAY POSTING'!E33","v":5000},{"$f":"'EDIT PAY POSTING'!F33","v":5000},{"$f":"'EDIT PAY POSTING'!G33","v":5000},{"$f":"'EDIT PAY POSTING'!H33","v":5000},{"$f":"'EDIT PAY POSTING'!I33","v":5000},{"$f":"'EDIT PAY POSTING'!J33","v":5000},{"$f":"'EDIT PAY POSTING'!K33","v":5000},{"$f":"'EDIT PAY POSTING'!L33","v":5000},{"$f":"'EDIT PAY POSTING'!M33","v":5000},{"$f":"'EDIT PAY POSTING'!N33","v":5000}]
[null,"SI Loan",{"$f":"'EDIT PAY POSTING'!C34","v":0},{"$f":"'EDIT PAY POSTING'!D34","v":0},{"$f":"'EDIT PAY POSTING'!E34","v":0},{"$f":"'EDIT PAY POSTING'!F34","v":0},{"$f":"'EDIT PAY POSTING'!G34","v":0},{"$f":"'EDIT PAY POSTING'!H34","v":0},{"$f":"'EDIT PAY POSTING'!I34","v":0},{"$f":"'EDIT PAY POSTING'!J34","v":0},{"$f":"'EDIT PAY POSTING'!K34","v":0},{"$f":"'EDIT PAY POSTING'!L34","v":0},{"$f":"'EDIT PAY POSTING'!M34","v":0},{"$f":"'EDIT PAY POSTING'!N34","v":0}]
[null,"ITAX",{"$f":"'EDIT PAY POSTING'!C35","v":7000},{"$f":"'EDIT PAY POSTING'!D35","v":7000},{"$f":"'EDIT PAY POSTING'!E35","v":7000},{"$f":"'EDIT PAY POSTING'!F35","v":7000},{"$f":"'EDIT PAY POSTING'!G35","v":7000},{"$f":"'EDIT PAY POSTING'!H35","v":7000},{"$f":"'EDIT PAY POSTING'!I35","v":7000},{"$f":"'EDIT PAY POSTING'!J35","v":7000},{"$f":"'EDIT PAY POSTING'!K35","v":7000},{"$f":"'EDIT PAY POSTING'!L35","v":7000},{"$f":"'EDIT PAY POSTING'!M35","v":7000},{"$f":"'EDIT PAY POSTING'!N35","v":7000}]
[null,"RPMF/RGHS",{"$f":"'EDIT PAY POSTING'!C36","v":875},{"$f":"'EDIT PAY POSTING'!D36","v":875},{"$f":"'EDIT PAY POSTING'!E36","v":875},{"$f":"'EDIT PAY POSTING'!F36","v":875},{"$f":"'EDIT PAY POSTING'!G36","v":875},{"$f":"'EDIT PAY POSTING'!H36","v":875},{"$f":"'EDIT PAY POSTING'!I36","v":875},{"$f":"'EDIT PAY POSTING'!J36","v":875},{"$f":"'EDIT PAY POSTING'!K36","v":875},{"$f":"'EDIT PAY POSTING'!L36","v":875},{"$f":"'EDIT PAY POSTING'!M36","v":875},{"$f":"'EDIT PAY POSTING'!N36","v":875}]
[null,"LIC",{"$f":"'EDIT PAY POSTING'!C37","v":0},{"$f":"'EDIT PAY POSTING'!D37","v":0},{"$f":"'EDIT PAY POSTING'!E37","v":0},{"$f":"'EDIT PAY POSTING'!F37","v":0},{"$f":"'EDIT PAY POSTING'!G37","v":0},{"$f":"'EDIT PAY POSTING'!H37","v":0},{"$f":"'EDIT PAY POSTING'!I37","v":0},{"$f":"'EDIT PAY POSTING'!J37","v":0},{"$f":"'EDIT PAY POSTING'!K37","v":0},{"$f":"'EDIT PAY POSTING'!L37","v":0},{"$f":"'EDIT PAY POSTING'!M37","v":0},{"$f":"'EDIT PAY POSTING'!N37","v":0}]
[null,"OTHER",{"$f":"'EDIT PAY POSTING'!C38","v":0},{"$f":"'EDIT PAY POSTING'!D38","v":0},{"$f":"'EDIT PAY POSTING'!E38","v":0},{"$f":"'EDIT PAY POSTING'!F38","v":0},{"$f":"'EDIT PAY POSTING'!G38","v":0},{"$f":"'EDIT PAY POSTING'!H38","v":0},{"$f":"'EDIT PAY POSTING'!I38","v":0},{"$f":"'EDIT PAY POSTING'!J38","v":0},{"$f":"'EDIT PAY POSTING'!K38","v":0},{"$f":"'EDIT PAY POSTING'!L38","v":0},{"$f":"'EDIT PAY POSTING'!M38","v":0},{"$f":"'EDIT PAY POSTING'!N38","v":0}]
[null,"GIS",{"$f":"'EDIT PAY POSTING'!C39","v":0},{"$f":"'EDIT PAY POSTING'!D39","v":0},{"$f":"'EDIT PAY POSTING'!E39","v":0},{"$f":"'EDIT PAY POSTING'!F39","v":0},{"$f":"'EDIT PAY POSTING'!G39","v":0},{"$f":"'EDIT PAY POSTING'!H39","v":0},{"$f":"'EDIT PAY POSTING'!I39","v":0},{"$f":"'EDIT PAY POSTING'!J39","v":0},{"$f":"'EDIT PAY POSTING'!K39","v":0},{"$f":"'EDIT PAY POSTING'!L39","v":0},{"$f":"'EDIT PAY POSTING'!M39","v":0},{"$f":"'EDIT PAY POSTING'!N39","v":0}]
[null,"हितकारी निधि ",{"$f":"'EDIT PAY POSTING'!C40","v":0},{"$f":"'EDIT PAY POSTING'!D40","v":0},{"$f":"'EDIT PAY POSTING'!E40","v":0},{"$f":"'EDIT PAY POSTING'!F40","v":0},{"$f":"'EDIT PAY POSTING'!G40","v":0},{"$f":"'EDIT PAY POSTING'!H40","v":0},{"$f":"'EDIT PAY POSTING'!I40","v":0},{"$f":"'EDIT PAY POSTING'!J40","v":0},{"$f":"'EDIT PAY POSTING'!K40","v":250},{"$f":"'EDIT PAY POSTING'!L40","v":0},{"$f":"'EDIT PAY POSTING'!M40","v":0},{"$f":"'EDIT PAY POSTING'!N40","v":0}]
[null,"अन्य 1",{"$f":"'EDIT PAY POSTING'!C41","v":0},{"$f":"'EDIT PAY POSTING'!D41","v":0},{"$f":"'EDIT PAY POSTING'!E41","v":0},{"$f":"'EDIT PAY POSTING'!F41","v":0},{"$f":"'EDIT PAY POSTING'!G41","v":0},{"$f":"'EDIT PAY POSTING'!H41","v":0},{"$f":"'EDIT PAY POSTING'!I41","v":0},{"$f":"'EDIT PAY POSTING'!J41","v":0},{"$f":"'EDIT PAY POSTING'!K41","v":0},{"$f":"'EDIT PAY POSTING'!L41","v":0},{"$f":"'EDIT PAY POSTING'!M41","v":0},{"$f":"'EDIT PAY POSTING'!N41","v":0}]
[null,"अन्य 2",{"$f":"'EDIT PAY POSTING'!C42","v":0},{"$f":"'EDIT PAY POSTING'!D42","v":0},{"$f":"'EDIT PAY POSTING'!E42","v":0},{"$f":"'EDIT PAY POSTING'!F42","v":0},{"$f":"'EDIT PAY POSTING'!G42","v":0},{"$f":"'EDIT PAY POSTING'!H42","v":0},{"$f":"'EDIT PAY POSTING'!I42","v":0},{"$f":"'EDIT PAY POSTING'!J42","v":0},{"$f":"'EDIT PAY POSTING'!K42","v":0},{"$f":"'EDIT PAY POSTING'!L42","v":0},{"$f":"'EDIT PAY POSTING'!M42","v":0},{"$f":"'EDIT PAY POSTING'!N42","v":0}]
[null,"अन्य 3",{"$f":"'EDIT PAY POSTING'!C43","v":0},{"$f":"'EDIT PAY POSTING'!D43","v":0},{"$f":"'EDIT PAY POSTING'!E43","v":0},{"$f":"'EDIT PAY POSTING'!F43","v":0},{"$f":"'EDIT PAY POSTING'!G43","v":0},{"$f":"'EDIT PAY POSTING'!H43","v":0},{"$f":"'EDIT PAY POSTING'!I43","v":0},{"$f":"'EDIT PAY POSTING'!J43","v":0},{"$f":"'EDIT PAY POSTING'!K43","v":0},{"$f":"'EDIT PAY POSTING'!L43","v":0},{"$f":"'EDIT PAY POSTING'!M43","v":0},{"$f":"'EDIT PAY POSTING'!N43","v":0}]
["योग (2)",null,{"$f":"SUM(C30:C43)","v":17075},{"$f":"SUM(D30:D43)","v":17075},17075,17075,17075,17075,17075,17075,17325,17075,17075,17075]
["कुल देय वेतन राशि (1-2)",null,{"$f":"C27-C44","v":87417},{"$f":"D27-D44","v":87417},87417,90588,90588,90588,90588,93440,96135,{"$f":"L27-L44","v":96385},{"$f":"M27-M44","v":96385},{"$f":"N27-N44","v":96385}]
[]
["Arrear Type","Bill No. and TV No.","(3) शेष बकाया भुगतान का विवरण"]
[{"$f":"'EDIT PAY POSTING'!A48","v":"Arrear 1"},{"$f":"'EDIT PAY POSTING'!B48","v":0},{"$f":"'EDIT PAY POSTING'!C48","v":0},{"$f":"'EDIT PAY POSTING'!D48","v":0},{"$f":"'EDIT PAY POSTING'!E48","v":0},{"$f":"'EDIT PAY POSTING'!F48","v":0},{"$f":"'EDIT PAY POSTING'!G48","v":0},{"$f":"'EDIT PAY POSTING'!H48","v":0},{"$f":"'EDIT PAY POSTING'!I48","v":0},{"$f":"'EDIT PAY POSTING'!J48","v":0},{"$f":"'EDIT PAY POSTING'!K48","v":0},{"$f":"'EDIT PAY POSTING'!L48","v":0},{"$f":"'EDIT PAY POSTING'!M48","v":0},{"$f":"'EDIT PAY POSTING'!N48","v":0}]
[{"$f":"'EDIT PAY POSTING'!A49","v":"Arrear 2"},{"$f":"'EDIT PAY POSTING'!B49","v":0},{"$f":"'EDIT PAY POSTING'!C49","v":0},{"$f":"'EDIT PAY POSTING'!D49","v":0},{"$f":"'EDIT PAY POSTING'!E49","v":0},{"$f":"'EDIT PAY POSTING'!F49","v":0},{"$f":"'EDIT PAY POSTING'!G49","v":0},{"$f":"'EDIT PAY POSTING'!H49","v":0},{"$f":"'EDIT PAY POSTING'!I49","v":0},{"$f":"'EDIT PAY POSTING'!J49","v":0},{"$f":"'EDIT PAY POSTING'!K49","v":0},{"$f":"'EDIT PAY POSTING'!L49","v":0},{"$f":"'EDIT PAY POSTING'!M49","v":0},{"$f":"'EDIT PAY POSTING'!N49","v":0}]
[{"$f":"'EDIT PAY POSTING'!A50","v":"Arrear 3"},{"$f":"'EDIT PAY POSTING'!B50","v":0},{"$f":"'EDIT PAY POSTING'!C50","v":0},{"$f":"'EDIT PAY POSTING'!D50","v":0},{"$f":"'EDIT PAY POSTING'!E50","v":0},{"$f":"'EDIT PAY POSTING'!F50","v":0},{"$f":"'EDIT PAY POSTING'!G50","v":0},{"$f":"'EDIT PAY POSTING'!H50","v":0},{"$f":"'EDIT PAY POSTING'!I50","v":0},{"$f":"'EDIT PAY POSTING'!J50","v":0},{"$f":"'EDIT PAY POSTING'!K50","v":0},{"$f":"'EDIT PAY POSTING'!L50","v":0},{"$f":"'EDIT PAY POSTING'!M50","v":0},{"$f":"'EDIT PAY POSTING'!N50","v":0}]
[{"$f":"'EDIT PAY POSTING'!A51","v":"Arrear 4"},{"$f":"'EDIT PAY POSTING'!B51","v":0},{"$f":"'EDIT PAY POSTING'!C51","v":0},{"$f":"'EDIT PAY POSTING'!D51","v":0},{"$f":"'EDIT PAY POSTING'!E51","v":0},{"$f":"'EDIT PAY POSTING'!F51","v":0},{"$f":"'EDIT PAY POSTING'!G51","v":0},{"$f":"'EDIT PAY POSTING'!H51","v":0},{"$f":"'EDIT PAY POSTING'!I51","v":0},{"$f":"'EDIT PAY POSTING'!J51","v":0},{"$f":"'EDIT PAY POSTING'!K51","v":0},{"$f":"'EDIT PAY POSTING'!L51","v":0},{"$f":"'EDIT PAY POSTING'!M51","v":0},{"$f":"'EDIT PAY POSTING'!N51","v":0}]
["कुल राशि",null,{"$f":"SUM(C48:C51)","v":0},{"$f":"SUM(D48:D51)","v":0},0,0,0,0,0,0,0,{"$f":"SUM(L48:L51)","v":0},{"$f":"SUM(M48:M51)","v":0},{"$f":"SUM(N48:N51)","v":0}]
[]
["समर्पित या अंतिम उपार्जित अवकाश","Bill No. and TV No.","(4) समर्पित या उपार्जित अवकाश का भुगतान विवरण"]
[null,{"$f":"'EDIT PAY POSTING'!B55","v":0},{"$f":"'EDIT PAY POSTING'!C55","v":0},{"$f":"'EDIT PAY POSTING'!D55","v":0},{"$f":"'EDIT PAY POSTING'!E55","v":0},{"$f":"'EDIT PAY POSTING'!F55","v":0},{"$f":"'EDIT PAY POSTING'!G55","v":0},{"$f":"'EDIT PAY POSTING'!H55","v":0},{"$f":"'EDIT PAY POSTING'!I55","v":0},{"$f":"'EDIT PAY POSTING'!J55","v":0},{"$f":"'EDIT PAY POSTING'!K55","v":53436},{"$f":"'EDIT PAY POSTING'!L55","v":0},{"$f":"'EDIT PAY POSTING'!M55","v":0},{"$f":"'EDIT PAY POSTING'!N55","v":0}]
[]
["कुल प्राप्त वेतन योग माहवार",null,{"$f":"SUM(C45,C52,C55)","v":87417},{"$f":"SUM(D45,D52,D55)","v":87417},87417,90588,90588,90588,90588,93440,149571,96385,96385,96385]
[]
[]
[]
["लिपिक के हस्ताक्षर",{"$nulls":8},"DDO के हस्ताक्षर/शील"]