{"text_format":"3","workbook":"xlsx","n_sheets":2,"sheets":["MASTER DATA SHEET","DA ARREAR SHEET"],"not_rendered":{"defined_names":2},"read":"whole","date_system":"1900"}

{"sheet":"MASTER DATA SHEET","index":0,"n_rows":50,"n_cols":12,"rows_kept":50,"merged":[[0,0,0,8],[1,0,1,8],[2,0,2,8],[3,1,3,2],[3,7,3,8],[4,0,4,8]]}
["MADE BY:--BHAGIRATH MAL KALWANIA G.S.S.S.DASANA KHURD (MOULASAR) DEEDWANA-KUCHAMAN            MOB.NO.9828789204"]
["राजकीय उच्च माध्यमिक विद्यालय डसाणा खुर्द (मौलासर),डीडवाना-कुचामन "]
["DA ARREAR  46% to 50 %"]
["क्रमांक-","राउमावि डसाखु /2024/1",{"$nulls":4},"दिनाँक ","2024-04-01"]
["                                    राजस्थान सरकार वित्त विभाग के आदेश कर्मांक --NO.F.6(3)FD (Rules)/2017 जयपुर 14.03.2024 के अनुसार महगांईभत्ता (डी.ए.) की दर को संशोधित कर 46 प्रतिशत से बढाकर 50 प्रतिशत किया गया है lइस कारण निम्नाकित कर्मचारियों की महगांई भत्ता दर को पुन: निर्धारित कर अंतर माह जनवरी 24 से फरबरी 24 तक की राशि का वेतन भुगतान स्वीकृति प्रदान की जाती है l"]
["SR.NO.","EMPLOYEE NAME","POST","GPF/\nGPF 2004","BASIC\nJAN-24","DRAWN DA RATE JAN-24","BASIC\nFEB-24","DRAWN DA RATE FEB-24","DA DRAWN DUE TO BE JAN/FEB24",null,null,{"v":0.46,"d":"46%"}]
[1,"BHAGIRATH MAL","TEACHER L-1","GPF",73200,{"v":0.46,"d":"46%"},73200,{"v":0.46,"d":"46%"},{"v":0.5,"d":"50%"},null,null,{"v":0.47,"d":"47%"}]
[2,"A","SEN.TEACHER","GPF 2004",46500,{"v":0.46,"d":"46%"},46500,{"v":0.46,"d":"46%"},{"v":0.5,"d":"50%"},null,null,{"v":0.48,"d":"48%"}]
[{"$nulls":11},{"v":0.49,"d":"49%"}]
[{"$nulls":11},{"v":0.5,"d":"50%"}]
[{"$nulls":11},{"v":0.51,"d":"51%"}]
[{"$nulls":11},{"v":0.52,"d":"52%"}]
[{"$nulls":11},{"v":0.53,"d":"53%"}]
[{"$nulls":11},{"v":0.54,"d":"54%"}]
[{"$nulls":11},{"v":0.55,"d":"55%"}]
[{"$nulls":11},{"v":0.559999999999999,"d":"56%"}]
[{"$nulls":11},{"v":0.569999999999999,"d":"57%"}]
[{"$nulls":11},{"v":0.579999999999999,"d":"58%"}]
[{"$nulls":11},{"v":0.589999999999999,"d":"59%"}]
[{"$nulls":11},{"v":0.599999999999999,"d":"60%"}]
[{"$nulls":11},{"v":0.609999999999999,"d":"61%"}]
[{"$nulls":11},{"v":0.619999999999999,"d":"62%"}]
[{"$nulls":11},{"v":0.629999999999999,"d":"63%"}]
[{"$nulls":11},{"v":0.639999999999999,"d":"64%"}]
[{"$nulls":11},{"v":0.649999999999999,"d":"65%"}]
[{"$nulls":11},{"v":0.659999999999999,"d":"66%"}]
[{"$nulls":11},{"v":0.669999999999999,"d":"67%"}]
[{"$nulls":11},{"v":0.679999999999999,"d":"68%"}]
[{"$nulls":11},{"v":0.689999999999999,"d":"69%"}]
[{"$nulls":11},{"v":0.699999999999999,"d":"70%"}]
{"$rows_left_out":21}
{"sheet":"DA ARREAR SHEET","index":1,"n_rows":62,"n_cols":17,"rows_kept":62,"merged":[[0,0,0,10],[1,0,1,7],[1,9,1,10],[2,0,2,10],[3,0,3,10],[55,9,55,10],[56,0,56,7],[62,9,62,10],[63,9,63,10],[64,9,64,10]]}
[{"$f":"'MASTER DATA SHEET'!$A$2","v":"राजकीय उच्च माध्यमिक विद्यालय डसाणा खुर्द (मौलासर),डीडवाना-कुचामन "}]
[{"$f":"\"क्रमांक-\"&'MASTER DATA SHEET'!B4","v":"क्रमांक-राउमावि डसाखु /2024/1"},{"$nulls":7},{"$f":"'MASTER DATA SHEET'!G4","v":"दिनाँक "},{"$f":"'MASTER DATA SHEET'!H4","v":"2024-04-01"}]
["dk;kZy; vkns'k"]
[{"$f":"'MASTER DATA SHEET'!$A$5","v":"                                    राजस्थान सरकार वित्त विभाग के आदेश कर्मांक --NO.F.6(3)FD (Rules)/2017 जयपुर 14.03.2024 के अनुसार महगांईभत्ता (डी.ए.) की दर को संशोधित कर 46 प्रतिशत से बढाकर 50 प्रतिशत किया गया है lइस कारण निम्नाकित कर्मचारियों की महगांई भत्ता दर को पुन: निर्धारित कर अंतर माह जनवरी 24 से फरबरी 24 तक की राशि का वेतन भुगतान स्वीकृति प्रदान की जाती है l"}]
["Sr. No.","Name of Employee","Post","Basic\nJAN-24","Drawn DA","DA to be Drawn","Basic\nFeb-24","Drawn DA","DA to be Drawn","Total Difference DA Amount Credited to GPF / GPF 2004","Net Amount Payble Cash in hand"]
[{"$f":"IF('MASTER DATA SHEET'!A7=\"\",\"\",'MASTER DATA SHEET'!A7)","v":1},{"$f":"IF('MASTER DATA SHEET'!B7=\"\",\"\",'MASTER DATA SHEET'!B7)","v":"BHAGIRATH MAL"},{"$f":"IF('MASTER DATA SHEET'!C7=\"\",\"\",'MASTER DATA SHEET'!C7)","v":"TEACHER L-1"},{"$f":"IF('MASTER DATA SHEET'!E7=0,\"\",'MASTER DATA SHEET'!E7)","v":73200},{"$f":"IFERROR(ROUND(D6*'MASTER DATA SHEET'!F7,0),\"\")","v":33672},{"$f":"IFERROR(ROUND(D6*'MASTER DATA SHEET'!$I7,0),\"\")","v":36600},{"$f":"IF('MASTER DATA SHEET'!G7=0,\"\",'MASTER DATA SHEET'!G7)","v":73200},{"$f":"IFERROR(ROUND(G6*'MASTER DATA SHEET'!H7,0),\"\")","v":33672},{"$f":"IFERROR(ROUND(G6*'MASTER DATA SHEET'!$I7,0),\"\")","v":36600},{"$f":"SUM(O6:P6)","v":{"v":5856,"d":"5856.00"}},{"$f":"SUM(O6:P6)-SUM(J6:J6)","v":{"v":0,"d":"0.00"}},{"$nulls":3},{"$f":"IFERROR(F6-E6,\"\")","v":2928},{"$f":"IFERROR(I6-H6,\"\")","v":2928},{"$f":"IFERROR(SUM(O6:P6),\"\")","v":5856}]
[{"$f":"IF('MASTER DATA SHEET'!A8=\"\",\"\",'MASTER DATA SHEET'!A8)","v":2},{"$f":"IF('MASTER DATA SHEET'!B8=\"\",\"\",'MASTER DATA SHEET'!B8)","v":"A"},{"$f":"IF('MASTER DATA SHEET'!C8=\"\",\"\",'MASTER DATA SHEET'!C8)","v":"SEN.TEACHER"},{"$f":"IF('MASTER DATA SHEET'!E8=0,\"\",'MASTER DATA SHEET'!E8)","v":46500},{"$f":"IFERROR(ROUND(D7*'MASTER DATA SHEET'!F8,0),\"\")","v":21390},{"$f":"IFERROR(ROUND(D7*'MASTER DATA SHEET'!$I8,0),\"\")","v":23250},{"$f":"IF('MASTER DATA SHEET'!G8=0,\"\",'MASTER DATA SHEET'!G8)","v":46500},{"$f":"IFERROR(ROUND(G7*'MASTER DATA SHEET'!H8,0),\"\")","v":21390},{"$f":"IFERROR(ROUND(G7*'MASTER DATA SHEET'!$I8,0),\"\")","v":23250},{"$f":"SUM(O7:P7)","v":{"v":3720,"d":"3720.00"}},{"$f":"SUM(O7:P7)-SUM(J7:J7)","v":{"v":0,"d":"0.00"}},{"$nulls":3},1860,1860,{"$f":"IFERROR(#REF!-#REF!,\"\")","v":""}]
[{"$f":"IF('MASTER DATA SHEET'!A9=\"\",\"\",'MASTER DATA SHEET'!A9)","v":""},{"$f":"IF('MASTER DATA SHEET'!B9=\"\",\"\",'MASTER DATA SHEET'!B9)","v":""},{"$f":"IF('MASTER DATA SHEET'!C9=\"\",\"\",'MASTER DATA SHEET'!C9)","v":""},{"$f":"IF('MASTER DATA SHEET'!E9=0,\"\",'MASTER DATA SHEET'!E9)","v":""},{"$f":"IFERROR(ROUND(D8*'MASTER DATA SHEET'!F9,0),\"\")","v":""},{"$f":"IFERROR(ROUND(D8*'MASTER DATA SHEET'!$I9,0),\"\")","v":""},{"$f":"IF('MASTER DATA SHEET'!G9=0,\"\",'MASTER DATA SHEET'!G9)","v":""},{"$f":"IFERROR(ROUND(G8*'MASTER DATA SHEET'!H9,0),\"\")","v":""},{"$f":"IFERROR(ROUND(G8*'MASTER DATA SHEET'!$I9,0),\"\")","v":""},{"v":0,"d":"0.00"},{"v":0,"d":"0.00"},{"$nulls":3},"","",{"$f":"IFERROR(#REF!-#REF!,\"\")","v":""}]
[{"$f":"IF('MASTER DATA SHEET'!A10=\"\",\"\",'MASTER DATA SHEET'!A10)","v":""},{"$f":"IF('MASTER DATA SHEET'!B10=\"\",\"\",'MASTER DATA SHEET'!B10)","v":""},{"$f":"IF('MASTER DATA SHEET'!C10=\"\",\"\",'MASTER DATA SHEET'!C10)","v":""},{"$f":"IF('MASTER DATA SHEET'!E10=0,\"\",'MASTER DATA SHEET'!E10)","v":""},{"$f":"IFERROR(ROUND(D9*'MASTER DATA SHEET'!F10,0),\"\")","v":""},{"$f":"IFERROR(ROUND(D9*'MASTER DATA SHEET'!$I10,0),\"\")","v":""},{"$f":"IF('MASTER DATA SHEET'!G10=0,\"\",'MASTER DATA SHEET'!G10)","v":""},{"$f":"IFERROR(ROUND(G9*'MASTER DATA SHEET'!H10,0),\"\")","v":""},{"$f":"IFERROR(ROUND(G9*'MASTER DATA SHEET'!$I10,0),\"\")","v":""},{"v":0,"d":"0.00"},{"v":0,"d":"0.00"},{"$nulls":3},"","",{"$f":"IFERROR(#REF!-#REF!,\"\")","v":""}]
[{"$f":"IF('MASTER DATA SHEET'!A11=\"\",\"\",'MASTER DATA SHEET'!A11)","v":""},{"$f":"IF('MASTER DATA SHEET'!B11=\"\",\"\",'MASTER DATA SHEET'!B11)","v":""},{"$f":"IF('MASTER DATA SHEET'!C11=\"\",\"\",'MASTER DATA SHEET'!C11)","v":""},{"$f":"IF('MASTER DATA SHEET'!E11=0,\"\",'MASTER DATA SHEET'!E11)","v":""},{"$f":"IFERROR(ROUND(D10*'MASTER DATA SHEET'!F11,0),\"\")","v":""},{"$f":"IFERROR(ROUND(D10*'MASTER DATA SHEET'!$I11,0),\"\")","v":""},{"$f":"IF('MASTER DATA SHEET'!G11=0,\"\",'MASTER DATA SHEET'!G11)","v":""},{"$f":"IFERROR(ROUND(G10*'MASTER DATA SHEET'!H11,0),\"\")","v":""},{"$f":"IFERROR(ROUND(G10*'MASTER DATA SHEET'!$I11,0),\"\")","v":""},{"v":0,"d":"0.00"},{"v":0,"d":"0.00"},{"$nulls":3},"","",{"$f":"IFERROR(#REF!-#REF!,\"\")","v":""}]
[{"$f":"IF('MASTER DATA SHEET'!A12=\"\",\"\",'MASTER DATA SHEET'!A12)","v":""},{"$f":"IF('MASTER DATA SHEET'!B12=\"\",\"\",'MASTER DATA SHEET'!B12)","v":""},{"$f":"IF('MASTER DATA SHEET'!C12=\"\",\"\",'MASTER DATA SHEET'!C12)","v":""},{"$f":"IF('MASTER DATA SHEET'!E12=0,\"\",'MASTER DATA SHEET'!E12)","v":""},{"$f":"IFERROR(ROUND(D11*'MASTER DATA SHEET'!F12,0),\"\")","v":""},{"$f":"IFERROR(ROUND(D11*'MASTER DATA SHEET'!$I12,0),\"\")","v":""},{"$f":"IF('MASTER DATA SHEET'!G12=0,\"\",'MASTER DATA SHEET'!G12)","v":""},{"$f":"IFERROR(ROUND(G11*'MASTER DATA SHEET'!H12,0),\"\")","v":""},{"$f":"IFERROR(ROUND(G11*'MASTER DATA SHEET'!$I12,0),\"\")","v":""},{"v":0,"d":"0.00"},{"v":0,"d":"0.00"},{"$nulls":3},"","",{"$f":"IFERROR(#REF!-#REF!,\"\")","v":""}]
[{"$f":"IF('MASTER DATA SHEET'!A13=\"\",\"\",'MASTER DATA SHEET'!A13)","v":""},{"$f":"IF('MASTER DATA SHEET'!B13=\"\",\"\",'MASTER DATA SHEET'!B13)","v":""},{"$f":"IF('MASTER DATA SHEET'!C13=\"\",\"\",'MASTER DATA SHEET'!C13)","v":""},{"$f":"IF('MASTER DATA SHEET'!E13=0,\"\",'MASTER DATA SHEET'!E13)","v":""},{"$f":"IFERROR(ROUND(D12*'MASTER DATA SHEET'!F13,0),\"\")","v":""},{"$f":"IFERROR(ROUND(D12*'MASTER DATA SHEET'!$I13,0),\"\")","v":""},{"$f":"IF('MASTER DATA SHEET'!G13=0,\"\",'MASTER DATA SHEET'!G13)","v":""},{"$f":"IFERROR(ROUND(G12*'MASTER DATA SHEET'!H13,0),\"\")","v":""},{"$f":"IFERROR(ROUND(G12*'MASTER DATA SHEET'!$I13,0),\"\")","v":""},{"v":0,"d":"0.00"},{"v":0,"d":"0.00"},{"$nulls":3},"","",{"$f":"IFERROR(#REF!-#REF!,\"\")","v":""}]
[{"$f":"IF('MASTER DATA SHEET'!A14=\"\",\"\",'MASTER DATA SHEET'!A14)","v":""},{"$f":"IF('MASTER DATA SHEET'!B14=\"\",\"\",'MASTER DATA SHEET'!B14)","v":""},{"$f":"IF('MASTER DATA SHEET'!C14=\"\",\"\",'MASTER DATA SHEET'!C14)","v":""},{"$f":"IF('MASTER DATA SHEET'!E14=0,\"\",'MASTER DATA SHEET'!E14)","v":""},{"$f":"IFERROR(ROUND(D13*'MASTER DATA SHEET'!F14,0),\"\")","v":""},{"$f":"IFERROR(ROUND(D13*'MASTER DATA SHEET'!$I14,0),\"\")","v":""},{"$f":"IF('MASTER DATA SHEET'!G14=0,\"\",'MASTER DATA SHEET'!G14)","v":""},{"$f":"IFERROR(ROUND(G13*'MASTER DATA SHEET'!H14,0),\"\")","v":""},{"$f":"IFERROR(ROUND(G13*'MASTER DATA SHEET'!$I14,0),\"\")","v":""},{"v":0,"d":"0.00"},{"v":0,"d":"0.00"},{"$nulls":3},"","",{"$f":"IFERROR(#REF!-#REF!,\"\")","v":""}]
[{"$f":"IF('MASTER DATA SHEET'!A15=\"\",\"\",'MASTER DATA SHEET'!A15)","v":""},{"$f":"IF('MASTER DATA SHEET'!B15=\"\",\"\",'MASTER DATA SHEET'!B15)","v":""},{"$f":"IF('MASTER DATA SHEET'!C15=\"\",\"\",'MASTER DATA SHEET'!C15)","v":""},{"$f":"IF('MASTER DATA SHEET'!E15=0,\"\",'MASTER DATA SHEET'!E15)","v":""},{"$f":"IFERROR(ROUND(D14*'MASTER DATA SHEET'!F15,0),\"\")","v":""},{"$f":"IFERROR(ROUND(D14*'MASTER DATA SHEET'!$I15,0),\"\")","v":""},{"$f":"IF('MASTER DATA SHEET'!G15=0,\"\",'MASTER DATA SHEET'!G15)","v":""},{"$f":"IFERROR(ROUND(G14*'MASTER DATA SHEET'!H15,0),\"\")","v":""},{"$f":"IFERROR(ROUND(G14*'MASTER DATA SHEET'!$I15,0),\"\")","v":""},{"v":0,"d":"0.00"},{"v":0,"d":"0.00"},{"$nulls":3},"","",{"$f":"IFERROR(#REF!-#REF!,\"\")","v":""}]
[{"$f":"IF('MASTER DATA SHEET'!A16=\"\",\"\",'MASTER DATA SHEET'!A16)","v":""},{"$f":"IF('MASTER DATA SHEET'!B16=\"\",\"\",'MASTER DATA SHEET'!B16)","v":""},{"$f":"IF('MASTER DATA SHEET'!C16=\"\",\"\",'MASTER DATA SHEET'!C16)","v":""},{"$f":"IF('MASTER DATA SHEET'!E16=0,\"\",'MASTER DATA SHEET'!E16)","v":""},{"$f":"IFERROR(ROUND(D15*'MASTER DATA SHEET'!F16,0),\"\")","v":""},{"$f":"IFERROR(ROUND(D15*'MASTER DATA SHEET'!$I16,0),\"\")","v":""},{"$f":"IF('MASTER DATA SHEET'!G16=0,\"\",'MASTER DATA SHEET'!G16)","v":""},{"$f":"IFERROR(ROUND(G15*'MASTER DATA SHEET'!H16,0),\"\")","v":""},{"$f":"IFERROR(ROUND(G15*'MASTER DATA SHEET'!$I16,0),\"\")","v":""},{"v":0,"d":"0.00"},{"v":0,"d":"0.00"},{"$nulls":3},"","",{"$f":"IFERROR(#REF!-#REF!,\"\")","v":""}]
[{"$f":"IF('MASTER DATA SHEET'!A17=\"\",\"\",'MASTER DATA SHEET'!A17)","v":""},{"$f":"IF('MASTER DATA SHEET'!B17=\"\",\"\",'MASTER DATA SHEET'!B17)","v":""},{"$f":"IF('MASTER DATA SHEET'!C17=\"\",\"\",'MASTER DATA SHEET'!C17)","v":""},{"$f":"IF('MASTER DATA SHEET'!E17=0,\"\",'MASTER DATA SHEET'!E17)","v":""},{"$f":"IFERROR(ROUND(D16*'MASTER DATA SHEET'!F17,0),\"\")","v":""},{"$f":"IFERROR(ROUND(D16*'MASTER DATA SHEET'!$I17,0),\"\")","v":""},{"$f":"IF('MASTER DATA SHEET'!G17=0,\"\",'MASTER DATA SHEET'!G17)","v":""},{"$f":"IFERROR(ROUND(G16*'MASTER DATA SHEET'!H17,0),\"\")","v":""},{"$f":"IFERROR(ROUND(G16*'MASTER DATA SHEET'!$I17,0),\"\")","v":""},{"v":0,"d":"0.00"},{"v":0,"d":"0.00"},{"$nulls":3},"","",{"$f":"IFERROR(#REF!-#REF!,\"\")","v":""}]
[{"$f":"IF('MASTER DATA SHEET'!A18=\"\",\"\",'MASTER DATA SHEET'!A18)","v":""},{"$f":"IF('MASTER DATA SHEET'!B18=\"\",\"\",'MASTER DATA SHEET'!B18)","v":""},{"$f":"IF('MASTER DATA SHEET'!C18=\"\",\"\",'MASTER DATA SHEET'!C18)","v":""},{"$f":"IF('MASTER DATA SHEET'!E18=0,\"\",'MASTER DATA SHEET'!E18)","v":""},{"$f":"IFERROR(ROUND(D17*'MASTER DATA SHEET'!F18,0),\"\")","v":""},{"$f":"IFERROR(ROUND(D17*'MASTER DATA SHEET'!$I18,0),\"\")","v":""},{"$f":"IF('MASTER DATA SHEET'!G18=0,\"\",'MASTER DATA SHEET'!G18)","v":""},{"$f":"IFERROR(ROUND(G17*'MASTER DATA SHEET'!H18,0),\"\")","v":""},{"$f":"IFERROR(ROUND(G17*'MASTER DATA SHEET'!$I18,0),\"\")","v":""},{"v":0,"d":"0.00"},{"v":0,"d":"0.00"},{"$nulls":3},"","",{"$f":"IFERROR(#REF!-#REF!,\"\")","v":""}]
[{"$f":"IF('MASTER DATA SHEET'!A19=\"\",\"\",'MASTER DATA SHEET'!A19)","v":""},{"$f":"IF('MASTER DATA SHEET'!B19=\"\",\"\",'MASTER DATA SHEET'!B19)","v":""},{"$f":"IF('MASTER DATA SHEET'!C19=\"\",\"\",'MASTER DATA SHEET'!C19)","v":""},{"$f":"IF('MASTER DATA SHEET'!E19=0,\"\",'MASTER DATA SHEET'!E19)","v":""},{"$f":"IFERROR(ROUND(D18*'MASTER DATA SHEET'!F19,0),\"\")","v":""},{"$f":"IFERROR(ROUND(D18*'MASTER DATA SHEET'!$I19,0),\"\")","v":""},{"$f":"IF('MASTER DATA SHEET'!G19=0,\"\",'MASTER DATA SHEET'!G19)","v":""},{"$f":"IFERROR(ROUND(G18*'MASTER DATA SHEET'!H19,0),\"\")","v":""},{"$f":"IFERROR(ROUND(G18*'MASTER DATA SHEET'!$I19,0),\"\")","v":""},{"v":0,"d":"0.00"},{"v":0,"d":"0.00"},{"$nulls":3},"","",{"$f":"IFERROR(#REF!-#REF!,\"\")","v":""}]
[{"$f":"IF('MASTER DATA SHEET'!A20=\"\",\"\",'MASTER DATA SHEET'!A20)","v":""},{"$f":"IF('MASTER DATA SHEET'!B20=\"\",\"\",'MASTER DATA SHEET'!B20)","v":""},{"$f":"IF('MASTER DATA SHEET'!C20=\"\",\"\",'MASTER DATA SHEET'!C20)","v":""},{"$f":"IF('MASTER DATA SHEET'!E20=0,\"\",'MASTER DATA SHEET'!E20)","v":""},{"$f":"IFERROR(ROUND(D19*'MASTER DATA SHEET'!F20,0),\"\")","v":""},{"$f":"IFERROR(ROUND(D19*'MASTER DATA SHEET'!$I20,0),\"\")","v":""},{"$f":"IF('MASTER DATA SHEET'!G20=0,\"\",'MASTER DATA SHEET'!G20)","v":""},{"$f":"IFERROR(ROUND(G19*'MASTER DATA SHEET'!H20,0),\"\")","v":""},{"$f":"IFERROR(ROUND(G19*'MASTER DATA SHEET'!$I20,0),\"\")","v":""},{"v":0,"d":"0.00"},{"v":0,"d":"0.00"},{"$nulls":3},"","",{"$f":"IFERROR(#REF!-#REF!,\"\")","v":""}]
[{"$f":"IF('MASTER DATA SHEET'!A21=\"\",\"\",'MASTER DATA SHEET'!A21)","v":""},{"$f":"IF('MASTER DATA SHEET'!B21=\"\",\"\",'MASTER DATA SHEET'!B21)","v":""},{"$f":"IF('MASTER DATA SHEET'!C21=\"\",\"\",'MASTER DATA SHEET'!C21)","v":""},{"$f":"IF('MASTER DATA SHEET'!E21=0,\"\",'MASTER DATA SHEET'!E21)","v":""},{"$f":"IFERROR(ROUND(D20*'MASTER DATA SHEET'!F21,0),\"\")","v":""},{"$f":"IFERROR(ROUND(D20*'MASTER DATA SHEET'!$I21,0),\"\")","v":""},{"$f":"IF('MASTER DATA SHEET'!G21=0,\"\",'MASTER DATA SHEET'!G21)","v":""},{"$f":"IFERROR(ROUND(G20*'MASTER DATA SHEET'!H21,0),\"\")","v":""},{"$f":"IFERROR(ROUND(G20*'MASTER DATA SHEET'!$I21,0),\"\")","v":""},{"v":0,"d":"0.00"},{"v":0,"d":"0.00"},{"$nulls":3},"","",{"$f":"IFERROR(#REF!-#REF!,\"\")","v":""}]
[{"$f":"IF('MASTER DATA SHEET'!A22=\"\",\"\",'MASTER DATA SHEET'!A22)","v":""},{"$f":"IF('MASTER DATA SHEET'!B22=\"\",\"\",'MASTER DATA SHEET'!B22)","v":""},{"$f":"IF('MASTER DATA SHEET'!C22=\"\",\"\",'MASTER DATA SHEET'!C22)","v":""},{"$f":"IF('MASTER DATA SHEET'!E22=0,\"\",'MASTER DATA SHEET'!E22)","v":""},{"$f":"IFERROR(ROUND(D21*'MASTER DATA SHEET'!F22,0),\"\")","v":""},{"$f":"IFERROR(ROUND(D21*'MASTER DATA SHEET'!$I22,0),\"\")","v":""},{"$f":"IF('MASTER DATA SHEET'!G22=0,\"\",'MASTER DATA SHEET'!G22)","v":""},{"$f":"IFERROR(ROUND(G21*'MASTER DATA SHEET'!H22,0),\"\")","v":""},{"$f":"IFERROR(ROUND(G21*'MASTER DATA SHEET'!$I22,0),\"\")","v":""},{"v":0,"d":"0.00"},{"v":0,"d":"0.00"},{"$nulls":3},"","",{"$f":"IFERROR(#REF!-#REF!,\"\")","v":""}]
[{"$f":"IF('MASTER DATA SHEET'!A23=\"\",\"\",'MASTER DATA SHEET'!A23)","v":""},{"$f":"IF('MASTER DATA SHEET'!B23=\"\",\"\",'MASTER DATA SHEET'!B23)","v":""},{"$f":"IF('MASTER DATA SHEET'!C23=\"\",\"\",'MASTER DATA SHEET'!C23)","v":""},{"$f":"IF('MASTER DATA SHEET'!E23=0,\"\",'MASTER DATA SHEET'!E23)","v":""},{"$f":"IFERROR(ROUND(D22*'MASTER DATA SHEET'!F23,0),\"\")","v":""},{"$f":"IFERROR(ROUND(D22*'MASTER DATA SHEET'!$I23,0),\"\")","v":""},{"$f":"IF('MASTER DATA SHEET'!G23=0,\"\",'MASTER DATA SHEET'!G23)","v":""},{"$f":"IFERROR(ROUND(G22*'MASTER DATA SHEET'!H23,0),\"\")","v":""},{"$f":"IFERROR(ROUND(G22*'MASTER DATA SHEET'!$I23,0),\"\")","v":""},{"v":0,"d":"0.00"},{"v":0,"d":"0.00"},{"$nulls":3},"","",{"$f":"IFERROR(#REF!-#REF!,\"\")","v":""}]
[{"$f":"IF('MASTER DATA SHEET'!A24=\"\",\"\",'MASTER DATA SHEET'!A24)","v":""},{"$f":"IF('MASTER DATA SHEET'!B24=\"\",\"\",'MASTER DATA SHEET'!B24)","v":""},{"$f":"IF('MASTER DATA SHEET'!C24=\"\",\"\",'MASTER DATA SHEET'!C24)","v":""},{"$f":"IF('MASTER DATA SHEET'!E24=0,\"\",'MASTER DATA SHEET'!E24)","v":""},{"$f":"IFERROR(ROUND(D23*'MASTER DATA SHEET'!F24,0),\"\")","v":""},{"$f":"IFERROR(ROUND(D23*'MASTER DATA SHEET'!$I24,0),\"\")","v":""},{"$f":"IF('MASTER DATA SHEET'!G24=0,\"\",'MASTER DATA SHEET'!G24)","v":""},{"$f":"IFERROR(ROUND(G23*'MASTER DATA SHEET'!H24,0),\"\")","v":""},{"$f":"IFERROR(ROUND(G23*'MASTER DATA SHEET'!$I24,0),\"\")","v":""},{"v":0,"d":"0.00"},{"v":0,"d":"0.00"},{"$nulls":3},"","",{"$f":"IFERROR(#REF!-#REF!,\"\")","v":""}]
[{"$f":"IF('MASTER DATA SHEET'!A25=\"\",\"\",'MASTER DATA SHEET'!A25)","v":""},{"$f":"IF('MASTER DATA SHEET'!B25=\"\",\"\",'MASTER DATA SHEET'!B25)","v":""},{"$f":"IF('MASTER DATA SHEET'!C25=\"\",\"\",'MASTER DATA SHEET'!C25)","v":""},{"$f":"IF('MASTER DATA SHEET'!E25=0,\"\",'MASTER DATA SHEET'!E25)","v":""},{"$f":"IFERROR(ROUND(D24*'MASTER DATA SHEET'!F25,0),\"\")","v":""},{"$f":"IFERROR(ROUND(D24*'MASTER DATA SHEET'!$I25,0),\"\")","v":""},{"$f":"IF('MASTER DATA SHEET'!G25=0,\"\",'MASTER DATA SHEET'!G25)","v":""},{"$f":"IFERROR(ROUND(G24*'MASTER DATA SHEET'!H25,0),\"\")","v":""},{"$f":"IFERROR(ROUND(G24*'MASTER DATA SHEET'!$I25,0),\"\")","v":""},{"v":0,"d":"0.00"},{"v":0,"d":"0.00"},{"$nulls":3},"","",{"$f":"IFERROR(#REF!-#REF!,\"\")","v":""}]
[{"$f":"IF('MASTER DATA SHEET'!A26=\"\",\"\",'MASTER DATA SHEET'!A26)","v":""},{"$f":"IF('MASTER DATA SHEET'!B26=\"\",\"\",'MASTER DATA SHEET'!B26)","v":""},{"$f":"IF('MASTER DATA SHEET'!C26=\"\",\"\",'MASTER DATA SHEET'!C26)","v":""},{"$f":"IF('MASTER DATA SHEET'!E26=0,\"\",'MASTER DATA SHEET'!E26)","v":""},{"$f":"IFERROR(ROUND(D25*'MASTER DATA SHEET'!F26,0),\"\")","v":""},{"$f":"IFERROR(ROUND(D25*'MASTER DATA SHEET'!$I26,0),\"\")","v":""},{"$f":"IF('MASTER DATA SHEET'!G26=0,\"\",'MASTER DATA SHEET'!G26)","v":""},{"$f":"IFERROR(ROUND(G25*'MASTER DATA SHEET'!H26,0),\"\")","v":""},{"$f":"IFERROR(ROUND(G25*'MASTER DATA SHEET'!$I26,0),\"\")","v":""},{"v":0,"d":"0.00"},{"v":0,"d":"0.00"},{"$nulls":3},"","",{"$f":"IFERROR(#REF!-#REF!,\"\")","v":""}]
[{"$f":"IF('MASTER DATA SHEET'!A27=\"\",\"\",'MASTER DATA SHEET'!A27)","v":""},{"$f":"IF('MASTER DATA SHEET'!B27=\"\",\"\",'MASTER DATA SHEET'!B27)","v":""},{"$f":"IF('MASTER DATA SHEET'!C27=\"\",\"\",'MASTER DATA SHEET'!C27)","v":""},{"$f":"IF('MASTER DATA SHEET'!E27=0,\"\",'MASTER DATA SHEET'!E27)","v":""},{"$f":"IFERROR(ROUND(D26*'MASTER DATA SHEET'!F27,0),\"\")","v":""},{"$f":"IFERROR(ROUND(D26*'MASTER DATA SHEET'!$I27,0),\"\")","v":""},{"$f":"IF('MASTER DATA SHEET'!G27=0,\"\",'MASTER DATA SHEET'!G27)","v":""},{"$f":"IFERROR(ROUND(G26*'MASTER DATA SHEET'!H27,0),\"\")","v":""},{"$f":"IFERROR(ROUND(G26*'MASTER DATA SHEET'!$I27,0),\"\")","v":""},{"v":0,"d":"0.00"},{"v":0,"d":"0.00"},{"$nulls":3},"","",{"$f":"IFERROR(#REF!-#REF!,\"\")","v":""}]
[{"$f":"IF('MASTER DATA SHEET'!A28=\"\",\"\",'MASTER DATA SHEET'!A28)","v":""},{"$f":"IF('MASTER DATA SHEET'!B28=\"\",\"\",'MASTER DATA SHEET'!B28)","v":""},{"$f":"IF('MASTER DATA SHEET'!C28=\"\",\"\",'MASTER DATA SHEET'!C28)","v":""},{"$f":"IF('MASTER DATA SHEET'!E28=0,\"\",'MASTER DATA SHEET'!E28)","v":""},{"$f":"IFERROR(ROUND(D27*'MASTER DATA SHEET'!F28,0),\"\")","v":""},{"$f":"IFERROR(ROUND(D27*'MASTER DATA SHEET'!$I28,0),\"\")","v":""},{"$f":"IF('MASTER DATA SHEET'!G28=0,\"\",'MASTER DATA SHEET'!G28)","v":""},{"$f":"IFERROR(ROUND(G27*'MASTER DATA SHEET'!H28,0),\"\")","v":""},{"$f":"IFERROR(ROUND(G27*'MASTER DATA SHEET'!$I28,0),\"\")","v":""},{"v":0,"d":"0.00"},{"v":0,"d":"0.00"},{"$nulls":3},"","",{"$f":"IFERROR(#REF!-#REF!,\"\")","v":""}]
[{"$f":"IF('MASTER DATA SHEET'!A29=\"\",\"\",'MASTER DATA SHEET'!A29)","v":""},{"$f":"IF('MASTER DATA SHEET'!B29=\"\",\"\",'MASTER DATA SHEET'!B29)","v":""},{"$f":"IF('MASTER DATA SHEET'!C29=\"\",\"\",'MASTER DATA SHEET'!C29)","v":""},{"$f":"IF('MASTER DATA SHEET'!E29=0,\"\",'MASTER DATA SHEET'!E29)","v":""},{"$f":"IFERROR(ROUND(D28*'MASTER DATA SHEET'!F29,0),\"\")","v":""},{"$f":"IFERROR(ROUND(D28*'MASTER DATA SHEET'!$I29,0),\"\")","v":""},{"$f":"IF('MASTER DATA SHEET'!G29=0,\"\",'MASTER DATA SHEET'!G29)","v":""},{"$f":"IFERROR(ROUND(G28*'MASTER DATA SHEET'!H29,0),\"\")","v":""},{"$f":"IFERROR(ROUND(G28*'MASTER DATA SHEET'!$I29,0),\"\")","v":""},{"v":0,"d":"0.00"},{"v":0,"d":"0.00"},{"$nulls":3},"","",{"$f":"IFERROR(#REF!-#REF!,\"\")","v":""}]
[{"$f":"IF('MASTER DATA SHEET'!A30=\"\",\"\",'MASTER DATA SHEET'!A30)","v":""},{"$f":"IF('MASTER DATA SHEET'!B30=\"\",\"\",'MASTER DATA SHEET'!B30)","v":""},{"$f":"IF('MASTER DATA SHEET'!C30=\"\",\"\",'MASTER DATA SHEET'!C30)","v":""},{"$f":"IF('MASTER DATA SHEET'!E30=0,\"\",'MASTER DATA SHEET'!E30)","v":""},{"$f":"IFERROR(ROUND(D29*'MASTER DATA SHEET'!F30,0),\"\")","v":""},{"$f":"IFERROR(ROUND(D29*'MASTER DATA SHEET'!$I30,0),\"\")","v":""},{"$f":"IF('MASTER DATA SHEET'!G30=0,\"\",'MASTER DATA SHEET'!G30)","v":""},{"$f":"IFERROR(ROUND(G29*'MASTER DATA SHEET'!H30,0),\"\")","v":""},{"$f":"IFERROR(ROUND(G29*'MASTER DATA SHEET'!$I30,0),\"\")","v":""},{"v":0,"d":"0.00"},{"v":0,"d":"0.00"},{"$nulls":3},"","",{"$f":"IFERROR(#REF!-#REF!,\"\")","v":""}]
[{"$f":"IF('MASTER DATA SHEET'!A31=\"\",\"\",'MASTER DATA SHEET'!A31)","v":""},{"$f":"IF('MASTER DATA SHEET'!B31=\"\",\"\",'MASTER DATA SHEET'!B31)","v":""},{"$f":"IF('MASTER DATA SHEET'!C31=\"\",\"\",'MASTER DATA SHEET'!C31)","v":""},{"$f":"IF('MASTER DATA SHEET'!E31=0,\"\",'MASTER DATA SHEET'!E31)","v":""},{"$f":"IFERROR(ROUND(D30*'MASTER DATA SHEET'!F31,0),\"\")","v":""},{"$f":"IFERROR(ROUND(D30*'MASTER DATA SHEET'!$I31,0),\"\")","v":""},{"$f":"IF('MASTER DATA SHEET'!G31=0,\"\",'MASTER DATA SHEET'!G31)","v":""},{"$f":"IFERROR(ROUND(G30*'MASTER DATA SHEET'!H31,0),\"\")","v":""},{"$f":"IFERROR(ROUND(G30*'MASTER DATA SHEET'!$I31,0),\"\")","v":""},{"v":0,"d":"0.00"},{"v":0,"d":"0.00"},{"$nulls":3},"","",{"$f":"IFERROR(#REF!-#REF!,\"\")","v":""}]
{"$rows_left_out":32}