{"text_format":"3","workbook":"xlsx","n_sheets":5,"sheets":["Info","Deta From Shala Dar. Class-12","Deta From Shala Dar. Class-10","Sr. Sec. Form","Sec. Form "],"not_rendered":{"images":2,"defined_names":2},"read":"whole","date_system":"1900"}

{"sheet":"Info","index":0,"n_rows":11,"n_cols":11,"rows_kept":11,"merged":[[0,0,0,11],[1,0,4,0],[1,1,1,10],[1,11,4,11],[2,1,2,8],[3,1,3,5],[3,6,3,8],[3,9,4,9],[4,1,4,8],[5,2,5,8],[6,2,6,8],[7,2,7,8],[8,2,8,8],[10,1,10,10],[11,1,11,11]]}
[]
[null,"Updated On : 25-08-2023"]
[null,"Sheet Unlprotect Pw-Board",{"$nulls":8},"Programmer"]
[null,"              Youtube Help Video  ☞            (Please subscribe my channel)"]
[]
[null,"Year :-",2024]
[null,"School Name :-","Govt. Sr. Sec. School Raimalwada"]
[null,"School Medium :-","Hindi"]
[null,"Shala Darpan Code :-",12345,{"$nulls":7},"UMMED TARAD "]
[null,"R.B.S.E. Board Code :-",1,7,0,1,7,5,1,null,"Email id-ummedtrdedu@gmail.com"]
[null,"नोट:- हालाँकि यह प्रोग्राम पूर्ण सावधानी से बनाया गया है, फिर भी किसी प्रकार की त्रुटी की स्थिति में आपके विवेक का इस्तेमाल करें l इसे अंतिम रूप देने से पहले इसे भली-भांति रूप अवश्य जाँच लेवेंl\nDevLys 010 Font Compulsory installed"]

{"sheet":"Deta From Shala Dar. Class-12","index":1,"n_rows":201,"n_cols":31,"rows_kept":201}
["Sr. No.","Class","Section","SRNO","DOA","Name","Late Status","FatherName","MotherName","Gender","Dob","ClassRollNo","ExamRollNumber","School Total Working Days","Student Total Attendence","Category","Religion","Previous Year Marks","Name Of School","School UDise Code","Aadhar No of Student","Bhamashash Card","Mobile No Student(Father/Mother/Guardian","Student Permanent Address","Annual Parental Income","CWSN Status","BPL Status","Minority Status","Age On Present(In Years)","Co-Curricular Activity","Distance From School"]
[1]
[2]
[3]
[4]
[5]
[6]
[7]
[8]
[9]
[10]
[11]
[12]
[13]
[14]
[15]
[16]
[17]
[18]
[19]
[20]
[21]
[22]
[23]
[24]
[25]
[26]
[27]
[28]
[29]
[30]
[31]
[32]
[33]
[34]
[35]
[36]
[37]
[38]
[39]
[40]
[41]
[42]
[43]
[44]
[45]
[46]
[47]
[48]
[49]
[50]
[51]
[52]
[53]
[54]
[55]
[56]
[57]
[58]
[59]
[60]
[61]
[62]
[63]
[64]
[65]
[66]
[67]
[68]
[69]
[70]
[71]
[72]
[73]
[74]
[75]
[76]
[77]
[78]
[79]
[80]
[81]
[82]
[83]
[84]
[85]
[86]
[87]
[88]
[89]
[90]
[91]
[92]
[93]
[94]
[95]
[96]
[97]
[98]
[99]
[100]
[101]
[102]
[103]
[104]
[105]
[106]
[107]
[108]
[109]
[110]
[111]
[112]
[113]
[114]
[115]
[116]
[117]
[118]
[119]
[120]
[121]
[122]
[123]
[124]
[125]
[126]
[127]
[128]
[129]
[130]
[131]
[132]
[133]
[134]
[135]
[136]
[137]
[138]
[139]
[140]
[141]
[142]
[143]
[144]
[145]
[146]
[147]
[148]
[149]
[150]
[151]
[152]
[153]
[154]
[155]
[156]
[157]
[158]
[159]
[160]
[161]
[162]
[163]
[164]
[165]
[166]
[167]
[168]
[169]
[170]
[171]
[172]
[173]
[174]
[175]
[176]
[177]
[178]
[179]
[180]
[181]
[182]
[183]
[184]
[185]
[186]
[187]
[188]
[189]
[190]
[191]
[192]
[193]
[194]
[195]
[196]
[197]
[198]
[199]
[200]

{"sheet":"Deta From Shala Dar. Class-10","index":2,"n_rows":201,"n_cols":31,"rows_kept":201}
["Sr. No.","Class","Section","SRNO","DOA","Name","Late Status","FatherName","MotherName","Gender","Dob","ClassRollNo","ExamRollNumber","School Total Working Days","Student Total Attendence","Category","Religion","Previous Year Marks","Name Of School","School UDise Code","Aadhar No of Student","Bhamashash Card","Mobile No Student(Father/Mother/Guardian","Student Permanent Address","Annual Parental Income","CWSN Status","BPL Status","Minority Status","Age On Present(In Years)","Co-Curricular Activity","Distance From School"]
[1]
[2]
[3]
[4]
[5]
[6]
[7]
[8]
[9]
[10]
[11]
[12]
[13]
[14]
[15]
[16]
[17]
[18]
[19]
[20]
[21]
[22]
[23]
[24]
[25]
[26]
[27]
[28]
[29]
[30]
[31]
[32]
[33]
[34]
[35]
[36]
[37]
[38]
[39]
[40]
[41]
[42]
[43]
[44]
[45]
[46]
[47]
[48]
[49]
[50]
[51]
[52]
[53]
[54]
[55]
[56]
[57]
[58]
[59]
[60]
[61]
[62]
[63]
[64]
[65]
[66]
[67]
[68]
[69]
[70]
[71]
[72]
[73]
[74]
[75]
[76]
[77]
[78]
[79]
[80]
[81]
[82]
[83]
[84]
[85]
[86]
[87]
[88]
[89]
[90]
[91]
[92]
[93]
[94]
[95]
[96]
[97]
[98]
[99]
[100]
[101]
[102]
[103]
[104]
[105]
[106]
[107]
[108]
[109]
[110]
[111]
[112]
[113]
[114]
[115]
[116]
[117]
[118]
[119]
[120]
[121]
[122]
[123]
[124]
[125]
[126]
[127]
[128]
[129]
[130]
[131]
[132]
[133]
[134]
[135]
[136]
[137]
[138]
[139]
[140]
[141]
[142]
[143]
[144]
[145]
[146]
[147]
[148]
[149]
[150]
[151]
[152]
[153]
[154]
[155]
[156]
[157]
[158]
[159]
[160]
[161]
[162]
[163]
[164]
[165]
[166]
[167]
[168]
[169]
[170]
[171]
[172]
[173]
[174]
[175]
[176]
[177]
[178]
[179]
[180]
[181]
[182]
[183]
[184]
[185]
[186]
[187]
[188]
[189]
[190]
[191]
[192]
[193]
[194]
[195]
[196]
[197]
[198]
[199]
[200]

{"sheet":"Sr. Sec. Form","index":3,"n_rows":2040,"n_cols":24,"rows_kept":2040,"merged":[[0,0,0,9],[0,10,0,13],[0,14,0,15],[0,16,0,20],[1,0,102,0],[1,1,1,20],[1607,1,1607,19],[1611,1,1611,19],[1612,1,1612,3],[1612,4,1612,5],[1612,6,1612,8],[1612,9,1612,11],[1612,12,1612,19],[1613,1,1613,3],[1613,4,1613,5],[1613,6,1613,8],[1613,9,1613,11],[1613,12,1613,19],[1614,1,1614,3],[1614,4,1614,5],[1614,6,1614,8],[1614,9,1614,11],[1614,12,1614,19],[1615,1,1615,3],[1615,4,1615,5],[1615,6,1615,8],[1615,9,1615,11],[1615,12,1615,19],[1616,1,1616,19],[1617,1,1617,11],[1617,12,1617,14],[1617,15,1617,16],[1617,17,1617,19],[1618,1,1618,19],[1619,2,1619,11],[1619,12,1619,19],[1620,1,1620,9],[1620,10,1620,19],[1621,1,1628,2],[1621,3,1628,6],[1621,7,1628,9],[1621,10,1629,10],[1621,11,1624,18],[1621,19,1629,19],[1625,11,1625,18],[1626,11,1629,18],[1629,1,1629,9],[1630,1,1630,19],[1631,1,1631,3],[1631,4,1631,10],[1631,11,1631,12],[1632,1,1632,20],[1633,0,1633,20],[1634,0,1734,0],[1634,1,1634,19],[1634,20,1733,20],[1635,1,1636,2],[1635,3,1635,15],[1635,16,1635,19],[1636,3,1636,15],[1636,16,1636,19],[1637,1,1638,4],[1637,5,1637,12],[1638,5,1638,15],[1639,1,1639,12],[1639,13,1639,16],[1639,17,1639,19],[1640,1,1640,6],[1640,7,1640,9],[1640,10,1640,19],[1641,1,1641,6],[1641,7,1641,19],[1642,1,1642,6],[1642,7,1642,19],[1643,1,1643,6],[1643,7,1643,19],[1644,1,1644,9],[1644,10,1644,15],[1644,16,1644,17],[1644,18,1644,19],[1645,1,1645,19],[1646,1,1646,19],[1647,1,1647,19],[1648,3,1648,5],[1648,7,1648,10],[1648,11,1651,11],[1648,13,1648,15],[1648,17,1648,19],[1649,2,1649,5],[1649,6,1649,9],[1649,12,1649,14],[1649,16,1649,18],[1650,2,1650,5],[1650,6,1650,9],[1650,12,1650,14],[1650,16,1650,18],[1651,2,1651,5],[1651,6,1651,9],[1651,12,1651,14],[1651,16,1651,18],[1652,1,1652,19],[1653,1,1653,19],[1654,1,1654,19],[1655,1,1655,10],[1655,11,1659,11],[1655,13,1655,14],[1655,16,1655,18],[1656,3,1656,5],[1656,8,1656,10],[1656,13,1656,14],[1656,16,1656,18],[1657,2,1659,10],[1657,13,1657,14],[1657,16,1657,18],[1658,13,1658,14],[1658,16,1658,18],[1659,12,1659,15],[1659,16,1659,18],[1660,1,1660,19],[1661,1,1661,19],[1662,1,1662,10],[1663,1,1663,10],[1663,13,1663,14],[1663,16,1663,18],[1664,3,1664,5],[1664,8,1664,10],[1664,13,1664,14],[1664,16,1664,18],[1665,3,1665,10],[1665,13,1665,14],[1665,16,1665,18],[1666,3,1666,10],[1666,13,1666,14],[1666,16,1666,18],[1667,1,1667,10],[1667,16,1667,18],[1668,1,1668,19],[1669,3,1669,11],[1670,1,1670,19],[1671,2,1671,5],[1671,7,1671,9],[1671,11,1671,14],[1671,16,1671,18],[1672,1,1672,19],[1673,2,1673,5],[1673,7,1673,8],[1673,10,1673,11],[1673,13,1673,14],[1673,16,1673,18],[1674,1,1674,19],[1675,2,1675,3],[1675,5,1675,8],[1675,10,1675,12],[1675,14,1675,15],[1675,17,1675,18],[1676,1,1676,19],[1677,1,1677,19],[1678,2,1678,5],[1678,7,1678,8],[1678,10,1678,11],[1678,13,1678,14],[1678,16,1678,18],[1679,1,1679,19],[1680,2,1680,3],[1680,5,1680,7],[1680,9,1680,11],[1680,13,1680,14],[1680,16,1680,18],[1681,1,1681,19],[1682,2,1682,4],[1682,6,1682,8],[1682,10,1682,12],[1682,14,1682,16],[1683,1,1683,19],[1684,2,1684,8],[1684,9,1684,13],[1684,15,1684,19],[1685,2,1685,19],[1686,2,1686,4],[1686,6,1686,8],[1686,10,1686,12],[1686,14,1686,15],[1686,17,1686,18],[1687,1,1687,19],[1688,2,1688,5],[1688,7,1688,11],[1688,13,1688,18],[1689,1,1689,19],[1690,2,1690,4],[1690,6,1690,8],[1690,10,1690,12],[1690,14,1690,19],[1691,1,1691,19],[1692,2,1692,6],[1692,7,1692,8],[1692,10,1692,11],[1692,12,1692,13],[1692,15,1692,19],[1693,1,1693,19],[1694,2,1694,6],[1694,7,1694,8],[1694,10,1694,11],[1694,12,1694,13],[1694,15,1694,19],[1695,1,1695,19],[1696,2,1696,6],[1696,7,1696,8],[1696,10,1696,11],[1696,12,1696,13],[1696,15,1696,19],[1697,1,1697,19],[1698,2,1698,4],[1698,5,1698,7],[1698,9,1698,12],[1698,14,1698,18],[1699,1,1699,19],[1700,5,1700,7],[1700,9,1700,12],[1700,14,1700,18],[1701,1,1701,19],[1702,1,1702,19],[1703,2,1703,19],[1704,2,1704,9],[1704,10,1705,19],[1705,2,1705,9],[1706,2,1706,4],[1706,5,1706,7],[1706,8,1706,10],[1706,11,1706,14],[1706,15,1706,17],[1706,18,1706,19],[1707,1,1707,19],[1708,2,1708,5],[1708,6,1708,9],[1708,10,1708,11],[1708,12,1708,14],[1708,15,1708,17],[1708,18,1708,19],[1709,1,1709,19],[1710,2,1710,11],[1710,12,1710,19],[1711,1,1711,19],[1712,2,1712,11],[1712,12,1712,19],[1713,1,1713,19],[1714,1,1714,3],[1714,4,1714,5],[1714,6,1714,8],[1714,9,1714,11],[1714,12,1714,19],[1715,1,1715,3],[1715,4,1715,5],[1715,6,1715,8],[1715,9,1715,11],[1715,12,1715,19],[1716,1,1716,3],[1716,4,1716,5],[1716,6,1716,8],[1716,9,1716,11],[1716,12,1716,19],[1717,1,1717,3],[1717,4,1717,5],[1717,6,1717,8],[1717,9,1717,11],[1717,12,1717,19],[1718,1,1718,19],[1719,1,1719,11],[1719,12,1719,14],[1719,15,1719,16],[1719,17,1719,19],[1720,1,1720,19],[1721,2,1721,11],[1721,12,1721,19],[1722,1,1722,9],[1722,10,1722,19],[1723,1,1730,2],[1723,3,1730,6],[1723,7,1730,9],[1723,10,1731,10],[1723,11,1726,18],[1723,19,1731,19],[1727,11,1727,18],[1728,11,1731,18],[1731,1,1731,9],[1732,1,1732,19],[1733,1,1733,3],[1733,4,1733,10],[1733,11,1733,12],[1734,1,1734,20],[1735,0,1735,20],[1736,0,1836,0],[1736,1,1736,19],[1736,20,1835,20],[1737,1,1738,2],[1737,3,1737,15],[1737,16,1737,19],[1738,3,1738,15],[1738,16,1738,19],[1739,1,1740,4],[1739,5,1739,12],[1740,5,1740,15],[1741,1,1741,12],[1741,13,1741,16],[1741,17,1741,19],[1742,1,1742,6],[1742,7,1742,9],[1742,10,1742,19],[1743,1,1743,6],[1743,7,1743,19],[1744,1,1744,6],[1744,7,1744,19],[1745,1,1745,6],[1745,7,1745,19],[1746,1,1746,9],[1746,10,1746,15],[1746,16,1746,17],[1746,18,1746,19],[1747,1,1747,19],[1748,1,1748,19],[1749,1,1749,19],[1750,3,1750,5],[1750,7,1750,10],[1750,11,1753,11],[1750,13,1750,15],[1750,17,1750,19],[1751,2,1751,5],[1751,6,1751,9],[1751,12,1751,14],[1751,16,1751,18],[1752,2,1752,5],[1752,6,1752,9],[1752,12,1752,14],[1752,16,1752,18],[1753,2,1753,5],[1753,6,1753,9],[1753,12,1753,14],[1753,16,1753,18],[1754,1,1754,19],[1755,1,1755,19],[1756,1,1756,19],[1757,1,1757,10],[1757,11,1761,11],[1757,13,1757,14],[1757,16,1757,18],[1758,3,1758,5],[1758,8,1758,10],[1758,13,1758,14],[1758,16,1758,18],[1759,2,1761,10],[1759,13,1759,14],[1759,16,1759,18],[1760,13,1760,14],[1760,16,1760,18],[1761,12,1761,15],[1761,16,1761,18],[1762,1,1762,19],[1763,1,1763,19],[1764,1,1764,10],[1765,1,1765,10],[1765,13,1765,14],[1765,16,1765,18],[1766,3,1766,5],[1766,8,1766,10],[1766,13,1766,14],[1766,16,1766,18],[1767,3,1767,10],[1767,13,1767,14],[1767,16,1767,18],[1768,3,1768,10],[1768,13,1768,14],[1768,16,1768,18],[1769,1,1769,10],[1769,16,1769,18],[1770,1,1770,19],[1771,3,1771,11],[1772,1,1772,19],[1773,2,1773,5],[1773,7,1773,9],[1773,11,1773,14],[1773,16,1773,18],[1774,1,1774,19],[1775,2,1775,5],[1775,7,1775,8],[1775,10,1775,11],[1775,13,1775,14],[1775,16,1775,18],[1776,1,1776,19],[1777,2,1777,3],[1777,5,1777,8],[1777,10,1777,12],[1777,14,1777,15],[1777,17,1777,18],[1778,1,1778,19],[1779,1,1779,19],[1780,2,1780,5],[1780,7,1780,8],[1780,10,1780,11],[1780,13,1780,14],[1780,16,1780,18],[1781,1,1781,19],[1782,2,1782,3],[1782,5,1782,7],[1782,9,1782,11],[1782,13,1782,14],[1782,16,1782,18],[1783,1,1783,19],[1784,2,1784,4],[1784,6,1784,8],[1784,10,1784,12],[1784,14,1784,16],[1785,1,1785,19],[1786,2,1786,8],[1786,9,1786,13],[1786,15,1786,19],[1787,2,1787,19],[1788,2,1788,4],[1788,6,1788,8],[1788,10,1788,12],[1788,14,1788,15],[1788,17,1788,18],[1789,1,1789,19],[1790,2,1790,5],[1790,7,1790,11],[1790,13,1790,18],[1791,1,1791,19],[1792,2,1792,4],[1792,6,1792,8],[1792,10,1792,12],[1792,14,1792,19],[1793,1,1793,19],[1794,2,1794,6],[1794,7,1794,8],[1794,10,1794,11],[1794,12,1794,13],[1794,15,1794,19],[1795,1,1795,19],[1796,2,1796,6],[1796,7,1796,8],[1796,10,1796,11],[1796,12,1796,13],[1796,15,1796,19],[1797,1,1797,19],[1798,2,1798,6],[1798,7,1798,8],[1798,10,1798,11],[1798,12,1798,13],[1798,15,1798,19],[1799,1,1799,19],[1800,2,1800,4],[1800,5,1800,7],[1800,9,1800,12],[1800,14,1800,18],[1801,1,1801,19],[1802,5,1802,7],[1802,9,1802,12],[1802,14,1802,18],[1803,1,1803,19],[1804,1,1804,19],[1805,2,1805,19],[1806,2,1806,9],[1806,10,1807,19],[1807,2,1807,9],[1808,2,1808,4],[1808,5,1808,7],[1808,8,1808,10],[1808,11,1808,14],[1808,15,1808,17],[1808,18,1808,19],[1809,1,1809,19],[1810,2,1810,5],[1810,6,1810,9],[1810,10,1810,11],[1810,12,1810,14],[1810,15,1810,17],[1810,18,1810,19],[1811,1,1811,19],[1812,2,1812,11],[1812,12,1812,19],[1813,1,1813,19],[1814,2,1814,11],[1814,12,1814,19],[1815,1,1815,19],[1816,1,1816,3],[1816,4,1816,5],[1816,6,1816,8],[1816,9,1816,11],[1816,12,1816,19],[1817,1,1817,3],[1817,4,1817,5],[1817,6,1817,8],[1817,9,1817,11],[1817,12,1817,19],[1818,1,1818,3],[1818,4,1818,5],[1818,6,1818,8],[1818,9,1818,11],[1818,12,1818,19],[1819,1,1819,3],[1819,4,1819,5],[1819,6,1819,8],[1819,9,1819,11],[1819,12,1819,19],[1820,1,1820,19],[1821,1,1821,11],[1821,12,1821,14],[1821,15,1821,16],[1821,17,1821,19],[1822,1,1822,19],[1823,2,1823,11],[1823,12,1823,19],[1824,1,1824,9],[1824,10,1824,19],[1825,1,1832,2],[1825,3,1832,6],[1825,7,1832,9],[1825,10,1833,10],[1825,11,1828,18],[1825,19,1833,19],[1829,11,1829,18],[1830,11,1833,18],[1833,1,1833,9],[1834,1,1834,19],[1835,1,1835,3],[1835,4,1835,10],[1835,11,1835,12],[1836,1,1836,20],[1837,0,1837,20],[1838,0,1938,0],[1838,1,1838,19],[1838,20,1937,20],[1839,1,1840,2],[1839,3,1839,15],[1839,16,1839,19],[1840,3,1840,15],[1840,16,1840,19],[1841,1,1842,4],[1841,5,1841,12],[1842,5,1842,15],[1843,1,1843,12],[1843,13,1843,16],[1843,17,1843,19],[1844,1,1844,6],[1844,7,1844,9],[1844,10,1844,19],[1845,1,1845,6],[1845,7,1845,19],[1846,1,1846,6],[1846,7,1846,19],[1847,1,1847,6],[1847,7,1847,19],[1848,1,1848,9],[1848,10,1848,15],[1848,16,1848,17],[1848,18,1848,19],[1849,1,1849,19],[1850,1,1850,19],[1851,1,1851,19],[1852,3,1852,5],[1852,7,1852,10],[1852,11,1855,11],[1852,13,1852,15],[1852,17,1852,19],[1853,2,1853,5],[1853,6,1853,9],[1853,12,1853,14],[1853,16,1853,18],[1854,2,1854,5],[1854,6,1854,9],[1854,12,1854,14],[1854,16,1854,18],[1855,2,1855,5],[1855,6,1855,9],[1855,12,1855,14],[1855,16,1855,18],[1856,1,1856,19],[1857,1,1857,19],[1858,1,1858,19],[1859,1,1859,10],[1859,11,1863,11],[1859,13,1859,14],[1859,16,1859,18],[1860,3,1860,5],[1860,8,1860,10],[1860,13,1860,14],[1860,16,1860,18],[1861,2,1863,10],[1861,13,1861,14],[1861,16,1861,18],[1862,13,1862,14],[1862,16,1862,18],[1863,12,1863,15],[1863,16,1863,18],[1864,1,1864,19],[1865,1,1865,19],[1866,1,1866,10],[1867,1,1867,10],[1867,13,1867,14],[1867,16,1867,18],[1868,3,1868,5],[1868,8,1868,10],[1868,13,1868,14],[1868,16,1868,18],[1869,3,1869,10],[1869,13,1869,14],[1869,16,1869,18],[1870,3,1870,10],[1870,13,1870,14],[1870,16,1870,18],[1871,1,1871,10],[1871,16,1871,18],[1872,1,1872,19],[1873,3,1873,11],[1874,1,1874,19],[1875,2,1875,5],[1875,7,1875,9],[1875,11,1875,14],[1875,16,1875,18],[1876,1,1876,19],[1877,2,1877,5],[1877,7,1877,8],[1877,10,1877,11],[1877,13,1877,14],[1877,16,1877,18],[1878,1,1878,19],[1879,2,1879,3],[1879,5,1879,8],[1879,10,1879,12],[1879,14,1879,15],[1879,17,1879,18],[1880,1,1880,19],[1881,1,1881,19],[1882,2,1882,5],[1882,7,1882,8],[1882,10,1882,11],[1882,13,1882,14],[1882,16,1882,18],[1883,1,1883,19],[1884,2,1884,3],[1884,5,1884,7],[1884,9,1884,11],[1884,13,1884,14],[1884,16,1884,18],[1885,1,1885,19],[1886,2,1886,4],[1886,6,1886,8],[1886,10,1886,12],[1886,14,1886,16],[1887,1,1887,19],[1888,2,1888,8],[1888,9,1888,13],[1888,15,1888,19],[1889,2,1889,19],[1890,2,1890,4],[1890,6,1890,8],[1890,10,1890,12],[1890,14,1890,15],[1890,17,1890,18],[1891,1,1891,19],[1892,2,1892,5],[1892,7,1892,11],[1892,13,1892,18],[1893,1,1893,19],[1894,2,1894,4],[1894,6,1894,8],[1894,10,1894,12],[1894,14,1894,19],[1895,1,1895,19],[1896,2,1896,6],[1896,7,1896,8],[1896,10,1896,11],[1896,12,1896,13],[1896,15,1896,19],[1897,1,1897,19],[1898,2,1898,6],[1898,7,1898,8],[1898,10,1898,11],[1898,12,1898,13],[1898,15,1898,19],[1899,1,1899,19],[1900,2,1900,6],[1900,7,1900,8],[1900,10,1900,11],[1900,12,1900,13],[1900,15,1900,19],[1901,1,1901,19],[1902,2,1902,4],[1902,5,1902,7],[1902,9,1902,12],[1902,14,1902,18],[1903,1,1903,19],[1904,5,1904,7],[1904,9,1904,12],[1904,14,1904,18],[1905,1,1905,19],[1906,1,1906,19],[1907,2,1907,19],[1908,2,1908,9],[1908,10,1909,19],[1909,2,1909,9],[1910,2,1910,4],[1910,5,1910,7],[1910,8,1910,10],[1910,11,1910,14],[1910,15,1910,17],[1910,18,1910,19],[1911,1,1911,19],[1912,2,1912,5],[1912,6,1912,9],[1912,10,1912,11],[1912,12,1912,14],[1912,15,1912,17],[1912,18,1912,19],[1913,1,1913,19],[1914,2,1914,11],[1914,12,1914,19],[1915,1,1915,19],[1916,2,1916,11],[1916,12,1916,19],[1917,1,1917,19],[1918,1,1918,3],[1918,4,1918,5],[1918,6,1918,8],[1918,9,1918,11],[1918,12,1918,19],[1919,1,1919,3],[1919,4,1919,5],[1919,6,1919,8],[1919,9,1919,11],[1919,12,1919,19],[1920,1,1920,3],[1920,4,1920,5],[1920,6,1920,8],[1920,9,1920,11],[1920,12,1920,19],[1921,1,1921,3],[1921,4,1921,5],[1921,6,1921,8],[1921,9,1921,11],[1921,12,1921,19],[1922,1,1922,19],[1923,1,1923,11],[1923,12,1923,14],[1923,15,1923,16],[1923,17,1923,19],[1924,1,1924,19],[1925,2,1925,11],[1925,12,1925,19],[1926,1,1926,9],[1926,10,1926,19],[1927,1,1934,2],[1927,3,1934,6],[1927,7,1934,9],[1927,10,1935,10],[1927,11,1930,18],[1927,19,1935,19],[1931,11,1931,18],[1932,11,1935,18],[1935,1,1935,9],[1936,1,1936,19],[1937,1,1937,3],[1937,4,1937,10],[1937,11,1937,12],[1938,1,1938,20],[1939,0,1939,20],[1940,0,2040,0],[1940,1,1940,19],[1940,20,2039,20],[1941,1,1942,2],[1941,3,1941,15],[1941,16,1941,19],[1942,3,1942,15],[1942,16,1942,19],[1943,1,1944,4],[1943,5,1943,12],[1944,5,1944,15],[1945,1,1945,12],[1945,13,1945,16],[1945,17,1945,19],[1946,1,1946,6],[1946,7,1946,9],[1946,10,1946,19],[1947,1,1947,6],[1947,7,1947,19],[1948,1,1948,6],[1948,7,1948,19],[1949,1,1949,6],[1949,7,1949,19],[1950,1,1950,9],[1950,10,1950,15],[1950,16,1950,17],[1950,18,1950,19],[1951,1,1951,19],[1952,1,1952,19],[1953,1,1953,19],[1954,3,1954,5],[1954,7,1954,10],[1954,11,1957,11],[1954,13,1954,15],[1954,17,1954,19],[1955,2,1955,5],[1955,6,1955,9],[1955,12,1955,14],[1955,16,1955,18],[1956,2,1956,5],[1956,6,1956,9],[1956,12,1956,14],[1956,16,1956,18],[1957,2,1957,5],[1957,6,1957,9],[1957,12,1957,14],[1957,16,1957,18],[1958,1,1958,19],[1959,1,1959,19],[1960,1,1960,19],[1961,1,1961,10],[1961,11,1965,11],[1961,13,1961,14],[1961,16,1961,18],[1962,3,1962,5],[1962,8,1962,10],[1962,13,1962,14],[1962,16,1962,18],[1963,2,1965,10],[1963,13,1963,14],[1963,16,1963,18],[1964,13,1964,14],[1964,16,1964,18],[1965,12,1965,15],[1965,16,1965,18],[1966,1,1966,19],[1967,1,1967,19],[1968,1,1968,10],[1969,1,1969,10],[1969,13,1969,14],[1969,16,1969,18],[1970,3,1970,5],[1970,8,1970,10],[1970,13,1970,14],[1970,16,1970,18],[1971,3,1971,10],[1971,13,1971,14],[1971,16,1971,18],[1972,3,1972,10],[1972,13,1972,14],[1972,16,1972,18],[1973,1,1973,10],[1973,16,1973,18],[1974,1,1974,19],[1975,3,1975,11],[1976,1,1976,19],[1977,2,1977,5],[1977,7,1977,9],[1977,11,1977,14],[1977,16,1977,18],[1978,1,1978,19],[1979,2,1979,5],[1979,7,1979,8],[1979,10,1979,11],[1979,13,1979,14],[1979,16,1979,18],[1980,1,1980,19],[1981,2,1981,3],[1981,5,1981,8],[1981,10,1981,12],[1981,14,1981,15],[1981,17,1981,18],[1982,1,1982,19],[1983,1,1983,19],[1984,2,1984,5],[1984,7,1984,8],[1984,10,1984,11],[1984,13,1984,14],[1984,16,1984,18],[1985,1,1985,19],[1986,2,1986,3],[1986,5,1986,7],[1986,9,1986,11],[1986,13,1986,14],[1986,16,1986,18],[1987,1,1987,19],[1988,2,1988,4],[1988,6,1988,8],[1988,10,1988,12],[1988,14,1988,16],[1989,1,1989,19],[1990,2,1990,8],[1990,9,1990,13],[1990,15,1990,19],[1991,2,1991,19],[1992,2,1992,4],[1992,6,1992,8],[1992,10,1992,12],[1992,14,1992,15],[1992,17,1992,18],[1993,1,1993,19],[1994,2,1994,5],[1994,7,1994,11],[1994,13,1994,18],[1995,1,1995,19],[1996,2,1996,4],[1996,6,1996,8],[1996,10,1996,12],[1996,14,1996,19],[1997,1,1997,19],[1998,2,1998,6],[1998,7,1998,8],[1998,10,1998,11],[1998,12,1998,13],[1998,15,1998,19],[1999,1,1999,19],[2000,2,2000,6],[2000,7,2000,8],[2000,10,2000,11],[2000,12,2000,13],[2000,15,2000,19],[2001,1,2001,19],[2002,2,2002,6],[2002,7,2002,8],[2002,10,2002,11],[2002,12,2002,13],[2002,15,2002,19],[2003,1,2003,19],[2004,2,2004,4],[2004,5,2004,7],[2004,9,2004,12],[2004,14,2004,18],[2005,1,2005,19],[2006,5,2006,7],[2006,9,2006,12],[2006,14,2006,18],[2007,1,2007,19],[2008,1,2008,19],[2009,2,2009,19],[2010,2,2010,9],[2010,10,2011,19],[2011,2,2011,9],[2012,2,2012,4],[2012,5,2012,7],[2012,8,2012,10],[2012,11,2012,14],[2012,15,2012,17],[2012,18,2012,19],[2013,1,2013,19],[2014,2,2014,5],[2014,6,2014,9],[2014,10,2014,11],[2014,12,2014,14],[2014,15,2014,17],[2014,18,2014,19],[2015,1,2015,19],[2016,2,2016,11],[2016,12,2016,19],[2017,1,2017,19],[2018,2,2018,11],[2018,12,2018,19],[2019,1,2019,19],[2020,1,2020,3],[2020,4,2020,5],[2020,6,2020,8],[2020,9,2020,11],[2020,12,2020,19],[2021,1,2021,3],[2021,4,2021,5],[2021,6,2021,8],[2021,9,2021,11],[2021,12,2021,19],[2022,1,2022,3],[2022,4,2022,5],[2022,6,2022,8],[2022,9,2022,11],[2022,12,2022,19],[2023,1,2023,3],[2023,4,2023,5],[2023,6,2023,8],[2023,9,2023,11],[2023,12,2023,19],[2024,1,2024,19],[2025,1,2025,11],[2025,12,2025,14],[2025,15,2025,16],[2025,17,2025,19],[2026,1,2026,19],[2027,2,2027,11],[2027,12,2027,19],[2028,1,2028,9],[2028,10,2028,19],[2029,1,2036,2],[2029,3,2036,6],[2029,7,2036,9],[2029,10,2037,10],[2029,11,2032,18],[2029,19,2037,19],[2033,11,2033,18],[2034,11,2037,18],[2037,1,2037,9],[2038,1,2038,19],[2039,1,2039,3],[2039,4,2039,10],[2039,11,2039,12],[2040,1,2040,20]],"merged_total":4745,"flags":["merged_cut"]}
["ftl Øekad ls tgk¡ rd dk fçaV dh vko';drk gS] oks jsat nsa ¼vf/kdre 20 fçaV ,d lkFk ns ldrs gks½→",{"$nulls":9},21,{"$nulls":3},"ls",null,{"$f":"K1+19","v":40}]
[null,{"$f":"K1","v":21}]
[null,{"$f":"CONCATENATE(Info!$B$7,Info!$C$7)","v":"School Name :-Govt. Sr. Sec. School Raimalwada"}]
[{"$nulls":3},"Board of Secondary Education, Rajasthan",{"$nulls":12},"Sr. (Reg.)"]
[{"$nulls":3}," Ekk/;fed f’k{kk cksMZ]jktLFkku ",{"$nulls":12},"fu;fer ijh{kkFkhZ"]
[null,"mPp ek/;fed ijh{kk",{"$nulls":3},"APPLICATION FORM FOR SENIOR SECONDARY EXAMINATION-2024",{"$nulls":7},{"$f":"Info!$C$10","v":1},{"$f":"Info!$D$10","v":7},{"$f":"Info!$E$10","v":0},{"$f":"Info!$F$10","v":1},{"$f":"Info!$G$10","v":7},{"$f":"Info!$H$10","v":5},{"$f":"Info!$I$10","v":1}]
[{"$nulls":5}," Ikjh{kk vkosnu i= mPp ek/;fed ijh{kk & 2024"]
[{"$nulls":13}," 'kkyk niZ.k Øekad %&",{"$nulls":3},{"$f":"Info!$C$9","v":12345}]
[null,"Scholar Reg. No. ¼LdkWyj jftLVj Øekad½",{"$nulls":5},{"$f":"VLOOKUP(B2,'Deta From Shala Dar. Class-12'!$A$2:$AE$201,4,0)","v":0}]
[null,"1- Student’s Name (fo|kFkhZ dk uke) :",{"$nulls":5},{"$f":"VLOOKUP(B2,'Deta From Shala Dar. Class-12'!$A$2:$AE$201,6,0)","v":0}]
[null,"2- Mother’s Name ¼ekrk dk uke) :",{"$nulls":5},{"$f":"VLOOKUP(B2,'Deta From Shala Dar. Class-12'!$A$2:$AE$201,8,0)","v":0}]
[null,"3- Father’s Name (firk dk uke) :",{"$nulls":5},{"$f":"VLOOKUP(B2,'Deta From Shala Dar. Class-12'!$A$2:$AE$201,9,0)","v":0}]
[null,"4- Category Code (Js.kh dksM) : ¼Js.kh p;u gsrq ihNs fy[ks fo’k\"sk funsZ’k la[;k 1 ns[ks½ Js.kh dk uke %&",{"$nulls":8},"………………………………………………….",{"$nulls":5},"dksM %&"]
[null,"5- Group & Subjects (oxZ ,o a fo\"k;): ( as apply)"]
[null,"Table - A : Only for category(dsoy Js.kh 1]2 , o 8 ds fy;s) (I)ALL SUBJECTS (1-lEiw.kZ fo\"k;), (II) DIVISION IMPROVEMENT (2-Js.kh lq/kkj) & (VIII) FACULTY CHANGE (8-oxZ ifjorZu)  OPTIONAL SUBJECTS oSdfYid fo\"k;) :"]
[]
[{"$nulls":3},"ARTS ¼dyk oxZ½ (1)",{"$nulls":3},"COMMERCE ¼okf.kT; oxZ½ (2)",{"$nulls":5},"SCIENCE ¼foKku oxZ½ (3A)",{"$nulls":3},"AGRICULTURE ¼d`f\"k oxZ½ (3B)"]
[null,null,"1………………………………………",{"$nulls":3},"1 Accountancy",{"$nulls":3},30,null,"1 Physics",null,null,40,"1 Agriculture",null,null,84]
[null,null,"2………………………………………",{"$nulls":3},"2 Buisness Studies",{"$nulls":3},31,null,"2 Chemistry",null,null,41,"2 Ag. Bio.",null,null,39]
[null,null,"3………………………………………",{"$nulls":3},"3………………………………………",{"$nulls":5},"3 …………………………….",{"$nulls":3},"3 ……………………………."]
[]
[]
[]
[{"$nulls":13},"ARTS",null,"((1))","1 ……………………………."]
[{"$nulls":3},"As Applicable ",{"$nulls":4},"tks ykxw gks½",{"$nulls":4},"COMMERCE",null,"((2))","2 ……………………………."]
[null,null,"ADDISTIONAL OPTIONAL SUBJECTS ¼vfrfjDr oSdfYid fo\"k;½ %",{"$nulls":10},"SCIENCE",null,"(3A)","3 ……………………………."]
[{"$nulls":13},"ARGRICULTURE",null,"(3B)","4 ……………………………."]
[{"$nulls":12},"1…………………………………………"]
[]
[]
[]
[null,"Table - B Only for category ¼dsoy Js.kh 4 o 6 ds fy,½ : ",{"$nulls":11},"ARTS",null,"((1))","1 ……………………………."]
[{"$nulls":3},"As Applicable ",{"$nulls":4},"tks ykxw gks½",{"$nulls":4},"COMMERCE",null,"((2))","2 ……………………………."]
[{"$nulls":3},"(IV) ADDITIONAL SUBJECTS ¼vfrfjDr fo\"k;½   (4)",{"$nulls":9},"SCIENCE",null,"((3A))","3 ……………………………."]
[{"$nulls":3},"(VI) MARKS IMPROVEMENT ¼vad lqFkkj½      (6)",{"$nulls":9},"AGRICULTURE",null,"((3B))","4 ……………………………."]
[]
[]
[{"$nulls":3},"As Applicable from Number 6 to 13 ¼Øekad 6 ls 13 rd tks ykxw gks",{"$nulls":9},"djsa½"]
[]
[null,"6-","Gender ¼fyax½ : (01) Male ¼iq:\"k½",{"$nulls":3},{"$f":"IF(W40=\"M\",\"Yes\",\"\")","v":""},"(02) FEMALE ¼efgyk½",null,null,{"$f":"IF(W40=\"F\",\"Yes\",\"\")","v":""},"Medium ¼ek/;e½ : (01) HINDI ¼fgUnh½",{"$nulls":3},{"$f":"IF(X40=\"Hindi\",\"Yes\",\"\")","v":"Yes"},"(02) ENGLISH ¼vaxzsth½",null,null,{"$f":"IF(X40=\"english\",\"Yes\",\"\")","v":""},null,null,{"$f":"VLOOKUP(B2,'Deta From Shala Dar. Class-12'!$A$2:$AE$201,10,0)","v":0},{"$f":"Info!$C$8","v":"Hindi"}]
[]
[null,"7-","CWSN-1 ¼Hkkx½ : ekufld eanrk (01)",{"$nulls":4},"vkWfVTe (02)",null,null,"lsfjcy iYlh (03)",null,null,"ekufld jksx (04)",null,null,"Jo.k ckf/kr (05)"]
[]
[null,null,"ewd fu'kDrrk (06)",null,null,"LisfLQd yfuZax fMl,fcfyfV (14)",{"$nulls":4},"ckSf)d fu'kDrrk (15)",{"$nulls":3},"efYViy LDysjksfll (16)",null,null,"cgq fu'kDrrk (21)"]
[]
[]
[null,"8-","CWSN-2 ¼Hkkx½ : n`f\"V ckf/kr (07)",{"$nulls":4},"vYi n`f\"V (08)",null,null,"pyu fu'kDrrk(09)",null,null,"dq\"B jksx (10)",null,null,"ckSukiu (11)"]
[]
[null,null,"rStkc fif³r (12)",null,null,"ekalis'kh nqfoZdkl ¼13½",{"$nulls":3},"ikfdZlkal jksx ¼17½",{"$nulls":3},"fgeksfQfy;k ¼18½",null,null,"FkSyslhfe;k ¼19½"]
[]
[null,null,",fufed@fLdy fMtht (20)",{"$nulls":3},"iksfy;ks@uoZ batjh ¼22½",{"$nulls":3},"lw;Zeq[kh ¼23½",{"$nulls":3}," @lSfud ¼24½"]
[]
[null,"9-","Name of Vocational Trade ¼O;kolkf;d VªsM dk uke½",{"$nulls":6},"………………………………………………………..",{"$nulls":5},"lgh dk fpUg yxk,aA"]
[null,null,"¼dsoy mu 'kkykvksa ds fy, tgka O;kolkf;d f'k{kk lapkfyr gS ,oa ftu fo|kfFkZ;ksa us d{kk 10 rFkk 11 oha esa O;kolkf;d ijh{kk mRrh.kZ dh gSA½"]
[null,null," (1) Automotive (101)",{"$nulls":3},"(2) Beauty & Wellness (102)",{"$nulls":3},"(3) Health Care (103)",{"$nulls":3},"(4) IT & ITES (104)",null,null,"(5) Retail (105)"]
[]
[null,null,"(6) Tourism & Hospitality (106)",{"$nulls":4},"(7) Apprel Made up Home Furnishing (108)",{"$nulls":5},"(8) Electronics & Hardware (109)"]
[]
[null,null," (9) Agriculture (110)",{"$nulls":3},"(10) Plumber (111)",{"$nulls":3},"(11) Telecom (112)"]
[]
[null,"10-","BPL ¼chih,y½ %",{"$nulls":4},"1- YES ¼gk¡½",null,{"$f":"IF(W61=\"N\",\"\",\"Yes\")","v":"Yes"},null,null,"2- NO ¼ugha¡½",null,{"$f":"IF(W61=\"Y\",\"\",\"Yes\")","v":"Yes"},{"$nulls":7},{"$f":"VLOOKUP(B2,'Deta From Shala Dar. Class-12'!$A$2:$AE$201,27,0)","v":0}]
[]
[null,"11-","vukFk oxZ %",{"$nulls":4},"1- YES ¼gk¡½",{"$nulls":4},"2- NO ¼ugha¡½"]
[]
[null,"12-","EWS ¼vkfFkZd n`f\"V ls detksj oxZ½ %",{"$nulls":4},"1- YES ¼gk¡½",{"$nulls":4},"2- NO ¼ugha¡½"]
[]
[null,"13-","CASTE ¼tkfr Js.kh½ %",null,null,"¼05½ Gen ¼lkekU;½",null,null,{"$f":"IF($W67=\"GEN\",\"YES\",\"\")","v":""},"¼06½ MINORITY ¼lkekU;vYi la[;d½",{"$nulls":3},{"$f":"IF($W67=\"MIN\",\"YES\",\"\")","v":""},"¼07½ SC ¼vuqlwfpr tkfr½",{"$nulls":4},{"$f":"IF($W67=\"SC\",\"YES\",\"\")","v":""},null,null,{"$f":"VLOOKUP(B2,'Deta From Shala Dar. Class-12'!$A$2:$AE$201,16,0)","v":0}]
[]
[{"$nulls":5},"¼08½ ST ¼vuqlwfpr tutkfr½",null,null,{"$f":"IF($W67=\"ST\",\"YES\",\"\")","v":""},"¼09½ OBC ¼vU; fiN³k oxZ½",{"$nulls":3},{"$f":"IF($W67=\"OBC\",\"YES\",\"\")","v":""},"¼10½ Special OBC ¼fo'ks\"k fiN³k oxZ½@MBC",{"$nulls":4},{"$f":"IF(OR($W67=\"MBC\",$W$67=\"SBC\"),\"YES\",\"\")","v":""}]
[null,"uksV%& Nk=o`fr@iqjLdkj mijksDr p;fur Js.kh ds vk/kj ij gh nh tk;sxhA"]
[]
[null,"14-","ADDRESS ¼fo|kFkhZ dk iw.kZ irk½ %&"]
[null,null,"House No./Street/Place Name ¼edku ua-@xyh ua-@LFkku½ %",{"$nulls":7},{"$f":"VLOOKUP(B2,'Deta From Shala Dar. Class-12'!$A$2:$AE$201,24,0)","v":0}]
[null,null,"Village/Town/City ¼xzke@dLck@'kgj½ %"]
[null,null,"District ¼ftyk½ %",null,null,"………………………….",null,null,"STATE ¼jkT;½ %",null,null,"…………………………………..",{"$nulls":3},"PIN CODE NO. ¼fiu dksM ua-½ %",null,null,"……………………"]
[]
[null,"15-","fo|kFkhZ dk vk/kkj dkMZ uEcj %",{"$nulls":3},{"$f":"VLOOKUP(B2,'Deta From Shala Dar. Class-12'!$A$2:$AE$201,21,0)","v":{"v":0,"d":"0000"}},{"$nulls":3},"tu vk/kkj uEcj %",null,{"$f":"VLOOKUP(B2,'Deta From Shala Dar. Class-12'!$A$2:$AE$201,22,0)","v":0},null,null,"vfHkHkkod dh okf\"kZd vk; %",null,null,{"$f":"VLOOKUP(B2,'Deta From Shala Dar. Class-12'!$A$2:$AE$201,25,0)","v":{"v":0,"d":"₹ 0"}}]
[]
[null,null,"Student/Guardian's Mobile No. ¼fo|kFkhZ@vfHkHkkod dk eksckby uacj½ %",{"$nulls":9},{"$f":"VLOOKUP(B2,'Deta From Shala Dar. Class-12'!$A$2:$AE$201,23,0)","v":0}]
[]
[null,"16-","Previous Academic Details ¼iwoZ 'kS{kf.kd ;ksX;rk½ %",{"$nulls":9},"---------------------------------------------------------"]
[]
[null,"CLASS ¼d{kk½",null,null,"YEAR ¼oxZ½",null,"ROLL NO. ¼ukekad½",null,null,"RESULT ¼ifj.kke½",null,null,"NAME OF SCHOOL/BOARD ¼Ldwy@cksMZ dk uke½"]
[null,"X"]
[null,"XI"]
[null,"XII"]
[]
[null,"Nk= us ;fn d{kk X vU; cksMZ ls mRrh.kZ dh gS rks %& ¼ns[ksa fo’ks\"k funsZ’k la[;k 6½ ik=rk izek.k i= Øekad",{"$nulls":13},"fnukad"]
[]
[null,"17-","Student's Photo and Signature ¼fo|kFkhZ dk QksVks ,oa gLrk{kj½",{"$nulls":9}," "]
[{"$nulls":10},"Student's Signature ¼fo|kFkhZ ds gLrk{kj½"]
[{"$nulls":3},"PASTE PASSPORT\nSIZE PHOTO"]
[]
[]
[]
[]
[{"$nulls":11}," 'kkyk ç/kku dk çek.khdj.k %&\ngLrk{kj---------------------------------------------------------------"]
[]
[]
[]
[]
[null,"fo|ky; dk uke %&",null,null,{"$f":"Info!$C$7","v":"Govt. Sr. Sec. School Raimalwada"},{"$nulls":6}," 'kkyk dksM %&",null,{"$f":"Info!$C$10","v":1},{"$f":"Info!$D$10","v":7},{"$f":"Info!$E$10","v":0},{"$f":"Info!$F$10","v":1},{"$f":"Info!$G$10","v":7},{"$f":"Info!$H$10","v":5},{"$f":"Info!$I$10","v":1}]
[]
[{"$f":"B2+1","v":22}]
[null,{"$f":"CONCATENATE(Info!$B$7,Info!$C$7)","v":"School Name :-Govt. Sr. Sec. School Raimalwada"}]
[{"$nulls":3},"Board of Secondary Education, Rajasthan",{"$nulls":12},"Sr. (Reg.)"]
[{"$nulls":3}," Ekk/;fed f’k{kk cksMZ]jktLFkku ",{"$nulls":12},"fu;fer ijh{kkFkhZ"]
[null,"mPp ek/;fed ijh{kk",{"$nulls":3},"APPLICATION FORM FOR SENIOR SECONDARY EXAMINATION-2024",{"$nulls":7},{"$f":"Info!$C$10","v":1},{"$f":"Info!$D$10","v":7},{"$f":"Info!$E$10","v":0},{"$f":"Info!$F$10","v":1},{"$f":"Info!$G$10","v":7},{"$f":"Info!$H$10","v":5},{"$f":"Info!$I$10","v":1}]
[{"$nulls":5}," Ikjh{kk vkosnu i= mPp ek/;fed ijh{kk & 2024"]
[{"$nulls":13}," 'kkyk niZ.k Øekad %&",{"$nulls":3},{"$f":"Info!$C$9","v":12345}]
[null,"Scholar Reg. No. ¼LdkWyj jftLVj Øekad½",{"$nulls":5},{"$f":"VLOOKUP(A104,'Deta From Shala Dar. Class-12'!$A$2:$AE$201,4,0)","v":0}]
[null,"1- Student’s Name (fo|kFkhZ dk uke) :",{"$nulls":5},{"$f":"VLOOKUP(A104,'Deta From Shala Dar. Class-12'!$A$2:$AE$201,6,0)","v":0}]
[null,"2- Mother’s Name ¼ekrk dk uke) :",{"$nulls":5},{"$f":"VLOOKUP(A104,'Deta From Shala Dar. Class-12'!$A$2:$AE$201,8,0)","v":0}]
[null,"3- Father’s Name (firk dk uke) :",{"$nulls":5},{"$f":"VLOOKUP(A104,'Deta From Shala Dar. Class-12'!$A$2:$AE$201,9,0)","v":0}]
[null,"4- Category Code (Js.kh dksM) : ¼Js.kh p;u gsrq ihNs fy[ks fo’k\"sk funsZ’k la[;k 1 ns[ks½ Js.kh dk uke %&",{"$nulls":8},"………………………………………………….",{"$nulls":5},"dksM %&"]
[null,"5- Group & Subjects (oxZ ,o a fo\"k;): ( as apply)"]
[null,"Table - A : Only for category(dsoy Js.kh 1]2 , o 8 ds fy;s) (I)ALL SUBJECTS (1-lEiw.kZ fo\"k;), (II) DIVISION IMPROVEMENT (2-Js.kh lq/kkj) & (VIII) FACULTY CHANGE (8-oxZ ifjorZu)  OPTIONAL SUBJECTS oSdfYid fo\"k;) :"]
[]
[{"$nulls":3},"ARTS ¼dyk oxZ½ (1)",{"$nulls":3},"COMMERCE ¼okf.kT; oxZ½ (2)",{"$nulls":5},"SCIENCE ¼foKku oxZ½ (3A)",{"$nulls":3},"AGRICULTURE ¼d`f\"k oxZ½ (3B)"]
[null,null,"1………………………………………",{"$nulls":3},"1 Accountancy",{"$nulls":3},30,null,"1 Physics",null,null,40,"1 Agriculture",null,null,84]
[null,null,"2………………………………………",{"$nulls":3},"2 Buisness Studies",{"$nulls":3},31,null,"2 Chemistry",null,null,41,"2 Ag. Bio.",null,null,39]
[null,null,"3………………………………………",{"$nulls":3},"3………………………………………",{"$nulls":5},"3 …………………………….",{"$nulls":3},"3 ……………………………."]
[]
[]
[]
[{"$nulls":13},"ARTS",null,"((1))","1 ……………………………."]
[{"$nulls":3},"As Applicable ",{"$nulls":4},"tks ykxw gks½",{"$nulls":4},"COMMERCE",null,"((2))","2 ……………………………."]
[null,null,"ADDISTIONAL OPTIONAL SUBJECTS ¼vfrfjDr oSdfYid fo\"k;½ %",{"$nulls":10},"SCIENCE",null,"(3A)","3 ……………………………."]
[{"$nulls":13},"ARGRICULTURE",null,"(3B)","4 ……………………………."]
[{"$nulls":12},"1…………………………………………"]
[]
[]
[]
[null,"Table - B Only for category ¼dsoy Js.kh 4 o 6 ds fy,½ : ",{"$nulls":11},"ARTS",null,"((1))","1 ……………………………."]
[{"$nulls":3},"As Applicable ",{"$nulls":4},"tks ykxw gks½",{"$nulls":4},"COMMERCE",null,"((2))","2 ……………………………."]
[{"$nulls":3},"(IV) ADDITIONAL SUBJECTS ¼vfrfjDr fo\"k;½   (4)",{"$nulls":9},"SCIENCE",null,"((3A))","3 ……………………………."]
[{"$nulls":3},"(VI) MARKS IMPROVEMENT ¼vad lqFkkj½      (6)",{"$nulls":9},"AGRICULTURE",null,"((3B))","4 ……………………………."]
[]
[]
[{"$nulls":3},"As Applicable from Number 6 to 13 ¼Øekad 6 ls 13 rd tks ykxw gks",{"$nulls":9},"djsa½"]
[]
[null,"6-","Gender ¼fyax½ : (01) Male ¼iq:\"k½",{"$nulls":3},{"$f":"IF(W142=\"M\",\"Yes\",\"\")","v":""},"(02) FEMALE ¼efgyk½",null,null,{"$f":"IF(W142=\"F\",\"Yes\",\"\")","v":""},"Medium ¼ek/;e½ : (01) HINDI ¼fgUnh½",{"$nulls":3},{"$f":"IF(X142=\"Hindi\",\"Yes\",\"\")","v":"Yes"},"(02) ENGLISH ¼vaxzsth½",null,null,{"$f":"IF(X142=\"english\",\"Yes\",\"\")","v":""},null,null,{"$f":"VLOOKUP(A104,'Deta From Shala Dar. Class-12'!$A$2:$AE$201,10,0)","v":0},{"$f":"Info!$C$8","v":"Hindi"}]
[]
[null,"7-","CWSN-1 ¼Hkkx½ : ekufld eanrk (01)",{"$nulls":4},"vkWfVTe (02)",null,null,"lsfjcy iYlh (03)",null,null,"ekufld jksx (04)",null,null,"Jo.k ckf/kr (05)"]
[]
[null,null,"ewd fu'kDrrk (06)",null,null,"LisfLQd yfuZax fMl,fcfyfV (14)",{"$nulls":4},"ckSf)d fu'kDrrk (15)",{"$nulls":3},"efYViy LDysjksfll (16)",null,null,"cgq fu'kDrrk (21)"]
[]
[]
[null,"8-","CWSN-2 ¼Hkkx½ : n`f\"V ckf/kr (07)",{"$nulls":4},"vYi n`f\"V (08)",null,null,"pyu fu'kDrrk(09)",null,null,"dq\"B jksx (10)",null,null,"ckSukiu (11)"]
[]
[null,null,"rStkc fif³r (12)",null,null,"ekalis'kh nqfoZdkl ¼13½",{"$nulls":3},"ikfdZlkal jksx ¼17½",{"$nulls":3},"fgeksfQfy;k ¼18½",null,null,"FkSyslhfe;k ¼19½"]
[]
[null,null,",fufed@fLdy fMtht (20)",{"$nulls":3},"iksfy;ks@uoZ batjh ¼22½",{"$nulls":3},"lw;Zeq[kh ¼23½",{"$nulls":3}," @lSfud ¼24½"]
[]
[null,"9-","Name of Vocational Trade ¼O;kolkf;d VªsM dk uke½",{"$nulls":6},"………………………………………………………..",{"$nulls":5},"lgh dk fpUg yxk,aA"]
[null,null,"¼dsoy mu 'kkykvksa ds fy, tgka O;kolkf;d f'k{kk lapkfyr gS ,oa ftu fo|kfFkZ;ksa us d{kk 10 rFkk 11 oha esa O;kolkf;d ijh{kk mRrh.kZ dh gSA½"]
[null,null," (1) Automotive (101)",{"$nulls":3},"(2) Beauty & Wellness (102)",{"$nulls":3},"(3) Health Care (103)",{"$nulls":3},"(4) IT & ITES (104)",null,null,"(5) Retail (105)"]
[]
[null,null,"(6) Tourism & Hospitality (106)",{"$nulls":4},"(7) Apprel Made up Home Furnishing (108)",{"$nulls":5},"(8) Electronics & Hardware (109)"]
[]
[null,null," (9) Agriculture (110)",{"$nulls":3},"(10) Plumber (111)",{"$nulls":3},"(11) Telecom (112)"]
[]
[null,"10-","BPL ¼chih,y½ %",{"$nulls":4},"1- YES ¼gk¡½",null,{"$f":"IF(W163=\"N\",\"\",\"Yes\")","v":"Yes"},null,null,"2- NO ¼ugha¡½",null,{"$f":"IF(W163=\"Y\",\"\",\"Yes\")","v":"Yes"},{"$nulls":7},{"$f":"VLOOKUP(A104,'Deta From Shala Dar. Class-12'!$A$2:$AE$201,27,0)","v":0}]
[]
[null,"11-","vukFk oxZ %",{"$nulls":4},"1- YES ¼gk¡½",{"$nulls":4},"2- NO ¼ugha¡½"]
[]
[null,"12-","EWS ¼vkfFkZd n`f\"V ls detksj oxZ½ %",{"$nulls":4},"1- YES ¼gk¡½",{"$nulls":4},"2- NO ¼ugha¡½"]
[]
[null,"13-","CASTE ¼tkfr Js.kh½ %",null,null,"¼05½ Gen ¼lkekU;½",null,null,{"$f":"IF($W169=\"GEN\",\"YES\",\"\")","v":""},"¼06½ MINORITY ¼lkekU;vYi la[;d½",{"$nulls":3},{"$f":"IF($W169=\"MIN\",\"YES\",\"\")","v":""},"¼07½ SC ¼vuqlwfpr tkfr½",{"$nulls":4},{"$f":"IF($W169=\"SC\",\"YES\",\"\")","v":""},null,null,{"$f":"VLOOKUP(A104,'Deta From Shala Dar. Class-12'!$A$2:$AE$201,16,0)","v":0}]
[]
[{"$nulls":5},"¼08½ ST ¼vuqlwfpr tutkfr½",null,null,{"$f":"IF($W169=\"ST\",\"YES\",\"\")","v":""},"¼09½ OBC ¼vU; fiN³k oxZ½",{"$nulls":3},{"$f":"IF($W169=\"OBC\",\"YES\",\"\")","v":""},"¼10½ Special OBC ¼fo'ks\"k fiN³k oxZ½@MBC",{"$nulls":4},{"$f":"IF(OR($W169=\"MBC\",$W$67=\"SBC\"),\"YES\",\"\")","v":""}]
[null,"uksV%& Nk=o`fr@iqjLdkj mijksDr p;fur Js.kh ds vk/kj ij gh nh tk;sxhA"]
[]
[null,"14-","ADDRESS ¼fo|kFkhZ dk iw.kZ irk½ %&"]
[null,null,"House No./Street/Place Name ¼edku ua-@xyh ua-@LFkku½ %",{"$nulls":7},{"$f":"VLOOKUP(A104,'Deta From Shala Dar. Class-12'!$A$2:$AE$201,24,0)","v":0}]
[null,null,"Village/Town/City ¼xzke@dLck@'kgj½ %"]
[null,null,"District ¼ftyk½ %",null,null,"………………………….",null,null,"STATE ¼jkT;½ %",null,null,"…………………………………..",{"$nulls":3},"PIN CODE NO. ¼fiu dksM ua-½ %",null,null,"……………………"]
[]
[null,"15-","fo|kFkhZ dk vk/kkj dkMZ uEcj %",{"$nulls":3},{"$f":"VLOOKUP(A104,'Deta From Shala Dar. Class-12'!$A$2:$AE$201,21,0)","v":{"v":0,"d":"0000"}},{"$nulls":3},"tu vk/kkj uEcj %",null,{"$f":"VLOOKUP(A104,'Deta From Shala Dar. Class-12'!$A$2:$AE$201,22,0)","v":0},null,null,"vfHkHkkod dh okf\"kZd vk; %",null,null,{"$f":"VLOOKUP(A104,'Deta From Shala Dar. Class-12'!$A$2:$AE$201,25,0)","v":{"v":0,"d":"₹ 0"}}]
[]
[null,null,"Student/Guardian's Mobile No. ¼fo|kFkhZ@vfHkHkkod dk eksckby uacj½ %",{"$nulls":9},{"$f":"VLOOKUP(A104,'Deta From Shala Dar. Class-12'!$A$2:$AE$201,23,0)","v":0}]
[]
[null,"16-","Previous Academic Details ¼iwoZ 'kS{kf.kd ;ksX;rk½ %",{"$nulls":9},"---------------------------------------------------------"]
[]
[null,"CLASS ¼d{kk½",null,null,"YEAR ¼oxZ½",null,"ROLL NO. ¼ukekad½",null,null,"RESULT ¼ifj.kke½",null,null,"NAME OF SCHOOL/BOARD ¼Ldwy@cksMZ dk uke½"]
[null,"X"]
[null,"XI"]
[null,"XII"]
[]
[null,"Nk= us ;fn d{kk X vU; cksMZ ls mRrh.kZ dh gS rks %& ¼ns[ksa fo’ks\"k funsZ’k la[;k 6½ ik=rk izek.k i= Øekad",{"$nulls":13},"fnukad"]
[]
[null,"17-","Student's Photo and Signature ¼fo|kFkhZ dk QksVks ,oa gLrk{kj½",{"$nulls":9}," "]
[{"$nulls":10},"Student's Signature ¼fo|kFkhZ ds gLrk{kj½"]
[{"$nulls":3},"PASTE PASSPORT\nSIZE PHOTO"]
[]
[]
[]
[]
[{"$nulls":11}," 'kkyk ç/kku dk çek.khdj.k %&\ngLrk{kj---------------------------------------------------------------"]
[]
[]
[]
[]
[null,"fo|ky; dk uke %&",null,null,{"$f":"Info!$C$7","v":"Govt. Sr. Sec. School Raimalwada"},{"$nulls":6}," 'kkyk dksM %&",null,{"$f":"Info!$C$10","v":1},{"$f":"Info!$D$10","v":7},{"$f":"Info!$E$10","v":0},{"$f":"Info!$F$10","v":1},{"$f":"Info!$G$10","v":7},{"$f":"Info!$H$10","v":5},{"$f":"Info!$I$10","v":1}]
[]
[{"$f":"A104+1","v":23}]
[null,{"$f":"CONCATENATE(Info!$B$7,Info!$C$7)","v":"School Name :-Govt. Sr. Sec. School Raimalwada"}]
[{"$nulls":3},"Board of Secondary Education, Rajasthan",{"$nulls":12},"Sr. (Reg.)"]
[{"$nulls":3}," Ekk/;fed f’k{kk cksMZ]jktLFkku ",{"$nulls":12},"fu;fer ijh{kkFkhZ"]
[null,"mPp ek/;fed ijh{kk",{"$nulls":3},"APPLICATION FORM FOR SENIOR SECONDARY EXAMINATION-2024",{"$nulls":7},{"$f":"Info!$C$10","v":1},{"$f":"Info!$D$10","v":7},{"$f":"Info!$E$10","v":0},{"$f":"Info!$F$10","v":1},{"$f":"Info!$G$10","v":7},{"$f":"Info!$H$10","v":5},{"$f":"Info!$I$10","v":1}]
[{"$nulls":5}," Ikjh{kk vkosnu i= mPp ek/;fed ijh{kk & 2024"]
[{"$nulls":13}," 'kkyk niZ.k Øekad %&",{"$nulls":3},{"$f":"Info!$C$9","v":12345}]
[null,"Scholar Reg. No. ¼LdkWyj jftLVj Øekad½",{"$nulls":5},{"$f":"VLOOKUP(A206,'Deta From Shala Dar. Class-12'!$A$2:$AE$201,4,0)","v":0}]
[null,"1- Student’s Name (fo|kFkhZ dk uke) :",{"$nulls":5},{"$f":"VLOOKUP(A206,'Deta From Shala Dar. Class-12'!$A$2:$AE$201,6,0)","v":0}]
[null,"2- Mother’s Name ¼ekrk dk uke) :",{"$nulls":5},{"$f":"VLOOKUP(A206,'Deta From Shala Dar. Class-12'!$A$2:$AE$201,8,0)","v":0}]
[null,"3- Father’s Name (firk dk uke) :",{"$nulls":5},{"$f":"VLOOKUP(A206,'Deta From Shala Dar. Class-12'!$A$2:$AE$201,9,0)","v":0}]
[null,"4- Category Code (Js.kh dksM) : ¼Js.kh p;u gsrq ihNs fy[ks fo’k\"sk funsZ’k la[;k 1 ns[ks½ Js.kh dk uke %&",{"$nulls":8},"………………………………………………….",{"$nulls":5},"dksM %&"]
[null,"5- Group & Subjects (oxZ ,o a fo\"k;): ( as apply)"]
[null,"Table - A : Only for category(dsoy Js.kh 1]2 , o 8 ds fy;s) (I)ALL SUBJECTS (1-lEiw.kZ fo\"k;), (II) DIVISION IMPROVEMENT (2-Js.kh lq/kkj) & (VIII) FACULTY CHANGE (8-oxZ ifjorZu)  OPTIONAL SUBJECTS oSdfYid fo\"k;) :"]
[]
[{"$nulls":3},"ARTS ¼dyk oxZ½ (1)",{"$nulls":3},"COMMERCE ¼okf.kT; oxZ½ (2)",{"$nulls":5},"SCIENCE ¼foKku oxZ½ (3A)",{"$nulls":3},"AGRICULTURE ¼d`f\"k oxZ½ (3B)"]
[null,null,"1………………………………………",{"$nulls":3},"1 Accountancy",{"$nulls":3},30,null,"1 Physics",null,null,40,"1 Agriculture",null,null,84]
[null,null,"2………………………………………",{"$nulls":3},"2 Buisness Studies",{"$nulls":3},31,null,"2 Chemistry",null,null,41,"2 Ag. Bio.",null,null,39]
[null,null,"3………………………………………",{"$nulls":3},"3………………………………………",{"$nulls":5},"3 …………………………….",{"$nulls":3},"3 ……………………………."]
[]
[]
[]
[{"$nulls":13},"ARTS",null,"((1))","1 ……………………………."]
[{"$nulls":3},"As Applicable ",{"$nulls":4},"tks ykxw gks½",{"$nulls":4},"COMMERCE",null,"((2))","2 ……………………………."]
[null,null,"ADDISTIONAL OPTIONAL SUBJECTS ¼vfrfjDr oSdfYid fo\"k;½ %",{"$nulls":10},"SCIENCE",null,"(3A)","3 ……………………………."]
[{"$nulls":13},"ARGRICULTURE",null,"(3B)","4 ……………………………."]
[{"$nulls":12},"1…………………………………………"]
[]
[]
[]
[null,"Table - B Only for category ¼dsoy Js.kh 4 o 6 ds fy,½ : ",{"$nulls":11},"ARTS",null,"((1))","1 ……………………………."]
[{"$nulls":3},"As Applicable ",{"$nulls":4},"tks ykxw gks½",{"$nulls":4},"COMMERCE",null,"((2))","2 ……………………………."]
[{"$nulls":3},"(IV) ADDITIONAL SUBJECTS ¼vfrfjDr fo\"k;½   (4)",{"$nulls":9},"SCIENCE",null,"((3A))","3 ……………………………."]
[{"$nulls":3},"(VI) MARKS IMPROVEMENT ¼vad lqFkkj½      (6)",{"$nulls":9},"AGRICULTURE",null,"((3B))","4 ……………………………."]
[]
[]
[{"$nulls":3},"As Applicable from Number 6 to 13 ¼Øekad 6 ls 13 rd tks ykxw gks",{"$nulls":9},"djsa½"]
[]
[null,"6-","Gender ¼fyax½ : (01) Male ¼iq:\"k½",{"$nulls":3},{"$f":"IF(W244=\"M\",\"Yes\",\"\")","v":""},"(02) FEMALE ¼efgyk½",null,null,{"$f":"IF(W244=\"F\",\"Yes\",\"\")","v":""},"Medium ¼ek/;e½ : (01) HINDI ¼fgUnh½",{"$nulls":3},{"$f":"IF(X244=\"Hindi\",\"Yes\",\"\")","v":"Yes"},"(02) ENGLISH ¼vaxzsth½",null,null,{"$f":"IF(X244=\"english\",\"Yes\",\"\")","v":""},null,null,{"$f":"VLOOKUP(A206,'Deta From Shala Dar. Class-12'!$A$2:$AE$201,10,0)","v":0},{"$f":"Info!$C$8","v":"Hindi"}]
[]
[null,"7-","CWSN-1 ¼Hkkx½ : ekufld eanrk (01)",{"$nulls":4},"vkWfVTe (02)",null,null,"lsfjcy iYlh (03)",null,null,"ekufld jksx (04)",null,null,"Jo.k ckf/kr (05)"]
[]
[null,null,"ewd fu'kDrrk (06)",null,null,"LisfLQd yfuZax fMl,fcfyfV (14)",{"$nulls":4},"ckSf)d fu'kDrrk (15)",{"$nulls":3},"efYViy LDysjksfll (16)",null,null,"cgq fu'kDrrk (21)"]
[]
[]
[null,"8-","CWSN-2 ¼Hkkx½ : n`f\"V ckf/kr (07)",{"$nulls":4},"vYi n`f\"V (08)",null,null,"pyu fu'kDrrk(09)",null,null,"dq\"B jksx (10)",null,null,"ckSukiu (11)"]
[]
[null,null,"rStkc fif³r (12)",null,null,"ekalis'kh nqfoZdkl ¼13½",{"$nulls":3},"ikfdZlkal jksx ¼17½",{"$nulls":3},"fgeksfQfy;k ¼18½",null,null,"FkSyslhfe;k ¼19½"]
[]
[null,null,",fufed@fLdy fMtht (20)",{"$nulls":3},"iksfy;ks@uoZ batjh ¼22½",{"$nulls":3},"lw;Zeq[kh ¼23½",{"$nulls":3}," @lSfud ¼24½"]
[]
[null,"9-","Name of Vocational Trade ¼O;kolkf;d VªsM dk uke½",{"$nulls":6},"………………………………………………………..",{"$nulls":5},"lgh dk fpUg yxk,aA"]
[null,null,"¼dsoy mu 'kkykvksa ds fy, tgka O;kolkf;d f'k{kk lapkfyr gS ,oa ftu fo|kfFkZ;ksa us d{kk 10 rFkk 11 oha esa O;kolkf;d ijh{kk mRrh.kZ dh gSA½"]
[null,null," (1) Automotive (101)",{"$nulls":3},"(2) Beauty & Wellness (102)",{"$nulls":3},"(3) Health Care (103)",{"$nulls":3},"(4) IT & ITES (104)",null,null,"(5) Retail (105)"]
[]
[null,null,"(6) Tourism & Hospitality (106)",{"$nulls":4},"(7) Apprel Made up Home Furnishing (108)",{"$nulls":5},"(8) Electronics & Hardware (109)"]
[]
[null,null," (9) Agriculture (110)",{"$nulls":3},"(10) Plumber (111)",{"$nulls":3},"(11) Telecom (112)"]
[]
[null,"10-","BPL ¼chih,y½ %",{"$nulls":4},"1- YES ¼gk¡½",null,{"$f":"IF(W265=\"N\",\"\",\"Yes\")","v":"Yes"},null,null,"2- NO ¼ugha¡½",null,{"$f":"IF(W265=\"Y\",\"\",\"Yes\")","v":"Yes"},{"$nulls":7},{"$f":"VLOOKUP(A206,'Deta From Shala Dar. Class-12'!$A$2:$AE$201,27,0)","v":0}]
[]
[null,"11-","vukFk oxZ %",{"$nulls":4},"1- YES ¼gk¡½",{"$nulls":4},"2- NO ¼ugha¡½"]
[]
[null,"12-","EWS ¼vkfFkZd n`f\"V ls detksj oxZ½ %",{"$nulls":4},"1- YES ¼gk¡½",{"$nulls":4},"2- NO ¼ugha¡½"]
[]
[null,"13-","CASTE ¼tkfr Js.kh½ %",null,null,"¼05½ Gen ¼lkekU;½",null,null,{"$f":"IF($W271=\"GEN\",\"YES\",\"\")","v":""},"¼06½ MINORITY ¼lkekU;vYi la[;d½",{"$nulls":3},{"$f":"IF($W271=\"MIN\",\"YES\",\"\")","v":""},"¼07½ SC ¼vuqlwfpr tkfr½",{"$nulls":4},{"$f":"IF($W271=\"SC\",\"YES\",\"\")","v":""},null,null,{"$f":"VLOOKUP(A206,'Deta From Shala Dar. Class-12'!$A$2:$AE$201,16,0)","v":0}]
[]
[{"$nulls":5},"¼08½ ST ¼vuqlwfpr tutkfr½",null,null,{"$f":"IF($W271=\"ST\",\"YES\",\"\")","v":""},"¼09½ OBC ¼vU; fiN³k oxZ½",{"$nulls":3},{"$f":"IF($W271=\"OBC\",\"YES\",\"\")","v":""},"¼10½ Special OBC ¼fo'ks\"k fiN³k oxZ½@MBC",{"$nulls":4},{"$f":"IF(OR($W271=\"MBC\",$W$67=\"SBC\"),\"YES\",\"\")","v":""}]
[null,"uksV%& Nk=o`fr@iqjLdkj mijksDr p;fur Js.kh ds vk/kj ij gh nh tk;sxhA"]
[]
[null,"14-","ADDRESS ¼fo|kFkhZ dk iw.kZ irk½ %&"]
[null,null,"House No./Street/Place Name ¼edku ua-@xyh ua-@LFkku½ %",{"$nulls":7},{"$f":"VLOOKUP(A206,'Deta From Shala Dar. Class-12'!$A$2:$AE$201,24,0)","v":0}]
[null,null,"Village/Town/City ¼xzke@dLck@'kgj½ %"]
[null,null,"District ¼ftyk½ %",null,null,"………………………….",null,null,"STATE ¼jkT;½ %",null,null,"…………………………………..",{"$nulls":3},"PIN CODE NO. ¼fiu dksM ua-½ %",null,null,"……………………"]
[]
[null,"15-","fo|kFkhZ dk vk/kkj dkMZ uEcj %",{"$nulls":3},{"$f":"VLOOKUP(A206,'Deta From Shala Dar. Class-12'!$A$2:$AE$201,21,0)","v":{"v":0,"d":"0000"}},{"$nulls":3},"tu vk/kkj uEcj %",null,{"$f":"VLOOKUP(A206,'Deta From Shala Dar. Class-12'!$A$2:$AE$201,22,0)","v":0},null,null,"vfHkHkkod dh okf\"kZd vk; %",null,null,{"$f":"VLOOKUP(A206,'Deta From Shala Dar. Class-12'!$A$2:$AE$201,25,0)","v":{"v":0,"d":"₹ 0"}}]
[]
[null,null,"Student/Guardian's Mobile No. ¼fo|kFkhZ@vfHkHkkod dk eksckby uacj½ %",{"$nulls":9},{"$f":"VLOOKUP(A206,'Deta From Shala Dar. Class-12'!$A$2:$AE$201,23,0)","v":0}]
[]
[null,"16-","Previous Academic Details ¼iwoZ 'kS{kf.kd ;ksX;rk½ %",{"$nulls":9},"---------------------------------------------------------"]
[]
[null,"CLASS ¼d{kk½",null,null,"YEAR ¼oxZ½",null,"ROLL NO. ¼ukekad½",null,null,"RESULT ¼ifj.kke½",null,null,"NAME OF SCHOOL/BOARD ¼Ldwy@cksMZ dk uke½"]
[null,"X"]
[null,"XI"]
[null,"XII"]
[]
[null,"Nk= us ;fn d{kk X vU; cksMZ ls mRrh.kZ dh gS rks %& ¼ns[ksa fo’ks\"k funsZ’k la[;k 6½ ik=rk izek.k i= Øekad",{"$nulls":13},"fnukad"]
[]
[null,"17-","Student's Photo and Signature ¼fo|kFkhZ dk QksVks ,oa gLrk{kj½",{"$nulls":9}," "]
[{"$nulls":10},"Student's Signature ¼fo|kFkhZ ds gLrk{kj½"]
[{"$nulls":3},"PASTE PASSPORT\nSIZE PHOTO"]
[]
[]
[]
[]
[{"$nulls":11}," 'kkyk ç/kku dk çek.khdj.k %&\ngLrk{kj---------------------------------------------------------------"]
[]
[]
[]
[]
[null,"fo|ky; dk uke %&",null,null,{"$f":"Info!$C$7","v":"Govt. Sr. Sec. School Raimalwada"},{"$nulls":6}," 'kkyk dksM %&",null,{"$f":"Info!$C$10","v":1},{"$f":"Info!$D$10","v":7},{"$f":"Info!$E$10","v":0},{"$f":"Info!$F$10","v":1},{"$f":"Info!$G$10","v":7},{"$f":"Info!$H$10","v":5},{"$f":"Info!$I$10","v":1}]
[]
[{"$f":"A206+1","v":24}]
[null,{"$f":"CONCATENATE(Info!$B$7,Info!$C$7)","v":"School Name :-Govt. Sr. Sec. School Raimalwada"}]
[{"$nulls":3},"Board of Secondary Education, Rajasthan",{"$nulls":12},"Sr. (Reg.)"]
[{"$nulls":3}," Ekk/;fed f’k{kk cksMZ]jktLFkku ",{"$nulls":12},"fu;fer ijh{kkFkhZ"]
[null,"mPp ek/;fed ijh{kk",{"$nulls":3},"APPLICATION FORM FOR SENIOR SECONDARY EXAMINATION-2024",{"$nulls":7},{"$f":"Info!$C$10","v":1},{"$f":"Info!$D$10","v":7},{"$f":"Info!$E$10","v":0},{"$f":"Info!$F$10","v":1},{"$f":"Info!$G$10","v":7},{"$f":"Info!$H$10","v":5},{"$f":"Info!$I$10","v":1}]
[{"$nulls":5}," Ikjh{kk vkosnu i= mPp ek/;fed ijh{kk & 2024"]
[{"$nulls":13}," 'kkyk niZ.k Øekad %&",{"$nulls":3},{"$f":"Info!$C$9","v":12345}]
[null,"Scholar Reg. No. ¼LdkWyj jftLVj Øekad½",{"$nulls":5},{"$f":"VLOOKUP(A308,'Deta From Shala Dar. Class-12'!$A$2:$AE$201,4,0)","v":0}]
[null,"1- Student’s Name (fo|kFkhZ dk uke) :",{"$nulls":5},{"$f":"VLOOKUP(A308,'Deta From Shala Dar. Class-12'!$A$2:$AE$201,6,0)","v":0}]
[null,"2- Mother’s Name ¼ekrk dk uke) :",{"$nulls":5},{"$f":"VLOOKUP(A308,'Deta From Shala Dar. Class-12'!$A$2:$AE$201,8,0)","v":0}]
[null,"3- Father’s Name (firk dk uke) :",{"$nulls":5},{"$f":"VLOOKUP(A308,'Deta From Shala Dar. Class-12'!$A$2:$AE$201,9,0)","v":0}]
[null,"4- Category Code (Js.kh dksM) : ¼Js.kh p;u gsrq ihNs fy[ks fo’k\"sk funsZ’k la[;k 1 ns[ks½ Js.kh dk uke %&",{"$nulls":8},"………………………………………………….",{"$nulls":5},"dksM %&"]
[null,"5- Group & Subjects (oxZ ,o a fo\"k;): ( as apply)"]
[null,"Table - A : Only for category(dsoy Js.kh 1]2 , o 8 ds fy;s) (I)ALL SUBJECTS (1-lEiw.kZ fo\"k;), (II) DIVISION IMPROVEMENT (2-Js.kh lq/kkj) & (VIII) FACULTY CHANGE (8-oxZ ifjorZu)  OPTIONAL SUBJECTS oSdfYid fo\"k;) :"]
[]
[{"$nulls":3},"ARTS ¼dyk oxZ½ (1)",{"$nulls":3},"COMMERCE ¼okf.kT; oxZ½ (2)",{"$nulls":5},"SCIENCE ¼foKku oxZ½ (3A)",{"$nulls":3},"AGRICULTURE ¼d`f\"k oxZ½ (3B)"]
[null,null,"1………………………………………",{"$nulls":3},"1 Accountancy",{"$nulls":3},30,null,"1 Physics",null,null,40,"1 Agriculture",null,null,84]
[null,null,"2………………………………………",{"$nulls":3},"2 Buisness Studies",{"$nulls":3},31,null,"2 Chemistry",null,null,41,"2 Ag. Bio.",null,null,39]
[null,null,"3………………………………………",{"$nulls":3},"3………………………………………",{"$nulls":5},"3 …………………………….",{"$nulls":3},"3 ……………………………."]
[]
[]
[]
[{"$nulls":13},"ARTS",null,"((1))","1 ……………………………."]
[{"$nulls":3},"As Applicable ",{"$nulls":4},"tks ykxw gks½",{"$nulls":4},"COMMERCE",null,"((2))","2 ……………………………."]
[null,null,"ADDISTIONAL OPTIONAL SUBJECTS ¼vfrfjDr oSdfYid fo\"k;½ %",{"$nulls":10},"SCIENCE",null,"(3A)","3 ……………………………."]
[{"$nulls":13},"ARGRICULTURE",null,"(3B)","4 ……………………………."]
[{"$nulls":12},"1…………………………………………"]
[]
[]
[]
[null,"Table - B Only for category ¼dsoy Js.kh 4 o 6 ds fy,½ : ",{"$nulls":11},"ARTS",null,"((1))","1 ……………………………."]
[{"$nulls":3},"As Applicable ",{"$nulls":4},"tks ykxw gks½",{"$nulls":4},"COMMERCE",null,"((2))","2 ……………………………."]
[{"$nulls":3},"(IV) ADDITIONAL SUBJECTS ¼vfrfjDr fo\"k;½   (4)",{"$nulls":9},"SCIENCE",null,"((3A))","3 ……………………………."]
[{"$nulls":3},"(VI) MARKS IMPROVEMENT ¼vad lqFkkj½      (6)",{"$nulls":9},"AGRICULTURE",null,"((3B))","4 ……………………………."]
[]
[]
[{"$nulls":3},"As Applicable from Number 6 to 13 ¼Øekad 6 ls 13 rd tks ykxw gks",{"$nulls":9},"djsa½"]
[]
[null,"6-","Gender ¼fyax½ : (01) Male ¼iq:\"k½",{"$nulls":3},{"$f":"IF(W346=\"F\",\"\",\"Yes\")","v":"Yes"},"(02) FEMALE ¼efgyk½",null,null,{"$f":"IF(W346=\"M\",\"\",\"Yes\")","v":"Yes"},"Medium ¼ek/;e½ : (01) HINDI ¼fgUnh½",{"$nulls":3},{"$f":"IF(X346=\"Hindi\",\"Yes\",\"\")","v":"Yes"},"(02) ENGLISH ¼vaxzsth½",null,null,{"$f":"IF(X346=\"english\",\"Yes\",\"\")","v":""},null,null,{"$f":"VLOOKUP(A308,'Deta From Shala Dar. Class-12'!$A$2:$AE$201,10,0)","v":0},{"$f":"Info!$C$8","v":"Hindi"}]
[]
[null,"7-","CWSN-1 ¼Hkkx½ : ekufld eanrk (01)",{"$nulls":4},"vkWfVTe (02)",null,null,"lsfjcy iYlh (03)",null,null,"ekufld jksx (04)",null,null,"Jo.k ckf/kr (05)"]
[]
[null,null,"ewd fu'kDrrk (06)",null,null,"LisfLQd yfuZax fMl,fcfyfV (14)",{"$nulls":4},"ckSf)d fu'kDrrk (15)",{"$nulls":3},"efYViy LDysjksfll (16)",null,null,"cgq fu'kDrrk (21)"]
[]
[]
[null,"8-","CWSN-2 ¼Hkkx½ : n`f\"V ckf/kr (07)",{"$nulls":4},"vYi n`f\"V (08)",null,null,"pyu fu'kDrrk(09)",null,null,"dq\"B jksx (10)",null,null,"ckSukiu (11)"]
[]
[null,null,"rStkc fif³r (12)",null,null,"ekalis'kh nqfoZdkl ¼13½",{"$nulls":3},"ikfdZlkal jksx ¼17½",{"$nulls":3},"fgeksfQfy;k ¼18½",null,null,"FkSyslhfe;k ¼19½"]
[]
[null,null,",fufed@fLdy fMtht (20)",{"$nulls":3},"iksfy;ks@uoZ batjh ¼22½",{"$nulls":3},"lw;Zeq[kh ¼23½",{"$nulls":3}," @lSfud ¼24½"]
[]
[null,"9-","Name of Vocational Trade ¼O;kolkf;d VªsM dk uke½",{"$nulls":6},"………………………………………………………..",{"$nulls":5},"lgh dk fpUg yxk,aA"]
[null,null,"¼dsoy mu 'kkykvksa ds fy, tgka O;kolkf;d f'k{kk lapkfyr gS ,oa ftu fo|kfFkZ;ksa us d{kk 10 rFkk 11 oha esa O;kolkf;d ijh{kk mRrh.kZ dh gSA½"]
[null,null," (1) Automotive (101)",{"$nulls":3},"(2) Beauty & Wellness (102)",{"$nulls":3},"(3) Health Care (103)",{"$nulls":3},"(4) IT & ITES (104)",null,null,"(5) Retail (105)"]
[]
[null,null,"(6) Tourism & Hospitality (106)",{"$nulls":4},"(7) Apprel Made up Home Furnishing (108)",{"$nulls":5},"(8) Electronics & Hardware (109)"]
[]
[null,null," (9) Agriculture (110)",{"$nulls":3},"(10) Plumber (111)",{"$nulls":3},"(11) Telecom (112)"]
[]
[null,"10-","BPL ¼chih,y½ %",{"$nulls":4},"1- YES ¼gk¡½",null,{"$f":"IF(W367=\"N\",\"\",\"Yes\")","v":"Yes"},null,null,"2- NO ¼ugha¡½",null,{"$f":"IF(W367=\"Y\",\"\",\"Yes\")","v":"Yes"},{"$nulls":7},{"$f":"VLOOKUP(A308,'Deta From Shala Dar. Class-12'!$A$2:$AE$201,27,0)","v":0}]
[]
[null,"11-","vukFk oxZ %",{"$nulls":4},"1- YES ¼gk¡½",{"$nulls":4},"2- NO ¼ugha¡½"]
[]
[null,"12-","EWS ¼vkfFkZd n`f\"V ls detksj oxZ½ %",{"$nulls":4},"1- YES ¼gk¡½",{"$nulls":4},"2- NO ¼ugha¡½"]
[]
[null,"13-","CASTE ¼tkfr Js.kh½ %",null,null,"¼05½ Gen ¼lkekU;½",null,null,{"$f":"IF($W373=\"GEN\",\"YES\",\"\")","v":""},"¼06½ MINORITY ¼lkekU;vYi la[;d½",{"$nulls":3},{"$f":"IF($W373=\"MIN\",\"YES\",\"\")","v":""},"¼07½ SC ¼vuqlwfpr tkfr½",{"$nulls":4},{"$f":"IF($W373=\"SC\",\"YES\",\"\")","v":""},null,null,{"$f":"VLOOKUP(A308,'Deta From Shala Dar. Class-12'!$A$2:$AE$201,16,0)","v":0}]
[]
[{"$nulls":5},"¼08½ ST ¼vuqlwfpr tutkfr½",null,null,{"$f":"IF($W373=\"ST\",\"YES\",\"\")","v":""},"¼09½ OBC ¼vU; fiN³k oxZ½",{"$nulls":3},{"$f":"IF($W373=\"OBC\",\"YES\",\"\")","v":""},"¼10½ Special OBC ¼fo'ks\"k fiN³k oxZ½@MBC",{"$nulls":4},{"$f":"IF(OR($W373=\"MBC\",$W$67=\"SBC\"),\"YES\",\"\")","v":""}]
[null,"uksV%& Nk=o`fr@iqjLdkj mijksDr p;fur Js.kh ds vk/kj ij gh nh tk;sxhA"]
[]
[null,"14-","ADDRESS ¼fo|kFkhZ dk iw.kZ irk½ %&"]
[null,null,"House No./Street/Place Name ¼edku ua-@xyh ua-@LFkku½ %",{"$nulls":7},{"$f":"VLOOKUP(A308,'Deta From Shala Dar. Class-12'!$A$2:$AE$201,24,0)","v":0}]
[null,null,"Village/Town/City ¼xzke@dLck@'kgj½ %"]
[null,null,"District ¼ftyk½ %",null,null,"………………………….",null,null,"STATE ¼jkT;½ %",null,null,"…………………………………..",{"$nulls":3},"PIN CODE NO. ¼fiu dksM ua-½ %",null,null,"……………………"]
[]
[null,"15-","fo|kFkhZ dk vk/kkj dkMZ uEcj %",{"$nulls":3},{"$f":"VLOOKUP(A308,'Deta From Shala Dar. Class-12'!$A$2:$AE$201,21,0)","v":{"v":0,"d":"0000"}},{"$nulls":3},"tu vk/kkj uEcj %",null,{"$f":"VLOOKUP(A308,'Deta From Shala Dar. Class-12'!$A$2:$AE$201,22,0)","v":0},null,null,"vfHkHkkod dh okf\"kZd vk; %",null,null,{"$f":"VLOOKUP(A308,'Deta From Shala Dar. Class-12'!$A$2:$AE$201,25,0)","v":{"v":0,"d":"₹ 0"}}]
[]
[null,null,"Student/Guardian's Mobile No. ¼fo|kFkhZ@vfHkHkkod dk eksckby uacj½ %",{"$nulls":9},{"$f":"VLOOKUP(A308,'Deta From Shala Dar. Class-12'!$A$2:$AE$201,23,0)","v":0}]
[]
[null,"16-","Previous Academic Details ¼iwoZ 'kS{kf.kd ;ksX;rk½ %",{"$nulls":9},"---------------------------------------------------------"]
[]
[null,"CLASS ¼d{kk½",null,null,"YEAR ¼oxZ½",null,"ROLL NO. ¼ukekad½",null,null,"RESULT ¼ifj.kke½",null,null,"NAME OF SCHOOL/BOARD ¼Ldwy@cksMZ dk uke½"]
[null,"X"]
[null,"XI"]
[null,"XII"]
[]
[null,"Nk= us ;fn d{kk X vU; cksMZ ls mRrh.kZ dh gS rks %& ¼ns[ksa fo’ks\"k funsZ’k la[;k 6½ ik=rk izek.k i= Øekad",{"$nulls":13},"fnukad"]
[]
[null,"17-","Student's Photo and Signature ¼fo|kFkhZ dk QksVks ,oa gLrk{kj½",{"$nulls":9}," "]
[{"$nulls":10},"Student's Signature ¼fo|kFkhZ ds gLrk{kj½"]
[{"$nulls":3},"PASTE PASSPORT\nSIZE PHOTO"]
[]
[]
[]
[]
[{"$nulls":11}," 'kkyk ç/kku dk çek.khdj.k %&\ngLrk{kj---------------------------------------------------------------"]
[]
[]
[]
[]
[null,"fo|ky; dk uke %&",null,null,{"$f":"Info!$C$7","v":"Govt. Sr. Sec. School Raimalwada"},{"$nulls":6}," 'kkyk dksM %&",null,{"$f":"Info!$C$10","v":1},{"$f":"Info!$D$10","v":7},{"$f":"Info!$E$10","v":0},{"$f":"Info!$F$10","v":1},{"$f":"Info!$G$10","v":7},{"$f":"Info!$H$10","v":5},{"$f":"Info!$I$10","v":1}]
[]
[{"$f":"A308+1","v":25}]
[null,{"$f":"CONCATENATE(Info!$B$7,Info!$C$7)","v":"School Name :-Govt. Sr. Sec. School Raimalwada"}]
[{"$nulls":3},"Board of Secondary Education, Rajasthan",{"$nulls":12},"Sr. (Reg.)"]
[{"$nulls":3}," Ekk/;fed f’k{kk cksMZ]jktLFkku ",{"$nulls":12},"fu;fer ijh{kkFkhZ"]
[null,"mPp ek/;fed ijh{kk",{"$nulls":3},"APPLICATION FORM FOR SENIOR SECONDARY EXAMINATION-2024",{"$nulls":7},{"$f":"Info!$C$10","v":1},{"$f":"Info!$D$10","v":7},{"$f":"Info!$E$10","v":0},{"$f":"Info!$F$10","v":1},{"$f":"Info!$G$10","v":7},{"$f":"Info!$H$10","v":5},{"$f":"Info!$I$10","v":1}]
[{"$nulls":5}," Ikjh{kk vkosnu i= mPp ek/;fed ijh{kk & 2024"]
[{"$nulls":13}," 'kkyk niZ.k Øekad %&",{"$nulls":3},{"$f":"Info!$C$9","v":12345}]
[null,"Scholar Reg. No. ¼LdkWyj jftLVj Øekad½",{"$nulls":5},{"$f":"VLOOKUP(A410,'Deta From Shala Dar. Class-12'!$A$2:$AE$201,4,0)","v":0}]
[null,"1- Student’s Name (fo|kFkhZ dk uke) :",{"$nulls":5},{"$f":"VLOOKUP(A410,'Deta From Shala Dar. Class-12'!$A$2:$AE$201,6,0)","v":0}]
[null,"2- Mother’s Name ¼ekrk dk uke) :",{"$nulls":5},{"$f":"VLOOKUP(A410,'Deta From Shala Dar. Class-12'!$A$2:$AE$201,8,0)","v":0}]
[null,"3- Father’s Name (firk dk uke) :",{"$nulls":5},{"$f":"VLOOKUP(A410,'Deta From Shala Dar. Class-12'!$A$2:$AE$201,9,0)","v":0}]
[null,"4- Category Code (Js.kh dksM) : ¼Js.kh p;u gsrq ihNs fy[ks fo’k\"sk funsZ’k la[;k 1 ns[ks½ Js.kh dk uke %&",{"$nulls":8},"………………………………………………….",{"$nulls":5},"dksM %&"]
[null,"5- Group & Subjects (oxZ ,o a fo\"k;): ( as apply)"]
[null,"Table - A : Only for category(dsoy Js.kh 1]2 , o 8 ds fy;s) (I)ALL SUBJECTS (1-lEiw.kZ fo\"k;), (II) DIVISION IMPROVEMENT (2-Js.kh lq/kkj) & (VIII) FACULTY CHANGE (8-oxZ ifjorZu)  OPTIONAL SUBJECTS oSdfYid fo\"k;) :"]
[]
[{"$nulls":3},"ARTS ¼dyk oxZ½ (1)",{"$nulls":3},"COMMERCE ¼okf.kT; oxZ½ (2)",{"$nulls":5},"SCIENCE ¼foKku oxZ½ (3A)",{"$nulls":3},"AGRICULTURE ¼d`f\"k oxZ½ (3B)"]
[null,null,"1………………………………………",{"$nulls":3},"1 Accountancy",{"$nulls":3},30,null,"1 Physics",null,null,40,"1 Agriculture",null,null,84]
[null,null,"2………………………………………",{"$nulls":3},"2 Buisness Studies",{"$nulls":3},31,null,"2 Chemistry",null,null,41,"2 Ag. Bio.",null,null,39]
[null,null,"3………………………………………",{"$nulls":3},"3………………………………………",{"$nulls":5},"3 …………………………….",{"$nulls":3},"3 ……………………………."]
[]
[]
[]
[{"$nulls":13},"ARTS",null,"((1))","1 ……………………………."]
[{"$nulls":3},"As Applicable ",{"$nulls":4},"tks ykxw gks½",{"$nulls":4},"COMMERCE",null,"((2))","2 ……………………………."]
[null,null,"ADDISTIONAL OPTIONAL SUBJECTS ¼vfrfjDr oSdfYid fo\"k;½ %",{"$nulls":10},"SCIENCE",null,"(3A)","3 ……………………………."]
[{"$nulls":13},"ARGRICULTURE",null,"(3B)","4 ……………………………."]
[{"$nulls":12},"1…………………………………………"]
[]
[]
[]
[null,"Table - B Only for category ¼dsoy Js.kh 4 o 6 ds fy,½ : ",{"$nulls":11},"ARTS",null,"((1))","1 ……………………………."]
[{"$nulls":3},"As Applicable ",{"$nulls":4},"tks ykxw gks½",{"$nulls":4},"COMMERCE",null,"((2))","2 ……………………………."]
[{"$nulls":3},"(IV) ADDITIONAL SUBJECTS ¼vfrfjDr fo\"k;½   (4)",{"$nulls":9},"SCIENCE",null,"((3A))","3 ……………………………."]
[{"$nulls":3},"(VI) MARKS IMPROVEMENT ¼vad lqFkkj½      (6)",{"$nulls":9},"AGRICULTURE",null,"((3B))","4 ……………………………."]
[]
[]
[{"$nulls":3},"As Applicable from Number 6 to 13 ¼Øekad 6 ls 13 rd tks ykxw gks",{"$nulls":9},"djsa½"]
[]
[null,"6-","Gender ¼fyax½ : (01) Male ¼iq:\"k½",{"$nulls":3},{"$f":"IF(W448=\"F\",\"\",\"Yes\")","v":"Yes"},"(02) FEMALE ¼efgyk½",null,null,{"$f":"IF(W448=\"M\",\"\",\"Yes\")","v":"Yes"},"Medium ¼ek/;e½ : (01) HINDI ¼fgUnh½",{"$nulls":3},{"$f":"IF(X448=\"Hindi\",\"Yes\",\"\")","v":"Yes"},"(02) ENGLISH ¼vaxzsth½",null,null,{"$f":"IF(X448=\"english\",\"Yes\",\"\")","v":""},null,null,{"$f":"VLOOKUP(A410,'Deta From Shala Dar. Class-12'!$A$2:$AE$201,10,0)","v":0},{"$f":"Info!$C$8","v":"Hindi"}]
[]
[null,"7-","CWSN-1 ¼Hkkx½ : ekufld eanrk (01)",{"$nulls":4},"vkWfVTe (02)",null,null,"lsfjcy iYlh (03)",null,null,"ekufld jksx (04)",null,null,"Jo.k ckf/kr (05)"]
[]
[null,null,"ewd fu'kDrrk (06)",null,null,"LisfLQd yfuZax fMl,fcfyfV (14)",{"$nulls":4},"ckSf)d fu'kDrrk (15)",{"$nulls":3},"efYViy LDysjksfll (16)",null,null,"cgq fu'kDrrk (21)"]
[]
[]
[null,"8-","CWSN-2 ¼Hkkx½ : n`f\"V ckf/kr (07)",{"$nulls":4},"vYi n`f\"V (08)",null,null,"pyu fu'kDrrk(09)",null,null,"dq\"B jksx (10)",null,null,"ckSukiu (11)"]
[]
[null,null,"rStkc fif³r (12)",null,null,"ekalis'kh nqfoZdkl ¼13½",{"$nulls":3},"ikfdZlkal jksx ¼17½",{"$nulls":3},"fgeksfQfy;k ¼18½",null,null,"FkSyslhfe;k ¼19½"]
[]
[null,null,",fufed@fLdy fMtht (20)",{"$nulls":3},"iksfy;ks@uoZ batjh ¼22½",{"$nulls":3},"lw;Zeq[kh ¼23½",{"$nulls":3}," @lSfud ¼24½"]
[]
[null,"9-","Name of Vocational Trade ¼O;kolkf;d VªsM dk uke½",{"$nulls":6},"………………………………………………………..",{"$nulls":5},"lgh dk fpUg yxk,aA"]
[null,null,"¼dsoy mu 'kkykvksa ds fy, tgka O;kolkf;d f'k{kk lapkfyr gS ,oa ftu fo|kfFkZ;ksa us d{kk 10 rFkk 11 oha esa O;kolkf;d ijh{kk mRrh.kZ dh gSA½"]
[null,null," (1) Automotive (101)",{"$nulls":3},"(2) Beauty & Wellness (102)",{"$nulls":3},"(3) Health Care (103)",{"$nulls":3},"(4) IT & ITES (104)",null,null,"(5) Retail (105)"]
[]
[null,null,"(6) Tourism & Hospitality (106)",{"$nulls":4},"(7) Apprel Made up Home Furnishing (108)",{"$nulls":5},"(8) Electronics & Hardware (109)"]
[]
[null,null," (9) Agriculture (110)",{"$nulls":3},"(10) Plumber (111)",{"$nulls":3},"(11) Telecom (112)"]
[]
[null,"10-","BPL ¼chih,y½ %",{"$nulls":4},"1- YES ¼gk¡½",null,{"$f":"IF(W469=\"N\",\"\",\"Yes\")","v":"Yes"},null,null,"2- NO ¼ugha¡½",null,{"$f":"IF(W469=\"Y\",\"\",\"Yes\")","v":"Yes"},{"$nulls":7},{"$f":"VLOOKUP(A410,'Deta From Shala Dar. Class-12'!$A$2:$AE$201,27,0)","v":0}]
[]
[null,"11-","vukFk oxZ %",{"$nulls":4},"1- YES ¼gk¡½",{"$nulls":4},"2- NO ¼ugha¡½"]
[]
[null,"12-","EWS ¼vkfFkZd n`f\"V ls detksj oxZ½ %",{"$nulls":4},"1- YES ¼gk¡½",{"$nulls":4},"2- NO ¼ugha¡½"]
[]
[null,"13-","CASTE ¼tkfr Js.kh½ %",null,null,"¼05½ Gen ¼lkekU;½",null,null,{"$f":"IF($W475=\"GEN\",\"YES\",\"\")","v":""},"¼06½ MINORITY ¼lkekU;vYi la[;d½",{"$nulls":3},{"$f":"IF($W475=\"MIN\",\"YES\",\"\")","v":""},"¼07½ SC ¼vuqlwfpr tkfr½",{"$nulls":4},{"$f":"IF($W475=\"SC\",\"YES\",\"\")","v":""},null,null,{"$f":"VLOOKUP(A410,'Deta From Shala Dar. Class-12'!$A$2:$AE$201,16,0)","v":0}]
[]
[{"$nulls":5},"¼08½ ST ¼vuqlwfpr tutkfr½",null,null,{"$f":"IF($W475=\"ST\",\"YES\",\"\")","v":""},"¼09½ OBC ¼vU; fiN³k oxZ½",{"$nulls":3},{"$f":"IF($W475=\"OBC\",\"YES\",\"\")","v":""},"¼10½ Special OBC ¼fo'ks\"k fiN³k oxZ½@MBC",{"$nulls":4},{"$f":"IF(OR($W475=\"MBC\",$W$67=\"SBC\"),\"YES\",\"\")","v":""}]
[null,"uksV%& Nk=o`fr@iqjLdkj mijksDr p;fur Js.kh ds vk/kj ij gh nh tk;sxhA"]
[]
[null,"14-","ADDRESS ¼fo|kFkhZ dk iw.kZ irk½ %&"]
[null,null,"House No./Street/Place Name ¼edku ua-@xyh ua-@LFkku½ %",{"$nulls":7},{"$f":"VLOOKUP(A410,'Deta From Shala Dar. Class-12'!$A$2:$AE$201,24,0)","v":0}]
[null,null,"Village/Town/City ¼xzke@dLck@'kgj½ %"]
[null,null,"District ¼ftyk½ %",null,null,"………………………….",null,null,"STATE ¼jkT;½ %",null,null,"…………………………………..",{"$nulls":3},"PIN CODE NO. ¼fiu dksM ua-½ %",null,null,"……………………"]
[]
[null,"15-","fo|kFkhZ dk vk/kkj dkMZ uEcj %",{"$nulls":3},{"$f":"VLOOKUP(A410,'Deta From Shala Dar. Class-12'!$A$2:$AE$201,21,0)","v":{"v":0,"d":"0000"}},{"$nulls":3},"tu vk/kkj uEcj %",null,{"$f":"VLOOKUP(A410,'Deta From Shala Dar. Class-12'!$A$2:$AE$201,22,0)","v":0},null,null,"vfHkHkkod dh okf\"kZd vk; %",null,null,{"$f":"VLOOKUP(A410,'Deta From Shala Dar. Class-12'!$A$2:$AE$201,25,0)","v":{"v":0,"d":"₹ 0"}}]
[]
[null,null,"Student/Guardian's Mobile No. ¼fo|kFkhZ@vfHkHkkod dk eksckby uacj½ %",{"$nulls":9},{"$f":"VLOOKUP(A410,'Deta From Shala Dar. Class-12'!$A$2:$AE$201,23,0)","v":0}]
[]
[null,"16-","Previous Academic Details ¼iwoZ 'kS{kf.kd ;ksX;rk½ %",{"$nulls":9},"---------------------------------------------------------"]
[]
[null,"CLASS ¼d{kk½",null,null,"YEAR ¼oxZ½",null,"ROLL NO. ¼ukekad½",null,null,"RESULT ¼ifj.kke½",null,null,"NAME OF SCHOOL/BOARD ¼Ldwy@cksMZ dk uke½"]
[null,"X"]
[null,"XI"]
[null,"XII"]
[]
[null,"Nk= us ;fn d{kk X vU; cksMZ ls mRrh.kZ dh gS rks %& ¼ns[ksa fo’ks\"k funsZ’k la[;k 6½ ik=rk izek.k i= Øekad",{"$nulls":13},"fnukad"]
[]
[null,"17-","Student's Photo and Signature ¼fo|kFkhZ dk QksVks ,oa gLrk{kj½",{"$nulls":9}," "]
[{"$nulls":10},"Student's Signature ¼fo|kFkhZ ds gLrk{kj½"]
[{"$nulls":3},"PASTE PASSPORT\nSIZE PHOTO"]
[]
[]
[]
[]
[{"$nulls":11}," 'kkyk ç/kku dk çek.khdj.k %&\ngLrk{kj---------------------------------------------------------------"]
[]
[]
[]
[]
[null,"fo|ky; dk uke %&",null,null,{"$f":"Info!$C$7","v":"Govt. Sr. Sec. School Raimalwada"},{"$nulls":6}," 'kkyk dksM %&",null,{"$f":"Info!$C$10","v":1},{"$f":"Info!$D$10","v":7},{"$f":"Info!$E$10","v":0},{"$f":"Info!$F$10","v":1},{"$f":"Info!$G$10","v":7},{"$f":"Info!$H$10","v":5},{"$f":"Info!$I$10","v":1}]
[]
[{"$f":"A410+1","v":26}]
[null,{"$f":"CONCATENATE(Info!$B$7,Info!$C$7)","v":"School Name :-Govt. Sr. Sec. School Raimalwada"}]
[{"$nulls":3},"Board of Secondary Education, Rajasthan",{"$nulls":12},"Sr. (Reg.)"]
[{"$nulls":3}," Ekk/;fed f’k{kk cksMZ]jktLFkku ",{"$nulls":12},"fu;fer ijh{kkFkhZ"]
[null,"mPp ek/;fed ijh{kk",{"$nulls":3},"APPLICATION FORM FOR SENIOR SECONDARY EXAMINATION-2024",{"$nulls":7},{"$f":"Info!$C$10","v":1},{"$f":"Info!$D$10","v":7},{"$f":"Info!$E$10","v":0},{"$f":"Info!$F$10","v":1},{"$f":"Info!$G$10","v":7},{"$f":"Info!$H$10","v":5},{"$f":"Info!$I$10","v":1}]
[{"$nulls":5}," Ikjh{kk vkosnu i= mPp ek/;fed ijh{kk & 2024"]
[{"$nulls":13}," 'kkyk niZ.k Øekad %&",{"$nulls":3},{"$f":"Info!$C$9","v":12345}]
[null,"Scholar Reg. No. ¼LdkWyj jftLVj Øekad½",{"$nulls":5},{"$f":"VLOOKUP(A512,'Deta From Shala Dar. Class-12'!$A$2:$AE$201,4,0)","v":0}]
[null,"1- Student’s Name (fo|kFkhZ dk uke) :",{"$nulls":5},{"$f":"VLOOKUP(A512,'Deta From Shala Dar. Class-12'!$A$2:$AE$201,6,0)","v":0}]
[null,"2- Mother’s Name ¼ekrk dk uke) :",{"$nulls":5},{"$f":"VLOOKUP(A512,'Deta From Shala Dar. Class-12'!$A$2:$AE$201,8,0)","v":0}]
[null,"3- Father’s Name (firk dk uke) :",{"$nulls":5},{"$f":"VLOOKUP(A512,'Deta From Shala Dar. Class-12'!$A$2:$AE$201,9,0)","v":0}]
[null,"4- Category Code (Js.kh dksM) : ¼Js.kh p;u gsrq ihNs fy[ks fo’k\"sk funsZ’k la[;k 1 ns[ks½ Js.kh dk uke %&",{"$nulls":8},"………………………………………………….",{"$nulls":5},"dksM %&"]
[null,"5- Group & Subjects (oxZ ,o a fo\"k;): ( as apply)"]
[null,"Table - A : Only for category(dsoy Js.kh 1]2 , o 8 ds fy;s) (I)ALL SUBJECTS (1-lEiw.kZ fo\"k;), (II) DIVISION IMPROVEMENT (2-Js.kh lq/kkj) & (VIII) FACULTY CHANGE (8-oxZ ifjorZu)  OPTIONAL SUBJECTS oSdfYid fo\"k;) :"]
[]
[{"$nulls":3},"ARTS ¼dyk oxZ½ (1)",{"$nulls":3},"COMMERCE ¼okf.kT; oxZ½ (2)",{"$nulls":5},"SCIENCE ¼foKku oxZ½ (3A)",{"$nulls":3},"AGRICULTURE ¼d`f\"k oxZ½ (3B)"]
[null,null,"1………………………………………",{"$nulls":3},"1 Accountancy",{"$nulls":3},30,null,"1 Physics",null,null,40,"1 Agriculture",null,null,84]
[null,null,"2………………………………………",{"$nulls":3},"2 Buisness Studies",{"$nulls":3},31,null,"2 Chemistry",null,null,41,"2 Ag. Bio.",null,null,39]
[null,null,"3………………………………………",{"$nulls":3},"3………………………………………",{"$nulls":5},"3 …………………………….",{"$nulls":3},"3 ……………………………."]
[]
[]
[]
[{"$nulls":13},"ARTS",null,"((1))","1 ……………………………."]
[{"$nulls":3},"As Applicable ",{"$nulls":4},"tks ykxw gks½",{"$nulls":4},"COMMERCE",null,"((2))","2 ……………………………."]
[null,null,"ADDISTIONAL OPTIONAL SUBJECTS ¼vfrfjDr oSdfYid fo\"k;½ %",{"$nulls":10},"SCIENCE",null,"(3A)","3 ……………………………."]
[{"$nulls":13},"ARGRICULTURE",null,"(3B)","4 ……………………………."]
[{"$nulls":12},"1…………………………………………"]
[]
[]
[]
[null,"Table - B Only for category ¼dsoy Js.kh 4 o 6 ds fy,½ : ",{"$nulls":11},"ARTS",null,"((1))","1 ……………………………."]
[{"$nulls":3},"As Applicable ",{"$nulls":4},"tks ykxw gks½",{"$nulls":4},"COMMERCE",null,"((2))","2 ……………………………."]
[{"$nulls":3},"(IV) ADDITIONAL SUBJECTS ¼vfrfjDr fo\"k;½   (4)",{"$nulls":9},"SCIENCE",null,"((3A))","3 ……………………………."]
[{"$nulls":3},"(VI) MARKS IMPROVEMENT ¼vad lqFkkj½      (6)",{"$nulls":9},"AGRICULTURE",null,"((3B))","4 ……………………………."]
[]
[]
[{"$nulls":3},"As Applicable from Number 6 to 13 ¼Øekad 6 ls 13 rd tks ykxw gks",{"$nulls":9},"djsa½"]
[]
[null,"6-","Gender ¼fyax½ : (01) Male ¼iq:\"k½",{"$nulls":3},{"$f":"IF(W550=\"M\",\"Yes\",\"\")","v":""},"(02) FEMALE ¼efgyk½",null,null,{"$f":"IF(W550=\"F\",\"Yes\",\"\")","v":""},"Medium ¼ek/;e½ : (01) HINDI ¼fgUnh½",{"$nulls":3},{"$f":"IF(X550=\"Hindi\",\"Yes\",\"\")","v":"Yes"},"(02) ENGLISH ¼vaxzsth½",null,null,{"$f":"IF(X550=\"english\",\"Yes\",\"\")","v":""},null,null,{"$f":"VLOOKUP(A512,'Deta From Shala Dar. Class-12'!$A$2:$AE$201,10,0)","v":0},{"$f":"Info!$C$8","v":"Hindi"}]
[]
[null,"7-","CWSN-1 ¼Hkkx½ : ekufld eanrk (01)",{"$nulls":4},"vkWfVTe (02)",null,null,"lsfjcy iYlh (03)",null,null,"ekufld jksx (04)",null,null,"Jo.k ckf/kr (05)"]
[]
[null,null,"ewd fu'kDrrk (06)",null,null,"LisfLQd yfuZax fMl,fcfyfV (14)",{"$nulls":4},"ckSf)d fu'kDrrk (15)",{"$nulls":3},"efYViy LDysjksfll (16)",null,null,"cgq fu'kDrrk (21)"]
[]
[]
[null,"8-","CWSN-2 ¼Hkkx½ : n`f\"V ckf/kr (07)",{"$nulls":4},"vYi n`f\"V (08)",null,null,"pyu fu'kDrrk(09)",null,null,"dq\"B jksx (10)",null,null,"ckSukiu (11)"]
[]
[null,null,"rStkc fif³r (12)",null,null,"ekalis'kh nqfoZdkl ¼13½",{"$nulls":3},"ikfdZlkal jksx ¼17½",{"$nulls":3},"fgeksfQfy;k ¼18½",null,null,"FkSyslhfe;k ¼19½"]
[]
[null,null,",fufed@fLdy fMtht (20)",{"$nulls":3},"iksfy;ks@uoZ batjh ¼22½",{"$nulls":3},"lw;Zeq[kh ¼23½",{"$nulls":3}," @lSfud ¼24½"]
[]
[null,"9-","Name of Vocational Trade ¼O;kolkf;d VªsM dk uke½",{"$nulls":6},"………………………………………………………..",{"$nulls":5},"lgh dk fpUg yxk,aA"]
[null,null,"¼dsoy mu 'kkykvksa ds fy, tgka O;kolkf;d f'k{kk lapkfyr gS ,oa ftu fo|kfFkZ;ksa us d{kk 10 rFkk 11 oha esa O;kolkf;d ijh{kk mRrh.kZ dh gSA½"]
[null,null," (1) Automotive (101)",{"$nulls":3},"(2) Beauty & Wellness (102)",{"$nulls":3},"(3) Health Care (103)",{"$nulls":3},"(4) IT & ITES (104)",null,null,"(5) Retail (105)"]
[]
[null,null,"(6) Tourism & Hospitality (106)",{"$nulls":4},"(7) Apprel Made up Home Furnishing (108)",{"$nulls":5},"(8) Electronics & Hardware (109)"]
[]
[null,null," (9) Agriculture (110)",{"$nulls":3},"(10) Plumber (111)",{"$nulls":3},"(11) Telecom (112)"]
[]
[null,"10-","BPL ¼chih,y½ %",{"$nulls":4},"1- YES ¼gk¡½",null,{"$f":"IF(W571=\"N\",\"\",\"Yes\")","v":"Yes"},null,null,"2- NO ¼ugha¡½",null,{"$f":"IF(W571=\"Y\",\"\",\"Yes\")","v":"Yes"},{"$nulls":7},{"$f":"VLOOKUP(A512,'Deta From Shala Dar. Class-12'!$A$2:$AE$201,27,0)","v":0}]
[]
[null,"11-","vukFk oxZ %",{"$nulls":4},"1- YES ¼gk¡½",{"$nulls":4},"2- NO ¼ugha¡½"]
[]
[null,"12-","EWS ¼vkfFkZd n`f\"V ls detksj oxZ½ %",{"$nulls":4},"1- YES ¼gk¡½",{"$nulls":4},"2- NO ¼ugha¡½"]
[]
[null,"13-","CASTE ¼tkfr Js.kh½ %",null,null,"¼05½ Gen ¼lkekU;½",null,null,{"$f":"IF($W577=\"GEN\",\"YES\",\"\")","v":""},"¼06½ MINORITY ¼lkekU;vYi la[;d½",{"$nulls":3},{"$f":"IF($W577=\"MIN\",\"YES\",\"\")","v":""},"¼07½ SC ¼vuqlwfpr tkfr½",{"$nulls":4},{"$f":"IF($W577=\"SC\",\"YES\",\"\")","v":""},null,null,{"$f":"VLOOKUP(A512,'Deta From Shala Dar. Class-12'!$A$2:$AE$201,16,0)","v":0}]
[]
[{"$nulls":5},"¼08½ ST ¼vuqlwfpr tutkfr½",null,null,{"$f":"IF($W577=\"ST\",\"YES\",\"\")","v":""},"¼09½ OBC ¼vU; fiN³k oxZ½",{"$nulls":3},{"$f":"IF($W577=\"OBC\",\"YES\",\"\")","v":""},"¼10½ Special OBC ¼fo'ks\"k fiN³k oxZ½@MBC",{"$nulls":4},{"$f":"IF(OR($W577=\"MBC\",$W$67=\"SBC\"),\"YES\",\"\")","v":""}]
[null,"uksV%& Nk=o`fr@iqjLdkj mijksDr p;fur Js.kh ds vk/kj ij gh nh tk;sxhA"]
[]
[null,"14-","ADDRESS ¼fo|kFkhZ dk iw.kZ irk½ %&"]
[null,null,"House No./Street/Place Name ¼edku ua-@xyh ua-@LFkku½ %",{"$nulls":7},{"$f":"VLOOKUP(A512,'Deta From Shala Dar. Class-12'!$A$2:$AE$201,24,0)","v":0}]
[null,null,"Village/Town/City ¼xzke@dLck@'kgj½ %"]
[null,null,"District ¼ftyk½ %",null,null,"………………………….",null,null,"STATE ¼jkT;½ %",null,null,"…………………………………..",{"$nulls":3},"PIN CODE NO. ¼fiu dksM ua-½ %",null,null,"……………………"]
[]
[null,"15-","fo|kFkhZ dk vk/kkj dkMZ uEcj %",{"$nulls":3},{"$f":"VLOOKUP(A512,'Deta From Shala Dar. Class-12'!$A$2:$AE$201,21,0)","v":{"v":0,"d":"0000"}},{"$nulls":3},"tu vk/kkj uEcj %",null,{"$f":"VLOOKUP(A512,'Deta From Shala Dar. Class-12'!$A$2:$AE$201,22,0)","v":0},null,null,"vfHkHkkod dh okf\"kZd vk; %",null,null,{"$f":"VLOOKUP(A512,'Deta From Shala Dar. Class-12'!$A$2:$AE$201,25,0)","v":{"v":0,"d":"₹ 0"}}]
[]
[null,null,"Student/Guardian's Mobile No. ¼fo|kFkhZ@vfHkHkkod dk eksckby uacj½ %",{"$nulls":9},{"$f":"VLOOKUP(A512,'Deta From Shala Dar. Class-12'!$A$2:$AE$201,23,0)","v":0}]
[]
[null,"16-","Previous Academic Details ¼iwoZ 'kS{kf.kd ;ksX;rk½ %",{"$nulls":9},"---------------------------------------------------------"]
[]
[null,"CLASS ¼d{kk½",null,null,"YEAR ¼oxZ½",null,"ROLL NO. ¼ukekad½",null,null,"RESULT ¼ifj.kke½",null,null,"NAME OF SCHOOL/BOARD ¼Ldwy@cksMZ dk uke½"]
[null,"X"]
[null,"XI"]
[null,"XII"]
[]
[null,"Nk= us ;fn d{kk X vU; cksMZ ls mRrh.kZ dh gS rks %& ¼ns[ksa fo’ks\"k funsZ’k la[;k 6½ ik=rk izek.k i= Øekad",{"$nulls":13},"fnukad"]
[]
[null,"17-","Student's Photo and Signature ¼fo|kFkhZ dk QksVks ,oa gLrk{kj½",{"$nulls":9}," "]
[{"$nulls":10},"Student's Signature ¼fo|kFkhZ ds gLrk{kj½"]
[{"$nulls":3},"PASTE PASSPORT\nSIZE PHOTO"]
[]
[]
[]
[]
[{"$nulls":11}," 'kkyk ç/kku dk çek.khdj.k %&\ngLrk{kj---------------------------------------------------------------"]
[]
[]
[]
[]
[null,"fo|ky; dk uke %&",null,null,{"$f":"Info!$C$7","v":"Govt. Sr. Sec. School Raimalwada"},{"$nulls":6}," 'kkyk dksM %&",null,{"$f":"Info!$C$10","v":1},{"$f":"Info!$D$10","v":7},{"$f":"Info!$E$10","v":0},{"$f":"Info!$F$10","v":1},{"$f":"Info!$G$10","v":7},{"$f":"Info!$H$10","v":5},{"$f":"Info!$I$10","v":1}]
[]
[{"$f":"A512+1","v":27}]
[null,{"$f":"CONCATENATE(Info!$B$7,Info!$C$7)","v":"School Name :-Govt. Sr. Sec. School Raimalwada"}]
[{"$nulls":3},"Board of Secondary Education, Rajasthan",{"$nulls":12},"Sr. (Reg.)"]
[{"$nulls":3}," Ekk/;fed f’k{kk cksMZ]jktLFkku ",{"$nulls":12},"fu;fer ijh{kkFkhZ"]
[null,"mPp ek/;fed ijh{kk",{"$nulls":3},"APPLICATION FORM FOR SENIOR SECONDARY EXAMINATION-2024",{"$nulls":7},{"$f":"Info!$C$10","v":1},{"$f":"Info!$D$10","v":7},{"$f":"Info!$E$10","v":0},{"$f":"Info!$F$10","v":1},{"$f":"Info!$G$10","v":7},{"$f":"Info!$H$10","v":5},{"$f":"Info!$I$10","v":1}]
[{"$nulls":5}," Ikjh{kk vkosnu i= mPp ek/;fed ijh{kk & 2024"]
[{"$nulls":13}," 'kkyk niZ.k Øekad %&",{"$nulls":3},{"$f":"Info!$C$9","v":12345}]
[null,"Scholar Reg. No. ¼LdkWyj jftLVj Øekad½",{"$nulls":5},{"$f":"VLOOKUP(A614,'Deta From Shala Dar. Class-12'!$A$2:$AE$201,4,0)","v":0}]
[null,"1- Student’s Name (fo|kFkhZ dk uke) :",{"$nulls":5},{"$f":"VLOOKUP(A614,'Deta From Shala Dar. Class-12'!$A$2:$AE$201,6,0)","v":0}]
[null,"2- Mother’s Name ¼ekrk dk uke) :",{"$nulls":5},{"$f":"VLOOKUP(A614,'Deta From Shala Dar. Class-12'!$A$2:$AE$201,8,0)","v":0}]
[null,"3- Father’s Name (firk dk uke) :",{"$nulls":5},{"$f":"VLOOKUP(A614,'Deta From Shala Dar. Class-12'!$A$2:$AE$201,9,0)","v":0}]
[null,"4- Category Code (Js.kh dksM) : ¼Js.kh p;u gsrq ihNs fy[ks fo’k\"sk funsZ’k la[;k 1 ns[ks½ Js.kh dk uke %&",{"$nulls":8},"………………………………………………….",{"$nulls":5},"dksM %&"]
[null,"5- Group & Subjects (oxZ ,o a fo\"k;): ( as apply)"]
[null,"Table - A : Only for category(dsoy Js.kh 1]2 , o 8 ds fy;s) (I)ALL SUBJECTS (1-lEiw.kZ fo\"k;), (II) DIVISION IMPROVEMENT (2-Js.kh lq/kkj) & (VIII) FACULTY CHANGE (8-oxZ ifjorZu)  OPTIONAL SUBJECTS oSdfYid fo\"k;) :"]
[]
[{"$nulls":3},"ARTS ¼dyk oxZ½ (1)",{"$nulls":3},"COMMERCE ¼okf.kT; oxZ½ (2)",{"$nulls":5},"SCIENCE ¼foKku oxZ½ (3A)",{"$nulls":3},"AGRICULTURE ¼d`f\"k oxZ½ (3B)"]
[null,null,"1………………………………………",{"$nulls":3},"1 Accountancy",{"$nulls":3},30,null,"1 Physics",null,null,40,"1 Agriculture",null,null,84]
[null,null,"2………………………………………",{"$nulls":3},"2 Buisness Studies",{"$nulls":3},31,null,"2 Chemistry",null,null,41,"2 Ag. Bio.",null,null,39]
[null,null,"3………………………………………",{"$nulls":3},"3………………………………………",{"$nulls":5},"3 …………………………….",{"$nulls":3},"3 ……………………………."]
[]
[]
[]
[{"$nulls":13},"ARTS",null,"((1))","1 ……………………………."]
[{"$nulls":3},"As Applicable ",{"$nulls":4},"tks ykxw gks½",{"$nulls":4},"COMMERCE",null,"((2))","2 ……………………………."]
[null,null,"ADDISTIONAL OPTIONAL SUBJECTS ¼vfrfjDr oSdfYid fo\"k;½ %",{"$nulls":10},"SCIENCE",null,"(3A)","3 ……………………………."]
[{"$nulls":13},"ARGRICULTURE",null,"(3B)","4 ……………………………."]
[{"$nulls":12},"1…………………………………………"]
[]
[]
[]
[null,"Table - B Only for category ¼dsoy Js.kh 4 o 6 ds fy,½ : ",{"$nulls":11},"ARTS",null,"((1))","1 ……………………………."]
[{"$nulls":3},"As Applicable ",{"$nulls":4},"tks ykxw gks½",{"$nulls":4},"COMMERCE",null,"((2))","2 ……………………………."]
[{"$nulls":3},"(IV) ADDITIONAL SUBJECTS ¼vfrfjDr fo\"k;½   (4)",{"$nulls":9},"SCIENCE",null,"((3A))","3 ……………………………."]
[{"$nulls":3},"(VI) MARKS IMPROVEMENT ¼vad lqFkkj½      (6)",{"$nulls":9},"AGRICULTURE",null,"((3B))","4 ……………………………."]
[]
[]
[{"$nulls":3},"As Applicable from Number 6 to 13 ¼Øekad 6 ls 13 rd tks ykxw gks",{"$nulls":9},"djsa½"]
[]
[null,"6-","Gender ¼fyax½ : (01) Male ¼iq:\"k½",{"$nulls":3},{"$f":"IF(W652=\"M\",\"Yes\",\"\")","v":""},"(02) FEMALE ¼efgyk½",null,null,{"$f":"IF(W652=\"F\",\"Yes\",\"\")","v":""},"Medium ¼ek/;e½ : (01) HINDI ¼fgUnh½",{"$nulls":3},{"$f":"IF(X652=\"Hindi\",\"Yes\",\"\")","v":"Yes"},"(02) ENGLISH ¼vaxzsth½",null,null,{"$f":"IF(X652=\"english\",\"Yes\",\"\")","v":""},null,null,{"$f":"VLOOKUP(A614,'Deta From Shala Dar. Class-12'!$A$2:$AE$201,10,0)","v":0},{"$f":"Info!$C$8","v":"Hindi"}]
[]
[null,"7-","CWSN-1 ¼Hkkx½ : ekufld eanrk (01)",{"$nulls":4},"vkWfVTe (02)",null,null,"lsfjcy iYlh (03)",null,null,"ekufld jksx (04)",null,null,"Jo.k ckf/kr (05)"]
[]
[null,null,"ewd fu'kDrrk (06)",null,null,"LisfLQd yfuZax fMl,fcfyfV (14)",{"$nulls":4},"ckSf)d fu'kDrrk (15)",{"$nulls":3},"efYViy LDysjksfll (16)",null,null,"cgq fu'kDrrk (21)"]
[]
[]
[null,"8-","CWSN-2 ¼Hkkx½ : n`f\"V ckf/kr (07)",{"$nulls":4},"vYi n`f\"V (08)",null,null,"pyu fu'kDrrk(09)",null,null,"dq\"B jksx (10)",null,null,"ckSukiu (11)"]
[]
[null,null,"rStkc fif³r (12)",null,null,"ekalis'kh nqfoZdkl ¼13½",{"$nulls":3},"ikfdZlkal jksx ¼17½",{"$nulls":3},"fgeksfQfy;k ¼18½",null,null,"FkSyslhfe;k ¼19½"]
[]
[null,null,",fufed@fLdy fMtht (20)",{"$nulls":3},"iksfy;ks@uoZ batjh ¼22½",{"$nulls":3},"lw;Zeq[kh ¼23½",{"$nulls":3}," @lSfud ¼24½"]
[]
[null,"9-","Name of Vocational Trade ¼O;kolkf;d VªsM dk uke½",{"$nulls":6},"………………………………………………………..",{"$nulls":5},"lgh dk fpUg yxk,aA"]
[null,null,"¼dsoy mu 'kkykvksa ds fy, tgka O;kolkf;d f'k{kk lapkfyr gS ,oa ftu fo|kfFkZ;ksa us d{kk 10 rFkk 11 oha esa O;kolkf;d ijh{kk mRrh.kZ dh gSA½"]
[null,null," (1) Automotive (101)",{"$nulls":3},"(2) Beauty & Wellness (102)",{"$nulls":3},"(3) Health Care (103)",{"$nulls":3},"(4) IT & ITES (104)",null,null,"(5) Retail (105)"]
[]
[null,null,"(6) Tourism & Hospitality (106)",{"$nulls":4},"(7) Apprel Made up Home Furnishing (108)",{"$nulls":5},"(8) Electronics & Hardware (109)"]
[]
[null,null," (9) Agriculture (110)",{"$nulls":3},"(10) Plumber (111)",{"$nulls":3},"(11) Telecom (112)"]
[]
[null,"10-","BPL ¼chih,y½ %",{"$nulls":4},"1- YES ¼gk¡½",null,{"$f":"IF(W673=\"N\",\"\",\"Yes\")","v":"Yes"},null,null,"2- NO ¼ugha¡½",null,{"$f":"IF(W673=\"Y\",\"\",\"Yes\")","v":"Yes"},{"$nulls":7},{"$f":"VLOOKUP(A614,'Deta From Shala Dar. Class-12'!$A$2:$AE$201,27,0)","v":0}]
[]
[null,"11-","vukFk oxZ %",{"$nulls":4},"1- YES ¼gk¡½",{"$nulls":4},"2- NO ¼ugha¡½"]
[]
[null,"12-","EWS ¼vkfFkZd n`f\"V ls detksj oxZ½ %",{"$nulls":4},"1- YES ¼gk¡½",{"$nulls":4},"2- NO ¼ugha¡½"]
[]
[null,"13-","CASTE ¼tkfr Js.kh½ %",null,null,"¼05½ Gen ¼lkekU;½",null,null,{"$f":"IF($W679=\"GEN\",\"YES\",\"\")","v":""},"¼06½ MINORITY ¼lkekU;vYi la[;d½",{"$nulls":3},{"$f":"IF($W679=\"MIN\",\"YES\",\"\")","v":""},"¼07½ SC ¼vuqlwfpr tkfr½",{"$nulls":4},{"$f":"IF($W679=\"SC\",\"YES\",\"\")","v":""},null,null,{"$f":"VLOOKUP(A614,'Deta From Shala Dar. Class-12'!$A$2:$AE$201,16,0)","v":0}]
[]
[{"$nulls":5},"¼08½ ST ¼vuqlwfpr tutkfr½",null,null,{"$f":"IF($W679=\"ST\",\"YES\",\"\")","v":""},"¼09½ OBC ¼vU; fiN³k oxZ½",{"$nulls":3},{"$f":"IF($W679=\"OBC\",\"YES\",\"\")","v":""},"¼10½ Special OBC ¼fo'ks\"k fiN³k oxZ½@MBC",{"$nulls":4},{"$f":"IF(OR($W679=\"MBC\",$W$67=\"SBC\"),\"YES\",\"\")","v":""}]
[null,"uksV%& Nk=o`fr@iqjLdkj mijksDr p;fur Js.kh ds vk/kj ij gh nh tk;sxhA"]
[]
[null,"14-","ADDRESS ¼fo|kFkhZ dk iw.kZ irk½ %&"]
[null,null,"House No./Street/Place Name ¼edku ua-@xyh ua-@LFkku½ %",{"$nulls":7},{"$f":"VLOOKUP(A614,'Deta From Shala Dar. Class-12'!$A$2:$AE$201,24,0)","v":0}]
[null,null,"Village/Town/City ¼xzke@dLck@'kgj½ %"]
[null,null,"District ¼ftyk½ %",null,null,"………………………….",null,null,"STATE ¼jkT;½ %",null,null,"…………………………………..",{"$nulls":3},"PIN CODE NO. ¼fiu dksM ua-½ %",null,null,"……………………"]
[]
[null,"15-","fo|kFkhZ dk vk/kkj dkMZ uEcj %",{"$nulls":3},{"$f":"VLOOKUP(A614,'Deta From Shala Dar. Class-12'!$A$2:$AE$201,21,0)","v":{"v":0,"d":"0000"}},{"$nulls":3},"tu vk/kkj uEcj %",null,{"$f":"VLOOKUP(A614,'Deta From Shala Dar. Class-12'!$A$2:$AE$201,22,0)","v":0},null,null,"vfHkHkkod dh okf\"kZd vk; %",null,null,{"$f":"VLOOKUP(A614,'Deta From Shala Dar. Class-12'!$A$2:$AE$201,25,0)","v":{"v":0,"d":"₹ 0"}}]
[]
[null,null,"Student/Guardian's Mobile No. ¼fo|kFkhZ@vfHkHkkod dk eksckby uacj½ %",{"$nulls":9},{"$f":"VLOOKUP(A614,'Deta From Shala Dar. Class-12'!$A$2:$AE$201,23,0)","v":0}]
[]
[null,"16-","Previous Academic Details ¼iwoZ 'kS{kf.kd ;ksX;rk½ %",{"$nulls":9},"---------------------------------------------------------"]
[]
[null,"CLASS ¼d{kk½",null,null,"YEAR ¼oxZ½",null,"ROLL NO. ¼ukekad½",null,null,"RESULT ¼ifj.kke½",null,null,"NAME OF SCHOOL/BOARD ¼Ldwy@cksMZ dk uke½"]
[null,"X"]
[null,"XI"]
[null,"XII"]
[]
[null,"Nk= us ;fn d{kk X vU; cksMZ ls mRrh.kZ dh gS rks %& ¼ns[ksa fo’ks\"k funsZ’k la[;k 6½ ik=rk izek.k i= Øekad",{"$nulls":13},"fnukad"]
[]
[null,"17-","Student's Photo and Signature ¼fo|kFkhZ dk QksVks ,oa gLrk{kj½",{"$nulls":9}," "]
[{"$nulls":10},"Student's Signature ¼fo|kFkhZ ds gLrk{kj½"]
[{"$nulls":3},"PASTE PASSPORT\nSIZE PHOTO"]
[]
[]
[]
[]
[{"$nulls":11}," 'kkyk ç/kku dk çek.khdj.k %&\ngLrk{kj---------------------------------------------------------------"]
[]
[]
[]
[]
[null,"fo|ky; dk uke %&",null,null,{"$f":"Info!$C$7","v":"Govt. Sr. Sec. School Raimalwada"},{"$nulls":6}," 'kkyk dksM %&",null,{"$f":"Info!$C$10","v":1},{"$f":"Info!$D$10","v":7},{"$f":"Info!$E$10","v":0},{"$f":"Info!$F$10","v":1},{"$f":"Info!$G$10","v":7},{"$f":"Info!$H$10","v":5},{"$f":"Info!$I$10","v":1}]
[]
[{"$f":"A614+1","v":28}]
[null,{"$f":"CONCATENATE(Info!$B$7,Info!$C$7)","v":"School Name :-Govt. Sr. Sec. School Raimalwada"}]
[{"$nulls":3},"Board of Secondary Education, Rajasthan",{"$nulls":12},"Sr. (Reg.)"]
[{"$nulls":3}," Ekk/;fed f’k{kk cksMZ]jktLFkku ",{"$nulls":12},"fu;fer ijh{kkFkhZ"]
[null,"mPp ek/;fed ijh{kk",{"$nulls":3},"APPLICATION FORM FOR SENIOR SECONDARY EXAMINATION-2024",{"$nulls":7},{"$f":"Info!$C$10","v":1},{"$f":"Info!$D$10","v":7},{"$f":"Info!$E$10","v":0},{"$f":"Info!$F$10","v":1},{"$f":"Info!$G$10","v":7},{"$f":"Info!$H$10","v":5},{"$f":"Info!$I$10","v":1}]
[{"$nulls":5}," Ikjh{kk vkosnu i= mPp ek/;fed ijh{kk & 2024"]
[{"$nulls":13}," 'kkyk niZ.k Øekad %&",{"$nulls":3},{"$f":"Info!$C$9","v":12345}]
[null,"Scholar Reg. No. ¼LdkWyj jftLVj Øekad½",{"$nulls":5},{"$f":"VLOOKUP(A716,'Deta From Shala Dar. Class-12'!$A$2:$AE$201,4,0)","v":0}]
[null,"1- Student’s Name (fo|kFkhZ dk uke) :",{"$nulls":5},{"$f":"VLOOKUP(A716,'Deta From Shala Dar. Class-12'!$A$2:$AE$201,6,0)","v":0}]
[null,"2- Mother’s Name ¼ekrk dk uke) :",{"$nulls":5},{"$f":"VLOOKUP(A716,'Deta From Shala Dar. Class-12'!$A$2:$AE$201,8,0)","v":0}]
[null,"3- Father’s Name (firk dk uke) :",{"$nulls":5},{"$f":"VLOOKUP(A716,'Deta From Shala Dar. Class-12'!$A$2:$AE$201,9,0)","v":0}]
[null,"4- Category Code (Js.kh dksM) : ¼Js.kh p;u gsrq ihNs fy[ks fo’k\"sk funsZ’k la[;k 1 ns[ks½ Js.kh dk uke %&",{"$nulls":8},"………………………………………………….",{"$nulls":5},"dksM %&"]
[null,"5- Group & Subjects (oxZ ,o a fo\"k;): ( as apply)"]
[null,"Table - A : Only for category(dsoy Js.kh 1]2 , o 8 ds fy;s) (I)ALL SUBJECTS (1-lEiw.kZ fo\"k;), (II) DIVISION IMPROVEMENT (2-Js.kh lq/kkj) & (VIII) FACULTY CHANGE (8-oxZ ifjorZu)  OPTIONAL SUBJECTS oSdfYid fo\"k;) :"]
[]
[{"$nulls":3},"ARTS ¼dyk oxZ½ (1)",{"$nulls":3},"COMMERCE ¼okf.kT; oxZ½ (2)",{"$nulls":5},"SCIENCE ¼foKku oxZ½ (3A)",{"$nulls":3},"AGRICULTURE ¼d`f\"k oxZ½ (3B)"]
[null,null,"1………………………………………",{"$nulls":3},"1 Accountancy",{"$nulls":3},30,null,"1 Physics",null,null,40,"1 Agriculture",null,null,84]
[null,null,"2………………………………………",{"$nulls":3},"2 Buisness Studies",{"$nulls":3},31,null,"2 Chemistry",null,null,41,"2 Ag. Bio.",null,null,39]
[null,null,"3………………………………………",{"$nulls":3},"3………………………………………",{"$nulls":5},"3 …………………………….",{"$nulls":3},"3 ……………………………."]
[]
[]
[]
[{"$nulls":13},"ARTS",null,"((1))","1 ……………………………."]
[{"$nulls":3},"As Applicable ",{"$nulls":4},"tks ykxw gks½",{"$nulls":4},"COMMERCE",null,"((2))","2 ……………………………."]
[null,null,"ADDISTIONAL OPTIONAL SUBJECTS ¼vfrfjDr oSdfYid fo\"k;½ %",{"$nulls":10},"SCIENCE",null,"(3A)","3 ……………………………."]
[{"$nulls":13},"ARGRICULTURE",null,"(3B)","4 ……………………………."]
[{"$nulls":12},"1…………………………………………"]
[]
[]
[]
[null,"Table - B Only for category ¼dsoy Js.kh 4 o 6 ds fy,½ : ",{"$nulls":11},"ARTS",null,"((1))","1 ……………………………."]
[{"$nulls":3},"As Applicable ",{"$nulls":4},"tks ykxw gks½",{"$nulls":4},"COMMERCE",null,"((2))","2 ……………………………."]
[{"$nulls":3},"(IV) ADDITIONAL SUBJECTS ¼vfrfjDr fo\"k;½   (4)",{"$nulls":9},"SCIENCE",null,"((3A))","3 ……………………………."]
[{"$nulls":3},"(VI) MARKS IMPROVEMENT ¼vad lqFkkj½      (6)",{"$nulls":9},"AGRICULTURE",null,"((3B))","4 ……………………………."]
[]
[]
[{"$nulls":3},"As Applicable from Number 6 to 13 ¼Øekad 6 ls 13 rd tks ykxw gks",{"$nulls":9},"djsa½"]
[]
[null,"6-","Gender ¼fyax½ : (01) Male ¼iq:\"k½",{"$nulls":3},{"$f":"IF(W754=\"F\",\"\",\"Yes\")","v":"Yes"},"(02) FEMALE ¼efgyk½",null,null,{"$f":"IF(W754=\"M\",\"\",\"Yes\")","v":"Yes"},"Medium ¼ek/;e½ : (01) HINDI ¼fgUnh½",{"$nulls":3},{"$f":"IF(X754=\"Hindi\",\"Yes\",\"\")","v":"Yes"},"(02) ENGLISH ¼vaxzsth½",null,null,{"$f":"IF(X754=\"english\",\"Yes\",\"\")","v":""},null,null,{"$f":"VLOOKUP(A716,'Deta From Shala Dar. Class-12'!$A$2:$AE$201,10,0)","v":0},{"$f":"Info!$C$8","v":"Hindi"}]
[]
[null,"7-","CWSN-1 ¼Hkkx½ : ekufld eanrk (01)",{"$nulls":4},"vkWfVTe (02)",null,null,"lsfjcy iYlh (03)",null,null,"ekufld jksx (04)",null,null,"Jo.k ckf/kr (05)"]
[]
[null,null,"ewd fu'kDrrk (06)",null,null,"LisfLQd yfuZax fMl,fcfyfV (14)",{"$nulls":4},"ckSf)d fu'kDrrk (15)",{"$nulls":3},"efYViy LDysjksfll (16)",null,null,"cgq fu'kDrrk (21)"]
[]
[]
[null,"8-","CWSN-2 ¼Hkkx½ : n`f\"V ckf/kr (07)",{"$nulls":4},"vYi n`f\"V (08)",null,null,"pyu fu'kDrrk(09)",null,null,"dq\"B jksx (10)",null,null,"ckSukiu (11)"]
[]
[null,null,"rStkc fif³r (12)",null,null,"ekalis'kh nqfoZdkl ¼13½",{"$nulls":3},"ikfdZlkal jksx ¼17½",{"$nulls":3},"fgeksfQfy;k ¼18½",null,null,"FkSyslhfe;k ¼19½"]
[]
[null,null,",fufed@fLdy fMtht (20)",{"$nulls":3},"iksfy;ks@uoZ batjh ¼22½",{"$nulls":3},"lw;Zeq[kh ¼23½",{"$nulls":3}," @lSfud ¼24½"]
[]
[null,"9-","Name of Vocational Trade ¼O;kolkf;d VªsM dk uke½",{"$nulls":6},"………………………………………………………..",{"$nulls":5},"lgh dk fpUg yxk,aA"]
[null,null,"¼dsoy mu 'kkykvksa ds fy, tgka O;kolkf;d f'k{kk lapkfyr gS ,oa ftu fo|kfFkZ;ksa us d{kk 10 rFkk 11 oha esa O;kolkf;d ijh{kk mRrh.kZ dh gSA½"]
[null,null," (1) Automotive (101)",{"$nulls":3},"(2) Beauty & Wellness (102)",{"$nulls":3},"(3) Health Care (103)",{"$nulls":3},"(4) IT & ITES (104)",null,null,"(5) Retail (105)"]
[]
[null,null,"(6) Tourism & Hospitality (106)",{"$nulls":4},"(7) Apprel Made up Home Furnishing (108)",{"$nulls":5},"(8) Electronics & Hardware (109)"]
[]
[null,null," (9) Agriculture (110)",{"$nulls":3},"(10) Plumber (111)",{"$nulls":3},"(11) Telecom (112)"]
[]
[null,"10-","BPL ¼chih,y½ %",{"$nulls":4},"1- YES ¼gk¡½",null,{"$f":"IF(W775=\"N\",\"\",\"Yes\")","v":"Yes"},null,null,"2- NO ¼ugha¡½",null,{"$f":"IF(W775=\"Y\",\"\",\"Yes\")","v":"Yes"},{"$nulls":7},{"$f":"VLOOKUP(A716,'Deta From Shala Dar. Class-12'!$A$2:$AE$201,27,0)","v":0}]
[]
[null,"11-","vukFk oxZ %",{"$nulls":4},"1- YES ¼gk¡½",{"$nulls":4},"2- NO ¼ugha¡½"]
[]
[null,"12-","EWS ¼vkfFkZd n`f\"V ls detksj oxZ½ %",{"$nulls":4},"1- YES ¼gk¡½",{"$nulls":4},"2- NO ¼ugha¡½"]
[]
[null,"13-","CASTE ¼tkfr Js.kh½ %",null,null,"¼05½ Gen ¼lkekU;½",null,null,{"$f":"IF($W781=\"GEN\",\"YES\",\"\")","v":""},"¼06½ MINORITY ¼lkekU;vYi la[;d½",{"$nulls":3},{"$f":"IF($W781=\"MIN\",\"YES\",\"\")","v":""},"¼07½ SC ¼vuqlwfpr tkfr½",{"$nulls":4},{"$f":"IF($W781=\"SC\",\"YES\",\"\")","v":""},null,null,{"$f":"VLOOKUP(A716,'Deta From Shala Dar. Class-12'!$A$2:$AE$201,16,0)","v":0}]
[]
[{"$nulls":5},"¼08½ ST ¼vuqlwfpr tutkfr½",null,null,{"$f":"IF($W781=\"ST\",\"YES\",\"\")","v":""},"¼09½ OBC ¼vU; fiN³k oxZ½",{"$nulls":3},{"$f":"IF($W781=\"OBC\",\"YES\",\"\")","v":""},"¼10½ Special OBC ¼fo'ks\"k fiN³k oxZ½@MBC",{"$nulls":4},{"$f":"IF(OR($W781=\"MBC\",$W$67=\"SBC\"),\"YES\",\"\")","v":""}]
[null,"uksV%& Nk=o`fr@iqjLdkj mijksDr p;fur Js.kh ds vk/kj ij gh nh tk;sxhA"]
[]
[null,"14-","ADDRESS ¼fo|kFkhZ dk iw.kZ irk½ %&"]
[null,null,"House No./Street/Place Name ¼edku ua-@xyh ua-@LFkku½ %",{"$nulls":7},{"$f":"VLOOKUP(A716,'Deta From Shala Dar. Class-12'!$A$2:$AE$201,24,0)","v":0}]
[null,null,"Village/Town/City ¼xzke@dLck@'kgj½ %"]
[null,null,"District ¼ftyk½ %",null,null,"………………………….",null,null,"STATE ¼jkT;½ %",null,null,"…………………………………..",{"$nulls":3},"PIN CODE NO. ¼fiu dksM ua-½ %",null,null,"……………………"]
[]
[null,"15-","fo|kFkhZ dk vk/kkj dkMZ uEcj %",{"$nulls":3},{"$f":"VLOOKUP(A716,'Deta From Shala Dar. Class-12'!$A$2:$AE$201,21,0)","v":{"v":0,"d":"0000"}},{"$nulls":3},"tu vk/kkj uEcj %",null,{"$f":"VLOOKUP(A716,'Deta From Shala Dar. Class-12'!$A$2:$AE$201,22,0)","v":0},null,null,"vfHkHkkod dh okf\"kZd vk; %",null,null,{"$f":"VLOOKUP(A716,'Deta From Shala Dar. Class-12'!$A$2:$AE$201,25,0)","v":{"v":0,"d":"₹ 0"}}]
[]
[null,null,"Student/Guardian's Mobile No. ¼fo|kFkhZ@vfHkHkkod dk eksckby uacj½ %",{"$nulls":9},{"$f":"VLOOKUP(A716,'Deta From Shala Dar. Class-12'!$A$2:$AE$201,23,0)","v":0}]
[]
[null,"16-","Previous Academic Details ¼iwoZ 'kS{kf.kd ;ksX;rk½ %",{"$nulls":9},"---------------------------------------------------------"]
[]
[null,"CLASS ¼d{kk½",null,null,"YEAR ¼oxZ½",null,"ROLL NO. ¼ukekad½",null,null,"RESULT ¼ifj.kke½",null,null,"NAME OF SCHOOL/BOARD ¼Ldwy@cksMZ dk uke½"]
[null,"X"]
[null,"XI"]
[null,"XII"]
[]
[null,"Nk= us ;fn d{kk X vU; cksMZ ls mRrh.kZ dh gS rks %& ¼ns[ksa fo’ks\"k funsZ’k la[;k 6½ ik=rk izek.k i= Øekad",{"$nulls":13},"fnukad"]
[]
[null,"17-","Student's Photo and Signature ¼fo|kFkhZ dk QksVks ,oa gLrk{kj½",{"$nulls":9}," "]
[{"$nulls":10},"Student's Signature ¼fo|kFkhZ ds gLrk{kj½"]
[{"$nulls":3},"PASTE PASSPORT\nSIZE PHOTO"]
[]
[]
[]
[]
[{"$nulls":11}," 'kkyk ç/kku dk çek.khdj.k %&\ngLrk{kj---------------------------------------------------------------"]
[]
[]
[]
[]
[null,"fo|ky; dk uke %&",null,null,{"$f":"Info!$C$7","v":"Govt. Sr. Sec. School Raimalwada"},{"$nulls":6}," 'kkyk dksM %&",null,{"$f":"Info!$C$10","v":1},{"$f":"Info!$D$10","v":7},{"$f":"Info!$E$10","v":0},{"$f":"Info!$F$10","v":1},{"$f":"Info!$G$10","v":7},{"$f":"Info!$H$10","v":5},{"$f":"Info!$I$10","v":1}]
[]
[{"$f":"A716+1","v":29}]
[null,{"$f":"CONCATENATE(Info!$B$7,Info!$C$7)","v":"School Name :-Govt. Sr. Sec. School Raimalwada"}]
[{"$nulls":3},"Board of Secondary Education, Rajasthan",{"$nulls":12},"Sr. (Reg.)"]
[{"$nulls":3}," Ekk/;fed f’k{kk cksMZ]jktLFkku ",{"$nulls":12},"fu;fer ijh{kkFkhZ"]
[null,"mPp ek/;fed ijh{kk",{"$nulls":3},"APPLICATION FORM FOR SENIOR SECONDARY EXAMINATION-2024",{"$nulls":7},{"$f":"Info!$C$10","v":1},{"$f":"Info!$D$10","v":7},{"$f":"Info!$E$10","v":0},{"$f":"Info!$F$10","v":1},{"$f":"Info!$G$10","v":7},{"$f":"Info!$H$10","v":5},{"$f":"Info!$I$10","v":1}]
[{"$nulls":5}," Ikjh{kk vkosnu i= mPp ek/;fed ijh{kk & 2024"]
[{"$nulls":13}," 'kkyk niZ.k Øekad %&",{"$nulls":3},{"$f":"Info!$C$9","v":12345}]
[null,"Scholar Reg. No. ¼LdkWyj jftLVj Øekad½",{"$nulls":5},{"$f":"VLOOKUP(A818,'Deta From Shala Dar. Class-12'!$A$2:$AE$201,4,0)","v":0}]
[null,"1- Student’s Name (fo|kFkhZ dk uke) :",{"$nulls":5},{"$f":"VLOOKUP(A818,'Deta From Shala Dar. Class-12'!$A$2:$AE$201,6,0)","v":0}]
[null,"2- Mother’s Name ¼ekrk dk uke) :",{"$nulls":5},{"$f":"VLOOKUP(A818,'Deta From Shala Dar. Class-12'!$A$2:$AE$201,8,0)","v":0}]
[null,"3- Father’s Name (firk dk uke) :",{"$nulls":5},{"$f":"VLOOKUP(A818,'Deta From Shala Dar. Class-12'!$A$2:$AE$201,9,0)","v":0}]
[null,"4- Category Code (Js.kh dksM) : ¼Js.kh p;u gsrq ihNs fy[ks fo’k\"sk funsZ’k la[;k 1 ns[ks½ Js.kh dk uke %&",{"$nulls":8},"………………………………………………….",{"$nulls":5},"dksM %&"]
[null,"5- Group & Subjects (oxZ ,o a fo\"k;): ( as apply)"]
[null,"Table - A : Only for category(dsoy Js.kh 1]2 , o 8 ds fy;s) (I)ALL SUBJECTS (1-lEiw.kZ fo\"k;), (II) DIVISION IMPROVEMENT (2-Js.kh lq/kkj) & (VIII) FACULTY CHANGE (8-oxZ ifjorZu)  OPTIONAL SUBJECTS oSdfYid fo\"k;) :"]
[]
[{"$nulls":3},"ARTS ¼dyk oxZ½ (1)",{"$nulls":3},"COMMERCE ¼okf.kT; oxZ½ (2)",{"$nulls":5},"SCIENCE ¼foKku oxZ½ (3A)",{"$nulls":3},"AGRICULTURE ¼d`f\"k oxZ½ (3B)"]
[null,null,"1………………………………………",{"$nulls":3},"1 Accountancy",{"$nulls":3},30,null,"1 Physics",null,null,40,"1 Agriculture",null,null,84]
[null,null,"2………………………………………",{"$nulls":3},"2 Buisness Studies",{"$nulls":3},31,null,"2 Chemistry",null,null,41,"2 Ag. Bio.",null,null,39]
[null,null,"3………………………………………",{"$nulls":3},"3………………………………………",{"$nulls":5},"3 …………………………….",{"$nulls":3},"3 ……………………………."]
[]
[]
[]
[{"$nulls":13},"ARTS",null,"((1))","1 ……………………………."]
[{"$nulls":3},"As Applicable ",{"$nulls":4},"tks ykxw gks½",{"$nulls":4},"COMMERCE",null,"((2))","2 ……………………………."]
[null,null,"ADDISTIONAL OPTIONAL SUBJECTS ¼vfrfjDr oSdfYid fo\"k;½ %",{"$nulls":10},"SCIENCE",null,"(3A)","3 ……………………………."]
[{"$nulls":13},"ARGRICULTURE",null,"(3B)","4 ……………………………."]
[{"$nulls":12},"1…………………………………………"]
[]
[]
[]
[null,"Table - B Only for category ¼dsoy Js.kh 4 o 6 ds fy,½ : ",{"$nulls":11},"ARTS",null,"((1))","1 ……………………………."]
[{"$nulls":3},"As Applicable ",{"$nulls":4},"tks ykxw gks½",{"$nulls":4},"COMMERCE",null,"((2))","2 ……………………………."]
[{"$nulls":3},"(IV) ADDITIONAL SUBJECTS ¼vfrfjDr fo\"k;½   (4)",{"$nulls":9},"SCIENCE",null,"((3A))","3 ……………………………."]
[{"$nulls":3},"(VI) MARKS IMPROVEMENT ¼vad lqFkkj½      (6)",{"$nulls":9},"AGRICULTURE",null,"((3B))","4 ……………………………."]
[]
[]
[{"$nulls":3},"As Applicable from Number 6 to 13 ¼Øekad 6 ls 13 rd tks ykxw gks",{"$nulls":9},"djsa½"]
[]
[null,"6-","Gender ¼fyax½ : (01) Male ¼iq:\"k½",{"$nulls":3},{"$f":"IF(W856=\"F\",\"\",\"Yes\")","v":"Yes"},"(02) FEMALE ¼efgyk½",null,null,{"$f":"IF(W856=\"M\",\"\",\"Yes\")","v":"Yes"},"Medium ¼ek/;e½ : (01) HINDI ¼fgUnh½",{"$nulls":3},{"$f":"IF(X856=\"Hindi\",\"Yes\",\"\")","v":"Yes"},"(02) ENGLISH ¼vaxzsth½",null,null,{"$f":"IF(X856=\"english\",\"Yes\",\"\")","v":""},null,null,{"$f":"VLOOKUP(A818,'Deta From Shala Dar. Class-12'!$A$2:$AE$201,10,0)","v":0},{"$f":"Info!$C$8","v":"Hindi"}]
[]
[null,"7-","CWSN-1 ¼Hkkx½ : ekufld eanrk (01)",{"$nulls":4},"vkWfVTe (02)",null,null,"lsfjcy iYlh (03)",null,null,"ekufld jksx (04)",null,null,"Jo.k ckf/kr (05)"]
[]
[null,null,"ewd fu'kDrrk (06)",null,null,"LisfLQd yfuZax fMl,fcfyfV (14)",{"$nulls":4},"ckSf)d fu'kDrrk (15)",{"$nulls":3},"efYViy LDysjksfll (16)",null,null,"cgq fu'kDrrk (21)"]
[]
[]
[null,"8-","CWSN-2 ¼Hkkx½ : n`f\"V ckf/kr (07)",{"$nulls":4},"vYi n`f\"V (08)",null,null,"pyu fu'kDrrk(09)",null,null,"dq\"B jksx (10)",null,null,"ckSukiu (11)"]
[]
[null,null,"rStkc fif³r (12)",null,null,"ekalis'kh nqfoZdkl ¼13½",{"$nulls":3},"ikfdZlkal jksx ¼17½",{"$nulls":3},"fgeksfQfy;k ¼18½",null,null,"FkSyslhfe;k ¼19½"]
[]
[null,null,",fufed@fLdy fMtht (20)",{"$nulls":3},"iksfy;ks@uoZ batjh ¼22½",{"$nulls":3},"lw;Zeq[kh ¼23½",{"$nulls":3}," @lSfud ¼24½"]
[]
[null,"9-","Name of Vocational Trade ¼O;kolkf;d VªsM dk uke½",{"$nulls":6},"………………………………………………………..",{"$nulls":5},"lgh dk fpUg yxk,aA"]
[null,null,"¼dsoy mu 'kkykvksa ds fy, tgka O;kolkf;d f'k{kk lapkfyr gS ,oa ftu fo|kfFkZ;ksa us d{kk 10 rFkk 11 oha esa O;kolkf;d ijh{kk mRrh.kZ dh gSA½"]
[null,null," (1) Automotive (101)",{"$nulls":3},"(2) Beauty & Wellness (102)",{"$nulls":3},"(3) Health Care (103)",{"$nulls":3},"(4) IT & ITES (104)",null,null,"(5) Retail (105)"]
[]
[null,null,"(6) Tourism & Hospitality (106)",{"$nulls":4},"(7) Apprel Made up Home Furnishing (108)",{"$nulls":5},"(8) Electronics & Hardware (109)"]
[]
[null,null," (9) Agriculture (110)",{"$nulls":3},"(10) Plumber (111)",{"$nulls":3},"(11) Telecom (112)"]
[]
[null,"10-","BPL ¼chih,y½ %",{"$nulls":4},"1- YES ¼gk¡½",null,{"$f":"IF(W877=\"N\",\"\",\"Yes\")","v":"Yes"},null,null,"2- NO ¼ugha¡½",null,{"$f":"IF(W877=\"Y\",\"\",\"Yes\")","v":"Yes"},{"$nulls":7},{"$f":"VLOOKUP(A818,'Deta From Shala Dar. Class-12'!$A$2:$AE$201,27,0)","v":0}]
[]
[null,"11-","vukFk oxZ %",{"$nulls":4},"1- YES ¼gk¡½",{"$nulls":4},"2- NO ¼ugha¡½"]
[]
[null,"12-","EWS ¼vkfFkZd n`f\"V ls detksj oxZ½ %",{"$nulls":4},"1- YES ¼gk¡½",{"$nulls":4},"2- NO ¼ugha¡½"]
[]
[null,"13-","CASTE ¼tkfr Js.kh½ %",null,null,"¼05½ Gen ¼lkekU;½",null,null,{"$f":"IF($W883=\"GEN\",\"YES\",\"\")","v":""},"¼06½ MINORITY ¼lkekU;vYi la[;d½",{"$nulls":3},{"$f":"IF($W883=\"MIN\",\"YES\",\"\")","v":""},"¼07½ SC ¼vuqlwfpr tkfr½",{"$nulls":4},{"$f":"IF($W883=\"SC\",\"YES\",\"\")","v":""},null,null,{"$f":"VLOOKUP(A818,'Deta From Shala Dar. Class-12'!$A$2:$AE$201,16,0)","v":0}]
[]
[{"$nulls":5},"¼08½ ST ¼vuqlwfpr tutkfr½",null,null,{"$f":"IF($W883=\"ST\",\"YES\",\"\")","v":""},"¼09½ OBC ¼vU; fiN³k oxZ½",{"$nulls":3},{"$f":"IF($W883=\"OBC\",\"YES\",\"\")","v":""},"¼10½ Special OBC ¼fo'ks\"k fiN³k oxZ½@MBC",{"$nulls":4},{"$f":"IF(OR($W883=\"MBC\",$W$67=\"SBC\"),\"YES\",\"\")","v":""}]
[null,"uksV%& Nk=o`fr@iqjLdkj mijksDr p;fur Js.kh ds vk/kj ij gh nh tk;sxhA"]
[]
[null,"14-","ADDRESS ¼fo|kFkhZ dk iw.kZ irk½ %&"]
[null,null,"House No./Street/Place Name ¼edku ua-@xyh ua-@LFkku½ %",{"$nulls":7},{"$f":"VLOOKUP(A818,'Deta From Shala Dar. Class-12'!$A$2:$AE$201,24,0)","v":0}]
[null,null,"Village/Town/City ¼xzke@dLck@'kgj½ %"]
[null,null,"District ¼ftyk½ %",null,null,"………………………….",null,null,"STATE ¼jkT;½ %",null,null,"…………………………………..",{"$nulls":3},"PIN CODE NO. ¼fiu dksM ua-½ %",null,null,"……………………"]
[]
[null,"15-","fo|kFkhZ dk vk/kkj dkMZ uEcj %",{"$nulls":3},{"$f":"VLOOKUP(A818,'Deta From Shala Dar. Class-12'!$A$2:$AE$201,21,0)","v":{"v":0,"d":"0000"}},{"$nulls":3},"tu vk/kkj uEcj %",null,{"$f":"VLOOKUP(A818,'Deta From Shala Dar. Class-12'!$A$2:$AE$201,22,0)","v":0},null,null,"vfHkHkkod dh okf\"kZd vk; %",null,null,{"$f":"VLOOKUP(A818,'Deta From Shala Dar. Class-12'!$A$2:$AE$201,25,0)","v":{"v":0,"d":"₹ 0"}}]
[]
[null,null,"Student/Guardian's Mobile No. ¼fo|kFkhZ@vfHkHkkod dk eksckby uacj½ %",{"$nulls":9},{"$f":"VLOOKUP(A818,'Deta From Shala Dar. Class-12'!$A$2:$AE$201,23,0)","v":0}]
[]
[null,"16-","Previous Academic Details ¼iwoZ 'kS{kf.kd ;ksX;rk½ %",{"$nulls":9},"---------------------------------------------------------"]
[]
[null,"CLASS ¼d{kk½",null,null,"YEAR ¼oxZ½",null,"ROLL NO. ¼ukekad½",null,null,"RESULT ¼ifj.kke½",null,null,"NAME OF SCHOOL/BOARD ¼Ldwy@cksMZ dk uke½"]
[null,"X"]
[null,"XI"]
[null,"XII"]
[]
[null,"Nk= us ;fn d{kk X vU; cksMZ ls mRrh.kZ dh gS rks %& ¼ns[ksa fo’ks\"k funsZ’k la[;k 6½ ik=rk izek.k i= Øekad",{"$nulls":13},"fnukad"]
[]
[null,"17-","Student's Photo and Signature ¼fo|kFkhZ dk QksVks ,oa gLrk{kj½",{"$nulls":9}," "]
[{"$nulls":10},"Student's Signature ¼fo|kFkhZ ds gLrk{kj½"]
[{"$nulls":3},"PASTE PASSPORT\nSIZE PHOTO"]
[]
[]
[]
[]
[{"$nulls":11}," 'kkyk ç/kku dk çek.khdj.k %&\ngLrk{kj---------------------------------------------------------------"]
[]
[]
[]
[]
[null,"fo|ky; dk uke %&",null,null,{"$f":"Info!$C$7","v":"Govt. Sr. Sec. School Raimalwada"},{"$nulls":6}," 'kkyk dksM %&",null,{"$f":"Info!$C$10","v":1},{"$f":"Info!$D$10","v":7},{"$f":"Info!$E$10","v":0},{"$f":"Info!$F$10","v":1},{"$f":"Info!$G$10","v":7},{"$f":"Info!$H$10","v":5},{"$f":"Info!$I$10","v":1}]
[]
[{"$f":"A818+1","v":30}]
[null,{"$f":"CONCATENATE(Info!$B$7,Info!$C$7)","v":"School Name :-Govt. Sr. Sec. School Raimalwada"}]
[{"$nulls":3},"Board of Secondary Education, Rajasthan",{"$nulls":12},"Sr. (Reg.)"]
[{"$nulls":3}," Ekk/;fed f’k{kk cksMZ]jktLFkku ",{"$nulls":12},"fu;fer ijh{kkFkhZ"]
[null,"mPp ek/;fed ijh{kk",{"$nulls":3},"APPLICATION FORM FOR SENIOR SECONDARY EXAMINATION-2024",{"$nulls":7},{"$f":"Info!$C$10","v":1},{"$f":"Info!$D$10","v":7},{"$f":"Info!$E$10","v":0},{"$f":"Info!$F$10","v":1},{"$f":"Info!$G$10","v":7},{"$f":"Info!$H$10","v":5},{"$f":"Info!$I$10","v":1}]
[{"$nulls":5}," Ikjh{kk vkosnu i= mPp ek/;fed ijh{kk & 2024"]
[{"$nulls":13}," 'kkyk niZ.k Øekad %&",{"$nulls":3},{"$f":"Info!$C$9","v":12345}]
[null,"Scholar Reg. No. ¼LdkWyj jftLVj Øekad½",{"$nulls":5},{"$f":"VLOOKUP(A920,'Deta From Shala Dar. Class-12'!$A$2:$AE$201,4,0)","v":0}]
[null,"1- Student’s Name (fo|kFkhZ dk uke) :",{"$nulls":5},{"$f":"VLOOKUP(A920,'Deta From Shala Dar. Class-12'!$A$2:$AE$201,6,0)","v":0}]
[null,"2- Mother’s Name ¼ekrk dk uke) :",{"$nulls":5},{"$f":"VLOOKUP(A920,'Deta From Shala Dar. Class-12'!$A$2:$AE$201,8,0)","v":0}]
[null,"3- Father’s Name (firk dk uke) :",{"$nulls":5},{"$f":"VLOOKUP(A920,'Deta From Shala Dar. Class-12'!$A$2:$AE$201,9,0)","v":0}]
[null,"4- Category Code (Js.kh dksM) : ¼Js.kh p;u gsrq ihNs fy[ks fo’k\"sk funsZ’k la[;k 1 ns[ks½ Js.kh dk uke %&",{"$nulls":8},"………………………………………………….",{"$nulls":5},"dksM %&"]
[null,"5- Group & Subjects (oxZ ,o a fo\"k;): ( as apply)"]
[null,"Table - A : Only for category(dsoy Js.kh 1]2 , o 8 ds fy;s) (I)ALL SUBJECTS (1-lEiw.kZ fo\"k;), (II) DIVISION IMPROVEMENT (2-Js.kh lq/kkj) & (VIII) FACULTY CHANGE (8-oxZ ifjorZu)  OPTIONAL SUBJECTS oSdfYid fo\"k;) :"]
[]
[{"$nulls":3},"ARTS ¼dyk oxZ½ (1)",{"$nulls":3},"COMMERCE ¼okf.kT; oxZ½ (2)",{"$nulls":5},"SCIENCE ¼foKku oxZ½ (3A)",{"$nulls":3},"AGRICULTURE ¼d`f\"k oxZ½ (3B)"]
[null,null,"1………………………………………",{"$nulls":3},"1 Accountancy",{"$nulls":3},30,null,"1 Physics",null,null,40,"1 Agriculture",null,null,84]
[null,null,"2………………………………………",{"$nulls":3},"2 Buisness Studies",{"$nulls":3},31,null,"2 Chemistry",null,null,41,"2 Ag. Bio.",null,null,39]
[null,null,"3………………………………………",{"$nulls":3},"3………………………………………",{"$nulls":5},"3 …………………………….",{"$nulls":3},"3 ……………………………."]
[]
[]
[]
[{"$nulls":13},"ARTS",null,"((1))","1 ……………………………."]
[{"$nulls":3},"As Applicable ",{"$nulls":4},"tks ykxw gks½",{"$nulls":4},"COMMERCE",null,"((2))","2 ……………………………."]
[null,null,"ADDISTIONAL OPTIONAL SUBJECTS ¼vfrfjDr oSdfYid fo\"k;½ %",{"$nulls":10},"SCIENCE",null,"(3A)","3 ……………………………."]
[{"$nulls":13},"ARGRICULTURE",null,"(3B)","4 ……………………………."]
[{"$nulls":12},"1…………………………………………"]
[]
[]
[]
[null,"Table - B Only for category ¼dsoy Js.kh 4 o 6 ds fy,½ : ",{"$nulls":11},"ARTS",null,"((1))","1 ……………………………."]
[{"$nulls":3},"As Applicable ",{"$nulls":4},"tks ykxw gks½",{"$nulls":4},"COMMERCE",null,"((2))","2 ……………………………."]
[{"$nulls":3},"(IV) ADDITIONAL SUBJECTS ¼vfrfjDr fo\"k;½   (4)",{"$nulls":9},"SCIENCE",null,"((3A))","3 ……………………………."]
[{"$nulls":3},"(VI) MARKS IMPROVEMENT ¼vad lqFkkj½      (6)",{"$nulls":9},"AGRICULTURE",null,"((3B))","4 ……………………………."]
[]
[]
[{"$nulls":3},"As Applicable from Number 6 to 13 ¼Øekad 6 ls 13 rd tks ykxw gks",{"$nulls":9},"djsa½"]
[]
[null,"6-","Gender ¼fyax½ : (01) Male ¼iq:\"k½",{"$nulls":3},{"$f":"IF(W958=\"M\",\"Yes\",\"\")","v":""},"(02) FEMALE ¼efgyk½",null,null,{"$f":"IF(W958=\"F\",\"Yes\",\"\")","v":""},"Medium ¼ek/;e½ : (01) HINDI ¼fgUnh½",{"$nulls":3},{"$f":"IF(X958=\"Hindi\",\"Yes\",\"\")","v":"Yes"},"(02) ENGLISH ¼vaxzsth½",null,null,{"$f":"IF(X958=\"english\",\"Yes\",\"\")","v":""},null,null,{"$f":"VLOOKUP(A920,'Deta From Shala Dar. Class-12'!$A$2:$AE$201,10,0)","v":0},{"$f":"Info!$C$8","v":"Hindi"}]
[]
[null,"7-","CWSN-1 ¼Hkkx½ : ekufld eanrk (01)",{"$nulls":4},"vkWfVTe (02)",null,null,"lsfjcy iYlh (03)",null,null,"ekufld jksx (04)",null,null,"Jo.k ckf/kr (05)"]
[]
[null,null,"ewd fu'kDrrk (06)",null,null,"LisfLQd yfuZax fMl,fcfyfV (14)",{"$nulls":4},"ckSf)d fu'kDrrk (15)",{"$nulls":3},"efYViy LDysjksfll (16)",null,null,"cgq fu'kDrrk (21)"]
[]
[]
[null,"8-","CWSN-2 ¼Hkkx½ : n`f\"V ckf/kr (07)",{"$nulls":4},"vYi n`f\"V (08)",null,null,"pyu fu'kDrrk(09)",null,null,"dq\"B jksx (10)",null,null,"ckSukiu (11)"]
[]
[null,null,"rStkc fif³r (12)",null,null,"ekalis'kh nqfoZdkl ¼13½",{"$nulls":3},"ikfdZlkal jksx ¼17½",{"$nulls":3},"fgeksfQfy;k ¼18½",null,null,"FkSyslhfe;k ¼19½"]
[]
[null,null,",fufed@fLdy fMtht (20)",{"$nulls":3},"iksfy;ks@uoZ batjh ¼22½",{"$nulls":3},"lw;Zeq[kh ¼23½",{"$nulls":3}," @lSfud ¼24½"]
[]
[null,"9-","Name of Vocational Trade ¼O;kolkf;d VªsM dk uke½",{"$nulls":6},"………………………………………………………..",{"$nulls":5},"lgh dk fpUg yxk,aA"]
[null,null,"¼dsoy mu 'kkykvksa ds fy, tgka O;kolkf;d f'k{kk lapkfyr gS ,oa ftu fo|kfFkZ;ksa us d{kk 10 rFkk 11 oha esa O;kolkf;d ijh{kk mRrh.kZ dh gSA½"]
[null,null," (1) Automotive (101)",{"$nulls":3},"(2) Beauty & Wellness (102)",{"$nulls":3},"(3) Health Care (103)",{"$nulls":3},"(4) IT & ITES (104)",null,null,"(5) Retail (105)"]
[]
[null,null,"(6) Tourism & Hospitality (106)",{"$nulls":4},"(7) Apprel Made up Home Furnishing (108)",{"$nulls":5},"(8) Electronics & Hardware (109)"]
[]
[null,null," (9) Agriculture (110)",{"$nulls":3},"(10) Plumber (111)",{"$nulls":3},"(11) Telecom (112)"]
[]
[null,"10-","BPL ¼chih,y½ %",{"$nulls":4},"1- YES ¼gk¡½",null,{"$f":"IF(W979=\"N\",\"\",\"Yes\")","v":"Yes"},null,null,"2- NO ¼ugha¡½",null,{"$f":"IF(W979=\"Y\",\"\",\"Yes\")","v":"Yes"},{"$nulls":7},{"$f":"VLOOKUP(A920,'Deta From Shala Dar. Class-12'!$A$2:$AE$201,27,0)","v":0}]
[]
[null,"11-","vukFk oxZ %",{"$nulls":4},"1- YES ¼gk¡½",{"$nulls":4},"2- NO ¼ugha¡½"]
[]
[null,"12-","EWS ¼vkfFkZd n`f\"V ls detksj oxZ½ %",{"$nulls":4},"1- YES ¼gk¡½",{"$nulls":4},"2- NO ¼ugha¡½"]
[]
[null,"13-","CASTE ¼tkfr Js.kh½ %",null,null,"¼05½ Gen ¼lkekU;½",null,null,{"$f":"IF($W985=\"GEN\",\"YES\",\"\")","v":""},"¼06½ MINORITY ¼lkekU;vYi la[;d½",{"$nulls":3},{"$f":"IF($W985=\"MIN\",\"YES\",\"\")","v":""},"¼07½ SC ¼vuqlwfpr tkfr½",{"$nulls":4},{"$f":"IF($W985=\"SC\",\"YES\",\"\")","v":""},null,null,{"$f":"VLOOKUP(A920,'Deta From Shala Dar. Class-12'!$A$2:$AE$201,16,0)","v":0}]
[]
[{"$nulls":5},"¼08½ ST ¼vuqlwfpr tutkfr½",null,null,{"$f":"IF($W985=\"ST\",\"YES\",\"\")","v":""},"¼09½ OBC ¼vU; fiN³k oxZ½",{"$nulls":3},{"$f":"IF($W985=\"OBC\",\"YES\",\"\")","v":""},"¼10½ Special OBC ¼fo'ks\"k fiN³k oxZ½@MBC",{"$nulls":4},{"$f":"IF(OR($W985=\"MBC\",$W$67=\"SBC\"),\"YES\",\"\")","v":""}]
[null,"uksV%& Nk=o`fr@iqjLdkj mijksDr p;fur Js.kh ds vk/kj ij gh nh tk;sxhA"]
[]
[null,"14-","ADDRESS ¼fo|kFkhZ dk iw.kZ irk½ %&"]
[null,null,"House No./Street/Place Name ¼edku ua-@xyh ua-@LFkku½ %",{"$nulls":7},{"$f":"VLOOKUP(A920,'Deta From Shala Dar. Class-12'!$A$2:$AE$201,24,0)","v":0}]
[null,null,"Village/Town/City ¼xzke@dLck@'kgj½ %"]
[null,null,"District ¼ftyk½ %",null,null,"………………………….",null,null,"STATE ¼jkT;½ %",null,null,"…………………………………..",{"$nulls":3},"PIN CODE NO. ¼fiu dksM ua-½ %",null,null,"……………………"]
[]
[null,"15-","fo|kFkhZ dk vk/kkj dkMZ uEcj %",{"$nulls":3},{"$f":"VLOOKUP(A920,'Deta From Shala Dar. Class-12'!$A$2:$AE$201,21,0)","v":{"v":0,"d":"0000"}},{"$nulls":3},"tu vk/kkj uEcj %",null,{"$f":"VLOOKUP(A920,'Deta From Shala Dar. Class-12'!$A$2:$AE$201,22,0)","v":0},null,null,"vfHkHkkod dh okf\"kZd vk; %",null,null,{"$f":"VLOOKUP(A920,'Deta From Shala Dar. Class-12'!$A$2:$AE$201,25,0)","v":{"v":0,"d":"₹ 0"}}]
[]
[null,null,"Student/Guardian's Mobile No. ¼fo|kFkhZ@vfHkHkkod dk eksckby uacj½ %",{"$nulls":9},{"$f":"VLOOKUP(A920,'Deta From Shala Dar. Class-12'!$A$2:$AE$201,23,0)","v":0}]
[]
[null,"16-","Previous Academic Details ¼iwoZ 'kS{kf.kd ;ksX;rk½ %",{"$nulls":9},"---------------------------------------------------------"]
[]
[null,"CLASS ¼d{kk½",null,null,"YEAR ¼oxZ½",null,"ROLL NO. ¼ukekad½",null,null,"RESULT ¼ifj.kke½",null,null,"NAME OF SCHOOL/BOARD ¼Ldwy@cksMZ dk uke½"]
[null,"X"]
[null,"XI"]
[null,"XII"]
[]
[null,"Nk= us ;fn d{kk X vU; cksMZ ls mRrh.kZ dh gS rks %& ¼ns[ksa fo’ks\"k funsZ’k la[;k 6½ ik=rk izek.k i= Øekad",{"$nulls":13},"fnukad"]
[]
[null,"17-","Student's Photo and Signature ¼fo|kFkhZ dk QksVks ,oa gLrk{kj½",{"$nulls":9}," "]
[{"$nulls":10},"Student's Signature ¼fo|kFkhZ ds gLrk{kj½"]
[{"$nulls":3},"PASTE PASSPORT\nSIZE PHOTO"]
[]
[]
[]
[]
[{"$nulls":11}," 'kkyk ç/kku dk çek.khdj.k %&\ngLrk{kj---------------------------------------------------------------"]
[]
[]
[]
[]
[null,"fo|ky; dk uke %&",null,null,{"$f":"Info!$C$7","v":"Govt. Sr. Sec. School Raimalwada"},{"$nulls":6}," 'kkyk dksM %&",null,{"$f":"Info!$C$10","v":1},{"$f":"Info!$D$10","v":7},{"$f":"Info!$E$10","v":0},{"$f":"Info!$F$10","v":1},{"$f":"Info!$G$10","v":7},{"$f":"Info!$H$10","v":5},{"$f":"Info!$I$10","v":1}]
[]
[{"$f":"A920+1","v":31}]
[null,{"$f":"CONCATENATE(Info!$B$7,Info!$C$7)","v":"School Name :-Govt. Sr. Sec. School Raimalwada"}]
[{"$nulls":3},"Board of Secondary Education, Rajasthan",{"$nulls":12},"Sr. (Reg.)"]
[{"$nulls":3}," Ekk/;fed f’k{kk cksMZ]jktLFkku ",{"$nulls":12},"fu;fer ijh{kkFkhZ"]
[null,"mPp ek/;fed ijh{kk",{"$nulls":3},"APPLICATION FORM FOR SENIOR SECONDARY EXAMINATION-2024",{"$nulls":7},{"$f":"Info!$C$10","v":1},{"$f":"Info!$D$10","v":7},{"$f":"Info!$E$10","v":0},{"$f":"Info!$F$10","v":1},{"$f":"Info!$G$10","v":7},{"$f":"Info!$H$10","v":5},{"$f":"Info!$I$10","v":1}]
[{"$nulls":5}," Ikjh{kk vkosnu i= mPp ek/;fed ijh{kk & 2024"]
[{"$nulls":13}," 'kkyk niZ.k Øekad %&",{"$nulls":3},{"$f":"Info!$C$9","v":12345}]
[null,"Scholar Reg. No. ¼LdkWyj jftLVj Øekad½",{"$nulls":5},{"$f":"VLOOKUP(A1022,'Deta From Shala Dar. Class-12'!$A$2:$AE$201,4,0)","v":0}]
[null,"1- Student’s Name (fo|kFkhZ dk uke) :",{"$nulls":5},{"$f":"VLOOKUP(A1022,'Deta From Shala Dar. Class-12'!$A$2:$AE$201,6,0)","v":0}]
[null,"2- Mother’s Name ¼ekrk dk uke) :",{"$nulls":5},{"$f":"VLOOKUP(A1022,'Deta From Shala Dar. Class-12'!$A$2:$AE$201,8,0)","v":0}]
[null,"3- Father’s Name (firk dk uke) :",{"$nulls":5},{"$f":"VLOOKUP(A1022,'Deta From Shala Dar. Class-12'!$A$2:$AE$201,9,0)","v":0}]
[null,"4- Category Code (Js.kh dksM) : ¼Js.kh p;u gsrq ihNs fy[ks fo’k\"sk funsZ’k la[;k 1 ns[ks½ Js.kh dk uke %&",{"$nulls":8},"………………………………………………….",{"$nulls":5},"dksM %&"]
[null,"5- Group & Subjects (oxZ ,o a fo\"k;): ( as apply)"]
[null,"Table - A : Only for category(dsoy Js.kh 1]2 , o 8 ds fy;s) (I)ALL SUBJECTS (1-lEiw.kZ fo\"k;), (II) DIVISION IMPROVEMENT (2-Js.kh lq/kkj) & (VIII) FACULTY CHANGE (8-oxZ ifjorZu)  OPTIONAL SUBJECTS oSdfYid fo\"k;) :"]
[]
[{"$nulls":3},"ARTS ¼dyk oxZ½ (1)",{"$nulls":3},"COMMERCE ¼okf.kT; oxZ½ (2)",{"$nulls":5},"SCIENCE ¼foKku oxZ½ (3A)",{"$nulls":3},"AGRICULTURE ¼d`f\"k oxZ½ (3B)"]
[null,null,"1………………………………………",{"$nulls":3},"1 Accountancy",{"$nulls":3},30,null,"1 Physics",null,null,40,"1 Agriculture",null,null,84]
[null,null,"2………………………………………",{"$nulls":3},"2 Buisness Studies",{"$nulls":3},31,null,"2 Chemistry",null,null,41,"2 Ag. Bio.",null,null,39]
[null,null,"3………………………………………",{"$nulls":3},"3………………………………………",{"$nulls":5},"3 …………………………….",{"$nulls":3},"3 ……………………………."]
[]
[]
[]
[{"$nulls":13},"ARTS",null,"((1))","1 ……………………………."]
[{"$nulls":3},"As Applicable ",{"$nulls":4},"tks ykxw gks½",{"$nulls":4},"COMMERCE",null,"((2))","2 ……………………………."]
[null,null,"ADDISTIONAL OPTIONAL SUBJECTS ¼vfrfjDr oSdfYid fo\"k;½ %",{"$nulls":10},"SCIENCE",null,"(3A)","3 ……………………………."]
[{"$nulls":13},"ARGRICULTURE",null,"(3B)","4 ……………………………."]
[{"$nulls":12},"1…………………………………………"]
[]
[]
[]
[null,"Table - B Only for category ¼dsoy Js.kh 4 o 6 ds fy,½ : ",{"$nulls":11},"ARTS",null,"((1))","1 ……………………………."]
[{"$nulls":3},"As Applicable ",{"$nulls":4},"tks ykxw gks½",{"$nulls":4},"COMMERCE",null,"((2))","2 ……………………………."]
[{"$nulls":3},"(IV) ADDITIONAL SUBJECTS ¼vfrfjDr fo\"k;½   (4)",{"$nulls":9},"SCIENCE",null,"((3A))","3 ……………………………."]
[{"$nulls":3},"(VI) MARKS IMPROVEMENT ¼vad lqFkkj½      (6)",{"$nulls":9},"AGRICULTURE",null,"((3B))","4 ……………………………."]
[]
[]
[{"$nulls":3},"As Applicable from Number 6 to 13 ¼Øekad 6 ls 13 rd tks ykxw gks",{"$nulls":9},"djsa½"]
[]
[null,"6-","Gender ¼fyax½ : (01) Male ¼iq:\"k½",{"$nulls":3},{"$f":"IF(W1060=\"M\",\"Yes\",\"\")","v":""},"(02) FEMALE ¼efgyk½",null,null,{"$f":"IF(W1060=\"F\",\"Yes\",\"\")","v":""},"Medium ¼ek/;e½ : (01) HINDI ¼fgUnh½",{"$nulls":3},{"$f":"IF(X1060=\"Hindi\",\"Yes\",\"\")","v":"Yes"},"(02) ENGLISH ¼vaxzsth½",null,null,{"$f":"IF(X1060=\"english\",\"Yes\",\"\")","v":""},null,null,{"$f":"VLOOKUP(A1022,'Deta From Shala Dar. Class-12'!$A$2:$AE$201,10,0)","v":0},{"$f":"Info!$C$8","v":"Hindi"}]
[]
[null,"7-","CWSN-1 ¼Hkkx½ : ekufld eanrk (01)",{"$nulls":4},"vkWfVTe (02)",null,null,"lsfjcy iYlh (03)",null,null,"ekufld jksx (04)",null,null,"Jo.k ckf/kr (05)"]
[]
[null,null,"ewd fu'kDrrk (06)",null,null,"LisfLQd yfuZax fMl,fcfyfV (14)",{"$nulls":4},"ckSf)d fu'kDrrk (15)",{"$nulls":3},"efYViy LDysjksfll (16)",null,null,"cgq fu'kDrrk (21)"]
[]
[]
[null,"8-","CWSN-2 ¼Hkkx½ : n`f\"V ckf/kr (07)",{"$nulls":4},"vYi n`f\"V (08)",null,null,"pyu fu'kDrrk(09)",null,null,"dq\"B jksx (10)",null,null,"ckSukiu (11)"]
[]
[null,null,"rStkc fif³r (12)",null,null,"ekalis'kh nqfoZdkl ¼13½",{"$nulls":3},"ikfdZlkal jksx ¼17½",{"$nulls":3},"fgeksfQfy;k ¼18½",null,null,"FkSyslhfe;k ¼19½"]
[]
[null,null,",fufed@fLdy fMtht (20)",{"$nulls":3},"iksfy;ks@uoZ batjh ¼22½",{"$nulls":3},"lw;Zeq[kh ¼23½",{"$nulls":3}," @lSfud ¼24½"]
[]
[null,"9-","Name of Vocational Trade ¼O;kolkf;d VªsM dk uke½",{"$nulls":6},"………………………………………………………..",{"$nulls":5},"lgh dk fpUg yxk,aA"]
[null,null,"¼dsoy mu 'kkykvksa ds fy, tgka O;kolkf;d f'k{kk lapkfyr gS ,oa ftu fo|kfFkZ;ksa us d{kk 10 rFkk 11 oha esa O;kolkf;d ijh{kk mRrh.kZ dh gSA½"]
[null,null," (1) Automotive (101)",{"$nulls":3},"(2) Beauty & Wellness (102)",{"$nulls":3},"(3) Health Care (103)",{"$nulls":3},"(4) IT & ITES (104)",null,null,"(5) Retail (105)"]
[]
[null,null,"(6) Tourism & Hospitality (106)",{"$nulls":4},"(7) Apprel Made up Home Furnishing (108)",{"$nulls":5},"(8) Electronics & Hardware (109)"]
[]
[null,null," (9) Agriculture (110)",{"$nulls":3},"(10) Plumber (111)",{"$nulls":3},"(11) Telecom (112)"]
[]
[null,"10-","BPL ¼chih,y½ %",{"$nulls":4},"1- YES ¼gk¡½",null,{"$f":"IF(W1081=\"N\",\"\",\"Yes\")","v":"Yes"},null,null,"2- NO ¼ugha¡½",null,{"$f":"IF(W1081=\"Y\",\"\",\"Yes\")","v":"Yes"},{"$nulls":7},{"$f":"VLOOKUP(A1022,'Deta From Shala Dar. Class-12'!$A$2:$AE$201,27,0)","v":0}]
[]
[null,"11-","vukFk oxZ %",{"$nulls":4},"1- YES ¼gk¡½",{"$nulls":4},"2- NO ¼ugha¡½"]
[]
[null,"12-","EWS ¼vkfFkZd n`f\"V ls detksj oxZ½ %",{"$nulls":4},"1- YES ¼gk¡½",{"$nulls":4},"2- NO ¼ugha¡½"]
[]
[null,"13-","CASTE ¼tkfr Js.kh½ %",null,null,"¼05½ Gen ¼lkekU;½",null,null,{"$f":"IF($W1087=\"GEN\",\"YES\",\"\")","v":""},"¼06½ MINORITY ¼lkekU;vYi la[;d½",{"$nulls":3},{"$f":"IF($W1087=\"MIN\",\"YES\",\"\")","v":""},"¼07½ SC ¼vuqlwfpr tkfr½",{"$nulls":4},{"$f":"IF($W1087=\"SC\",\"YES\",\"\")","v":""},null,null,{"$f":"VLOOKUP(A1022,'Deta From Shala Dar. Class-12'!$A$2:$AE$201,16,0)","v":0}]
[]
[{"$nulls":5},"¼08½ ST ¼vuqlwfpr tutkfr½",null,null,{"$f":"IF($W1087=\"ST\",\"YES\",\"\")","v":""},"¼09½ OBC ¼vU; fiN³k oxZ½",{"$nulls":3},{"$f":"IF($W1087=\"OBC\",\"YES\",\"\")","v":""},"¼10½ Special OBC ¼fo'ks\"k fiN³k oxZ½@MBC",{"$nulls":4},{"$f":"IF(OR($W1087=\"MBC\",$W$67=\"SBC\"),\"YES\",\"\")","v":""}]
[null,"uksV%& Nk=o`fr@iqjLdkj mijksDr p;fur Js.kh ds vk/kj ij gh nh tk;sxhA"]
[]
[null,"14-","ADDRESS ¼fo|kFkhZ dk iw.kZ irk½ %&"]
[null,null,"House No./Street/Place Name ¼edku ua-@xyh ua-@LFkku½ %",{"$nulls":7},{"$f":"VLOOKUP(A1022,'Deta From Shala Dar. Class-12'!$A$2:$AE$201,24,0)","v":0}]
[null,null,"Village/Town/City ¼xzke@dLck@'kgj½ %"]
[null,null,"District ¼ftyk½ %",null,null,"………………………….",null,null,"STATE ¼jkT;½ %",null,null,"…………………………………..",{"$nulls":3},"PIN CODE NO. ¼fiu dksM ua-½ %",null,null,"……………………"]
[]
[null,"15-","fo|kFkhZ dk vk/kkj dkMZ uEcj %",{"$nulls":3},{"$f":"VLOOKUP(A1022,'Deta From Shala Dar. Class-12'!$A$2:$AE$201,21,0)","v":{"v":0,"d":"0000"}},{"$nulls":3},"tu vk/kkj uEcj %",null,{"$f":"VLOOKUP(A1022,'Deta From Shala Dar. Class-12'!$A$2:$AE$201,22,0)","v":0},null,null,"vfHkHkkod dh okf\"kZd vk; %",null,null,{"$f":"VLOOKUP(A1022,'Deta From Shala Dar. Class-12'!$A$2:$AE$201,25,0)","v":{"v":0,"d":"₹ 0"}}]
[]
[null,null,"Student/Guardian's Mobile No. ¼fo|kFkhZ@vfHkHkkod dk eksckby uacj½ %",{"$nulls":9},{"$f":"VLOOKUP(A1022,'Deta From Shala Dar. Class-12'!$A$2:$AE$201,23,0)","v":0}]
[]
[null,"16-","Previous Academic Details ¼iwoZ 'kS{kf.kd ;ksX;rk½ %",{"$nulls":9},"---------------------------------------------------------"]
[]
[null,"CLASS ¼d{kk½",null,null,"YEAR ¼oxZ½",null,"ROLL NO. ¼ukekad½",null,null,"RESULT ¼ifj.kke½",null,null,"NAME OF SCHOOL/BOARD ¼Ldwy@cksMZ dk uke½"]
[null,"X"]
[null,"XI"]
[null,"XII"]
[]
[null,"Nk= us ;fn d{kk X vU; cksMZ ls mRrh.kZ dh gS rks %& ¼ns[ksa fo’ks\"k funsZ’k la[;k 6½ ik=rk izek.k i= Øekad",{"$nulls":13},"fnukad"]
[]
[null,"17-","Student's Photo and Signature ¼fo|kFkhZ dk QksVks ,oa gLrk{kj½",{"$nulls":9}," "]
[{"$nulls":10},"Student's Signature ¼fo|kFkhZ ds gLrk{kj½"]
[{"$nulls":3},"PASTE PASSPORT\nSIZE PHOTO"]
[]
[]
[]
[]
[{"$nulls":11}," 'kkyk ç/kku dk çek.khdj.k %&\ngLrk{kj---------------------------------------------------------------"]
[]
[]
[]
[]
[null,"fo|ky; dk uke %&",null,null,{"$f":"Info!$C$7","v":"Govt. Sr. Sec. School Raimalwada"},{"$nulls":6}," 'kkyk dksM %&",null,{"$f":"Info!$C$10","v":1},{"$f":"Info!$D$10","v":7},{"$f":"Info!$E$10","v":0},{"$f":"Info!$F$10","v":1},{"$f":"Info!$G$10","v":7},{"$f":"Info!$H$10","v":5},{"$f":"Info!$I$10","v":1}]
[]
[{"$f":"A1022+1","v":32}]
[null,{"$f":"CONCATENATE(Info!$B$7,Info!$C$7)","v":"School Name :-Govt. Sr. Sec. School Raimalwada"}]
[{"$nulls":3},"Board of Secondary Education, Rajasthan",{"$nulls":12},"Sr. (Reg.)"]
[{"$nulls":3}," Ekk/;fed f’k{kk cksMZ]jktLFkku ",{"$nulls":12},"fu;fer ijh{kkFkhZ"]
[null,"mPp ek/;fed ijh{kk",{"$nulls":3},"APPLICATION FORM FOR SENIOR SECONDARY EXAMINATION-2024",{"$nulls":7},{"$f":"Info!$C$10","v":1},{"$f":"Info!$D$10","v":7},{"$f":"Info!$E$10","v":0},{"$f":"Info!$F$10","v":1},{"$f":"Info!$G$10","v":7},{"$f":"Info!$H$10","v":5},{"$f":"Info!$I$10","v":1}]
[{"$nulls":5}," Ikjh{kk vkosnu i= mPp ek/;fed ijh{kk & 2024"]
[{"$nulls":13}," 'kkyk niZ.k Øekad %&",{"$nulls":3},{"$f":"Info!$C$9","v":12345}]
[null,"Scholar Reg. No. ¼LdkWyj jftLVj Øekad½",{"$nulls":5},{"$f":"VLOOKUP(A1124,'Deta From Shala Dar. Class-12'!$A$2:$AE$201,4,0)","v":0}]
[null,"1- Student’s Name (fo|kFkhZ dk uke) :",{"$nulls":5},{"$f":"VLOOKUP(A1124,'Deta From Shala Dar. Class-12'!$A$2:$AE$201,6,0)","v":0}]
[null,"2- Mother’s Name ¼ekrk dk uke) :",{"$nulls":5},{"$f":"VLOOKUP(A1124,'Deta From Shala Dar. Class-12'!$A$2:$AE$201,8,0)","v":0}]
[null,"3- Father’s Name (firk dk uke) :",{"$nulls":5},{"$f":"VLOOKUP(A1124,'Deta From Shala Dar. Class-12'!$A$2:$AE$201,9,0)","v":0}]
[null,"4- Category Code (Js.kh dksM) : ¼Js.kh p;u gsrq ihNs fy[ks fo’k\"sk funsZ’k la[;k 1 ns[ks½ Js.kh dk uke %&",{"$nulls":8},"………………………………………………….",{"$nulls":5},"dksM %&"]
[null,"5- Group & Subjects (oxZ ,o a fo\"k;): ( as apply)"]
[null,"Table - A : Only for category(dsoy Js.kh 1]2 , o 8 ds fy;s) (I)ALL SUBJECTS (1-lEiw.kZ fo\"k;), (II) DIVISION IMPROVEMENT (2-Js.kh lq/kkj) & (VIII) FACULTY CHANGE (8-oxZ ifjorZu)  OPTIONAL SUBJECTS oSdfYid fo\"k;) :"]
[]
[{"$nulls":3},"ARTS ¼dyk oxZ½ (1)",{"$nulls":3},"COMMERCE ¼okf.kT; oxZ½ (2)",{"$nulls":5},"SCIENCE ¼foKku oxZ½ (3A)",{"$nulls":3},"AGRICULTURE ¼d`f\"k oxZ½ (3B)"]
[null,null,"1………………………………………",{"$nulls":3},"1 Accountancy",{"$nulls":3},30,null,"1 Physics",null,null,40,"1 Agriculture",null,null,84]
[null,null,"2………………………………………",{"$nulls":3},"2 Buisness Studies",{"$nulls":3},31,null,"2 Chemistry",null,null,41,"2 Ag. Bio.",null,null,39]
[null,null,"3………………………………………",{"$nulls":3},"3………………………………………",{"$nulls":5},"3 …………………………….",{"$nulls":3},"3 ……………………………."]
[]
[]
[]
[{"$nulls":13},"ARTS",null,"((1))","1 ……………………………."]
[{"$nulls":3},"As Applicable ",{"$nulls":4},"tks ykxw gks½",{"$nulls":4},"COMMERCE",null,"((2))","2 ……………………………."]
[null,null,"ADDISTIONAL OPTIONAL SUBJECTS ¼vfrfjDr oSdfYid fo\"k;½ %",{"$nulls":10},"SCIENCE",null,"(3A)","3 ……………………………."]
[{"$nulls":13},"ARGRICULTURE",null,"(3B)","4 ……………………………."]
[{"$nulls":12},"1…………………………………………"]
[]
[]
[]
[null,"Table - B Only for category ¼dsoy Js.kh 4 o 6 ds fy,½ : ",{"$nulls":11},"ARTS",null,"((1))","1 ……………………………."]
[{"$nulls":3},"As Applicable ",{"$nulls":4},"tks ykxw gks½",{"$nulls":4},"COMMERCE",null,"((2))","2 ……………………………."]
[{"$nulls":3},"(IV) ADDITIONAL SUBJECTS ¼vfrfjDr fo\"k;½   (4)",{"$nulls":9},"SCIENCE",null,"((3A))","3 ……………………………."]
[{"$nulls":3},"(VI) MARKS IMPROVEMENT ¼vad lqFkkj½      (6)",{"$nulls":9},"AGRICULTURE",null,"((3B))","4 ……………………………."]
[]
[]
[{"$nulls":3},"As Applicable from Number 6 to 13 ¼Øekad 6 ls 13 rd tks ykxw gks",{"$nulls":9},"djsa½"]
[]
[null,"6-","Gender ¼fyax½ : (01) Male ¼iq:\"k½",{"$nulls":3},{"$f":"IF(W1162=\"F\",\"\",\"Yes\")","v":"Yes"},"(02) FEMALE ¼efgyk½",null,null,{"$f":"IF(W1162=\"M\",\"\",\"Yes\")","v":"Yes"},"Medium ¼ek/;e½ : (01) HINDI ¼fgUnh½",{"$nulls":3},{"$f":"IF(X1162=\"Hindi\",\"Yes\",\"\")","v":"Yes"},"(02) ENGLISH ¼vaxzsth½",null,null,{"$f":"IF(X1162=\"english\",\"Yes\",\"\")","v":""},null,null,{"$f":"VLOOKUP(A1124,'Deta From Shala Dar. Class-12'!$A$2:$AE$201,10,0)","v":0},{"$f":"Info!$C$8","v":"Hindi"}]
[]
[null,"7-","CWSN-1 ¼Hkkx½ : ekufld eanrk (01)",{"$nulls":4},"vkWfVTe (02)",null,null,"lsfjcy iYlh (03)",null,null,"ekufld jksx (04)",null,null,"Jo.k ckf/kr (05)"]
[]
[null,null,"ewd fu'kDrrk (06)",null,null,"LisfLQd yfuZax fMl,fcfyfV (14)",{"$nulls":4},"ckSf)d fu'kDrrk (15)",{"$nulls":3},"efYViy LDysjksfll (16)",null,null,"cgq fu'kDrrk (21)"]
[]
[]
[null,"8-","CWSN-2 ¼Hkkx½ : n`f\"V ckf/kr (07)",{"$nulls":4},"vYi n`f\"V (08)",null,null,"pyu fu'kDrrk(09)",null,null,"dq\"B jksx (10)",null,null,"ckSukiu (11)"]
[]
[null,null,"rStkc fif³r (12)",null,null,"ekalis'kh nqfoZdkl ¼13½",{"$nulls":3},"ikfdZlkal jksx ¼17½",{"$nulls":3},"fgeksfQfy;k ¼18½",null,null,"FkSyslhfe;k ¼19½"]
[]
[null,null,",fufed@fLdy fMtht (20)",{"$nulls":3},"iksfy;ks@uoZ batjh ¼22½",{"$nulls":3},"lw;Zeq[kh ¼23½",{"$nulls":3}," @lSfud ¼24½"]
[]
[null,"9-","Name of Vocational Trade ¼O;kolkf;d VªsM dk uke½",{"$nulls":6},"………………………………………………………..",{"$nulls":5},"lgh dk fpUg yxk,aA"]
[null,null,"¼dsoy mu 'kkykvksa ds fy, tgka O;kolkf;d f'k{kk lapkfyr gS ,oa ftu fo|kfFkZ;ksa us d{kk 10 rFkk 11 oha esa O;kolkf;d ijh{kk mRrh.kZ dh gSA½"]
[null,null," (1) Automotive (101)",{"$nulls":3},"(2) Beauty & Wellness (102)",{"$nulls":3},"(3) Health Care (103)",{"$nulls":3},"(4) IT & ITES (104)",null,null,"(5) Retail (105)"]
[]
[null,null,"(6) Tourism & Hospitality (106)",{"$nulls":4},"(7) Apprel Made up Home Furnishing (108)",{"$nulls":5},"(8) Electronics & Hardware (109)"]
[]
[null,null," (9) Agriculture (110)",{"$nulls":3},"(10) Plumber (111)",{"$nulls":3},"(11) Telecom (112)"]
[]
[null,"10-","BPL ¼chih,y½ %",{"$nulls":4},"1- YES ¼gk¡½",null,{"$f":"IF(W1183=\"N\",\"\",\"Yes\")","v":"Yes"},null,null,"2- NO ¼ugha¡½",null,{"$f":"IF(W1183=\"Y\",\"\",\"Yes\")","v":"Yes"},{"$nulls":7},{"$f":"VLOOKUP(A1124,'Deta From Shala Dar. Class-12'!$A$2:$AE$201,27,0)","v":0}]
[]
[null,"11-","vukFk oxZ %",{"$nulls":4},"1- YES ¼gk¡½",{"$nulls":4},"2- NO ¼ugha¡½"]
[]
[null,"12-","EWS ¼vkfFkZd n`f\"V ls detksj oxZ½ %",{"$nulls":4},"1- YES ¼gk¡½",{"$nulls":4},"2- NO ¼ugha¡½"]
[]
[null,"13-","CASTE ¼tkfr Js.kh½ %",null,null,"¼05½ Gen ¼lkekU;½",null,null,{"$f":"IF($W1189=\"GEN\",\"YES\",\"\")","v":""},"¼06½ MINORITY ¼lkekU;vYi la[;d½",{"$nulls":3},{"$f":"IF($W1189=\"MIN\",\"YES\",\"\")","v":""},"¼07½ SC ¼vuqlwfpr tkfr½",{"$nulls":4},{"$f":"IF($W1189=\"SC\",\"YES\",\"\")","v":""},null,null,{"$f":"VLOOKUP(A1124,'Deta From Shala Dar. Class-12'!$A$2:$AE$201,16,0)","v":0}]
[]
[{"$nulls":5},"¼08½ ST ¼vuqlwfpr tutkfr½",null,null,{"$f":"IF($W1189=\"ST\",\"YES\",\"\")","v":""},"¼09½ OBC ¼vU; fiN³k oxZ½",{"$nulls":3},{"$f":"IF($W1189=\"OBC\",\"YES\",\"\")","v":""},"¼10½ Special OBC ¼fo'ks\"k fiN³k oxZ½@MBC",{"$nulls":4},{"$f":"IF(OR($W1189=\"MBC\",$W$67=\"SBC\"),\"YES\",\"\")","v":""}]
[null,"uksV%& Nk=o`fr@iqjLdkj mijksDr p;fur Js.kh ds vk/kj ij gh nh tk;sxhA"]
[]
[null,"14-","ADDRESS ¼fo|kFkhZ dk iw.kZ irk½ %&"]
[null,null,"House No./Street/Place Name ¼edku ua-@xyh ua-@LFkku½ %",{"$nulls":7},{"$f":"VLOOKUP(A1124,'Deta From Shala Dar. Class-12'!$A$2:$AE$201,24,0)","v":0}]
[null,null,"Village/Town/City ¼xzke@dLck@'kgj½ %"]
[null,null,"District ¼ftyk½ %",null,null,"………………………….",null,null,"STATE ¼jkT;½ %",null,null,"…………………………………..",{"$nulls":3},"PIN CODE NO. ¼fiu dksM ua-½ %",null,null,"……………………"]
[]
[null,"15-","fo|kFkhZ dk vk/kkj dkMZ uEcj %",{"$nulls":3},{"$f":"VLOOKUP(A1124,'Deta From Shala Dar. Class-12'!$A$2:$AE$201,21,0)","v":{"v":0,"d":"0000"}},{"$nulls":3},"tu vk/kkj uEcj %",null,{"$f":"VLOOKUP(A1124,'Deta From Shala Dar. Class-12'!$A$2:$AE$201,22,0)","v":0},null,null,"vfHkHkkod dh okf\"kZd vk; %",null,null,{"$f":"VLOOKUP(A1124,'Deta From Shala Dar. Class-12'!$A$2:$AE$201,25,0)","v":{"v":0,"d":"₹ 0"}}]
[]
[null,null,"Student/Guardian's Mobile No. ¼fo|kFkhZ@vfHkHkkod dk eksckby uacj½ %",{"$nulls":9},{"$f":"VLOOKUP(A1124,'Deta From Shala Dar. Class-12'!$A$2:$AE$201,23,0)","v":0}]
[]
[null,"16-","Previous Academic Details ¼iwoZ 'kS{kf.kd ;ksX;rk½ %",{"$nulls":9},"---------------------------------------------------------"]
[]
[null,"CLASS ¼d{kk½",null,null,"YEAR ¼oxZ½",null,"ROLL NO. ¼ukekad½",null,null,"RESULT ¼ifj.kke½",null,null,"NAME OF SCHOOL/BOARD ¼Ldwy@cksMZ dk uke½"]
[null,"X"]
[null,"XI"]
[null,"XII"]
[]
[null,"Nk= us ;fn d{kk X vU; cksMZ ls mRrh.kZ dh gS rks %& ¼ns[ksa fo’ks\"k funsZ’k la[;k 6½ ik=rk izek.k i= Øekad",{"$nulls":13},"fnukad"]
[]
[null,"17-","Student's Photo and Signature ¼fo|kFkhZ dk QksVks ,oa gLrk{kj½",{"$nulls":9}," "]
[{"$nulls":10},"Student's Signature ¼fo|kFkhZ ds gLrk{kj½"]
[{"$nulls":3},"PASTE PASSPORT\nSIZE PHOTO"]
[]
[]
[]
[]
[{"$nulls":11}," 'kkyk ç/kku dk çek.khdj.k %&\ngLrk{kj---------------------------------------------------------------"]
[]
[]
[]
[]
[null,"fo|ky; dk uke %&",null,null,{"$f":"Info!$C$7","v":"Govt. Sr. Sec. School Raimalwada"},{"$nulls":6}," 'kkyk dksM %&",null,{"$f":"Info!$C$10","v":1},{"$f":"Info!$D$10","v":7},{"$f":"Info!$E$10","v":0},{"$f":"Info!$F$10","v":1},{"$f":"Info!$G$10","v":7},{"$f":"Info!$H$10","v":5},{"$f":"Info!$I$10","v":1}]
[]
[{"$f":"A1124+1","v":33}]
[null,{"$f":"CONCATENATE(Info!$B$7,Info!$C$7)","v":"School Name :-Govt. Sr. Sec. School Raimalwada"}]
[{"$nulls":3},"Board of Secondary Education, Rajasthan",{"$nulls":12},"Sr. (Reg.)"]
[{"$nulls":3}," Ekk/;fed f’k{kk cksMZ]jktLFkku ",{"$nulls":12},"fu;fer ijh{kkFkhZ"]
[null,"mPp ek/;fed ijh{kk",{"$nulls":3},"APPLICATION FORM FOR SENIOR SECONDARY EXAMINATION-2024",{"$nulls":7},{"$f":"Info!$C$10","v":1},{"$f":"Info!$D$10","v":7},{"$f":"Info!$E$10","v":0},{"$f":"Info!$F$10","v":1},{"$f":"Info!$G$10","v":7},{"$f":"Info!$H$10","v":5},{"$f":"Info!$I$10","v":1}]
[{"$nulls":5}," Ikjh{kk vkosnu i= mPp ek/;fed ijh{kk & 2024"]
[{"$nulls":13}," 'kkyk niZ.k Øekad %&",{"$nulls":3},{"$f":"Info!$C$9","v":12345}]
[null,"Scholar Reg. No. ¼LdkWyj jftLVj Øekad½",{"$nulls":5},{"$f":"VLOOKUP(A1226,'Deta From Shala Dar. Class-12'!$A$2:$AE$201,4,0)","v":0}]
[null,"1- Student’s Name (fo|kFkhZ dk uke) :",{"$nulls":5},{"$f":"VLOOKUP(A1226,'Deta From Shala Dar. Class-12'!$A$2:$AE$201,6,0)","v":0}]
[null,"2- Mother’s Name ¼ekrk dk uke) :",{"$nulls":5},{"$f":"VLOOKUP(A1226,'Deta From Shala Dar. Class-12'!$A$2:$AE$201,8,0)","v":0}]
[null,"3- Father’s Name (firk dk uke) :",{"$nulls":5},{"$f":"VLOOKUP(A1226,'Deta From Shala Dar. Class-12'!$A$2:$AE$201,9,0)","v":0}]
[null,"4- Category Code (Js.kh dksM) : ¼Js.kh p;u gsrq ihNs fy[ks fo’k\"sk funsZ’k la[;k 1 ns[ks½ Js.kh dk uke %&",{"$nulls":8},"………………………………………………….",{"$nulls":5},"dksM %&"]
[null,"5- Group & Subjects (oxZ ,o a fo\"k;): ( as apply)"]
[null,"Table - A : Only for category(dsoy Js.kh 1]2 , o 8 ds fy;s) (I)ALL SUBJECTS (1-lEiw.kZ fo\"k;), (II) DIVISION IMPROVEMENT (2-Js.kh lq/kkj) & (VIII) FACULTY CHANGE (8-oxZ ifjorZu)  OPTIONAL SUBJECTS oSdfYid fo\"k;) :"]
[]
[{"$nulls":3},"ARTS ¼dyk oxZ½ (1)",{"$nulls":3},"COMMERCE ¼okf.kT; oxZ½ (2)",{"$nulls":5},"SCIENCE ¼foKku oxZ½ (3A)",{"$nulls":3},"AGRICULTURE ¼d`f\"k oxZ½ (3B)"]
[null,null,"1………………………………………",{"$nulls":3},"1 Accountancy",{"$nulls":3},30,null,"1 Physics",null,null,40,"1 Agriculture",null,null,84]
[null,null,"2………………………………………",{"$nulls":3},"2 Buisness Studies",{"$nulls":3},31,null,"2 Chemistry",null,null,41,"2 Ag. Bio.",null,null,39]
[null,null,"3………………………………………",{"$nulls":3},"3………………………………………",{"$nulls":5},"3 …………………………….",{"$nulls":3},"3 ……………………………."]
[]
[]
[]
[{"$nulls":13},"ARTS",null,"((1))","1 ……………………………."]
[{"$nulls":3},"As Applicable ",{"$nulls":4},"tks ykxw gks½",{"$nulls":4},"COMMERCE",null,"((2))","2 ……………………………."]
[null,null,"ADDISTIONAL OPTIONAL SUBJECTS ¼vfrfjDr oSdfYid fo\"k;½ %",{"$nulls":10},"SCIENCE",null,"(3A)","3 ……………………………."]
[{"$nulls":13},"ARGRICULTURE",null,"(3B)","4 ……………………………."]
[{"$nulls":12},"1…………………………………………"]
[]
[]
[]
[null,"Table - B Only for category ¼dsoy Js.kh 4 o 6 ds fy,½ : ",{"$nulls":11},"ARTS",null,"((1))","1 ……………………………."]
[{"$nulls":3},"As Applicable ",{"$nulls":4},"tks ykxw gks½",{"$nulls":4},"COMMERCE",null,"((2))","2 ……………………………."]
[{"$nulls":3},"(IV) ADDITIONAL SUBJECTS ¼vfrfjDr fo\"k;½   (4)",{"$nulls":9},"SCIENCE",null,"((3A))","3 ……………………………."]
[{"$nulls":3},"(VI) MARKS IMPROVEMENT ¼vad lqFkkj½      (6)",{"$nulls":9},"AGRICULTURE",null,"((3B))","4 ……………………………."]
[]
[]
[{"$nulls":3},"As Applicable from Number 6 to 13 ¼Øekad 6 ls 13 rd tks ykxw gks",{"$nulls":9},"djsa½"]
[]
[null,"6-","Gender ¼fyax½ : (01) Male ¼iq:\"k½",{"$nulls":3},{"$f":"IF(W1264=\"F\",\"\",\"Yes\")","v":"Yes"},"(02) FEMALE ¼efgyk½",null,null,{"$f":"IF(W1264=\"M\",\"\",\"Yes\")","v":"Yes"},"Medium ¼ek/;e½ : (01) HINDI ¼fgUnh½",{"$nulls":3},{"$f":"IF(X1264=\"Hindi\",\"Yes\",\"\")","v":"Yes"},"(02) ENGLISH ¼vaxzsth½",null,null,{"$f":"IF(X1264=\"english\",\"Yes\",\"\")","v":""},null,null,{"$f":"VLOOKUP(A1226,'Deta From Shala Dar. Class-12'!$A$2:$AE$201,10,0)","v":0},{"$f":"Info!$C$8","v":"Hindi"}]
[]
[null,"7-","CWSN-1 ¼Hkkx½ : ekufld eanrk (01)",{"$nulls":4},"vkWfVTe (02)",null,null,"lsfjcy iYlh (03)",null,null,"ekufld jksx (04)",null,null,"Jo.k ckf/kr (05)"]
[]
[null,null,"ewd fu'kDrrk (06)",null,null,"LisfLQd yfuZax fMl,fcfyfV (14)",{"$nulls":4},"ckSf)d fu'kDrrk (15)",{"$nulls":3},"efYViy LDysjksfll (16)",null,null,"cgq fu'kDrrk (21)"]
[]
[]
[null,"8-","CWSN-2 ¼Hkkx½ : n`f\"V ckf/kr (07)",{"$nulls":4},"vYi n`f\"V (08)",null,null,"pyu fu'kDrrk(09)",null,null,"dq\"B jksx (10)",null,null,"ckSukiu (11)"]
[]
[null,null,"rStkc fif³r (12)",null,null,"ekalis'kh nqfoZdkl ¼13½",{"$nulls":3},"ikfdZlkal jksx ¼17½",{"$nulls":3},"fgeksfQfy;k ¼18½",null,null,"FkSyslhfe;k ¼19½"]
[]
[null,null,",fufed@fLdy fMtht (20)",{"$nulls":3},"iksfy;ks@uoZ batjh ¼22½",{"$nulls":3},"lw;Zeq[kh ¼23½",{"$nulls":3}," @lSfud ¼24½"]
[]
[null,"9-","Name of Vocational Trade ¼O;kolkf;d VªsM dk uke½",{"$nulls":6},"………………………………………………………..",{"$nulls":5},"lgh dk fpUg yxk,aA"]
[null,null,"¼dsoy mu 'kkykvksa ds fy, tgka O;kolkf;d f'k{kk lapkfyr gS ,oa ftu fo|kfFkZ;ksa us d{kk 10 rFkk 11 oha esa O;kolkf;d ijh{kk mRrh.kZ dh gSA½"]
[null,null," (1) Automotive (101)",{"$nulls":3},"(2) Beauty & Wellness (102)",{"$nulls":3},"(3) Health Care (103)",{"$nulls":3},"(4) IT & ITES (104)",null,null,"(5) Retail (105)"]
[]
[null,null,"(6) Tourism & Hospitality (106)",{"$nulls":4},"(7) Apprel Made up Home Furnishing (108)",{"$nulls":5},"(8) Electronics & Hardware (109)"]
[]
[null,null," (9) Agriculture (110)",{"$nulls":3},"(10) Plumber (111)",{"$nulls":3},"(11) Telecom (112)"]
[]
[null,"10-","BPL ¼chih,y½ %",{"$nulls":4},"1- YES ¼gk¡½",null,{"$f":"IF(W1285=\"N\",\"\",\"Yes\")","v":"Yes"},null,null,"2- NO ¼ugha¡½",null,{"$f":"IF(W1285=\"Y\",\"\",\"Yes\")","v":"Yes"},{"$nulls":7},{"$f":"VLOOKUP(A1226,'Deta From Shala Dar. Class-12'!$A$2:$AE$201,27,0)","v":0}]
[]
[null,"11-","vukFk oxZ %",{"$nulls":4},"1- YES ¼gk¡½",{"$nulls":4},"2- NO ¼ugha¡½"]
[]
[null,"12-","EWS ¼vkfFkZd n`f\"V ls detksj oxZ½ %",{"$nulls":4},"1- YES ¼gk¡½",{"$nulls":4},"2- NO ¼ugha¡½"]
[]
[null,"13-","CASTE ¼tkfr Js.kh½ %",null,null,"¼05½ Gen ¼lkekU;½",null,null,{"$f":"IF($W1291=\"GEN\",\"YES\",\"\")","v":""},"¼06½ MINORITY ¼lkekU;vYi la[;d½",{"$nulls":3},{"$f":"IF($W1291=\"MIN\",\"YES\",\"\")","v":""},"¼07½ SC ¼vuqlwfpr tkfr½",{"$nulls":4},{"$f":"IF($W1291=\"SC\",\"YES\",\"\")","v":""},null,null,{"$f":"VLOOKUP(A1226,'Deta From Shala Dar. Class-12'!$A$2:$AE$201,16,0)","v":0}]
[]
[{"$nulls":5},"¼08½ ST ¼vuqlwfpr tutkfr½",null,null,{"$f":"IF($W1291=\"ST\",\"YES\",\"\")","v":""},"¼09½ OBC ¼vU; fiN³k oxZ½",{"$nulls":3},{"$f":"IF($W1291=\"OBC\",\"YES\",\"\")","v":""},"¼10½ Special OBC ¼fo'ks\"k fiN³k oxZ½@MBC",{"$nulls":4},{"$f":"IF(OR($W1291=\"MBC\",$W$67=\"SBC\"),\"YES\",\"\")","v":""}]
[null,"uksV%& Nk=o`fr@iqjLdkj mijksDr p;fur Js.kh ds vk/kj ij gh nh tk;sxhA"]
[]
[null,"14-","ADDRESS ¼fo|kFkhZ dk iw.kZ irk½ %&"]
[null,null,"House No./Street/Place Name ¼edku ua-@xyh ua-@LFkku½ %",{"$nulls":7},{"$f":"VLOOKUP(A1226,'Deta From Shala Dar. Class-12'!$A$2:$AE$201,24,0)","v":0}]
[null,null,"Village/Town/City ¼xzke@dLck@'kgj½ %"]
[null,null,"District ¼ftyk½ %",null,null,"………………………….",null,null,"STATE ¼jkT;½ %",null,null,"…………………………………..",{"$nulls":3},"PIN CODE NO. ¼fiu dksM ua-½ %",null,null,"……………………"]
[]
[null,"15-","fo|kFkhZ dk vk/kkj dkMZ uEcj %",{"$nulls":3},{"$f":"VLOOKUP(A1226,'Deta From Shala Dar. Class-12'!$A$2:$AE$201,21,0)","v":{"v":0,"d":"0000"}},{"$nulls":3},"tu vk/kkj uEcj %",null,{"$f":"VLOOKUP(A1226,'Deta From Shala Dar. Class-12'!$A$2:$AE$201,22,0)","v":0},null,null,"vfHkHkkod dh okf\"kZd vk; %",null,null,{"$f":"VLOOKUP(A1226,'Deta From Shala Dar. Class-12'!$A$2:$AE$201,25,0)","v":{"v":0,"d":"₹ 0"}}]
[]
[null,null,"Student/Guardian's Mobile No. ¼fo|kFkhZ@vfHkHkkod dk eksckby uacj½ %",{"$nulls":9},{"$f":"VLOOKUP(A1226,'Deta From Shala Dar. Class-12'!$A$2:$AE$201,23,0)","v":0}]
[]
[null,"16-","Previous Academic Details ¼iwoZ 'kS{kf.kd ;ksX;rk½ %",{"$nulls":9},"---------------------------------------------------------"]
[]
[null,"CLASS ¼d{kk½",null,null,"YEAR ¼oxZ½",null,"ROLL NO. ¼ukekad½",null,null,"RESULT ¼ifj.kke½",null,null,"NAME OF SCHOOL/BOARD ¼Ldwy@cksMZ dk uke½"]
[null,"X"]
[null,"XI"]
[null,"XII"]
[]
[null,"Nk= us ;fn d{kk X vU; cksMZ ls mRrh.kZ dh gS rks %& ¼ns[ksa fo’ks\"k funsZ’k la[;k 6½ ik=rk izek.k i= Øekad",{"$nulls":13},"fnukad"]
[]
[null,"17-","Student's Photo and Signature ¼fo|kFkhZ dk QksVks ,oa gLrk{kj½",{"$nulls":9}," "]
[{"$nulls":10},"Student's Signature ¼fo|kFkhZ ds gLrk{kj½"]
[{"$nulls":3},"PASTE PASSPORT\nSIZE PHOTO"]
[]
[]
[]
[]
[{"$nulls":11}," 'kkyk ç/kku dk çek.khdj.k %&\ngLrk{kj---------------------------------------------------------------"]
[]
[]
[]
[]
[null,"fo|ky; dk uke %&",null,null,{"$f":"Info!$C$7","v":"Govt. Sr. Sec. School Raimalwada"},{"$nulls":6}," 'kkyk dksM %&",null,{"$f":"Info!$C$10","v":1},{"$f":"Info!$D$10","v":7},{"$f":"Info!$E$10","v":0},{"$f":"Info!$F$10","v":1},{"$f":"Info!$G$10","v":7},{"$f":"Info!$H$10","v":5},{"$f":"Info!$I$10","v":1}]
[]
[{"$f":"A1226+1","v":34}]
[null,{"$f":"CONCATENATE(Info!$B$7,Info!$C$7)","v":"School Name :-Govt. Sr. Sec. School Raimalwada"}]
[{"$nulls":3},"Board of Secondary Education, Rajasthan",{"$nulls":12},"Sr. (Reg.)"]
[{"$nulls":3}," Ekk/;fed f’k{kk cksMZ]jktLFkku ",{"$nulls":12},"fu;fer ijh{kkFkhZ"]
[null,"mPp ek/;fed ijh{kk",{"$nulls":3},"APPLICATION FORM FOR SENIOR SECONDARY EXAMINATION-2024",{"$nulls":7},{"$f":"Info!$C$10","v":1},{"$f":"Info!$D$10","v":7},{"$f":"Info!$E$10","v":0},{"$f":"Info!$F$10","v":1},{"$f":"Info!$G$10","v":7},{"$f":"Info!$H$10","v":5},{"$f":"Info!$I$10","v":1}]
[{"$nulls":5}," Ikjh{kk vkosnu i= mPp ek/;fed ijh{kk & 2024"]
[{"$nulls":13}," 'kkyk niZ.k Øekad %&",{"$nulls":3},{"$f":"Info!$C$9","v":12345}]
[null,"Scholar Reg. No. ¼LdkWyj jftLVj Øekad½",{"$nulls":5},{"$f":"VLOOKUP(A1328,'Deta From Shala Dar. Class-12'!$A$2:$AE$201,4,0)","v":0}]
[null,"1- Student’s Name (fo|kFkhZ dk uke) :",{"$nulls":5},{"$f":"VLOOKUP(A1328,'Deta From Shala Dar. Class-12'!$A$2:$AE$201,6,0)","v":0}]
[null,"2- Mother’s Name ¼ekrk dk uke) :",{"$nulls":5},{"$f":"VLOOKUP(A1328,'Deta From Shala Dar. Class-12'!$A$2:$AE$201,8,0)","v":0}]
[null,"3- Father’s Name (firk dk uke) :",{"$nulls":5},{"$f":"VLOOKUP(A1328,'Deta From Shala Dar. Class-12'!$A$2:$AE$201,9,0)","v":0}]
[null,"4- Category Code (Js.kh dksM) : ¼Js.kh p;u gsrq ihNs fy[ks fo’k\"sk funsZ’k la[;k 1 ns[ks½ Js.kh dk uke %&",{"$nulls":8},"………………………………………………….",{"$nulls":5},"dksM %&"]
[null,"5- Group & Subjects (oxZ ,o a fo\"k;): ( as apply)"]
[null,"Table - A : Only for category(dsoy Js.kh 1]2 , o 8 ds fy;s) (I)ALL SUBJECTS (1-lEiw.kZ fo\"k;), (II) DIVISION IMPROVEMENT (2-Js.kh lq/kkj) & (VIII) FACULTY CHANGE (8-oxZ ifjorZu)  OPTIONAL SUBJECTS oSdfYid fo\"k;) :"]
[]
[{"$nulls":3},"ARTS ¼dyk oxZ½ (1)",{"$nulls":3},"COMMERCE ¼okf.kT; oxZ½ (2)",{"$nulls":5},"SCIENCE ¼foKku oxZ½ (3A)",{"$nulls":3},"AGRICULTURE ¼d`f\"k oxZ½ (3B)"]
[null,null,"1………………………………………",{"$nulls":3},"1 Accountancy",{"$nulls":3},30,null,"1 Physics",null,null,40,"1 Agriculture",null,null,84]
[null,null,"2………………………………………",{"$nulls":3},"2 Buisness Studies",{"$nulls":3},31,null,"2 Chemistry",null,null,41,"2 Ag. Bio.",null,null,39]
[null,null,"3………………………………………",{"$nulls":3},"3………………………………………",{"$nulls":5},"3 …………………………….",{"$nulls":3},"3 ……………………………."]
[]
[]
[]
[{"$nulls":13},"ARTS",null,"((1))","1 ……………………………."]
[{"$nulls":3},"As Applicable ",{"$nulls":4},"tks ykxw gks½",{"$nulls":4},"COMMERCE",null,"((2))","2 ……………………………."]
[null,null,"ADDISTIONAL OPTIONAL SUBJECTS ¼vfrfjDr oSdfYid fo\"k;½ %",{"$nulls":10},"SCIENCE",null,"(3A)","3 ……………………………."]
[{"$nulls":13},"ARGRICULTURE",null,"(3B)","4 ……………………………."]
[{"$nulls":12},"1…………………………………………"]
[]
[]
[]
[null,"Table - B Only for category ¼dsoy Js.kh 4 o 6 ds fy,½ : ",{"$nulls":11},"ARTS",null,"((1))","1 ……………………………."]
[{"$nulls":3},"As Applicable ",{"$nulls":4},"tks ykxw gks½",{"$nulls":4},"COMMERCE",null,"((2))","2 ……………………………."]
[{"$nulls":3},"(IV) ADDITIONAL SUBJECTS ¼vfrfjDr fo\"k;½   (4)",{"$nulls":9},"SCIENCE",null,"((3A))","3 ……………………………."]
[{"$nulls":3},"(VI) MARKS IMPROVEMENT ¼vad lqFkkj½      (6)",{"$nulls":9},"AGRICULTURE",null,"((3B))","4 ……………………………."]
[]
[]
[{"$nulls":3},"As Applicable from Number 6 to 13 ¼Øekad 6 ls 13 rd tks ykxw gks",{"$nulls":9},"djsa½"]
[]
[null,"6-","Gender ¼fyax½ : (01) Male ¼iq:\"k½",{"$nulls":3},{"$f":"IF(W1366=\"M\",\"Yes\",\"\")","v":""},"(02) FEMALE ¼efgyk½",null,null,{"$f":"IF(W1366=\"F\",\"Yes\",\"\")","v":""},"Medium ¼ek/;e½ : (01) HINDI ¼fgUnh½",{"$nulls":3},{"$f":"IF(X1366=\"Hindi\",\"Yes\",\"\")","v":"Yes"},"(02) ENGLISH ¼vaxzsth½",null,null,{"$f":"IF(X1366=\"english\",\"Yes\",\"\")","v":""},null,null,{"$f":"VLOOKUP(A1328,'Deta From Shala Dar. Class-12'!$A$2:$AE$201,10,0)","v":0},{"$f":"Info!$C$8","v":"Hindi"}]
[]
[null,"7-","CWSN-1 ¼Hkkx½ : ekufld eanrk (01)",{"$nulls":4},"vkWfVTe (02)",null,null,"lsfjcy iYlh (03)",null,null,"ekufld jksx (04)",null,null,"Jo.k ckf/kr (05)"]
[]
[null,null,"ewd fu'kDrrk (06)",null,null,"LisfLQd yfuZax fMl,fcfyfV (14)",{"$nulls":4},"ckSf)d fu'kDrrk (15)",{"$nulls":3},"efYViy LDysjksfll (16)",null,null,"cgq fu'kDrrk (21)"]
[]
[]
[null,"8-","CWSN-2 ¼Hkkx½ : n`f\"V ckf/kr (07)",{"$nulls":4},"vYi n`f\"V (08)",null,null,"pyu fu'kDrrk(09)",null,null,"dq\"B jksx (10)",null,null,"ckSukiu (11)"]
[]
[null,null,"rStkc fif³r (12)",null,null,"ekalis'kh nqfoZdkl ¼13½",{"$nulls":3},"ikfdZlkal jksx ¼17½",{"$nulls":3},"fgeksfQfy;k ¼18½",null,null,"FkSyslhfe;k ¼19½"]
[]
[null,null,",fufed@fLdy fMtht (20)",{"$nulls":3},"iksfy;ks@uoZ batjh ¼22½",{"$nulls":3},"lw;Zeq[kh ¼23½",{"$nulls":3}," @lSfud ¼24½"]
[]
[null,"9-","Name of Vocational Trade ¼O;kolkf;d VªsM dk uke½",{"$nulls":6},"………………………………………………………..",{"$nulls":5},"lgh dk fpUg yxk,aA"]
[null,null,"¼dsoy mu 'kkykvksa ds fy, tgka O;kolkf;d f'k{kk lapkfyr gS ,oa ftu fo|kfFkZ;ksa us d{kk 10 rFkk 11 oha esa O;kolkf;d ijh{kk mRrh.kZ dh gSA½"]
[null,null," (1) Automotive (101)",{"$nulls":3},"(2) Beauty & Wellness (102)",{"$nulls":3},"(3) Health Care (103)",{"$nulls":3},"(4) IT & ITES (104)",null,null,"(5) Retail (105)"]
[]
[null,null,"(6) Tourism & Hospitality (106)",{"$nulls":4},"(7) Apprel Made up Home Furnishing (108)",{"$nulls":5},"(8) Electronics & Hardware (109)"]
[]
[null,null," (9) Agriculture (110)",{"$nulls":3},"(10) Plumber (111)",{"$nulls":3},"(11) Telecom (112)"]
[]
[null,"10-","BPL ¼chih,y½ %",{"$nulls":4},"1- YES ¼gk¡½",null,{"$f":"IF(W1387=\"N\",\"\",\"Yes\")","v":"Yes"},null,null,"2- NO ¼ugha¡½",null,{"$f":"IF(W1387=\"Y\",\"\",\"Yes\")","v":"Yes"},{"$nulls":7},{"$f":"VLOOKUP(A1328,'Deta From Shala Dar. Class-12'!$A$2:$AE$201,27,0)","v":0}]
[]
[null,"11-","vukFk oxZ %",{"$nulls":4},"1- YES ¼gk¡½",{"$nulls":4},"2- NO ¼ugha¡½"]
[]
[null,"12-","EWS ¼vkfFkZd n`f\"V ls detksj oxZ½ %",{"$nulls":4},"1- YES ¼gk¡½",{"$nulls":4},"2- NO ¼ugha¡½"]
[]
[null,"13-","CASTE ¼tkfr Js.kh½ %",null,null,"¼05½ Gen ¼lkekU;½",null,null,{"$f":"IF($W1393=\"GEN\",\"YES\",\"\")","v":""},"¼06½ MINORITY ¼lkekU;vYi la[;d½",{"$nulls":3},{"$f":"IF($W1393=\"MIN\",\"YES\",\"\")","v":""},"¼07½ SC ¼vuqlwfpr tkfr½",{"$nulls":4},{"$f":"IF($W1393=\"SC\",\"YES\",\"\")","v":""},null,null,{"$f":"VLOOKUP(A1328,'Deta From Shala Dar. Class-12'!$A$2:$AE$201,16,0)","v":0}]
[]
[{"$nulls":5},"¼08½ ST ¼vuqlwfpr tutkfr½",null,null,{"$f":"IF($W1393=\"ST\",\"YES\",\"\")","v":""},"¼09½ OBC ¼vU; fiN³k oxZ½",{"$nulls":3},{"$f":"IF($W1393=\"OBC\",\"YES\",\"\")","v":""},"¼10½ Special OBC ¼fo'ks\"k fiN³k oxZ½@MBC",{"$nulls":4},{"$f":"IF(OR($W1393=\"MBC\",$W$67=\"SBC\"),\"YES\",\"\")","v":""}]
[null,"uksV%& Nk=o`fr@iqjLdkj mijksDr p;fur Js.kh ds vk/kj ij gh nh tk;sxhA"]
[]
[null,"14-","ADDRESS ¼fo|kFkhZ dk iw.kZ irk½ %&"]
[null,null,"House No./Street/Place Name ¼edku ua-@xyh ua-@LFkku½ %",{"$nulls":7},{"$f":"VLOOKUP(A1328,'Deta From Shala Dar. Class-12'!$A$2:$AE$201,24,0)","v":0}]
[null,null,"Village/Town/City ¼xzke@dLck@'kgj½ %"]
[null,null,"District ¼ftyk½ %",null,null,"………………………….",null,null,"STATE ¼jkT;½ %",null,null,"…………………………………..",{"$nulls":3},"PIN CODE NO. ¼fiu dksM ua-½ %",null,null,"……………………"]
[]
[null,"15-","fo|kFkhZ dk vk/kkj dkMZ uEcj %",{"$nulls":3},{"$f":"VLOOKUP(A1328,'Deta From Shala Dar. Class-12'!$A$2:$AE$201,21,0)","v":{"v":0,"d":"0000"}},{"$nulls":3},"tu vk/kkj uEcj %",null,{"$f":"VLOOKUP(A1328,'Deta From Shala Dar. Class-12'!$A$2:$AE$201,22,0)","v":0},null,null,"vfHkHkkod dh okf\"kZd vk; %",null,null,{"$f":"VLOOKUP(A1328,'Deta From Shala Dar. Class-12'!$A$2:$AE$201,25,0)","v":{"v":0,"d":"₹ 0"}}]
[]
[null,null,"Student/Guardian's Mobile No. ¼fo|kFkhZ@vfHkHkkod dk eksckby uacj½ %",{"$nulls":9},{"$f":"VLOOKUP(A1328,'Deta From Shala Dar. Class-12'!$A$2:$AE$201,23,0)","v":0}]
[]
[null,"16-","Previous Academic Details ¼iwoZ 'kS{kf.kd ;ksX;rk½ %",{"$nulls":9},"---------------------------------------------------------"]
[]
[null,"CLASS ¼d{kk½",null,null,"YEAR ¼oxZ½",null,"ROLL NO. ¼ukekad½",null,null,"RESULT ¼ifj.kke½",null,null,"NAME OF SCHOOL/BOARD ¼Ldwy@cksMZ dk uke½"]
[null,"X"]
[null,"XI"]
[null,"XII"]
[]
[null,"Nk= us ;fn d{kk X vU; cksMZ ls mRrh.kZ dh gS rks %& ¼ns[ksa fo’ks\"k funsZ’k la[;k 6½ ik=rk izek.k i= Øekad",{"$nulls":13},"fnukad"]
[]
[null,"17-","Student's Photo and Signature ¼fo|kFkhZ dk QksVks ,oa gLrk{kj½",{"$nulls":9}," "]
[{"$nulls":10},"Student's Signature ¼fo|kFkhZ ds gLrk{kj½"]
[{"$nulls":3},"PASTE PASSPORT\nSIZE PHOTO"]
[]
[]
[]
[]
[{"$nulls":11}," 'kkyk ç/kku dk çek.khdj.k %&\ngLrk{kj---------------------------------------------------------------"]
[]
[]
[]
[]
[null,"fo|ky; dk uke %&",null,null,{"$f":"Info!$C$7","v":"Govt. Sr. Sec. School Raimalwada"},{"$nulls":6}," 'kkyk dksM %&",null,{"$f":"Info!$C$10","v":1},{"$f":"Info!$D$10","v":7},{"$f":"Info!$E$10","v":0},{"$f":"Info!$F$10","v":1},{"$f":"Info!$G$10","v":7},{"$f":"Info!$H$10","v":5},{"$f":"Info!$I$10","v":1}]
[]
[{"$f":"A1328+1","v":35}]
[null,{"$f":"CONCATENATE(Info!$B$7,Info!$C$7)","v":"School Name :-Govt. Sr. Sec. School Raimalwada"}]
[{"$nulls":3},"Board of Secondary Education, Rajasthan",{"$nulls":12},"Sr. (Reg.)"]
[{"$nulls":3}," Ekk/;fed f’k{kk cksMZ]jktLFkku ",{"$nulls":12},"fu;fer ijh{kkFkhZ"]
[null,"mPp ek/;fed ijh{kk",{"$nulls":3},"APPLICATION FORM FOR SENIOR SECONDARY EXAMINATION-2024",{"$nulls":7},{"$f":"Info!$C$10","v":1},{"$f":"Info!$D$10","v":7},{"$f":"Info!$E$10","v":0},{"$f":"Info!$F$10","v":1},{"$f":"Info!$G$10","v":7},{"$f":"Info!$H$10","v":5},{"$f":"Info!$I$10","v":1}]
[{"$nulls":5}," Ikjh{kk vkosnu i= mPp ek/;fed ijh{kk & 2024"]
[{"$nulls":13}," 'kkyk niZ.k Øekad %&",{"$nulls":3},{"$f":"Info!$C$9","v":12345}]
[null,"Scholar Reg. No. ¼LdkWyj jftLVj Øekad½",{"$nulls":5},{"$f":"VLOOKUP(A1430,'Deta From Shala Dar. Class-12'!$A$2:$AE$201,4,0)","v":0}]
[null,"1- Student’s Name (fo|kFkhZ dk uke) :",{"$nulls":5},{"$f":"VLOOKUP(A1430,'Deta From Shala Dar. Class-12'!$A$2:$AE$201,6,0)","v":0}]
[null,"2- Mother’s Name ¼ekrk dk uke) :",{"$nulls":5},{"$f":"VLOOKUP(A1430,'Deta From Shala Dar. Class-12'!$A$2:$AE$201,8,0)","v":0}]
[null,"3- Father’s Name (firk dk uke) :",{"$nulls":5},{"$f":"VLOOKUP(A1430,'Deta From Shala Dar. Class-12'!$A$2:$AE$201,9,0)","v":0}]
[null,"4- Category Code (Js.kh dksM) : ¼Js.kh p;u gsrq ihNs fy[ks fo’k\"sk funsZ’k la[;k 1 ns[ks½ Js.kh dk uke %&",{"$nulls":8},"………………………………………………….",{"$nulls":5},"dksM %&"]
[null,"5- Group & Subjects (oxZ ,o a fo\"k;): ( as apply)"]
[null,"Table - A : Only for category(dsoy Js.kh 1]2 , o 8 ds fy;s) (I)ALL SUBJECTS (1-lEiw.kZ fo\"k;), (II) DIVISION IMPROVEMENT (2-Js.kh lq/kkj) & (VIII) FACULTY CHANGE (8-oxZ ifjorZu)  OPTIONAL SUBJECTS oSdfYid fo\"k;) :"]
[]
[{"$nulls":3},"ARTS ¼dyk oxZ½ (1)",{"$nulls":3},"COMMERCE ¼okf.kT; oxZ½ (2)",{"$nulls":5},"SCIENCE ¼foKku oxZ½ (3A)",{"$nulls":3},"AGRICULTURE ¼d`f\"k oxZ½ (3B)"]
[null,null,"1………………………………………",{"$nulls":3},"1 Accountancy",{"$nulls":3},30,null,"1 Physics",null,null,40,"1 Agriculture",null,null,84]
[null,null,"2………………………………………",{"$nulls":3},"2 Buisness Studies",{"$nulls":3},31,null,"2 Chemistry",null,null,41,"2 Ag. Bio.",null,null,39]
[null,null,"3………………………………………",{"$nulls":3},"3………………………………………",{"$nulls":5},"3 …………………………….",{"$nulls":3},"3 ……………………………."]
[]
[]
[]
[{"$nulls":13},"ARTS",null,"((1))","1 ……………………………."]
[{"$nulls":3},"As Applicable ",{"$nulls":4},"tks ykxw gks½",{"$nulls":4},"COMMERCE",null,"((2))","2 ……………………………."]
[null,null,"ADDISTIONAL OPTIONAL SUBJECTS ¼vfrfjDr oSdfYid fo\"k;½ %",{"$nulls":10},"SCIENCE",null,"(3A)","3 ……………………………."]
[{"$nulls":13},"ARGRICULTURE",null,"(3B)","4 ……………………………."]
[{"$nulls":12},"1…………………………………………"]
[]
[]
[]
[null,"Table - B Only for category ¼dsoy Js.kh 4 o 6 ds fy,½ : ",{"$nulls":11},"ARTS",null,"((1))","1 ……………………………."]
[{"$nulls":3},"As Applicable ",{"$nulls":4},"tks ykxw gks½",{"$nulls":4},"COMMERCE",null,"((2))","2 ……………………………."]
[{"$nulls":3},"(IV) ADDITIONAL SUBJECTS ¼vfrfjDr fo\"k;½   (4)",{"$nulls":9},"SCIENCE",null,"((3A))","3 ……………………………."]
[{"$nulls":3},"(VI) MARKS IMPROVEMENT ¼vad lqFkkj½      (6)",{"$nulls":9},"AGRICULTURE",null,"((3B))","4 ……………………………."]
[]
[]
[{"$nulls":3},"As Applicable from Number 6 to 13 ¼Øekad 6 ls 13 rd tks ykxw gks",{"$nulls":9},"djsa½"]
[]
[null,"6-","Gender ¼fyax½ : (01) Male ¼iq:\"k½",{"$nulls":3},{"$f":"IF(W1468=\"M\",\"Yes\",\"\")","v":""},"(02) FEMALE ¼efgyk½",null,null,{"$f":"IF(W1468=\"F\",\"Yes\",\"\")","v":""},"Medium ¼ek/;e½ : (01) HINDI ¼fgUnh½",{"$nulls":3},{"$f":"IF(X1468=\"Hindi\",\"Yes\",\"\")","v":"Yes"},"(02) ENGLISH ¼vaxzsth½",null,null,{"$f":"IF(X1468=\"english\",\"Yes\",\"\")","v":""},null,null,{"$f":"VLOOKUP(A1430,'Deta From Shala Dar. Class-12'!$A$2:$AE$201,10,0)","v":0},{"$f":"Info!$C$8","v":"Hindi"}]
[]
[null,"7-","CWSN-1 ¼Hkkx½ : ekufld eanrk (01)",{"$nulls":4},"vkWfVTe (02)",null,null,"lsfjcy iYlh (03)",null,null,"ekufld jksx (04)",null,null,"Jo.k ckf/kr (05)"]
[]
[null,null,"ewd fu'kDrrk (06)",null,null,"LisfLQd yfuZax fMl,fcfyfV (14)",{"$nulls":4},"ckSf)d fu'kDrrk (15)",{"$nulls":3},"efYViy LDysjksfll (16)",null,null,"cgq fu'kDrrk (21)"]
[]
[]
[null,"8-","CWSN-2 ¼Hkkx½ : n`f\"V ckf/kr (07)",{"$nulls":4},"vYi n`f\"V (08)",null,null,"pyu fu'kDrrk(09)",null,null,"dq\"B jksx (10)",null,null,"ckSukiu (11)"]
[]
[null,null,"rStkc fif³r (12)",null,null,"ekalis'kh nqfoZdkl ¼13½",{"$nulls":3},"ikfdZlkal jksx ¼17½",{"$nulls":3},"fgeksfQfy;k ¼18½",null,null,"FkSyslhfe;k ¼19½"]
[]
[null,null,",fufed@fLdy fMtht (20)",{"$nulls":3},"iksfy;ks@uoZ batjh ¼22½",{"$nulls":3},"lw;Zeq[kh ¼23½",{"$nulls":3}," @lSfud ¼24½"]
[]
[null,"9-","Name of Vocational Trade ¼O;kolkf;d VªsM dk uke½",{"$nulls":6},"………………………………………………………..",{"$nulls":5},"lgh dk fpUg yxk,aA"]
[null,null,"¼dsoy mu 'kkykvksa ds fy, tgka O;kolkf;d f'k{kk lapkfyr gS ,oa ftu fo|kfFkZ;ksa us d{kk 10 rFkk 11 oha esa O;kolkf;d ijh{kk mRrh.kZ dh gSA½"]
[null,null," (1) Automotive (101)",{"$nulls":3},"(2) Beauty & Wellness (102)",{"$nulls":3},"(3) Health Care (103)",{"$nulls":3},"(4) IT & ITES (104)",null,null,"(5) Retail (105)"]
[]
[null,null,"(6) Tourism & Hospitality (106)",{"$nulls":4},"(7) Apprel Made up Home Furnishing (108)",{"$nulls":5},"(8) Electronics & Hardware (109)"]
[]
[null,null," (9) Agriculture (110)",{"$nulls":3},"(10) Plumber (111)",{"$nulls":3},"(11) Telecom (112)"]
[]
[null,"10-","BPL ¼chih,y½ %",{"$nulls":4},"1- YES ¼gk¡½",null,{"$f":"IF(W1489=\"N\",\"\",\"Yes\")","v":"Yes"},null,null,"2- NO ¼ugha¡½",null,{"$f":"IF(W1489=\"Y\",\"\",\"Yes\")","v":"Yes"},{"$nulls":7},{"$f":"VLOOKUP(A1430,'Deta From Shala Dar. Class-12'!$A$2:$AE$201,27,0)","v":0}]
[]
[null,"11-","vukFk oxZ %",{"$nulls":4},"1- YES ¼gk¡½",{"$nulls":4},"2- NO ¼ugha¡½"]
[]
[null,"12-","EWS ¼vkfFkZd n`f\"V ls detksj oxZ½ %",{"$nulls":4},"1- YES ¼gk¡½",{"$nulls":4},"2- NO ¼ugha¡½"]
[]
[null,"13-","CASTE ¼tkfr Js.kh½ %",null,null,"¼05½ Gen ¼lkekU;½",null,null,{"$f":"IF($W1495=\"GEN\",\"YES\",\"\")","v":""},"¼06½ MINORITY ¼lkekU;vYi la[;d½",{"$nulls":3},{"$f":"IF($W1495=\"MIN\",\"YES\",\"\")","v":""},"¼07½ SC ¼vuqlwfpr tkfr½",{"$nulls":4},{"$f":"IF($W1495=\"SC\",\"YES\",\"\")","v":""},null,null,{"$f":"VLOOKUP(A1430,'Deta From Shala Dar. Class-12'!$A$2:$AE$201,16,0)","v":0}]
[]
[{"$nulls":5},"¼08½ ST ¼vuqlwfpr tutkfr½",null,null,{"$f":"IF($W1495=\"ST\",\"YES\",\"\")","v":""},"¼09½ OBC ¼vU; fiN³k oxZ½",{"$nulls":3},{"$f":"IF($W1495=\"OBC\",\"YES\",\"\")","v":""},"¼10½ Special OBC ¼fo'ks\"k fiN³k oxZ½@MBC",{"$nulls":4},{"$f":"IF(OR($W1495=\"MBC\",$W$67=\"SBC\"),\"YES\",\"\")","v":""}]
[null,"uksV%& Nk=o`fr@iqjLdkj mijksDr p;fur Js.kh ds vk/kj ij gh nh tk;sxhA"]
[]
[null,"14-","ADDRESS ¼fo|kFkhZ dk iw.kZ irk½ %&"]
[null,null,"House No./Street/Place Name ¼edku ua-@xyh ua-@LFkku½ %",{"$nulls":7},{"$f":"VLOOKUP(A1430,'Deta From Shala Dar. Class-12'!$A$2:$AE$201,24,0)","v":0}]
[null,null,"Village/Town/City ¼xzke@dLck@'kgj½ %"]
[null,null,"District ¼ftyk½ %",null,null,"………………………….",null,null,"STATE ¼jkT;½ %",null,null,"…………………………………..",{"$nulls":3},"PIN CODE NO. ¼fiu dksM ua-½ %",null,null,"……………………"]
[]
[null,"15-","fo|kFkhZ dk vk/kkj dkMZ uEcj %",{"$nulls":3},{"$f":"VLOOKUP(A1430,'Deta From Shala Dar. Class-12'!$A$2:$AE$201,21,0)","v":{"v":0,"d":"0000"}},{"$nulls":3},"tu vk/kkj uEcj %",null,{"$f":"VLOOKUP(A1430,'Deta From Shala Dar. Class-12'!$A$2:$AE$201,22,0)","v":0},null,null,"vfHkHkkod dh okf\"kZd vk; %",null,null,{"$f":"VLOOKUP(A1430,'Deta From Shala Dar. Class-12'!$A$2:$AE$201,25,0)","v":{"v":0,"d":"₹ 0"}}]
[]
[null,null,"Student/Guardian's Mobile No. ¼fo|kFkhZ@vfHkHkkod dk eksckby uacj½ %",{"$nulls":9},{"$f":"VLOOKUP(A1430,'Deta From Shala Dar. Class-12'!$A$2:$AE$201,23,0)","v":0}]
[]
[null,"16-","Previous Academic Details ¼iwoZ 'kS{kf.kd ;ksX;rk½ %",{"$nulls":9},"---------------------------------------------------------"]
[]
[null,"CLASS ¼d{kk½",null,null,"YEAR ¼oxZ½",null,"ROLL NO. ¼ukekad½",null,null,"RESULT ¼ifj.kke½",null,null,"NAME OF SCHOOL/BOARD ¼Ldwy@cksMZ dk uke½"]
[null,"X"]
[null,"XI"]
[null,"XII"]
[]
[null,"Nk= us ;fn d{kk X vU; cksMZ ls mRrh.kZ dh gS rks %& ¼ns[ksa fo’ks\"k funsZ’k la[;k 6½ ik=rk izek.k i= Øekad",{"$nulls":13},"fnukad"]
[]
[null,"17-","Student's Photo and Signature ¼fo|kFkhZ dk QksVks ,oa gLrk{kj½",{"$nulls":9}," "]
[{"$nulls":10},"Student's Signature ¼fo|kFkhZ ds gLrk{kj½"]
[{"$nulls":3},"PASTE PASSPORT\nSIZE PHOTO"]
[]
[]
[]
[]
[{"$nulls":11}," 'kkyk ç/kku dk çek.khdj.k %&\ngLrk{kj---------------------------------------------------------------"]
[]
[]
[]
[]
[null,"fo|ky; dk uke %&",null,null,{"$f":"Info!$C$7","v":"Govt. Sr. Sec. School Raimalwada"},{"$nulls":6}," 'kkyk dksM %&",null,{"$f":"Info!$C$10","v":1},{"$f":"Info!$D$10","v":7},{"$f":"Info!$E$10","v":0},{"$f":"Info!$F$10","v":1},{"$f":"Info!$G$10","v":7},{"$f":"Info!$H$10","v":5},{"$f":"Info!$I$10","v":1}]
[]
[{"$f":"A1430+1","v":36}]
[null,{"$f":"CONCATENATE(Info!$B$7,Info!$C$7)","v":"School Name :-Govt. Sr. Sec. School Raimalwada"}]
[{"$nulls":3},"Board of Secondary Education, Rajasthan",{"$nulls":12},"Sr. (Reg.)"]
[{"$nulls":3}," Ekk/;fed f’k{kk cksMZ]jktLFkku ",{"$nulls":12},"fu;fer ijh{kkFkhZ"]
[null,"mPp ek/;fed ijh{kk",{"$nulls":3},"APPLICATION FORM FOR SENIOR SECONDARY EXAMINATION-2024",{"$nulls":7},{"$f":"Info!$C$10","v":1},{"$f":"Info!$D$10","v":7},{"$f":"Info!$E$10","v":0},{"$f":"Info!$F$10","v":1},{"$f":"Info!$G$10","v":7},{"$f":"Info!$H$10","v":5},{"$f":"Info!$I$10","v":1}]
[{"$nulls":5}," Ikjh{kk vkosnu i= mPp ek/;fed ijh{kk & 2024"]
[{"$nulls":13}," 'kkyk niZ.k Øekad %&",{"$nulls":3},{"$f":"Info!$C$9","v":12345}]
[null,"Scholar Reg. No. ¼LdkWyj jftLVj Øekad½",{"$nulls":5},{"$f":"VLOOKUP(A1532,'Deta From Shala Dar. Class-12'!$A$2:$AE$201,4,0)","v":0}]
[null,"1- Student’s Name (fo|kFkhZ dk uke) :",{"$nulls":5},{"$f":"VLOOKUP(A1532,'Deta From Shala Dar. Class-12'!$A$2:$AE$201,6,0)","v":0}]
[null,"2- Mother’s Name ¼ekrk dk uke) :",{"$nulls":5},{"$f":"VLOOKUP(A1532,'Deta From Shala Dar. Class-12'!$A$2:$AE$201,8,0)","v":0}]
[null,"3- Father’s Name (firk dk uke) :",{"$nulls":5},{"$f":"VLOOKUP(A1532,'Deta From Shala Dar. Class-12'!$A$2:$AE$201,9,0)","v":0}]
[null,"4- Category Code (Js.kh dksM) : ¼Js.kh p;u gsrq ihNs fy[ks fo’k\"sk funsZ’k la[;k 1 ns[ks½ Js.kh dk uke %&",{"$nulls":8},"………………………………………………….",{"$nulls":5},"dksM %&"]
[null,"5- Group & Subjects (oxZ ,o a fo\"k;): ( as apply)"]
[null,"Table - A : Only for category(dsoy Js.kh 1]2 , o 8 ds fy;s) (I)ALL SUBJECTS (1-lEiw.kZ fo\"k;), (II) DIVISION IMPROVEMENT (2-Js.kh lq/kkj) & (VIII) FACULTY CHANGE (8-oxZ ifjorZu)  OPTIONAL SUBJECTS oSdfYid fo\"k;) :"]
[]
[{"$nulls":3},"ARTS ¼dyk oxZ½ (1)",{"$nulls":3},"COMMERCE ¼okf.kT; oxZ½ (2)",{"$nulls":5},"SCIENCE ¼foKku oxZ½ (3A)",{"$nulls":3},"AGRICULTURE ¼d`f\"k oxZ½ (3B)"]
[null,null,"1………………………………………",{"$nulls":3},"1 Accountancy",{"$nulls":3},30,null,"1 Physics",null,null,40,"1 Agriculture",null,null,84]
[null,null,"2………………………………………",{"$nulls":3},"2 Buisness Studies",{"$nulls":3},31,null,"2 Chemistry",null,null,41,"2 Ag. Bio.",null,null,39]
[null,null,"3………………………………………",{"$nulls":3},"3………………………………………",{"$nulls":5},"3 …………………………….",{"$nulls":3},"3 ……………………………."]
[]
[]
[]
[{"$nulls":13},"ARTS",null,"((1))","1 ……………………………."]
[{"$nulls":3},"As Applicable ",{"$nulls":4},"tks ykxw gks½",{"$nulls":4},"COMMERCE",null,"((2))","2 ……………………………."]
[null,null,"ADDISTIONAL OPTIONAL SUBJECTS ¼vfrfjDr oSdfYid fo\"k;½ %",{"$nulls":10},"SCIENCE",null,"(3A)","3 ……………………………."]
[{"$nulls":13},"ARGRICULTURE",null,"(3B)","4 ……………………………."]
[{"$nulls":12},"1…………………………………………"]
[]
[]
[]
[null,"Table - B Only for category ¼dsoy Js.kh 4 o 6 ds fy,½ : ",{"$nulls":11},"ARTS",null,"((1))","1 ……………………………."]
[{"$nulls":3},"As Applicable ",{"$nulls":4},"tks ykxw gks½",{"$nulls":4},"COMMERCE",null,"((2))","2 ……………………………."]
[{"$nulls":3},"(IV) ADDITIONAL SUBJECTS ¼vfrfjDr fo\"k;½   (4)",{"$nulls":9},"SCIENCE",null,"((3A))","3 ……………………………."]
[{"$nulls":3},"(VI) MARKS IMPROVEMENT ¼vad lqFkkj½      (6)",{"$nulls":9},"AGRICULTURE",null,"((3B))","4 ……………………………."]
[]
[]
[{"$nulls":3},"As Applicable from Number 6 to 13 ¼Øekad 6 ls 13 rd tks ykxw gks",{"$nulls":9},"djsa½"]
[]
[null,"6-","Gender ¼fyax½ : (01) Male ¼iq:\"k½",{"$nulls":3},{"$f":"IF(W1570=\"F\",\"\",\"Yes\")","v":"Yes"},"(02) FEMALE ¼efgyk½",null,null,{"$f":"IF(W1570=\"M\",\"\",\"Yes\")","v":"Yes"},"Medium ¼ek/;e½ : (01) HINDI ¼fgUnh½",{"$nulls":3},{"$f":"IF(X1570=\"Hindi\",\"Yes\",\"\")","v":"Yes"},"(02) ENGLISH ¼vaxzsth½",null,null,{"$f":"IF(X1570=\"english\",\"Yes\",\"\")","v":""},null,null,{"$f":"VLOOKUP(A1532,'Deta From Shala Dar. Class-12'!$A$2:$AE$201,10,0)","v":0},{"$f":"Info!$C$8","v":"Hindi"}]
[]
[null,"7-","CWSN-1 ¼Hkkx½ : ekufld eanrk (01)",{"$nulls":4},"vkWfVTe (02)",null,null,"lsfjcy iYlh (03)",null,null,"ekufld jksx (04)",null,null,"Jo.k ckf/kr (05)"]
[]
[null,null,"ewd fu'kDrrk (06)",null,null,"LisfLQd yfuZax fMl,fcfyfV (14)",{"$nulls":4},"ckSf)d fu'kDrrk (15)",{"$nulls":3},"efYViy LDysjksfll (16)",null,null,"cgq fu'kDrrk (21)"]
[]
[]
[null,"8-","CWSN-2 ¼Hkkx½ : n`f\"V ckf/kr (07)",{"$nulls":4},"vYi n`f\"V (08)",null,null,"pyu fu'kDrrk(09)",null,null,"dq\"B jksx (10)",null,null,"ckSukiu (11)"]
[]
[null,null,"rStkc fif³r (12)",null,null,"ekalis'kh nqfoZdkl ¼13½",{"$nulls":3},"ikfdZlkal jksx ¼17½",{"$nulls":3},"fgeksfQfy;k ¼18½",null,null,"FkSyslhfe;k ¼19½"]
[]
[null,null,",fufed@fLdy fMtht (20)",{"$nulls":3},"iksfy;ks@uoZ batjh ¼22½",{"$nulls":3},"lw;Zeq[kh ¼23½",{"$nulls":3}," @lSfud ¼24½"]
[]
[null,"9-","Name of Vocational Trade ¼O;kolkf;d VªsM dk uke½",{"$nulls":6},"………………………………………………………..",{"$nulls":5},"lgh dk fpUg yxk,aA"]
[null,null,"¼dsoy mu 'kkykvksa ds fy, tgka O;kolkf;d f'k{kk lapkfyr gS ,oa ftu fo|kfFkZ;ksa us d{kk 10 rFkk 11 oha esa O;kolkf;d ijh{kk mRrh.kZ dh gSA½"]
[null,null," (1) Automotive (101)",{"$nulls":3},"(2) Beauty & Wellness (102)",{"$nulls":3},"(3) Health Care (103)",{"$nulls":3},"(4) IT & ITES (104)",null,null,"(5) Retail (105)"]
[]
[null,null,"(6) Tourism & Hospitality (106)",{"$nulls":4},"(7) Apprel Made up Home Furnishing (108)",{"$nulls":5},"(8) Electronics & Hardware (109)"]
[]
[null,null," (9) Agriculture (110)",{"$nulls":3},"(10) Plumber (111)",{"$nulls":3},"(11) Telecom (112)"]
[]
[null,"10-","BPL ¼chih,y½ %",{"$nulls":4},"1- YES ¼gk¡½",null,{"$f":"IF(W1591=\"N\",\"\",\"Yes\")","v":"Yes"},null,null,"2- NO ¼ugha¡½",null,{"$f":"IF(W1591=\"Y\",\"\",\"Yes\")","v":"Yes"},{"$nulls":7},{"$f":"VLOOKUP(A1532,'Deta From Shala Dar. Class-12'!$A$2:$AE$201,27,0)","v":0}]
[]
[null,"11-","vukFk oxZ %",{"$nulls":4},"1- YES ¼gk¡½",{"$nulls":4},"2- NO ¼ugha¡½"]
[]
[null,"12-","EWS ¼vkfFkZd n`f\"V ls detksj oxZ½ %",{"$nulls":4},"1- YES ¼gk¡½",{"$nulls":4},"2- NO ¼ugha¡½"]
[]
[null,"13-","CASTE ¼tkfr Js.kh½ %",null,null,"¼05½ Gen ¼lkekU;½",null,null,{"$f":"IF($W1597=\"GEN\",\"YES\",\"\")","v":""},"¼06½ MINORITY ¼lkekU;vYi la[;d½",{"$nulls":3},{"$f":"IF($W1597=\"MIN\",\"YES\",\"\")","v":""},"¼07½ SC ¼vuqlwfpr tkfr½",{"$nulls":4},{"$f":"IF($W1597=\"SC\",\"YES\",\"\")","v":""},null,null,{"$f":"VLOOKUP(A1532,'Deta From Shala Dar. Class-12'!$A$2:$AE$201,16,0)","v":0}]
[]
[{"$nulls":5},"¼08½ ST ¼vuqlwfpr tutkfr½",null,null,{"$f":"IF($W1597=\"ST\",\"YES\",\"\")","v":""},"¼09½ OBC ¼vU; fiN³k oxZ½",{"$nulls":3},{"$f":"IF($W1597=\"OBC\",\"YES\",\"\")","v":""},"¼10½ Special OBC ¼fo'ks\"k fiN³k oxZ½@MBC",{"$nulls":4},{"$f":"IF(OR($W1597=\"MBC\",$W$67=\"SBC\"),\"YES\",\"\")","v":""}]
[null,"uksV%& Nk=o`fr@iqjLdkj mijksDr p;fur Js.kh ds vk/kj ij gh nh tk;sxhA"]
[]
[null,"14-","ADDRESS ¼fo|kFkhZ dk iw.kZ irk½ %&"]
[null,null,"House No./Street/Place Name ¼edku ua-@xyh ua-@LFkku½ %",{"$nulls":7},{"$f":"VLOOKUP(A1532,'Deta From Shala Dar. Class-12'!$A$2:$AE$201,24,0)","v":0}]
[null,null,"Village/Town/City ¼xzke@dLck@'kgj½ %"]
[null,null,"District ¼ftyk½ %",null,null,"………………………….",null,null,"STATE ¼jkT;½ %",null,null,"…………………………………..",{"$nulls":3},"PIN CODE NO. ¼fiu dksM ua-½ %",null,null,"……………………"]
[]
[null,"15-","fo|kFkhZ dk vk/kkj dkMZ uEcj %",{"$nulls":3},{"$f":"VLOOKUP(A1532,'Deta From Shala Dar. Class-12'!$A$2:$AE$201,21,0)","v":{"v":0,"d":"0000"}},{"$nulls":3},"tu vk/kkj uEcj %",null,{"$f":"VLOOKUP(A1532,'Deta From Shala Dar. Class-12'!$A$2:$AE$201,22,0)","v":0},null,null,"vfHkHkkod dh okf\"kZd vk; %",null,null,{"$f":"VLOOKUP(A1532,'Deta From Shala Dar. Class-12'!$A$2:$AE$201,25,0)","v":{"v":0,"d":"₹ 0"}}]
[]
[null,null,"Student/Guardian's Mobile No. ¼fo|kFkhZ@vfHkHkkod dk eksckby uacj½ %",{"$nulls":9},{"$f":"VLOOKUP(A1532,'Deta From Shala Dar. Class-12'!$A$2:$AE$201,23,0)","v":0}]
[]
[null,"16-","Previous Academic Details ¼iwoZ 'kS{kf.kd ;ksX;rk½ %",{"$nulls":9},"---------------------------------------------------------"]
[]
[null,"CLASS ¼d{kk½",null,null,"YEAR ¼oxZ½",null,"ROLL NO. ¼ukekad½",null,null,"RESULT ¼ifj.kke½",null,null,"NAME OF SCHOOL/BOARD ¼Ldwy@cksMZ dk uke½"]
[null,"X"]
[null,"XI"]
[null,"XII"]
[]
[null,"Nk= us ;fn d{kk X vU; cksMZ ls mRrh.kZ dh gS rks %& ¼ns[ksa fo’ks\"k funsZ’k la[;k 6½ ik=rk izek.k i= Øekad",{"$nulls":13},"fnukad"]
[]
[null,"17-","Student's Photo and Signature ¼fo|kFkhZ dk QksVks ,oa gLrk{kj½",{"$nulls":9}," "]
[{"$nulls":10},"Student's Signature ¼fo|kFkhZ ds gLrk{kj½"]
[{"$nulls":3},"PASTE PASSPORT\nSIZE PHOTO"]
[]
[]
[]
[]
[{"$nulls":11}," 'kkyk ç/kku dk çek.khdj.k %&\ngLrk{kj---------------------------------------------------------------"]
[]
[]
[]
[]
[null,"fo|ky; dk uke %&",null,null,{"$f":"Info!$C$7","v":"Govt. Sr. Sec. School Raimalwada"},{"$nulls":6}," 'kkyk dksM %&",null,{"$f":"Info!$C$10","v":1},{"$f":"Info!$D$10","v":7},{"$f":"Info!$E$10","v":0},{"$f":"Info!$F$10","v":1},{"$f":"Info!$G$10","v":7},{"$f":"Info!$H$10","v":5},{"$f":"Info!$I$10","v":1}]
[]
[{"$f":"A1532+1","v":37}]
[null,{"$f":"CONCATENATE(Info!$B$7,Info!$C$7)","v":"School Name :-Govt. Sr. Sec. School Raimalwada"}]
[{"$nulls":3},"Board of Secondary Education, Rajasthan",{"$nulls":12},"Sr. (Reg.)"]
[{"$nulls":3}," Ekk/;fed f’k{kk cksMZ]jktLFkku ",{"$nulls":12},"fu;fer ijh{kkFkhZ"]
[null,"mPp ek/;fed ijh{kk",{"$nulls":3},"APPLICATION FORM FOR SENIOR SECONDARY EXAMINATION-2024",{"$nulls":7},{"$f":"Info!$C$10","v":1},{"$f":"Info!$D$10","v":7},{"$f":"Info!$E$10","v":0},{"$f":"Info!$F$10","v":1},{"$f":"Info!$G$10","v":7},{"$f":"Info!$H$10","v":5},{"$f":"Info!$I$10","v":1}]
[{"$nulls":5}," Ikjh{kk vkosnu i= mPp ek/;fed ijh{kk & 2024"]
[{"$nulls":13}," 'kkyk niZ.k Øekad %&",{"$nulls":3},{"$f":"Info!$C$9","v":12345}]
[null,"Scholar Reg. No. ¼LdkWyj jftLVj Øekad½",{"$nulls":5},{"$f":"VLOOKUP(A1634,'Deta From Shala Dar. Class-12'!$A$2:$AE$201,4,0)","v":0}]
[null,"1- Student’s Name (fo|kFkhZ dk uke) :",{"$nulls":5},{"$f":"VLOOKUP(A1634,'Deta From Shala Dar. Class-12'!$A$2:$AE$201,6,0)","v":0}]
[null,"2- Mother’s Name ¼ekrk dk uke) :",{"$nulls":5},{"$f":"VLOOKUP(A1634,'Deta From Shala Dar. Class-12'!$A$2:$AE$201,8,0)","v":0}]
[null,"3- Father’s Name (firk dk uke) :",{"$nulls":5},{"$f":"VLOOKUP(A1634,'Deta From Shala Dar. Class-12'!$A$2:$AE$201,9,0)","v":0}]
[null,"4- Category Code (Js.kh dksM) : ¼Js.kh p;u gsrq ihNs fy[ks fo’k\"sk funsZ’k la[;k 1 ns[ks½ Js.kh dk uke %&",{"$nulls":8},"………………………………………………….",{"$nulls":5},"dksM %&"]
[null,"5- Group & Subjects (oxZ ,o a fo\"k;): ( as apply)"]
[null,"Table - A : Only for category(dsoy Js.kh 1]2 , o 8 ds fy;s) (I)ALL SUBJECTS (1-lEiw.kZ fo\"k;), (II) DIVISION IMPROVEMENT (2-Js.kh lq/kkj) & (VIII) FACULTY CHANGE (8-oxZ ifjorZu)  OPTIONAL SUBJECTS oSdfYid fo\"k;) :"]
[]
[{"$nulls":3},"ARTS ¼dyk oxZ½ (1)",{"$nulls":3},"COMMERCE ¼okf.kT; oxZ½ (2)",{"$nulls":5},"SCIENCE ¼foKku oxZ½ (3A)",{"$nulls":3},"AGRICULTURE ¼d`f\"k oxZ½ (3B)"]
[null,null,"1………………………………………",{"$nulls":3},"1 Accountancy",{"$nulls":3},30,null,"1 Physics",null,null,40,"1 Agriculture",null,null,84]
[null,null,"2………………………………………",{"$nulls":3},"2 Buisness Studies",{"$nulls":3},31,null,"2 Chemistry",null,null,41,"2 Ag. Bio.",null,null,39]
[null,null,"3………………………………………",{"$nulls":3},"3………………………………………",{"$nulls":5},"3 …………………………….",{"$nulls":3},"3 ……………………………."]
[]
[]
[]
[{"$nulls":13},"ARTS",null,"((1))","1 ……………………………."]
[{"$nulls":3},"As Applicable ",{"$nulls":4},"tks ykxw gks½",{"$nulls":4},"COMMERCE",null,"((2))","2 ……………………………."]
[null,null,"ADDISTIONAL OPTIONAL SUBJECTS ¼vfrfjDr oSdfYid fo\"k;½ %",{"$nulls":10},"SCIENCE",null,"(3A)","3 ……………………………."]
[{"$nulls":13},"ARGRICULTURE",null,"(3B)","4 ……………………………."]
[{"$nulls":12},"1…………………………………………"]
[]
[]
[]
[null,"Table - B Only for category ¼dsoy Js.kh 4 o 6 ds fy,½ : ",{"$nulls":11},"ARTS",null,"((1))","1 ……………………………."]
[{"$nulls":3},"As Applicable ",{"$nulls":4},"tks ykxw gks½",{"$nulls":4},"COMMERCE",null,"((2))","2 ……………………………."]
[{"$nulls":3},"(IV) ADDITIONAL SUBJECTS ¼vfrfjDr fo\"k;½   (4)",{"$nulls":9},"SCIENCE",null,"((3A))","3 ……………………………."]
[{"$nulls":3},"(VI) MARKS IMPROVEMENT ¼vad lqFkkj½      (6)",{"$nulls":9},"AGRICULTURE",null,"((3B))","4 ……………………………."]
[]
[]
[{"$nulls":3},"As Applicable from Number 6 to 13 ¼Øekad 6 ls 13 rd tks ykxw gks",{"$nulls":9},"djsa½"]
[]
[null,"6-","Gender ¼fyax½ : (01) Male ¼iq:\"k½",{"$nulls":3},{"$f":"IF(W1672=\"F\",\"\",\"Yes\")","v":"Yes"},"(02) FEMALE ¼efgyk½",null,null,{"$f":"IF(W1672=\"M\",\"\",\"Yes\")","v":"Yes"},"Medium ¼ek/;e½ : (01) HINDI ¼fgUnh½",{"$nulls":3},{"$f":"IF(X1672=\"Hindi\",\"Yes\",\"\")","v":"Yes"},"(02) ENGLISH ¼vaxzsth½",null,null,{"$f":"IF(X1672=\"english\",\"Yes\",\"\")","v":""},null,null,{"$f":"VLOOKUP(A1634,'Deta From Shala Dar. Class-12'!$A$2:$AE$201,10,0)","v":0},{"$f":"Info!$C$8","v":"Hindi"}]
[]
[null,"7-","CWSN-1 ¼Hkkx½ : ekufld eanrk (01)",{"$nulls":4},"vkWfVTe (02)",null,null,"lsfjcy iYlh (03)",null,null,"ekufld jksx (04)",null,null,"Jo.k ckf/kr (05)"]
[]
[null,null,"ewd fu'kDrrk (06)",null,null,"LisfLQd yfuZax fMl,fcfyfV (14)",{"$nulls":4},"ckSf)d fu'kDrrk (15)",{"$nulls":3},"efYViy LDysjksfll (16)",null,null,"cgq fu'kDrrk (21)"]
[]
[]
[null,"8-","CWSN-2 ¼Hkkx½ : n`f\"V ckf/kr (07)",{"$nulls":4},"vYi n`f\"V (08)",null,null,"pyu fu'kDrrk(09)",null,null,"dq\"B jksx (10)",null,null,"ckSukiu (11)"]
[]
[null,null,"rStkc fif³r (12)",null,null,"ekalis'kh nqfoZdkl ¼13½",{"$nulls":3},"ikfdZlkal jksx ¼17½",{"$nulls":3},"fgeksfQfy;k ¼18½",null,null,"FkSyslhfe;k ¼19½"]
[]
[null,null,",fufed@fLdy fMtht (20)",{"$nulls":3},"iksfy;ks@uoZ batjh ¼22½",{"$nulls":3},"lw;Zeq[kh ¼23½",{"$nulls":3}," @lSfud ¼24½"]
[]
[null,"9-","Name of Vocational Trade ¼O;kolkf;d VªsM dk uke½",{"$nulls":6},"………………………………………………………..",{"$nulls":5},"lgh dk fpUg yxk,aA"]
[null,null,"¼dsoy mu 'kkykvksa ds fy, tgka O;kolkf;d f'k{kk lapkfyr gS ,oa ftu fo|kfFkZ;ksa us d{kk 10 rFkk 11 oha esa O;kolkf;d ijh{kk mRrh.kZ dh gSA½"]
[null,null," (1) Automotive (101)",{"$nulls":3},"(2) Beauty & Wellness (102)",{"$nulls":3},"(3) Health Care (103)",{"$nulls":3},"(4) IT & ITES (104)",null,null,"(5) Retail (105)"]
[]
[null,null,"(6) Tourism & Hospitality (106)",{"$nulls":4},"(7) Apprel Made up Home Furnishing (108)",{"$nulls":5},"(8) Electronics & Hardware (109)"]
[]
[null,null," (9) Agriculture (110)",{"$nulls":3},"(10) Plumber (111)",{"$nulls":3},"(11) Telecom (112)"]
[]
[null,"10-","BPL ¼chih,y½ %",{"$nulls":4},"1- YES ¼gk¡½",null,{"$f":"IF(W1693=\"N\",\"\",\"Yes\")","v":"Yes"},null,null,"2- NO ¼ugha¡½",null,{"$f":"IF(W1693=\"Y\",\"\",\"Yes\")","v":"Yes"},{"$nulls":7},{"$f":"VLOOKUP(A1634,'Deta From Shala Dar. Class-12'!$A$2:$AE$201,27,0)","v":0}]
[]
[null,"11-","vukFk oxZ %",{"$nulls":4},"1- YES ¼gk¡½",{"$nulls":4},"2- NO ¼ugha¡½"]
[]
[null,"12-","EWS ¼vkfFkZd n`f\"V ls detksj oxZ½ %",{"$nulls":4},"1- YES ¼gk¡½",{"$nulls":4},"2- NO ¼ugha¡½"]
[]
[null,"13-","CASTE ¼tkfr Js.kh½ %",null,null,"¼05½ Gen ¼lkekU;½",null,null,{"$f":"IF($W1699=\"GEN\",\"YES\",\"\")","v":""},"¼06½ MINORITY ¼lkekU;vYi la[;d½",{"$nulls":3},{"$f":"IF($W1699=\"MIN\",\"YES\",\"\")","v":""},"¼07½ SC ¼vuqlwfpr tkfr½",{"$nulls":4},{"$f":"IF($W1699=\"SC\",\"YES\",\"\")","v":""},null,null,{"$f":"VLOOKUP(A1634,'Deta From Shala Dar. Class-12'!$A$2:$AE$201,16,0)","v":0}]
[]
[{"$nulls":5},"¼08½ ST ¼vuqlwfpr tutkfr½",null,null,{"$f":"IF($W1699=\"ST\",\"YES\",\"\")","v":""},"¼09½ OBC ¼vU; fiN³k oxZ½",{"$nulls":3},{"$f":"IF($W1699=\"OBC\",\"YES\",\"\")","v":""},"¼10½ Special OBC ¼fo'ks\"k fiN³k oxZ½@MBC",{"$nulls":4},{"$f":"IF(OR($W1699=\"MBC\",$W$67=\"SBC\"),\"YES\",\"\")","v":""}]
[null,"uksV%& Nk=o`fr@iqjLdkj mijksDr p;fur Js.kh ds vk/kj ij gh nh tk;sxhA"]
[]
[null,"14-","ADDRESS ¼fo|kFkhZ dk iw.kZ irk½ %&"]
[null,null,"House No./Street/Place Name ¼edku ua-@xyh ua-@LFkku½ %",{"$nulls":7},{"$f":"VLOOKUP(A1634,'Deta From Shala Dar. Class-12'!$A$2:$AE$201,24,0)","v":0}]
[null,null,"Village/Town/City ¼xzke@dLck@'kgj½ %"]
[null,null,"District ¼ftyk½ %",null,null,"………………………….",null,null,"STATE ¼jkT;½ %",null,null,"…………………………………..",{"$nulls":3},"PIN CODE NO. ¼fiu dksM ua-½ %",null,null,"……………………"]
[]
[null,"15-","fo|kFkhZ dk vk/kkj dkMZ uEcj %",{"$nulls":3},{"$f":"VLOOKUP(A1634,'Deta From Shala Dar. Class-12'!$A$2:$AE$201,21,0)","v":{"v":0,"d":"0000"}},{"$nulls":3},"tu vk/kkj uEcj %",null,{"$f":"VLOOKUP(A1634,'Deta From Shala Dar. Class-12'!$A$2:$AE$201,22,0)","v":0},null,null,"vfHkHkkod dh okf\"kZd vk; %",null,null,{"$f":"VLOOKUP(A1634,'Deta From Shala Dar. Class-12'!$A$2:$AE$201,25,0)","v":{"v":0,"d":"₹ 0"}}]
[]
[null,null,"Student/Guardian's Mobile No. ¼fo|kFkhZ@vfHkHkkod dk eksckby uacj½ %",{"$nulls":9},{"$f":"VLOOKUP(A1634,'Deta From Shala Dar. Class-12'!$A$2:$AE$201,23,0)","v":0}]
[]
[null,"16-","Previous Academic Details ¼iwoZ 'kS{kf.kd ;ksX;rk½ %",{"$nulls":9},"---------------------------------------------------------"]
[]
[null,"CLASS ¼d{kk½",null,null,"YEAR ¼oxZ½",null,"ROLL NO. ¼ukekad½",null,null,"RESULT ¼ifj.kke½",null,null,"NAME OF SCHOOL/BOARD ¼Ldwy@cksMZ dk uke½"]
[null,"X"]
[null,"XI"]
[null,"XII"]
[]
[null,"Nk= us ;fn d{kk X vU; cksMZ ls mRrh.kZ dh gS rks %& ¼ns[ksa fo’ks\"k funsZ’k la[;k 6½ ik=rk izek.k i= Øekad",{"$nulls":13},"fnukad"]
[]
[null,"17-","Student's Photo and Signature ¼fo|kFkhZ dk QksVks ,oa gLrk{kj½",{"$nulls":9}," "]
[{"$nulls":10},"Student's Signature ¼fo|kFkhZ ds gLrk{kj½"]
[{"$nulls":3},"PASTE PASSPORT\nSIZE PHOTO"]
[]
[]
[]
[]
[{"$nulls":11}," 'kkyk ç/kku dk çek.khdj.k %&\ngLrk{kj---------------------------------------------------------------"]
[]
[]
[]
[]
[null,"fo|ky; dk uke %&",null,null,{"$f":"Info!$C$7","v":"Govt. Sr. Sec. School Raimalwada"},{"$nulls":6}," 'kkyk dksM %&",null,{"$f":"Info!$C$10","v":1},{"$f":"Info!$D$10","v":7},{"$f":"Info!$E$10","v":0},{"$f":"Info!$F$10","v":1},{"$f":"Info!$G$10","v":7},{"$f":"Info!$H$10","v":5},{"$f":"Info!$I$10","v":1}]
[]
[{"$f":"A1634+1","v":38}]
[null,{"$f":"CONCATENATE(Info!$B$7,Info!$C$7)","v":"School Name :-Govt. Sr. Sec. School Raimalwada"}]
[{"$nulls":3},"Board of Secondary Education, Rajasthan",{"$nulls":12},"Sr. (Reg.)"]
[{"$nulls":3}," Ekk/;fed f’k{kk cksMZ]jktLFkku ",{"$nulls":12},"fu;fer ijh{kkFkhZ"]
[null,"mPp ek/;fed ijh{kk",{"$nulls":3},"APPLICATION FORM FOR SENIOR SECONDARY EXAMINATION-2024",{"$nulls":7},{"$f":"Info!$C$10","v":1},{"$f":"Info!$D$10","v":7},{"$f":"Info!$E$10","v":0},{"$f":"Info!$F$10","v":1},{"$f":"Info!$G$10","v":7},{"$f":"Info!$H$10","v":5},{"$f":"Info!$I$10","v":1}]
[{"$nulls":5}," Ikjh{kk vkosnu i= mPp ek/;fed ijh{kk & 2024"]
[{"$nulls":13}," 'kkyk niZ.k Øekad %&",{"$nulls":3},{"$f":"Info!$C$9","v":12345}]
[null,"Scholar Reg. No. ¼LdkWyj jftLVj Øekad½",{"$nulls":5},{"$f":"VLOOKUP(A1736,'Deta From Shala Dar. Class-12'!$A$2:$AE$201,4,0)","v":0}]
[null,"1- Student’s Name (fo|kFkhZ dk uke) :",{"$nulls":5},{"$f":"VLOOKUP(A1736,'Deta From Shala Dar. Class-12'!$A$2:$AE$201,6,0)","v":0}]
[null,"2- Mother’s Name ¼ekrk dk uke) :",{"$nulls":5},{"$f":"VLOOKUP(A1736,'Deta From Shala Dar. Class-12'!$A$2:$AE$201,8,0)","v":0}]
[null,"3- Father’s Name (firk dk uke) :",{"$nulls":5},{"$f":"VLOOKUP(A1736,'Deta From Shala Dar. Class-12'!$A$2:$AE$201,9,0)","v":0}]
[null,"4- Category Code (Js.kh dksM) : ¼Js.kh p;u gsrq ihNs fy[ks fo’k\"sk funsZ’k la[;k 1 ns[ks½ Js.kh dk uke %&",{"$nulls":8},"………………………………………………….",{"$nulls":5},"dksM %&"]
[null,"5- Group & Subjects (oxZ ,o a fo\"k;): ( as apply)"]
[null,"Table - A : Only for category(dsoy Js.kh 1]2 , o 8 ds fy;s) (I)ALL SUBJECTS (1-lEiw.kZ fo\"k;), (II) DIVISION IMPROVEMENT (2-Js.kh lq/kkj) & (VIII) FACULTY CHANGE (8-oxZ ifjorZu)  OPTIONAL SUBJECTS oSdfYid fo\"k;) :"]
[]
[{"$nulls":3},"ARTS ¼dyk oxZ½ (1)",{"$nulls":3},"COMMERCE ¼okf.kT; oxZ½ (2)",{"$nulls":5},"SCIENCE ¼foKku oxZ½ (3A)",{"$nulls":3},"AGRICULTURE ¼d`f\"k oxZ½ (3B)"]
[null,null,"1………………………………………",{"$nulls":3},"1 Accountancy",{"$nulls":3},30,null,"1 Physics",null,null,40,"1 Agriculture",null,null,84]
[null,null,"2………………………………………",{"$nulls":3},"2 Buisness Studies",{"$nulls":3},31,null,"2 Chemistry",null,null,41,"2 Ag. Bio.",null,null,39]
[null,null,"3………………………………………",{"$nulls":3},"3………………………………………",{"$nulls":5},"3 …………………………….",{"$nulls":3},"3 ……………………………."]
[]
[]
[]
[{"$nulls":13},"ARTS",null,"((1))","1 ……………………………."]
[{"$nulls":3},"As Applicable ",{"$nulls":4},"tks ykxw gks½",{"$nulls":4},"COMMERCE",null,"((2))","2 ……………………………."]
[null,null,"ADDISTIONAL OPTIONAL SUBJECTS ¼vfrfjDr oSdfYid fo\"k;½ %",{"$nulls":10},"SCIENCE",null,"(3A)","3 ……………………………."]
[{"$nulls":13},"ARGRICULTURE",null,"(3B)","4 ……………………………."]
[{"$nulls":12},"1…………………………………………"]
[]
[]
[]
[null,"Table - B Only for category ¼dsoy Js.kh 4 o 6 ds fy,½ : ",{"$nulls":11},"ARTS",null,"((1))","1 ……………………………."]
[{"$nulls":3},"As Applicable ",{"$nulls":4},"tks ykxw gks½",{"$nulls":4},"COMMERCE",null,"((2))","2 ……………………………."]
[{"$nulls":3},"(IV) ADDITIONAL SUBJECTS ¼vfrfjDr fo\"k;½   (4)",{"$nulls":9},"SCIENCE",null,"((3A))","3 ……………………………."]
[{"$nulls":3},"(VI) MARKS IMPROVEMENT ¼vad lqFkkj½      (6)",{"$nulls":9},"AGRICULTURE",null,"((3B))","4 ……………………………."]
[]
[]
[{"$nulls":3},"As Applicable from Number 6 to 13 ¼Øekad 6 ls 13 rd tks ykxw gks",{"$nulls":9},"djsa½"]
[]
[null,"6-","Gender ¼fyax½ : (01) Male ¼iq:\"k½",{"$nulls":3},{"$f":"IF(W1774=\"M\",\"Yes\",\"\")","v":""},"(02) FEMALE ¼efgyk½",null,null,{"$f":"IF(W1774=\"F\",\"Yes\",\"\")","v":""},"Medium ¼ek/;e½ : (01) HINDI ¼fgUnh½",{"$nulls":3},{"$f":"IF(X1774=\"Hindi\",\"Yes\",\"\")","v":"Yes"},"(02) ENGLISH ¼vaxzsth½",null,null,{"$f":"IF(X1774=\"english\",\"Yes\",\"\")","v":""},null,null,{"$f":"VLOOKUP(A1736,'Deta From Shala Dar. Class-12'!$A$2:$AE$201,10,0)","v":0},{"$f":"Info!$C$8","v":"Hindi"}]
[]
[null,"7-","CWSN-1 ¼Hkkx½ : ekufld eanrk (01)",{"$nulls":4},"vkWfVTe (02)",null,null,"lsfjcy iYlh (03)",null,null,"ekufld jksx (04)",null,null,"Jo.k ckf/kr (05)"]
[]
[null,null,"ewd fu'kDrrk (06)",null,null,"LisfLQd yfuZax fMl,fcfyfV (14)",{"$nulls":4},"ckSf)d fu'kDrrk (15)",{"$nulls":3},"efYViy LDysjksfll (16)",null,null,"cgq fu'kDrrk (21)"]
[]
[]
[null,"8-","CWSN-2 ¼Hkkx½ : n`f\"V ckf/kr (07)",{"$nulls":4},"vYi n`f\"V (08)",null,null,"pyu fu'kDrrk(09)",null,null,"dq\"B jksx (10)",null,null,"ckSukiu (11)"]
[]
[null,null,"rStkc fif³r (12)",null,null,"ekalis'kh nqfoZdkl ¼13½",{"$nulls":3},"ikfdZlkal jksx ¼17½",{"$nulls":3},"fgeksfQfy;k ¼18½",null,null,"FkSyslhfe;k ¼19½"]
[]
[null,null,",fufed@fLdy fMtht (20)",{"$nulls":3},"iksfy;ks@uoZ batjh ¼22½",{"$nulls":3},"lw;Zeq[kh ¼23½",{"$nulls":3}," @lSfud ¼24½"]
[]
[null,"9-","Name of Vocational Trade ¼O;kolkf;d VªsM dk uke½",{"$nulls":6},"………………………………………………………..",{"$nulls":5},"lgh dk fpUg yxk,aA"]
[null,null,"¼dsoy mu 'kkykvksa ds fy, tgka O;kolkf;d f'k{kk lapkfyr gS ,oa ftu fo|kfFkZ;ksa us d{kk 10 rFkk 11 oha esa O;kolkf;d ijh{kk mRrh.kZ dh gSA½"]
[null,null," (1) Automotive (101)",{"$nulls":3},"(2) Beauty & Wellness (102)",{"$nulls":3},"(3) Health Care (103)",{"$nulls":3},"(4) IT & ITES (104)",null,null,"(5) Retail (105)"]
[]
[null,null,"(6) Tourism & Hospitality (106)",{"$nulls":4},"(7) Apprel Made up Home Furnishing (108)",{"$nulls":5},"(8) Electronics & Hardware (109)"]
[]
[null,null," (9) Agriculture (110)",{"$nulls":3},"(10) Plumber (111)",{"$nulls":3},"(11) Telecom (112)"]
[]
[null,"10-","BPL ¼chih,y½ %",{"$nulls":4},"1- YES ¼gk¡½",null,{"$f":"IF(W1795=\"N\",\"\",\"Yes\")","v":"Yes"},null,null,"2- NO ¼ugha¡½",null,{"$f":"IF(W1795=\"Y\",\"\",\"Yes\")","v":"Yes"},{"$nulls":7},{"$f":"VLOOKUP(A1736,'Deta From Shala Dar. Class-12'!$A$2:$AE$201,27,0)","v":0}]
[]
[null,"11-","vukFk oxZ %",{"$nulls":4},"1- YES ¼gk¡½",{"$nulls":4},"2- NO ¼ugha¡½"]
[]
[null,"12-","EWS ¼vkfFkZd n`f\"V ls detksj oxZ½ %",{"$nulls":4},"1- YES ¼gk¡½",{"$nulls":4},"2- NO ¼ugha¡½"]
[]
[null,"13-","CASTE ¼tkfr Js.kh½ %",null,null,"¼05½ Gen ¼lkekU;½",null,null,{"$f":"IF($W1801=\"GEN\",\"YES\",\"\")","v":""},"¼06½ MINORITY ¼lkekU;vYi la[;d½",{"$nulls":3},{"$f":"IF($W1801=\"MIN\",\"YES\",\"\")","v":""},"¼07½ SC ¼vuqlwfpr tkfr½",{"$nulls":4},{"$f":"IF($W1801=\"SC\",\"YES\",\"\")","v":""},null,null,{"$f":"VLOOKUP(A1736,'Deta From Shala Dar. Class-12'!$A$2:$AE$201,16,0)","v":0}]
[]
[{"$nulls":5},"¼08½ ST ¼vuqlwfpr tutkfr½",null,null,{"$f":"IF($W1801=\"ST\",\"YES\",\"\")","v":""},"¼09½ OBC ¼vU; fiN³k oxZ½",{"$nulls":3},{"$f":"IF($W1801=\"OBC\",\"YES\",\"\")","v":""},"¼10½ Special OBC ¼fo'ks\"k fiN³k oxZ½@MBC",{"$nulls":4},{"$f":"IF(OR($W1801=\"MBC\",$W$67=\"SBC\"),\"YES\",\"\")","v":""}]
[null,"uksV%& Nk=o`fr@iqjLdkj mijksDr p;fur Js.kh ds vk/kj ij gh nh tk;sxhA"]
[]
[null,"14-","ADDRESS ¼fo|kFkhZ dk iw.kZ irk½ %&"]
[null,null,"House No./Street/Place Name ¼edku ua-@xyh ua-@LFkku½ %",{"$nulls":7},{"$f":"VLOOKUP(A1736,'Deta From Shala Dar. Class-12'!$A$2:$AE$201,24,0)","v":0}]
[null,null,"Village/Town/City ¼xzke@dLck@'kgj½ %"]
[null,null,"District ¼ftyk½ %",null,null,"………………………….",null,null,"STATE ¼jkT;½ %",null,null,"…………………………………..",{"$nulls":3},"PIN CODE NO. ¼fiu dksM ua-½ %",null,null,"……………………"]
[]
[null,"15-","fo|kFkhZ dk vk/kkj dkMZ uEcj %",{"$nulls":3},{"$f":"VLOOKUP(A1736,'Deta From Shala Dar. Class-12'!$A$2:$AE$201,21,0)","v":{"v":0,"d":"0000"}},{"$nulls":3},"tu vk/kkj uEcj %",null,{"$f":"VLOOKUP(A1736,'Deta From Shala Dar. Class-12'!$A$2:$AE$201,22,0)","v":0},null,null,"vfHkHkkod dh okf\"kZd vk; %",null,null,{"$f":"VLOOKUP(A1736,'Deta From Shala Dar. Class-12'!$A$2:$AE$201,25,0)","v":{"v":0,"d":"₹ 0"}}]
[]
[null,null,"Student/Guardian's Mobile No. ¼fo|kFkhZ@vfHkHkkod dk eksckby uacj½ %",{"$nulls":9},{"$f":"VLOOKUP(A1736,'Deta From Shala Dar. Class-12'!$A$2:$AE$201,23,0)","v":0}]
[]
[null,"16-","Previous Academic Details ¼iwoZ 'kS{kf.kd ;ksX;rk½ %",{"$nulls":9},"---------------------------------------------------------"]
[]
[null,"CLASS ¼d{kk½",null,null,"YEAR ¼oxZ½",null,"ROLL NO. ¼ukekad½",null,null,"RESULT ¼ifj.kke½",null,null,"NAME OF SCHOOL/BOARD ¼Ldwy@cksMZ dk uke½"]
[null,"X"]
[null,"XI"]
[null,"XII"]
[]
[null,"Nk= us ;fn d{kk X vU; cksMZ ls mRrh.kZ dh gS rks %& ¼ns[ksa fo’ks\"k funsZ’k la[;k 6½ ik=rk izek.k i= Øekad",{"$nulls":13},"fnukad"]
[]
[null,"17-","Student's Photo and Signature ¼fo|kFkhZ dk QksVks ,oa gLrk{kj½",{"$nulls":9}," "]
[{"$nulls":10},"Student's Signature ¼fo|kFkhZ ds gLrk{kj½"]
[{"$nulls":3},"PASTE PASSPORT\nSIZE PHOTO"]
[]
[]
[]
[]
[{"$nulls":11}," 'kkyk ç/kku dk çek.khdj.k %&\ngLrk{kj---------------------------------------------------------------"]
[]
[]
[]
[]
[null,"fo|ky; dk uke %&",null,null,{"$f":"Info!$C$7","v":"Govt. Sr. Sec. School Raimalwada"},{"$nulls":6}," 'kkyk dksM %&",null,{"$f":"Info!$C$10","v":1},{"$f":"Info!$D$10","v":7},{"$f":"Info!$E$10","v":0},{"$f":"Info!$F$10","v":1},{"$f":"Info!$G$10","v":7},{"$f":"Info!$H$10","v":5},{"$f":"Info!$I$10","v":1}]
[]
[{"$f":"A1736+1","v":39}]
[null,{"$f":"CONCATENATE(Info!$B$7,Info!$C$7)","v":"School Name :-Govt. Sr. Sec. School Raimalwada"}]
[{"$nulls":3},"Board of Secondary Education, Rajasthan",{"$nulls":12},"Sr. (Reg.)"]
[{"$nulls":3}," Ekk/;fed f’k{kk cksMZ]jktLFkku ",{"$nulls":12},"fu;fer ijh{kkFkhZ"]
[null,"mPp ek/;fed ijh{kk",{"$nulls":3},"APPLICATION FORM FOR SENIOR SECONDARY EXAMINATION-2024",{"$nulls":7},{"$f":"Info!$C$10","v":1},{"$f":"Info!$D$10","v":7},{"$f":"Info!$E$10","v":0},{"$f":"Info!$F$10","v":1},{"$f":"Info!$G$10","v":7},{"$f":"Info!$H$10","v":5},{"$f":"Info!$I$10","v":1}]
[{"$nulls":5}," Ikjh{kk vkosnu i= mPp ek/;fed ijh{kk & 2024"]
[{"$nulls":13}," 'kkyk niZ.k Øekad %&",{"$nulls":3},{"$f":"Info!$C$9","v":12345}]
[null,"Scholar Reg. No. ¼LdkWyj jftLVj Øekad½",{"$nulls":5},{"$f":"VLOOKUP(A1838,'Deta From Shala Dar. Class-12'!$A$2:$AE$201,4,0)","v":0}]
[null,"1- Student’s Name (fo|kFkhZ dk uke) :",{"$nulls":5},{"$f":"VLOOKUP(A1838,'Deta From Shala Dar. Class-12'!$A$2:$AE$201,6,0)","v":0}]
[null,"2- Mother’s Name ¼ekrk dk uke) :",{"$nulls":5},{"$f":"VLOOKUP(A1838,'Deta From Shala Dar. Class-12'!$A$2:$AE$201,8,0)","v":0}]
[null,"3- Father’s Name (firk dk uke) :",{"$nulls":5},{"$f":"VLOOKUP(A1838,'Deta From Shala Dar. Class-12'!$A$2:$AE$201,9,0)","v":0}]
[null,"4- Category Code (Js.kh dksM) : ¼Js.kh p;u gsrq ihNs fy[ks fo’k\"sk funsZ’k la[;k 1 ns[ks½ Js.kh dk uke %&",{"$nulls":8},"………………………………………………….",{"$nulls":5},"dksM %&"]
[null,"5- Group & Subjects (oxZ ,o a fo\"k;): ( as apply)"]
[null,"Table - A : Only for category(dsoy Js.kh 1]2 , o 8 ds fy;s) (I)ALL SUBJECTS (1-lEiw.kZ fo\"k;), (II) DIVISION IMPROVEMENT (2-Js.kh lq/kkj) & (VIII) FACULTY CHANGE (8-oxZ ifjorZu)  OPTIONAL SUBJECTS oSdfYid fo\"k;) :"]
[]
[{"$nulls":3},"ARTS ¼dyk oxZ½ (1)",{"$nulls":3},"COMMERCE ¼okf.kT; oxZ½ (2)",{"$nulls":5},"SCIENCE ¼foKku oxZ½ (3A)",{"$nulls":3},"AGRICULTURE ¼d`f\"k oxZ½ (3B)"]
[null,null,"1………………………………………",{"$nulls":3},"1 Accountancy",{"$nulls":3},30,null,"1 Physics",null,null,40,"1 Agriculture",null,null,84]
[null,null,"2………………………………………",{"$nulls":3},"2 Buisness Studies",{"$nulls":3},31,null,"2 Chemistry",null,null,41,"2 Ag. Bio.",null,null,39]
[null,null,"3………………………………………",{"$nulls":3},"3………………………………………",{"$nulls":5},"3 …………………………….",{"$nulls":3},"3 ……………………………."]
[]
[]
[]
[{"$nulls":13},"ARTS",null,"((1))","1 ……………………………."]
[{"$nulls":3},"As Applicable ",{"$nulls":4},"tks ykxw gks½",{"$nulls":4},"COMMERCE",null,"((2))","2 ……………………………."]
[null,null,"ADDISTIONAL OPTIONAL SUBJECTS ¼vfrfjDr oSdfYid fo\"k;½ %",{"$nulls":10},"SCIENCE",null,"(3A)","3 ……………………………."]
[{"$nulls":13},"ARGRICULTURE",null,"(3B)","4 ……………………………."]
[{"$nulls":12},"1…………………………………………"]
[]
[]
[]
[null,"Table - B Only for category ¼dsoy Js.kh 4 o 6 ds fy,½ : ",{"$nulls":11},"ARTS",null,"((1))","1 ……………………………."]
[{"$nulls":3},"As Applicable ",{"$nulls":4},"tks ykxw gks½",{"$nulls":4},"COMMERCE",null,"((2))","2 ……………………………."]
[{"$nulls":3},"(IV) ADDITIONAL SUBJECTS ¼vfrfjDr fo\"k;½   (4)",{"$nulls":9},"SCIENCE",null,"((3A))","3 ……………………………."]
[{"$nulls":3},"(VI) MARKS IMPROVEMENT ¼vad lqFkkj½      (6)",{"$nulls":9},"AGRICULTURE",null,"((3B))","4 ……………………………."]
[]
[]
[{"$nulls":3},"As Applicable from Number 6 to 13 ¼Øekad 6 ls 13 rd tks ykxw gks",{"$nulls":9},"djsa½"]
[]
[null,"6-","Gender ¼fyax½ : (01) Male ¼iq:\"k½",{"$nulls":3},{"$f":"IF(W1876=\"F\",\"\",\"Yes\")","v":"Yes"},"(02) FEMALE ¼efgyk½",null,null,{"$f":"IF(W1876=\"M\",\"\",\"Yes\")","v":"Yes"},"Medium ¼ek/;e½ : (01) HINDI ¼fgUnh½",{"$nulls":3},{"$f":"IF(X1876=\"Hindi\",\"Yes\",\"\")","v":"Yes"},"(02) ENGLISH ¼vaxzsth½",null,null,{"$f":"IF(X1876=\"english\",\"Yes\",\"\")","v":""},null,null,{"$f":"VLOOKUP(A1838,'Deta From Shala Dar. Class-12'!$A$2:$AE$201,10,0)","v":0},{"$f":"Info!$C$8","v":"Hindi"}]
[]
[null,"7-","CWSN-1 ¼Hkkx½ : ekufld eanrk (01)",{"$nulls":4},"vkWfVTe (02)",null,null,"lsfjcy iYlh (03)",null,null,"ekufld jksx (04)",null,null,"Jo.k ckf/kr (05)"]
[]
[null,null,"ewd fu'kDrrk (06)",null,null,"LisfLQd yfuZax fMl,fcfyfV (14)",{"$nulls":4},"ckSf)d fu'kDrrk (15)",{"$nulls":3},"efYViy LDysjksfll (16)",null,null,"cgq fu'kDrrk (21)"]
[]
[]
[null,"8-","CWSN-2 ¼Hkkx½ : n`f\"V ckf/kr (07)",{"$nulls":4},"vYi n`f\"V (08)",null,null,"pyu fu'kDrrk(09)",null,null,"dq\"B jksx (10)",null,null,"ckSukiu (11)"]
[]
[null,null,"rStkc fif³r (12)",null,null,"ekalis'kh nqfoZdkl ¼13½",{"$nulls":3},"ikfdZlkal jksx ¼17½",{"$nulls":3},"fgeksfQfy;k ¼18½",null,null,"FkSyslhfe;k ¼19½"]
[]
[null,null,",fufed@fLdy fMtht (20)",{"$nulls":3},"iksfy;ks@uoZ batjh ¼22½",{"$nulls":3},"lw;Zeq[kh ¼23½",{"$nulls":3}," @lSfud ¼24½"]
[]
[null,"9-","Name of Vocational Trade ¼O;kolkf;d VªsM dk uke½",{"$nulls":6},"………………………………………………………..",{"$nulls":5},"lgh dk fpUg yxk,aA"]
[null,null,"¼dsoy mu 'kkykvksa ds fy, tgka O;kolkf;d f'k{kk lapkfyr gS ,oa ftu fo|kfFkZ;ksa us d{kk 10 rFkk 11 oha esa O;kolkf;d ijh{kk mRrh.kZ dh gSA½"]
[null,null," (1) Automotive (101)",{"$nulls":3},"(2) Beauty & Wellness (102)",{"$nulls":3},"(3) Health Care (103)",{"$nulls":3},"(4) IT & ITES (104)",null,null,"(5) Retail (105)"]
[]
[null,null,"(6) Tourism & Hospitality (106)",{"$nulls":4},"(7) Apprel Made up Home Furnishing (108)",{"$nulls":5},"(8) Electronics & Hardware (109)"]
[]
[null,null," (9) Agriculture (110)",{"$nulls":3},"(10) Plumber (111)",{"$nulls":3},"(11) Telecom (112)"]
[]
[null,"10-","BPL ¼chih,y½ %",{"$nulls":4},"1- YES ¼gk¡½",null,{"$f":"IF(W1897=\"N\",\"\",\"Yes\")","v":"Yes"},null,null,"2- NO ¼ugha¡½",null,{"$f":"IF(W1897=\"Y\",\"\",\"Yes\")","v":"Yes"},{"$nulls":7},{"$f":"VLOOKUP(A1838,'Deta From Shala Dar. Class-12'!$A$2:$AE$201,27,0)","v":0}]
[]
[null,"11-","vukFk oxZ %",{"$nulls":4},"1- YES ¼gk¡½",{"$nulls":4},"2- NO ¼ugha¡½"]
[]
[null,"12-","EWS ¼vkfFkZd n`f\"V ls detksj oxZ½ %",{"$nulls":4},"1- YES ¼gk¡½",{"$nulls":4},"2- NO ¼ugha¡½"]
[]
[null,"13-","CASTE ¼tkfr Js.kh½ %",null,null,"¼05½ Gen ¼lkekU;½",null,null,{"$f":"IF($W1903=\"GEN\",\"YES\",\"\")","v":""},"¼06½ MINORITY ¼lkekU;vYi la[;d½",{"$nulls":3},{"$f":"IF($W1903=\"MIN\",\"YES\",\"\")","v":""},"¼07½ SC ¼vuqlwfpr tkfr½",{"$nulls":4},{"$f":"IF($W1903=\"SC\",\"YES\",\"\")","v":""},null,null,{"$f":"VLOOKUP(A1838,'Deta From Shala Dar. Class-12'!$A$2:$AE$201,16,0)","v":0}]
[]
[{"$nulls":5},"¼08½ ST ¼vuqlwfpr tutkfr½",null,null,{"$f":"IF($W1903=\"ST\",\"YES\",\"\")","v":""},"¼09½ OBC ¼vU; fiN³k oxZ½",{"$nulls":3},{"$f":"IF($W1903=\"OBC\",\"YES\",\"\")","v":""},"¼10½ Special OBC ¼fo'ks\"k fiN³k oxZ½@MBC",{"$nulls":4},{"$f":"IF(OR($W1903=\"MBC\",$W$67=\"SBC\"),\"YES\",\"\")","v":""}]
[null,"uksV%& Nk=o`fr@iqjLdkj mijksDr p;fur Js.kh ds vk/kj ij gh nh tk;sxhA"]
[]
[null,"14-","ADDRESS ¼fo|kFkhZ dk iw.kZ irk½ %&"]
[null,null,"House No./Street/Place Name ¼edku ua-@xyh ua-@LFkku½ %",{"$nulls":7},{"$f":"VLOOKUP(A1838,'Deta From Shala Dar. Class-12'!$A$2:$AE$201,24,0)","v":0}]
[null,null,"Village/Town/City ¼xzke@dLck@'kgj½ %"]
[null,null,"District ¼ftyk½ %",null,null,"………………………….",null,null,"STATE ¼jkT;½ %",null,null,"…………………………………..",{"$nulls":3},"PIN CODE NO. ¼fiu dksM ua-½ %",null,null,"……………………"]
[]
[null,"15-","fo|kFkhZ dk vk/kkj dkMZ uEcj %",{"$nulls":3},{"$f":"VLOOKUP(A1838,'Deta From Shala Dar. Class-12'!$A$2:$AE$201,21,0)","v":{"v":0,"d":"0000"}},{"$nulls":3},"tu vk/kkj uEcj %",null,{"$f":"VLOOKUP(A1838,'Deta From Shala Dar. Class-12'!$A$2:$AE$201,22,0)","v":0},null,null,"vfHkHkkod dh okf\"kZd vk; %",null,null,{"$f":"VLOOKUP(A1838,'Deta From Shala Dar. Class-12'!$A$2:$AE$201,25,0)","v":{"v":0,"d":"₹ 0"}}]
[]
[null,null,"Student/Guardian's Mobile No. ¼fo|kFkhZ@vfHkHkkod dk eksckby uacj½ %",{"$nulls":9},{"$f":"VLOOKUP(A1838,'Deta From Shala Dar. Class-12'!$A$2:$AE$201,23,0)","v":0}]
[]
[null,"16-","Previous Academic Details ¼iwoZ 'kS{kf.kd ;ksX;rk½ %",{"$nulls":9},"---------------------------------------------------------"]
[]
[null,"CLASS ¼d{kk½",null,null,"YEAR ¼oxZ½",null,"ROLL NO. ¼ukekad½",null,null,"RESULT ¼ifj.kke½",null,null,"NAME OF SCHOOL/BOARD ¼Ldwy@cksMZ dk uke½"]
[null,"X"]
[null,"XI"]
[null,"XII"]
[]
[null,"Nk= us ;fn d{kk X vU; cksMZ ls mRrh.kZ dh gS rks %& ¼ns[ksa fo’ks\"k funsZ’k la[;k 6½ ik=rk izek.k i= Øekad",{"$nulls":13},"fnukad"]
[]
[null,"17-","Student's Photo and Signature ¼fo|kFkhZ dk QksVks ,oa gLrk{kj½",{"$nulls":9}," "]
[{"$nulls":10},"Student's Signature ¼fo|kFkhZ ds gLrk{kj½"]
[{"$nulls":3},"PASTE PASSPORT\nSIZE PHOTO"]
[]
[]
[]
[]
[{"$nulls":11}," 'kkyk ç/kku dk çek.khdj.k %&\ngLrk{kj---------------------------------------------------------------"]
[]
[]
[]
[]
[null,"fo|ky; dk uke %&",null,null,{"$f":"Info!$C$7","v":"Govt. Sr. Sec. School Raimalwada"},{"$nulls":6}," 'kkyk dksM %&",null,{"$f":"Info!$C$10","v":1},{"$f":"Info!$D$10","v":7},{"$f":"Info!$E$10","v":0},{"$f":"Info!$F$10","v":1},{"$f":"Info!$G$10","v":7},{"$f":"Info!$H$10","v":5},{"$f":"Info!$I$10","v":1}]
[]
[{"$f":"A1838+1","v":40}]
[null,{"$f":"CONCATENATE(Info!$B$7,Info!$C$7)","v":"School Name :-Govt. Sr. Sec. School Raimalwada"}]
[{"$nulls":3},"Board of Secondary Education, Rajasthan",{"$nulls":12},"Sr. (Reg.)"]
[{"$nulls":3}," Ekk/;fed f’k{kk cksMZ]jktLFkku ",{"$nulls":12},"fu;fer ijh{kkFkhZ"]
[null,"mPp ek/;fed ijh{kk",{"$nulls":3},"APPLICATION FORM FOR SENIOR SECONDARY EXAMINATION-2024",{"$nulls":7},{"$f":"Info!$C$10","v":1},{"$f":"Info!$D$10","v":7},{"$f":"Info!$E$10","v":0},{"$f":"Info!$F$10","v":1},{"$f":"Info!$G$10","v":7},{"$f":"Info!$H$10","v":5},{"$f":"Info!$I$10","v":1}]
[{"$nulls":5}," Ikjh{kk vkosnu i= mPp ek/;fed ijh{kk & 2024"]
[{"$nulls":13}," 'kkyk niZ.k Øekad %&",{"$nulls":3},{"$f":"Info!$C$9","v":12345}]
[null,"Scholar Reg. No. ¼LdkWyj jftLVj Øekad½",{"$nulls":5},{"$f":"VLOOKUP(A1940,'Deta From Shala Dar. Class-12'!$A$2:$AE$201,4,0)","v":0}]
[null,"1- Student’s Name (fo|kFkhZ dk uke) :",{"$nulls":5},{"$f":"VLOOKUP(A1940,'Deta From Shala Dar. Class-12'!$A$2:$AE$201,6,0)","v":0}]
[null,"2- Mother’s Name ¼ekrk dk uke) :",{"$nulls":5},{"$f":"VLOOKUP(A1940,'Deta From Shala Dar. Class-12'!$A$2:$AE$201,8,0)","v":0}]
[null,"3- Father’s Name (firk dk uke) :",{"$nulls":5},{"$f":"VLOOKUP(A1940,'Deta From Shala Dar. Class-12'!$A$2:$AE$201,9,0)","v":0}]
[null,"4- Category Code (Js.kh dksM) : ¼Js.kh p;u gsrq ihNs fy[ks fo’k\"sk funsZ’k la[;k 1 ns[ks½ Js.kh dk uke %&",{"$nulls":8},"………………………………………………….",{"$nulls":5},"dksM %&"]
[null,"5- Group & Subjects (oxZ ,o a fo\"k;): ( as apply)"]
[null,"Table - A : Only for category(dsoy Js.kh 1]2 , o 8 ds fy;s) (I)ALL SUBJECTS (1-lEiw.kZ fo\"k;), (II) DIVISION IMPROVEMENT (2-Js.kh lq/kkj) & (VIII) FACULTY CHANGE (8-oxZ ifjorZu)  OPTIONAL SUBJECTS oSdfYid fo\"k;) :"]
[]
[{"$nulls":3},"ARTS ¼dyk oxZ½ (1)",{"$nulls":3},"COMMERCE ¼okf.kT; oxZ½ (2)",{"$nulls":5},"SCIENCE ¼foKku oxZ½ (3A)",{"$nulls":3},"AGRICULTURE ¼d`f\"k oxZ½ (3B)"]
[null,null,"1………………………………………",{"$nulls":3},"1 Accountancy",{"$nulls":3},30,null,"1 Physics",null,null,40,"1 Agriculture",null,null,84]
[null,null,"2………………………………………",{"$nulls":3},"2 Buisness Studies",{"$nulls":3},31,null,"2 Chemistry",null,null,41,"2 Ag. Bio.",null,null,39]
[null,null,"3………………………………………",{"$nulls":3},"3………………………………………",{"$nulls":5},"3 …………………………….",{"$nulls":3},"3 ……………………………."]
[]
[]
[]
[{"$nulls":13},"ARTS",null,"((1))","1 ……………………………."]
[{"$nulls":3},"As Applicable ",{"$nulls":4},"tks ykxw gks½",{"$nulls":4},"COMMERCE",null,"((2))","2 ……………………………."]
[null,null,"ADDISTIONAL OPTIONAL SUBJECTS ¼vfrfjDr oSdfYid fo\"k;½ %",{"$nulls":10},"SCIENCE",null,"(3A)","3 ……………………………."]
[{"$nulls":13},"ARGRICULTURE",null,"(3B)","4 ……………………………."]
[{"$nulls":12},"1…………………………………………"]
[]
[]
[]
[null,"Table - B Only for category ¼dsoy Js.kh 4 o 6 ds fy,½ : ",{"$nulls":11},"ARTS",null,"((1))","1 ……………………………."]
[{"$nulls":3},"As Applicable ",{"$nulls":4},"tks ykxw gks½",{"$nulls":4},"COMMERCE",null,"((2))","2 ……………………………."]
[{"$nulls":3},"(IV) ADDITIONAL SUBJECTS ¼vfrfjDr fo\"k;½   (4)",{"$nulls":9},"SCIENCE",null,"((3A))","3 ……………………………."]
[{"$nulls":3},"(VI) MARKS IMPROVEMENT ¼vad lqFkkj½      (6)",{"$nulls":9},"AGRICULTURE",null,"((3B))","4 ……………………………."]
[]
[]
[{"$nulls":3},"As Applicable from Number 6 to 13 ¼Øekad 6 ls 13 rd tks ykxw gks",{"$nulls":9},"djsa½"]
[]
[null,"6-","Gender ¼fyax½ : (01) Male ¼iq:\"k½",{"$nulls":3},{"$f":"IF(W1978=\"F\",\"\",\"Yes\")","v":"Yes"},"(02) FEMALE ¼efgyk½",null,null,{"$f":"IF(W1978=\"M\",\"\",\"Yes\")","v":"Yes"},"Medium ¼ek/;e½ : (01) HINDI ¼fgUnh½",{"$nulls":3},{"$f":"IF(X1978=\"Hindi\",\"Yes\",\"\")","v":"Yes"},"(02) ENGLISH ¼vaxzsth½",null,null,{"$f":"IF(X1978=\"english\",\"Yes\",\"\")","v":""},null,null,{"$f":"VLOOKUP(A1940,'Deta From Shala Dar. Class-12'!$A$2:$AE$201,10,0)","v":0},{"$f":"Info!$C$8","v":"Hindi"}]
[]
[null,"7-","CWSN-1 ¼Hkkx½ : ekufld eanrk (01)",{"$nulls":4},"vkWfVTe (02)",null,null,"lsfjcy iYlh (03)",null,null,"ekufld jksx (04)",null,null,"Jo.k ckf/kr (05)"]
[]
[null,null,"ewd fu'kDrrk (06)",null,null,"LisfLQd yfuZax fMl,fcfyfV (14)",{"$nulls":4},"ckSf)d fu'kDrrk (15)",{"$nulls":3},"efYViy LDysjksfll (16)",null,null,"cgq fu'kDrrk (21)"]
[]
[]
[null,"8-","CWSN-2 ¼Hkkx½ : n`f\"V ckf/kr (07)",{"$nulls":4},"vYi n`f\"V (08)",null,null,"pyu fu'kDrrk(09)",null,null,"dq\"B jksx (10)",null,null,"ckSukiu (11)"]
[]
[null,null,"rStkc fif³r (12)",null,null,"ekalis'kh nqfoZdkl ¼13½",{"$nulls":3},"ikfdZlkal jksx ¼17½",{"$nulls":3},"fgeksfQfy;k ¼18½",null,null,"FkSyslhfe;k ¼19½"]
[]
[null,null,",fufed@fLdy fMtht (20)",{"$nulls":3},"iksfy;ks@uoZ batjh ¼22½",{"$nulls":3},"lw;Zeq[kh ¼23½",{"$nulls":3}," @lSfud ¼24½"]
[]
[null,"9-","Name of Vocational Trade ¼O;kolkf;d VªsM dk uke½",{"$nulls":6},"………………………………………………………..",{"$nulls":5},"lgh dk fpUg yxk,aA"]
[null,null,"¼dsoy mu 'kkykvksa ds fy, tgka O;kolkf;d f'k{kk lapkfyr gS ,oa ftu fo|kfFkZ;ksa us d{kk 10 rFkk 11 oha esa O;kolkf;d ijh{kk mRrh.kZ dh gSA½"]
[null,null," (1) Automotive (101)",{"$nulls":3},"(2) Beauty & Wellness (102)",{"$nulls":3},"(3) Health Care (103)",{"$nulls":3},"(4) IT & ITES (104)",null,null,"(5) Retail (105)"]
[]
[null,null,"(6) Tourism & Hospitality (106)",{"$nulls":4},"(7) Apprel Made up Home Furnishing (108)",{"$nulls":5},"(8) Electronics & Hardware (109)"]
[]
[null,null," (9) Agriculture (110)",{"$nulls":3},"(10) Plumber (111)",{"$nulls":3},"(11) Telecom (112)"]
[]
[null,"10-","BPL ¼chih,y½ %",{"$nulls":4},"1- YES ¼gk¡½",null,{"$f":"IF(W1999=\"N\",\"\",\"Yes\")","v":"Yes"},null,null,"2- NO ¼ugha¡½",null,{"$f":"IF(W1999=\"Y\",\"\",\"Yes\")","v":"Yes"},{"$nulls":7},{"$f":"VLOOKUP(A1940,'Deta From Shala Dar. Class-12'!$A$2:$AE$201,27,0)","v":0}]
[]
[null,"11-","vukFk oxZ %",{"$nulls":4},"1- YES ¼gk¡½",{"$nulls":4},"2- NO ¼ugha¡½"]
[]
[null,"12-","EWS ¼vkfFkZd n`f\"V ls detksj oxZ½ %",{"$nulls":4},"1- YES ¼gk¡½",{"$nulls":4},"2- NO ¼ugha¡½"]
[]
[null,"13-","CASTE ¼tkfr Js.kh½ %",null,null,"¼05½ Gen ¼lkekU;½",null,null,{"$f":"IF($W2005=\"GEN\",\"YES\",\"\")","v":""},"¼06½ MINORITY ¼lkekU;vYi la[;d½",{"$nulls":3},{"$f":"IF($W2005=\"MIN\",\"YES\",\"\")","v":""},"¼07½ SC ¼vuqlwfpr tkfr½",{"$nulls":4},{"$f":"IF($W2005=\"SC\",\"YES\",\"\")","v":""},null,null,{"$f":"VLOOKUP(A1940,'Deta From Shala Dar. Class-12'!$A$2:$AE$201,16,0)","v":0}]
[]
[{"$nulls":5},"¼08½ ST ¼vuqlwfpr tutkfr½",null,null,{"$f":"IF($W2005=\"ST\",\"YES\",\"\")","v":""},"¼09½ OBC ¼vU; fiN³k oxZ½",{"$nulls":3},{"$f":"IF($W2005=\"OBC\",\"YES\",\"\")","v":""},"¼10½ Special OBC ¼fo'ks\"k fiN³k oxZ½@MBC",{"$nulls":4},{"$f":"IF(OR($W2005=\"MBC\",$W$67=\"SBC\"),\"YES\",\"\")","v":""}]
[null,"uksV%& Nk=o`fr@iqjLdkj mijksDr p;fur Js.kh ds vk/kj ij gh nh tk;sxhA"]
[]
[null,"14-","ADDRESS ¼fo|kFkhZ dk iw.kZ irk½ %&"]
[null,null,"House No./Street/Place Name ¼edku ua-@xyh ua-@LFkku½ %",{"$nulls":7},{"$f":"VLOOKUP(A1940,'Deta From Shala Dar. Class-12'!$A$2:$AE$201,24,0)","v":0}]
[null,null,"Village/Town/City ¼xzke@dLck@'kgj½ %"]
[null,null,"District ¼ftyk½ %",null,null,"………………………….",null,null,"STATE ¼jkT;½ %",null,null,"…………………………………..",{"$nulls":3},"PIN CODE NO. ¼fiu dksM ua-½ %",null,null,"……………………"]
[]
[null,"15-","fo|kFkhZ dk vk/kkj dkMZ uEcj %",{"$nulls":3},{"$f":"VLOOKUP(A1940,'Deta From Shala Dar. Class-12'!$A$2:$AE$201,21,0)","v":{"v":0,"d":"0000"}},{"$nulls":3},"tu vk/kkj uEcj %",null,{"$f":"VLOOKUP(A1940,'Deta From Shala Dar. Class-12'!$A$2:$AE$201,22,0)","v":0},null,null,"vfHkHkkod dh okf\"kZd vk; %",null,null,{"$f":"VLOOKUP(A1940,'Deta From Shala Dar. Class-12'!$A$2:$AE$201,25,0)","v":{"v":0,"d":"₹ 0"}}]
[]
[null,null,"Student/Guardian's Mobile No. ¼fo|kFkhZ@vfHkHkkod dk eksckby uacj½ %",{"$nulls":9},{"$f":"VLOOKUP(A1940,'Deta From Shala Dar. Class-12'!$A$2:$AE$201,23,0)","v":0}]
[]
[null,"16-","Previous Academic Details ¼iwoZ 'kS{kf.kd ;ksX;rk½ %",{"$nulls":9},"---------------------------------------------------------"]
[]
[null,"CLASS ¼d{kk½",null,null,"YEAR ¼oxZ½",null,"ROLL NO. ¼ukekad½",null,null,"RESULT ¼ifj.kke½",null,null,"NAME OF SCHOOL/BOARD ¼Ldwy@cksMZ dk uke½"]
[null,"X"]
[null,"XI"]
[null,"XII"]
[]
[null,"Nk= us ;fn d{kk X vU; cksMZ ls mRrh.kZ dh gS rks %& ¼ns[ksa fo’ks\"k funsZ’k la[;k 6½ ik=rk izek.k i= Øekad",{"$nulls":13},"fnukad"]
[]
[null,"17-","Student's Photo and Signature ¼fo|kFkhZ dk QksVks ,oa gLrk{kj½",{"$nulls":9}," "]
[{"$nulls":10},"Student's Signature ¼fo|kFkhZ ds gLrk{kj½"]
[{"$nulls":3},"PASTE PASSPORT\nSIZE PHOTO"]
[]
[]
[]
[]
[{"$nulls":11}," 'kkyk ç/kku dk çek.khdj.k %&\ngLrk{kj---------------------------------------------------------------"]
[]
[]
[]
[]
[null,"fo|ky; dk uke %&",null,null,{"$f":"Info!$C$7","v":"Govt. Sr. Sec. School Raimalwada"},{"$nulls":6}," 'kkyk dksM %&",null,{"$f":"Info!$C$10","v":1},{"$f":"Info!$D$10","v":7},{"$f":"Info!$E$10","v":0},{"$f":"Info!$F$10","v":1},{"$f":"Info!$G$10","v":7},{"$f":"Info!$H$10","v":5},{"$f":"Info!$I$10","v":1}]

{"sheet":"Sec. Form ","index":4,"n_rows":1860,"n_cols":24,"rows_kept":1860,"merged":[[0,0,0,9],[0,10,0,13],[0,14,0,15],[0,16,0,20],[1,0,1,20],[2,0,93,0],[2,1,2,19],[2,20,92,20],[3,1,4,2],[3,3,3,15],[3,16,3,19],[4,3,4,15],[4,16,4,19],[5,1,6,4],[5,5,5,12],[6,5,6,15],[7,1,7,12],[7,13,7,16],[7,17,7,19],[8,1,8,6],[8,7,8,9],[8,10,8,19],[9,1,9,6],[9,7,9,19],[10,1,10,6],[10,7,10,19],[11,1,11,6],[11,7,11,19],[12,1,12,4],[12,5,12,10],[12,11,12,19],[13,1,13,6],[13,7,13,19],[14,1,14,9],[14,10,14,15],[14,16,14,17],[14,18,14,19],[15,1,15,19],[16,1,16,19],[17,1,17,19],[18,3,18,5],[18,8,18,10],[18,11,22,11],[18,12,18,19],[20,3,20,6],[20,8,20,10],[20,12,20,19],[22,3,22,6],[22,8,22,10],[22,12,22,19],[23,1,23,19],[24,1,24,19],[25,3,25,11],[25,14,25,19],[26,1,26,19],[27,2,27,19],[28,1,28,19],[29,2,29,7],[29,8,29,10],[29,11,29,12],[29,13,29,14],[30,1,30,19],[31,2,31,8],[31,9,31,13],[31,15,31,19],[32,2,32,19],[33,2,33,4],[33,6,33,8],[33,10,33,12],[33,14,33,15],[33,17,33,18],[34,1,34,19],[35,2,35,5],[35,7,35,8],[35,10,35,13],[35,15,35,18],[36,1,36,19],[37,2,37,4],[37,6,37,8],[37,10,37,12],[37,14,37,18],[38,1,38,19],[39,2,39,4],[39,6,39,8],[39,10,39,19],[40,1,40,19],[41,2,41,5],[41,7,41,9],[41,11,41,14],[41,16,41,18],[42,1,42,19],[43,2,43,5],[43,7,43,8],[43,10,43,11],[43,13,43,14],[43,16,43,18],[44,1,44,19],[45,2,45,3],[45,5,45,8],[45,10,45,12],[45,14,45,15],[45,17,45,18],[46,1,46,19],[47,2,47,5],[47,7,47,8],[47,10,47,11],[47,13,47,14],[47,16,47,18],[48,1,48,19],[49,2,49,3],[49,5,49,7],[49,9,49,11],[49,13,49,14],[49,16,49,18],[50,1,50,19],[51,2,51,4],[51,6,51,8],[51,10,51,12],[51,14,51,16],[52,1,52,19],[53,2,53,6],[53,7,53,8],[53,10,53,11],[53,12,53,13],[53,15,53,19],[54,1,54,19],[55,2,55,6],[55,7,55,8],[55,10,55,11],[55,12,55,13],[55,15,55,19],[56,1,56,19],[57,2,57,6],[57,7,57,8],[57,10,57,11],[57,12,57,13],[57,15,57,19],[58,1,58,19],[59,2,59,4],[59,5,59,7],[59,9,59,12],[59,14,59,18],[60,1,60,19],[61,5,61,7],[61,9,61,12],[61,14,61,18],[62,1,62,19],[63,1,63,19],[64,2,64,19],[65,2,65,9],[65,10,66,19],[66,2,66,9],[67,2,67,4],[67,5,67,7],[67,8,67,10],[67,11,67,14],[67,15,67,17],[67,18,67,19],[68,1,68,19],[69,2,69,5],[69,6,69,9],[69,10,69,11],[69,12,69,14],[69,15,69,17],[69,18,69,19],[70,1,70,19],[71,2,71,11],[71,12,71,19],[72,1,72,19],[73,2,73,11],[73,12,73,19],[74,1,74,19],[75,1,75,3],[75,4,75,5],[75,6,75,8],[75,9,75,11],[75,12,75,19],[76,1,76,3],[76,4,76,5],[76,6,76,8],[76,9,76,11],[76,12,76,19],[77,1,77,3],[77,4,77,5],[77,6,77,8],[77,9,77,11],[77,12,77,19],[78,1,78,3],[78,4,78,5],[78,6,78,8],[78,9,78,11],[78,12,78,19],[79,1,79,19],[80,2,80,11],[80,12,80,19],[81,1,81,9],[81,10,81,19],[82,1,89,2],[82,3,89,6],[82,7,89,9],[82,10,90,10],[82,11,85,18],[82,19,90,19],[86,11,86,18],[87,11,90,18],[90,1,90,9],[91,1,91,19],[92,1,92,3],[92,4,92,10],[92,11,92,12],[93,1,93,20],[94,0,94,20],[95,0,186,0],[95,1,95,19],[95,20,185,20],[96,1,97,2],[96,3,96,15],[96,16,96,19],[97,3,97,15],[97,16,97,19],[98,1,99,4],[98,5,98,12],[99,5,99,15],[100,1,100,12],[100,13,100,16],[100,17,100,19],[101,1,101,6],[101,7,101,9],[101,10,101,19],[102,1,102,6],[102,7,102,19],[103,1,103,6],[103,7,103,19],[104,1,104,6],[104,7,104,19],[105,1,105,4],[105,5,105,10],[105,11,105,19],[106,1,106,6],[106,7,106,19],[107,1,107,9],[107,10,107,15],[107,16,107,17],[107,18,107,19],[108,1,108,19],[109,1,109,19],[110,1,110,19],[111,3,111,5],[111,8,111,10],[111,11,115,11],[111,12,111,19],[113,3,113,6],[113,8,113,10],[113,12,113,19],[115,3,115,6],[115,8,115,10],[115,12,115,19],[116,1,116,19],[117,1,117,19],[118,3,118,11],[118,14,118,19],[119,1,119,19],[120,2,120,19],[121,1,121,19],[122,2,122,7],[122,8,122,10],[122,11,122,12],[122,13,122,14],[123,1,123,19],[124,2,124,8],[124,9,124,13],[124,15,124,19],[125,2,125,19],[126,2,126,4],[126,6,126,8],[126,10,126,12],[126,14,126,15],[126,17,126,18],[127,1,127,19],[128,2,128,5],[128,7,128,8],[128,10,128,13],[128,15,128,18],[129,1,129,19],[130,2,130,4],[130,6,130,8],[130,10,130,12],[130,14,130,18],[131,1,131,19],[132,2,132,4],[132,6,132,8],[132,10,132,19],[133,1,133,19],[134,2,134,5],[134,7,134,9],[134,11,134,14],[134,16,134,18],[135,1,135,19],[136,2,136,5],[136,7,136,8],[136,10,136,11],[136,13,136,14],[136,16,136,18],[137,1,137,19],[138,2,138,3],[138,5,138,8],[138,10,138,12],[138,14,138,15],[138,17,138,18],[139,1,139,19],[140,2,140,5],[140,7,140,8],[140,10,140,11],[140,13,140,14],[140,16,140,18],[141,1,141,19],[142,2,142,3],[142,5,142,7],[142,9,142,11],[142,13,142,14],[142,16,142,18],[143,1,143,19],[144,2,144,4],[144,6,144,8],[144,10,144,12],[144,14,144,16],[145,1,145,19],[146,2,146,6],[146,7,146,8],[146,10,146,11],[146,12,146,13],[146,15,146,19],[147,1,147,19],[148,2,148,6],[148,7,148,8],[148,10,148,11],[148,12,148,13],[148,15,148,19],[149,1,149,19],[150,2,150,6],[150,7,150,8],[150,10,150,11],[150,12,150,13],[150,15,150,19],[151,1,151,19],[152,2,152,4],[152,5,152,7],[152,9,152,12],[152,14,152,18],[153,1,153,19],[154,5,154,7],[154,9,154,12],[154,14,154,18],[155,1,155,19],[156,1,156,19],[157,2,157,19],[158,2,158,9],[158,10,159,19],[159,2,159,9],[160,2,160,4],[160,5,160,7],[160,8,160,10],[160,11,160,14],[160,15,160,17],[160,18,160,19],[161,1,161,19],[162,2,162,5],[162,6,162,9],[162,10,162,11],[162,12,162,14],[162,15,162,17],[162,18,162,19],[163,1,163,19],[164,2,164,11],[164,12,164,19],[165,1,165,19],[166,2,166,11],[166,12,166,19],[167,1,167,19],[168,1,168,3],[168,4,168,5],[168,6,168,8],[168,9,168,11],[168,12,168,19],[169,1,169,3],[169,4,169,5],[169,6,169,8],[169,9,169,11],[169,12,169,19],[170,1,170,3],[170,4,170,5],[170,6,170,8],[170,9,170,11],[170,12,170,19],[171,1,171,3],[171,4,171,5],[171,6,171,8],[171,9,171,11],[171,12,171,19],[172,1,172,19],[173,2,173,11],[173,12,173,19],[174,1,174,9],[174,10,174,19],[175,1,182,2],[175,3,182,6],[175,7,182,9],[175,10,183,10],[175,11,178,18],[175,19,183,19],[179,11,179,18],[180,11,183,18],[183,1,183,9],[184,1,184,19],[185,1,185,3],[185,4,185,10],[185,11,185,12],[186,1,186,20],[187,0,187,20],[188,0,279,0],[188,1,188,19],[188,20,278,20],[189,1,190,2],[189,3,189,15],[189,16,189,19],[190,3,190,15],[190,16,190,19],[191,1,192,4],[191,5,191,12],[192,5,192,15],[193,1,193,12],[193,13,193,16],[193,17,193,19],[194,1,194,6],[194,7,194,9],[194,10,194,19],[195,1,195,6],[195,7,195,19],[196,1,196,6],[196,7,196,19],[197,1,197,6],[197,7,197,19],[198,1,198,4],[198,5,198,10],[198,11,198,19],[199,1,199,6],[199,7,199,19],[200,1,200,9],[200,10,200,15],[200,16,200,17],[200,18,200,19],[201,1,201,19],[202,1,202,19],[203,1,203,19],[204,3,204,5],[204,8,204,10],[204,11,208,11],[204,12,204,19],[206,3,206,6],[206,8,206,10],[206,12,206,19],[208,3,208,6],[208,8,208,10],[208,12,208,19],[209,1,209,19],[210,1,210,19],[211,3,211,11],[211,14,211,19],[212,1,212,19],[213,2,213,19],[214,1,214,19],[215,2,215,7],[215,8,215,10],[215,11,215,12],[215,13,215,14],[216,1,216,19],[217,2,217,8],[217,9,217,13],[217,15,217,19],[218,2,218,19],[219,2,219,4],[219,6,219,8],[219,10,219,12],[219,14,219,15],[219,17,219,18],[220,1,220,19],[221,2,221,5],[221,7,221,8],[221,10,221,13],[221,15,221,18],[222,1,222,19],[223,2,223,4],[223,6,223,8],[223,10,223,12],[223,14,223,18],[224,1,224,19],[225,2,225,4],[225,6,225,8],[225,10,225,19],[226,1,226,19],[227,2,227,5],[227,7,227,9],[227,11,227,14],[227,16,227,18],[228,1,228,19],[229,2,229,5],[229,7,229,8],[229,10,229,11],[229,13,229,14],[229,16,229,18],[230,1,230,19],[231,2,231,3],[231,5,231,8],[231,10,231,12],[231,14,231,15],[231,17,231,18],[232,1,232,19],[233,2,233,5],[233,7,233,8],[233,10,233,11],[233,13,233,14],[233,16,233,18],[234,1,234,19],[235,2,235,3],[235,5,235,7],[235,9,235,11],[235,13,235,14],[235,16,235,18],[236,1,236,19],[237,2,237,4],[237,6,237,8],[237,10,237,12],[237,14,237,16],[238,1,238,19],[239,2,239,6],[239,7,239,8],[239,10,239,11],[239,12,239,13],[239,15,239,19],[240,1,240,19],[241,2,241,6],[241,7,241,8],[241,10,241,11],[241,12,241,13],[241,15,241,19],[242,1,242,19],[243,2,243,6],[243,7,243,8],[243,10,243,11],[243,12,243,13],[243,15,243,19],[244,1,244,19],[245,2,245,4],[245,5,245,7],[245,9,245,12],[245,14,245,18],[246,1,246,19],[247,5,247,7],[247,9,247,12],[247,14,247,18],[248,1,248,19],[249,1,249,19],[250,2,250,19],[251,2,251,9],[251,10,252,19],[252,2,252,9],[253,2,253,4],[253,5,253,7],[253,8,253,10],[253,11,253,14],[253,15,253,17],[253,18,253,19],[254,1,254,19],[255,2,255,5],[255,6,255,9],[255,10,255,11],[255,12,255,14],[255,15,255,17],[255,18,255,19],[256,1,256,19],[257,2,257,11],[257,12,257,19],[258,1,258,19],[259,2,259,11],[259,12,259,19],[260,1,260,19],[261,1,261,3],[261,4,261,5],[261,6,261,8],[261,9,261,11],[261,12,261,19],[262,1,262,3],[262,4,262,5],[262,6,262,8],[262,9,262,11],[262,12,262,19],[263,1,263,3],[263,4,263,5],[263,6,263,8],[263,9,263,11],[263,12,263,19],[264,1,264,3],[264,4,264,5],[264,6,264,8],[264,9,264,11],[264,12,264,19],[265,1,265,19],[266,2,266,11],[266,12,266,19],[267,1,267,9],[267,10,267,19],[268,1,275,2],[268,3,275,6],[268,7,275,9],[268,10,276,10],[268,11,271,18],[268,19,276,19],[272,11,272,18],[273,11,276,18],[276,1,276,9],[277,1,277,19],[278,1,278,3],[278,4,278,10],[278,11,278,12],[279,1,279,20],[280,0,280,20],[281,0,372,0],[281,1,281,19],[281,20,371,20],[282,1,283,2],[282,3,282,15],[282,16,282,19],[283,3,283,15],[283,16,283,19],[284,1,285,4],[284,5,284,12],[285,5,285,15],[286,1,286,12],[286,13,286,16],[286,17,286,19],[287,1,287,6],[287,7,287,9],[287,10,287,19],[288,1,288,6],[288,7,288,19],[289,1,289,6],[289,7,289,19],[290,1,290,6],[290,7,290,19],[291,1,291,4],[291,5,291,10],[291,11,291,19],[292,1,292,6],[292,7,292,19],[293,1,293,9],[293,10,293,15],[293,16,293,17],[293,18,293,19],[294,1,294,19],[295,1,295,19],[296,1,296,19],[297,3,297,5],[297,8,297,10],[297,11,301,11],[297,12,297,19],[299,3,299,6],[299,8,299,10],[299,12,299,19],[301,3,301,6],[301,8,301,10],[301,12,301,19],[302,1,302,19],[303,1,303,19],[304,3,304,11],[304,14,304,19],[305,1,305,19],[306,2,306,19],[307,1,307,19],[308,2,308,7],[308,8,308,10],[308,11,308,12],[308,13,308,14],[309,1,309,19],[310,2,310,8],[310,9,310,13],[310,15,310,19],[311,2,311,19],[312,2,312,4],[312,6,312,8],[312,10,312,12],[312,14,312,15],[312,17,312,18],[313,1,313,19],[314,2,314,5],[314,7,314,8],[314,10,314,13],[314,15,314,18],[315,1,315,19],[316,2,316,4],[316,6,316,8],[316,10,316,12],[316,14,316,18],[317,1,317,19],[318,2,318,4],[318,6,318,8],[318,10,318,19],[319,1,319,19],[320,2,320,5],[320,7,320,9],[320,11,320,14],[320,16,320,18],[321,1,321,19],[322,2,322,5],[322,7,322,8],[322,10,322,11],[322,13,322,14],[322,16,322,18],[323,1,323,19],[324,2,324,3],[324,5,324,8],[324,10,324,12],[324,14,324,15],[324,17,324,18],[325,1,325,19],[326,2,326,5],[326,7,326,8],[326,10,326,11],[326,13,326,14],[326,16,326,18],[327,1,327,19],[328,2,328,3],[328,5,328,7],[328,9,328,11],[328,13,328,14],[328,16,328,18],[329,1,329,19],[330,2,330,4],[330,6,330,8],[330,10,330,12],[330,14,330,16],[331,1,331,19],[332,2,332,6],[332,7,332,8],[332,10,332,11],[332,12,332,13],[332,15,332,19],[333,1,333,19],[334,2,334,6],[334,7,334,8],[334,10,334,11],[334,12,334,13],[334,15,334,19],[335,1,335,19],[336,2,336,6],[336,7,336,8],[336,10,336,11],[336,12,336,13],[336,15,336,19],[337,1,337,19],[338,2,338,4],[338,5,338,7],[338,9,338,12],[338,14,338,18],[339,1,339,19],[340,5,340,7],[340,9,340,12],[340,14,340,18],[341,1,341,19],[342,1,342,19],[343,2,343,19],[344,2,344,9],[344,10,345,19],[345,2,345,9],[346,2,346,4],[346,5,346,7],[346,8,346,10],[346,11,346,14],[346,15,346,17],[346,18,346,19],[347,1,347,19],[348,2,348,5],[348,6,348,9],[348,10,348,11],[348,12,348,14],[348,15,348,17],[348,18,348,19],[349,1,349,19],[350,2,350,11],[350,12,350,19],[351,1,351,19],[352,2,352,11],[352,12,352,19],[353,1,353,19],[354,1,354,3],[354,4,354,5],[354,6,354,8],[354,9,354,11],[354,12,354,19],[355,1,355,3],[355,4,355,5],[355,6,355,8],[355,9,355,11],[355,12,355,19],[356,1,356,3],[356,4,356,5],[356,6,356,8],[356,9,356,11],[356,12,356,19],[357,1,357,3],[357,4,357,5],[357,6,357,8],[357,9,357,11],[357,12,357,19],[358,1,358,19],[359,2,359,11],[359,12,359,19],[360,1,360,9],[360,10,360,19],[361,1,368,2],[361,3,368,6],[361,7,368,9],[361,10,369,10],[361,11,364,18],[361,19,369,19],[365,11,365,18],[366,11,369,18],[369,1,369,9],[370,1,370,19],[371,1,371,3],[371,4,371,10],[371,11,371,12],[372,1,372,20],[373,0,373,20],[374,0,465,0],[374,1,374,19],[374,20,464,20],[375,1,376,2],[375,3,375,15],[375,16,375,19],[376,3,376,15],[376,16,376,19],[377,1,378,4],[377,5,377,12],[378,5,378,15],[379,1,379,12],[379,13,379,16],[379,17,379,19],[380,1,380,6],[380,7,380,9],[380,10,380,19],[381,1,381,6],[381,7,381,19],[382,1,382,6],[382,7,382,19],[383,1,383,6],[383,7,383,19],[384,1,384,4],[384,5,384,10],[384,11,384,19],[385,1,385,6],[385,7,385,19],[386,1,386,9],[386,10,386,15],[386,16,386,17],[386,18,386,19],[387,1,387,19],[388,1,388,19],[389,1,389,19],[390,3,390,5],[390,8,390,10],[390,11,394,11],[390,12,390,19],[392,3,392,6],[392,8,392,10],[392,12,392,19],[394,3,394,6],[394,8,394,10],[394,12,394,19],[395,1,395,19],[396,1,396,19],[397,3,397,11],[397,14,397,19],[398,1,398,19],[399,2,399,19],[400,1,400,19],[401,2,401,7],[401,8,401,10],[401,11,401,12],[401,13,401,14],[402,1,402,19],[403,2,403,8],[403,9,403,13],[403,15,403,19],[404,2,404,19],[405,2,405,4],[405,6,405,8],[405,10,405,12],[405,14,405,15],[405,17,405,18],[406,1,406,19],[407,2,407,5],[407,7,407,8],[407,10,407,13],[407,15,407,18],[408,1,408,19],[409,2,409,4],[409,6,409,8],[409,10,409,12],[409,14,409,18],[410,1,410,19],[411,2,411,4],[411,6,411,8],[411,10,411,19],[412,1,412,19],[413,2,413,5],[413,7,413,9],[413,11,413,14],[413,16,413,18],[414,1,414,19],[415,2,415,5],[415,7,415,8],[415,10,415,11],[415,13,415,14],[415,16,415,18],[416,1,416,19],[417,2,417,3],[417,5,417,8],[417,10,417,12],[417,14,417,15],[417,17,417,18],[418,1,418,19],[419,2,419,5],[419,7,419,8],[419,10,419,11],[419,13,419,14],[419,16,419,18],[420,1,420,19],[421,2,421,3],[421,5,421,7],[421,9,421,11],[421,13,421,14],[421,16,421,18],[422,1,422,19],[423,2,423,4],[423,6,423,8],[423,10,423,12],[423,14,423,16],[424,1,424,19],[425,2,425,6],[425,7,425,8],[425,10,425,11],[425,12,425,13],[425,15,425,19],[426,1,426,19],[427,2,427,6],[427,7,427,8],[427,10,427,11],[427,12,427,13],[427,15,427,19],[428,1,428,19],[429,2,429,6],[429,7,429,8],[429,10,429,11],[429,12,429,13],[429,15,429,19],[430,1,430,19],[431,2,431,4],[431,5,431,7],[431,9,431,12],[431,14,431,18],[432,1,432,19],[433,5,433,7],[433,9,433,12],[433,14,433,18],[434,1,434,19],[435,1,435,19],[436,2,436,19],[437,2,437,9],[437,10,438,19],[438,2,438,9],[439,2,439,4],[439,5,439,7],[439,8,439,10],[439,11,439,14],[439,15,439,17],[439,18,439,19],[440,1,440,19],[441,2,441,5],[441,6,441,9],[441,10,441,11],[441,12,441,14],[441,15,441,17],[441,18,441,19],[442,1,442,19],[443,2,443,11],[443,12,443,19],[448,1,448,3],[448,4,448,5],[448,6,448,8],[448,9,448,11]],"merged_total":4146,"flags":["merged_cut"]}
["ftl Øekad ls tgk¡ rd dk fçaV dh vko';drk gS] oks jsat nsa ¼vf/kdre 20 fçaV ,d lkFk ns ldrs gks½→",{"$nulls":9},1,{"$nulls":3},"ls",null,{"$f":"K1+19","v":20}]
[1]
[null,{"$f":"CONCATENATE(Info!$B$7,Info!$C$7)","v":"School Name :-Govt. Sr. Sec. School Raimalwada"}]
[{"$nulls":3},"Board of Secondary Education, Rajasthan",{"$nulls":12},"Sec. (Reg.)"]
[{"$nulls":3}," Ekk/;fed f’k{kk cksMZ] jktLFkku ",{"$nulls":12},"fu;fer ijh{kkFkhZ"]
[null,"ek/;fed ijh{kk",{"$nulls":3},"APPLICATION FORM FOR SENIOR SECONDARY EXAMINATION-2024",{"$nulls":7},{"$f":"Info!$C$10","v":1},{"$f":"Info!$D$10","v":7},{"$f":"Info!$E$10","v":0},{"$f":"Info!$F$10","v":1},{"$f":"Info!$G$10","v":7},{"$f":"Info!$H$10","v":5},{"$f":"Info!$I$10","v":1}]
[{"$nulls":5}," Ikjh{kk vkosnu i= ek/;fed ijh{kk & 2024"]
[{"$nulls":13}," 'kkyk niZ.k Øekad %&",{"$nulls":3},{"$f":"Info!$C$9","v":12345}]
[null,"Scholar Reg. No. ¼LdkWyj jftLVj Øekad½",{"$nulls":5},{"$f":"VLOOKUP(A2,'Deta From Shala Dar. Class-10'!$A$2:$AE$201,4,0)","v":0}]
[null,"1- Student’s Name (fo|kFkhZ dk uke) :",{"$nulls":5},{"$f":"VLOOKUP(A2,'Deta From Shala Dar. Class-10'!$A$2:$AE$201,6,0)","v":0}]
[null,"2- Mother’s Name ¼ekrk dk uke) :",{"$nulls":5},{"$f":"VLOOKUP(A2,'Deta From Shala Dar. Class-10'!$A$2:$AE$201,8,0)","v":0}]
[null,"3- Father’s Name (firk dk uke) :",{"$nulls":5},{"$f":"VLOOKUP(A2,'Deta From Shala Dar. Class-10'!$A$2:$AE$201,9,0)","v":0}]
[null,"4- Date Of Birth (tUe frfFk vadks esa) :",{"$nulls":3},{"$f":"W13","v":"00:00:00"},{"$nulls":16},{"$f":"VLOOKUP(A2,'Deta From Shala Dar. Class-10'!$A$2:$AE$201,11,0)","v":"00:00:00"}]
[null,"In Words (tUe frfFk 'kCnksa esa) :",{"$nulls":5},"……………………………………………………………"]
[null,"5- Category Code (Js.kh dksM) : ¼Js.kh p;u gsrq ihNs fy[ks fo’k\"sk funsZ’k la[;k 1 ns[ks½ Js.kh dk uke %&",{"$nulls":8},"………………………………………………….",{"$nulls":5},"dksM %&"]
[null,"6- Only for Category IV & VI (dsoy Js.kh 4 o 6 ds fy,)"]
[null,"Table - A : Only for category(dsoy Js.kh 1]2 , o 8 ds fy;s) (I)ALL SUBJECTS (1-lEiw.kZ fo\"k;), (II) DIVISION IMPROVEMENT (2-Js.kh lq/kkj) & (VIII) FACULTY CHANGE (8-oxZ ifjorZu)  OPTIONAL SUBJECTS oSdfYid fo\"k;) :"]
[]
[{"$nulls":3},"As Applicable ",{"$nulls":4},"tks ykxw gks½",{"$nulls":3},"1…………………………………………………………………………….."]
[]
[{"$nulls":3},"(IV) ADDITIONAL SUBJECTS CAT",{"$nulls":4},"¼4½ vfrfjDr fo\"k;",{"$nulls":3},"2…………………………………………………3………………………...…………………….."]
[]
[{"$nulls":3},"(VI) MARKS IMPROVEMENT CAT",{"$nulls":4},"¼6½ vad lq/kkj",{"$nulls":3},"4…………………………………………………5………………………...…………………….."]
[]
[]
[null,null,"√","As Applicable from Number 8 to 15 ¼Øekad 8 ls 15 rd tks ykxw gks",{"$nulls":8},"√","djsa½"]
[]
[null,"7-","Third Language ¼r`rh; Hkk\"kk½ (Only for Category I &II) ¼dsoy Js.kh 1 o 2 ds fy,½ ¼fo\"k; p;u gsrq ihNs fy[ks fo’ks\"k funsZ’k \nla[;k 3 ns[ksa½ %&"]
[]
[null,null,"Third Language Opted (p;fur r`rh; Hkk\"kk) fo\"k; dk uke",{"$nulls":8},"dksM"]
[]
[null,"8-","Name of Vocational Trade ¼O;kolkf;d VªsM dk uke½",{"$nulls":6},"………………………………………………………..",{"$nulls":5},"lgh dk fpUg yxk,aA"]
[null,null,"¼dsoy mu 'kkykvksa ds fy, tgka O;kolkf;d f'k{kk lapkfyr gS ,oa ftu fo|kfFkZ;ksa us d{kk 10 rFkk 11 oha esa O;kolkf;d ijh{kk mRrh.kZ dh gSA½"]
[null,null," (1) Automotive (101)",{"$nulls":3},"(2) Beauty & Wellness (102)",{"$nulls":3},"(3) Health Care (103)",{"$nulls":3},"(4) IT & ITES (104)",null,null,"(5) Retail (105)"]
[]
[null,null," (6) Tourism & Hospitality (106)",{"$nulls":4},"(7) Security (107)",null,null,"(8) Apparel Made up Home Furnishing (108) ",{"$nulls":4},"(9) Electronics & Hardware (109)"]
[]
[null,null," (10) Agriculture (110)",{"$nulls":3},"(11) Plumber (111)",{"$nulls":3},"(12) Telecom (112)",{"$nulls":3},"(13) Banking Financial Services & Insurance (113)"]
[]
[null,null," (14) Construction (114)",{"$nulls":3},"(15) Food Processing (115)"]
[]
[null,"9-","Gender ¼fyax½ : (01) Male ¼iq:\"k½",{"$nulls":3},{"$f":"IF(W42=\"F\",\"\",\"Yes\")","v":"Yes"},"(02) FEMALE ¼efgyk½",null,null,{"$f":"IF(AA42=\"F\",\"\",\"Yes\")","v":"Yes"},"Medium ¼ek/;e½ : (01) HINDI ¼fgUnh½",{"$nulls":3},{"$f":"IF(X42=\"Hindi\",\"Yes\",\"\")","v":"Yes"},"(02) ENGLISH ¼vaxzsth½",null,null,{"$f":"IF(X42=\"english\",\"Yes\",\"\")","v":""},null,null,{"$f":"VLOOKUP(A2,'Deta From Shala Dar. Class-10'!$A$2:$AE$201,10,0)","v":0},{"$f":"Info!$C$8","v":"Hindi"}]
[]
[null,"10-","CWSN-1 ¼Hkkx½ : ekufld eanrk (01)",{"$nulls":4},"vkWfVTe (02)",null,null,"lsfjcy iYlh (03)",null,null,"ekufld jksx (04)",null,null,"Jo.k ckf/kr (05)"]
[]
[null,null,"ewd fu'kDrrk (06)",null,null,"LisfLQd yfuZax fMl,fcfyfV (14)",{"$nulls":4},"ckSf)d fu'kDrrk (15)",{"$nulls":3},"efYViy LDysjksfll (16)",null,null,"cgq fu'kDrrk (21)"]
[]
[null,"11-","CWSN-2 ¼Hkkx½ : n`f\"V ckf/kr (07)",{"$nulls":4},"vYi n`f\"V (08)",null,null,"pyu fu'kDrrk(09)",null,null,"dq\"B jksx (10)",null,null,"ckSukiu (11)"]
[]
[null,null,"rStkc fif³r (12)",null,null,"ekalis'kh nqfoZdkl ¼13½",{"$nulls":3},"ikfdZlkal jksx ¼17½",{"$nulls":3},"fgeksfQfy;k ¼18½",null,null,"FkSyslhfe;k ¼19½"]
[]
[null,null,",fufed@fLdy fMtht (20)",{"$nulls":3},"iksfy;ks@uoZ batjh ¼22½",{"$nulls":3},"lw;Zeq[kh ¼23½",{"$nulls":3}," @lSfud ¼24½"]
[]
[null,"12-","BPL ¼chih,y½ %",{"$nulls":4},"1- YES ¼gk¡½",null,{"$f":"IF(W54=\"N\",\"\",\"Yes\")","v":"Yes"},null,null,"2- NO ¼ugha¡½",null,{"$f":"IF(W54=\"Y\",\"\",\"Yes\")","v":"Yes"},{"$nulls":7},{"$f":"VLOOKUP(A2,'Deta From Shala Dar. Class-10'!$A$2:$AE$201,27,0)","v":0}]
[]
[null,"13-","vukFk oxZ %",{"$nulls":4},"1- YES ¼gk¡½",{"$nulls":4},"2- NO ¼ugha¡½"]
[]
[null,"14-","EWS ¼vkfFkZd n`f\"V ls detksj oxZ½ %",{"$nulls":4},"1- YES ¼gk¡½",{"$nulls":4},"2- NO ¼ugha¡½"]
[]
[null,"15-","CASTE ¼tkfr Js.kh½ %",null,null,"¼05½ Gen ¼lkekU;½",null,null,{"$f":"IF($W$60=\"GEN\",\"YES\",\"\")","v":""},"¼06½ MINORITY ¼lkekU;vYi la[;d½",{"$nulls":3},{"$f":"IF($W$60=\"MIN\",\"YES\",\"\")","v":""},"¼07½ SC ¼vuqlwfpr tkfr½",{"$nulls":4},{"$f":"IF($W$60=\"SC\",\"YES\",\"\")","v":""},null,null,{"$f":"VLOOKUP(A2,'Deta From Shala Dar. Class-10'!$A$2:$AE$201,16,0)","v":0}]
[]
[{"$nulls":5},"¼08½ ST ¼vuqlwfpr tutkfr½",null,null,{"$f":"IF($W$60=\"ST\",\"YES\",\"\")","v":""},"¼09½ OBC ¼vU; fiN³k oxZ½",{"$nulls":3},{"$f":"IF($W$60=\"OBC\",\"YES\",\"\")","v":""},"¼10½ Special OBC ¼fo'ks\"k fiN³k oxZ½@MBC",{"$nulls":4},{"$f":"IF(OR($W$60=\"MBC\",$W$60=\"SBC\"),\"YES\",\"\")","v":""}]
[null,"uksV%& Nk=o`fr@iqjLdkj mijksDr p;fur Js.kh ds vk/kj ij gh nh tk;sxhA"]
[]
[null,"16-","ADDRESS ¼fo|kFkhZ dk iw.kZ irk½ %&"]
[null,null,"House No./Street/Place Name ¼edku ua-@xyh ua-@LFkku½ %",{"$nulls":7},{"$f":"VLOOKUP(A2,'Deta From Shala Dar. Class-12'!$A$2:$AE$201,24,0)","v":0}]
[null,null,"Village/Town/City ¼xzke@dLck@'kgj½ %"]
[null,null,"District ¼ftyk½ %",null,null,"………………………….",null,null,"STATE ¼jkT;½ %",null,null,"…………………………………..",{"$nulls":3},"PIN CODE NO. ¼fiu dksM ua-½ %",null,null,"……………………"]
[]
[null,"17-","fo|kFkhZ dk vk/kkj dkMZ uEcj %",{"$nulls":3},{"$f":"VLOOKUP(A2,'Deta From Shala Dar. Class-12'!$A$2:$AE$201,21,0)","v":{"v":0,"d":"0000"}},{"$nulls":3},"tu vk/kkj uEcj %",null,{"$f":"VLOOKUP(A2,'Deta From Shala Dar. Class-12'!$A$2:$AE$201,22,0)","v":0},null,null,"vfHkHkkod dh okf\"kZd vk; %",null,null,{"$f":"VLOOKUP(A2,'Deta From Shala Dar. Class-12'!$A$2:$AE$201,25,0)","v":{"v":0,"d":"₹ 0"}}]
[]
[null,null,"Student/Guardian's Mobile No. ¼fo|kFkhZ@vfHkHkkod dk eksckby uacj½ %",{"$nulls":9},{"$f":"VLOOKUP(A2,'Deta From Shala Dar. Class-12'!$A$2:$AE$201,23,0)","v":0}]
[]
[null,"18-","Previous Academic Details ¼iwoZ 'kS{kf.kd ;ksX;rk½ %",{"$nulls":9},"---------------------------------------------------------"]
[]
[null,"CLASS ¼d{kk½",null,null,"YEAR ¼oxZ½",null,"ROLL NO. ¼ukekad½",null,null,"RESULT ¼ifj.kke½",null,null,"NAME OF SCHOOL/BOARD ¼Ldwy@cksMZ dk uke½"]
[null,"VIII"]
[null,"IX"]
[null,"X"]
[]
[null,"19-","Student's Photo and Signature ¼fo|kFkhZ dk QksVks ,oa gLrk{kj½",{"$nulls":9}," "]
[{"$nulls":10},"Student's Signature ¼fo|kFkhZ ds gLrk{kj½"]
[{"$nulls":3},"PASTE PASSPORT\nSIZE PHOTO"]
[]
[]
[]
[]
[{"$nulls":11}," 'kkyk ç/kku dk çek.khdj.k %&\ngLrk{kj---------------------------------------------------------------"]
[]
[]
[]
[]
[null,"fo|ky; dk uke %&",null,null,{"$f":"Info!$C$7","v":"Govt. Sr. Sec. School Raimalwada"},{"$nulls":6}," 'kkyk dksM %&",null,{"$f":"Info!$C$10","v":1},{"$f":"Info!$D$10","v":7},{"$f":"Info!$E$10","v":0},{"$f":"Info!$F$10","v":1},{"$f":"Info!$G$10","v":7},{"$f":"Info!$H$10","v":5},{"$f":"Info!$I$10","v":1}]
[]
[{"$f":"A2+1","v":2}]
[null,{"$f":"CONCATENATE(Info!$B$7,Info!$C$7)","v":"School Name :-Govt. Sr. Sec. School Raimalwada"}]
[{"$nulls":3},"Board of Secondary Education, Rajasthan",{"$nulls":12},"Sec. (Reg.)"]
[{"$nulls":3}," Ekk/;fed f’k{kk cksMZ] jktLFkku ",{"$nulls":12},"fu;fer ijh{kkFkhZ"]
[null,"ek/;fed ijh{kk",{"$nulls":3},"APPLICATION FORM FOR SENIOR SECONDARY EXAMINATION-2024",{"$nulls":7},{"$f":"Info!$C$10","v":1},{"$f":"Info!$D$10","v":7},{"$f":"Info!$E$10","v":0},{"$f":"Info!$F$10","v":1},{"$f":"Info!$G$10","v":7},{"$f":"Info!$H$10","v":5},{"$f":"Info!$I$10","v":1}]
[{"$nulls":5}," Ikjh{kk vkosnu i= ek/;fed ijh{kk & 2024"]
[{"$nulls":13}," 'kkyk niZ.k Øekad %&",{"$nulls":3},{"$f":"Info!$C$9","v":12345}]
[null,"Scholar Reg. No. ¼LdkWyj jftLVj Øekad½",{"$nulls":5},{"$f":"VLOOKUP(A95,'Deta From Shala Dar. Class-10'!$A$2:$AE$201,4,0)","v":0}]
[null,"1- Student’s Name (fo|kFkhZ dk uke) :",{"$nulls":5},{"$f":"VLOOKUP(A95,'Deta From Shala Dar. Class-10'!$A$2:$AE$201,6,0)","v":0}]
[null,"2- Mother’s Name ¼ekrk dk uke) :",{"$nulls":5},{"$f":"VLOOKUP(A95,'Deta From Shala Dar. Class-10'!$A$2:$AE$201,8,0)","v":0}]
[null,"3- Father’s Name (firk dk uke) :",{"$nulls":5},{"$f":"VLOOKUP(A95,'Deta From Shala Dar. Class-10'!$A$2:$AE$201,9,0)","v":0}]
[null,"4- Date Of Birth (tUe frfFk vadks esa) :",{"$nulls":3},{"$f":"W106","v":"00:00:00"},{"$nulls":16},{"$f":"VLOOKUP(A95,'Deta From Shala Dar. Class-10'!$A$2:$AE$201,11,0)","v":"00:00:00"}]
[null,"In Words (tUe frfFk 'kCnksa esa) :",{"$nulls":5},"……………………………………………………………"]
[null,"5- Category Code (Js.kh dksM) : ¼Js.kh p;u gsrq ihNs fy[ks fo’k\"sk funsZ’k la[;k 1 ns[ks½ Js.kh dk uke %&",{"$nulls":8},"………………………………………………….",{"$nulls":5},"dksM %&"]
[null,"6- Only for Category IV & VI (dsoy Js.kh 4 o 6 ds fy,)"]
[null,"Table - A : Only for category(dsoy Js.kh 1]2 , o 8 ds fy;s) (I)ALL SUBJECTS (1-lEiw.kZ fo\"k;), (II) DIVISION IMPROVEMENT (2-Js.kh lq/kkj) & (VIII) FACULTY CHANGE (8-oxZ ifjorZu)  OPTIONAL SUBJECTS oSdfYid fo\"k;) :"]
[]
[{"$nulls":3},"As Applicable ",{"$nulls":4},"tks ykxw gks½",{"$nulls":3},"1…………………………………………………………………………….."]
[]
[{"$nulls":3},"(IV) ADDITIONAL SUBJECTS CAT",{"$nulls":4},"¼4½ vfrfjDr fo\"k;",{"$nulls":3},"2…………………………………………………3………………………...…………………….."]
[]
[{"$nulls":3},"(VI) MARKS IMPROVEMENT CAT",{"$nulls":4},"¼6½ vad lq/kkj",{"$nulls":3},"4…………………………………………………5………………………...…………………….."]
[]
[]
[null,null,"√","As Applicable from Number 8 to 15 ¼Øekad 8 ls 15 rd tks ykxw gks",{"$nulls":8},"√","djsa½"]
[]
[null,"7-","Third Language ¼r`rh; Hkk\"kk½ (Only for Category I &II) ¼dsoy Js.kh 1 o 2 ds fy,½ ¼fo\"k; p;u gsrq ihNs fy[ks fo’ks\"k funsZ’k \nla[;k 3 ns[ksa½ %&"]
[]
[null,null,"Third Language Opted (p;fur r`rh; Hkk\"kk) fo\"k; dk uke",{"$nulls":8},"dksM"]
[]
[null,"8-","Name of Vocational Trade ¼O;kolkf;d VªsM dk uke½",{"$nulls":6},"………………………………………………………..",{"$nulls":5},"lgh dk fpUg yxk,aA"]
[null,null,"¼dsoy mu 'kkykvksa ds fy, tgka O;kolkf;d f'k{kk lapkfyr gS ,oa ftu fo|kfFkZ;ksa us d{kk 10 rFkk 11 oha esa O;kolkf;d ijh{kk mRrh.kZ dh gSA½"]
[null,null," (1) Automotive (101)",{"$nulls":3},"(2) Beauty & Wellness (102)",{"$nulls":3},"(3) Health Care (103)",{"$nulls":3},"(4) IT & ITES (104)",null,null,"(5) Retail (105)"]
[]
[null,null," (6) Tourism & Hospitality (106)",{"$nulls":4},"(7) Security (107)",null,null,"(8) Apparel Made up Home Furnishing (108) ",{"$nulls":4},"(9) Electronics & Hardware (109)"]
[]
[null,null," (10) Agriculture (110)",{"$nulls":3},"(11) Plumber (111)",{"$nulls":3},"(12) Telecom (112)",{"$nulls":3},"(13) Banking Financial Services & Insurance (113)"]
[]
[null,null," (14) Construction (114)",{"$nulls":3},"(15) Food Processing (115)"]
[]
[null,"9-","Gender ¼fyax½ : (01) Male ¼iq:\"k½",{"$nulls":3},{"$f":"IF(W135=\"F\",\"\",\"Yes\")","v":"Yes"},"(02) FEMALE ¼efgyk½",null,null,{"$f":"IF(AA135=\"F\",\"\",\"Yes\")","v":"Yes"},"Medium ¼ek/;e½ : (01) HINDI ¼fgUnh½",{"$nulls":3},{"$f":"IF(X135=\"Hindi\",\"Yes\",\"\")","v":"Yes"},"(02) ENGLISH ¼vaxzsth½",null,null,{"$f":"IF(X135=\"english\",\"Yes\",\"\")","v":""},null,null,{"$f":"VLOOKUP(A95,'Deta From Shala Dar. Class-10'!$A$2:$AE$201,10,0)","v":0},{"$f":"Info!$C$8","v":"Hindi"}]
[]
[null,"10-","CWSN-1 ¼Hkkx½ : ekufld eanrk (01)",{"$nulls":4},"vkWfVTe (02)",null,null,"lsfjcy iYlh (03)",null,null,"ekufld jksx (04)",null,null,"Jo.k ckf/kr (05)"]
[]
[null,null,"ewd fu'kDrrk (06)",null,null,"LisfLQd yfuZax fMl,fcfyfV (14)",{"$nulls":4},"ckSf)d fu'kDrrk (15)",{"$nulls":3},"efYViy LDysjksfll (16)",null,null,"cgq fu'kDrrk (21)"]
[]
[null,"11-","CWSN-2 ¼Hkkx½ : n`f\"V ckf/kr (07)",{"$nulls":4},"vYi n`f\"V (08)",null,null,"pyu fu'kDrrk(09)",null,null,"dq\"B jksx (10)",null,null,"ckSukiu (11)"]
[]
[null,null,"rStkc fif³r (12)",null,null,"ekalis'kh nqfoZdkl ¼13½",{"$nulls":3},"ikfdZlkal jksx ¼17½",{"$nulls":3},"fgeksfQfy;k ¼18½",null,null,"FkSyslhfe;k ¼19½"]
[]
[null,null,",fufed@fLdy fMtht (20)",{"$nulls":3},"iksfy;ks@uoZ batjh ¼22½",{"$nulls":3},"lw;Zeq[kh ¼23½",{"$nulls":3}," @lSfud ¼24½"]
[]
[null,"12-","BPL ¼chih,y½ %",{"$nulls":4},"1- YES ¼gk¡½",null,{"$f":"IF(W147=\"N\",\"\",\"Yes\")","v":"Yes"},null,null,"2- NO ¼ugha¡½",null,{"$f":"IF(W147=\"Y\",\"\",\"Yes\")","v":"Yes"},{"$nulls":7},{"$f":"VLOOKUP(A95,'Deta From Shala Dar. Class-10'!$A$2:$AE$201,27,0)","v":0}]
[]
[null,"13-","vukFk oxZ %",{"$nulls":4},"1- YES ¼gk¡½",{"$nulls":4},"2- NO ¼ugha¡½"]
[]
[null,"14-","EWS ¼vkfFkZd n`f\"V ls detksj oxZ½ %",{"$nulls":4},"1- YES ¼gk¡½",{"$nulls":4},"2- NO ¼ugha¡½"]
[]
[null,"15-","CASTE ¼tkfr Js.kh½ %",null,null,"¼05½ Gen ¼lkekU;½",null,null,{"$f":"IF($W$60=\"GEN\",\"YES\",\"\")","v":""},"¼06½ MINORITY ¼lkekU;vYi la[;d½",{"$nulls":3},{"$f":"IF($W$60=\"MIN\",\"YES\",\"\")","v":""},"¼07½ SC ¼vuqlwfpr tkfr½",{"$nulls":4},{"$f":"IF($W$60=\"SC\",\"YES\",\"\")","v":""},null,null,{"$f":"VLOOKUP(A95,'Deta From Shala Dar. Class-10'!$A$2:$AE$201,16,0)","v":0}]
[]
[{"$nulls":5},"¼08½ ST ¼vuqlwfpr tutkfr½",null,null,{"$f":"IF($W$60=\"ST\",\"YES\",\"\")","v":""},"¼09½ OBC ¼vU; fiN³k oxZ½",{"$nulls":3},{"$f":"IF($W$60=\"OBC\",\"YES\",\"\")","v":""},"¼10½ Special OBC ¼fo'ks\"k fiN³k oxZ½@MBC",{"$nulls":4},{"$f":"IF(OR($W$60=\"MBC\",$W$60=\"SBC\"),\"YES\",\"\")","v":""}]
[null,"uksV%& Nk=o`fr@iqjLdkj mijksDr p;fur Js.kh ds vk/kj ij gh nh tk;sxhA"]
[]
[null,"16-","ADDRESS ¼fo|kFkhZ dk iw.kZ irk½ %&"]
[null,null,"House No./Street/Place Name ¼edku ua-@xyh ua-@LFkku½ %",{"$nulls":7},{"$f":"VLOOKUP(A95,'Deta From Shala Dar. Class-12'!$A$2:$AE$201,24,0)","v":0}]
[null,null,"Village/Town/City ¼xzke@dLck@'kgj½ %"]
[null,null,"District ¼ftyk½ %",null,null,"………………………….",null,null,"STATE ¼jkT;½ %",null,null,"…………………………………..",{"$nulls":3},"PIN CODE NO. ¼fiu dksM ua-½ %",null,null,"……………………"]
[]
[null,"17-","fo|kFkhZ dk vk/kkj dkMZ uEcj %",{"$nulls":3},{"$f":"VLOOKUP(A95,'Deta From Shala Dar. Class-12'!$A$2:$AE$201,21,0)","v":{"v":0,"d":"0000"}},{"$nulls":3},"tu vk/kkj uEcj %",null,{"$f":"VLOOKUP(A95,'Deta From Shala Dar. Class-12'!$A$2:$AE$201,22,0)","v":0},null,null,"vfHkHkkod dh okf\"kZd vk; %",null,null,{"$f":"VLOOKUP(A95,'Deta From Shala Dar. Class-12'!$A$2:$AE$201,25,0)","v":{"v":0,"d":"₹ 0"}}]
[]
[null,null,"Student/Guardian's Mobile No. ¼fo|kFkhZ@vfHkHkkod dk eksckby uacj½ %",{"$nulls":9},{"$f":"VLOOKUP(A95,'Deta From Shala Dar. Class-12'!$A$2:$AE$201,23,0)","v":0}]
[]
[null,"18-","Previous Academic Details ¼iwoZ 'kS{kf.kd ;ksX;rk½ %",{"$nulls":9},"---------------------------------------------------------"]
[]
[null,"CLASS ¼d{kk½",null,null,"YEAR ¼oxZ½",null,"ROLL NO. ¼ukekad½",null,null,"RESULT ¼ifj.kke½",null,null,"NAME OF SCHOOL/BOARD ¼Ldwy@cksMZ dk uke½"]
[null,"VIII"]
[null,"IX"]
[null,"X"]
[]
[null,"19-","Student's Photo and Signature ¼fo|kFkhZ dk QksVks ,oa gLrk{kj½",{"$nulls":9}," "]
[{"$nulls":10},"Student's Signature ¼fo|kFkhZ ds gLrk{kj½"]
[{"$nulls":3},"PASTE PASSPORT\nSIZE PHOTO"]
[]
[]
[]
[]
[{"$nulls":11}," 'kkyk ç/kku dk çek.khdj.k %&\ngLrk{kj---------------------------------------------------------------"]
[]
[]
[]
[]
[null,"fo|ky; dk uke %&",null,null,{"$f":"Info!$C$7","v":"Govt. Sr. Sec. School Raimalwada"},{"$nulls":6}," 'kkyk dksM %&",null,{"$f":"Info!$C$10","v":1},{"$f":"Info!$D$10","v":7},{"$f":"Info!$E$10","v":0},{"$f":"Info!$F$10","v":1},{"$f":"Info!$G$10","v":7},{"$f":"Info!$H$10","v":5},{"$f":"Info!$I$10","v":1}]
[]
[{"$f":"A95+1","v":3}]
[null,{"$f":"CONCATENATE(Info!$B$7,Info!$C$7)","v":"School Name :-Govt. Sr. Sec. School Raimalwada"}]
[{"$nulls":3},"Board of Secondary Education, Rajasthan",{"$nulls":12},"Sec. (Reg.)"]
[{"$nulls":3}," Ekk/;fed f’k{kk cksMZ] jktLFkku ",{"$nulls":12},"fu;fer ijh{kkFkhZ"]
[null,"ek/;fed ijh{kk",{"$nulls":3},"APPLICATION FORM FOR SENIOR SECONDARY EXAMINATION-2024",{"$nulls":7},{"$f":"Info!$C$10","v":1},{"$f":"Info!$D$10","v":7},{"$f":"Info!$E$10","v":0},{"$f":"Info!$F$10","v":1},{"$f":"Info!$G$10","v":7},{"$f":"Info!$H$10","v":5},{"$f":"Info!$I$10","v":1}]
[{"$nulls":5}," Ikjh{kk vkosnu i= ek/;fed ijh{kk & 2024"]
[{"$nulls":13}," 'kkyk niZ.k Øekad %&",{"$nulls":3},{"$f":"Info!$C$9","v":12345}]
[null,"Scholar Reg. No. ¼LdkWyj jftLVj Øekad½",{"$nulls":5},{"$f":"VLOOKUP(A188,'Deta From Shala Dar. Class-10'!$A$2:$AE$201,4,0)","v":0}]
[null,"1- Student’s Name (fo|kFkhZ dk uke) :",{"$nulls":5},{"$f":"VLOOKUP(A188,'Deta From Shala Dar. Class-10'!$A$2:$AE$201,6,0)","v":0}]
[null,"2- Mother’s Name ¼ekrk dk uke) :",{"$nulls":5},{"$f":"VLOOKUP(A188,'Deta From Shala Dar. Class-10'!$A$2:$AE$201,8,0)","v":0}]
[null,"3- Father’s Name (firk dk uke) :",{"$nulls":5},{"$f":"VLOOKUP(A188,'Deta From Shala Dar. Class-10'!$A$2:$AE$201,9,0)","v":0}]
[null,"4- Date Of Birth (tUe frfFk vadks esa) :",{"$nulls":3},{"$f":"W199","v":"00:00:00"},{"$nulls":16},{"$f":"VLOOKUP(A188,'Deta From Shala Dar. Class-10'!$A$2:$AE$201,11,0)","v":"00:00:00"}]
[null,"In Words (tUe frfFk 'kCnksa esa) :",{"$nulls":5},"……………………………………………………………"]
[null,"5- Category Code (Js.kh dksM) : ¼Js.kh p;u gsrq ihNs fy[ks fo’k\"sk funsZ’k la[;k 1 ns[ks½ Js.kh dk uke %&",{"$nulls":8},"………………………………………………….",{"$nulls":5},"dksM %&"]
[null,"6- Only for Category IV & VI (dsoy Js.kh 4 o 6 ds fy,)"]
[null,"Table - A : Only for category(dsoy Js.kh 1]2 , o 8 ds fy;s) (I)ALL SUBJECTS (1-lEiw.kZ fo\"k;), (II) DIVISION IMPROVEMENT (2-Js.kh lq/kkj) & (VIII) FACULTY CHANGE (8-oxZ ifjorZu)  OPTIONAL SUBJECTS oSdfYid fo\"k;) :"]
[]
[{"$nulls":3},"As Applicable ",{"$nulls":4},"tks ykxw gks½",{"$nulls":3},"1…………………………………………………………………………….."]
[]
[{"$nulls":3},"(IV) ADDITIONAL SUBJECTS CAT",{"$nulls":4},"¼4½ vfrfjDr fo\"k;",{"$nulls":3},"2…………………………………………………3………………………...…………………….."]
[]
[{"$nulls":3},"(VI) MARKS IMPROVEMENT CAT",{"$nulls":4},"¼6½ vad lq/kkj",{"$nulls":3},"4…………………………………………………5………………………...…………………….."]
[]
[]
[null,null,"√","As Applicable from Number 8 to 15 ¼Øekad 8 ls 15 rd tks ykxw gks",{"$nulls":8},"√","djsa½"]
[]
[null,"7-","Third Language ¼r`rh; Hkk\"kk½ (Only for Category I &II) ¼dsoy Js.kh 1 o 2 ds fy,½ ¼fo\"k; p;u gsrq ihNs fy[ks fo’ks\"k funsZ’k \nla[;k 3 ns[ksa½ %&"]
[]
[null,null,"Third Language Opted (p;fur r`rh; Hkk\"kk) fo\"k; dk uke",{"$nulls":8},"dksM"]
[]
[null,"8-","Name of Vocational Trade ¼O;kolkf;d VªsM dk uke½",{"$nulls":6},"………………………………………………………..",{"$nulls":5},"lgh dk fpUg yxk,aA"]
[null,null,"¼dsoy mu 'kkykvksa ds fy, tgka O;kolkf;d f'k{kk lapkfyr gS ,oa ftu fo|kfFkZ;ksa us d{kk 10 rFkk 11 oha esa O;kolkf;d ijh{kk mRrh.kZ dh gSA½"]
[null,null," (1) Automotive (101)",{"$nulls":3},"(2) Beauty & Wellness (102)",{"$nulls":3},"(3) Health Care (103)",{"$nulls":3},"(4) IT & ITES (104)",null,null,"(5) Retail (105)"]
[]
[null,null," (6) Tourism & Hospitality (106)",{"$nulls":4},"(7) Security (107)",null,null,"(8) Apparel Made up Home Furnishing (108) ",{"$nulls":4},"(9) Electronics & Hardware (109)"]
[]
[null,null," (10) Agriculture (110)",{"$nulls":3},"(11) Plumber (111)",{"$nulls":3},"(12) Telecom (112)",{"$nulls":3},"(13) Banking Financial Services & Insurance (113)"]
[]
[null,null," (14) Construction (114)",{"$nulls":3},"(15) Food Processing (115)"]
[]
[null,"9-","Gender ¼fyax½ : (01) Male ¼iq:\"k½",{"$nulls":3},{"$f":"IF(W228=\"F\",\"\",\"Yes\")","v":"Yes"},"(02) FEMALE ¼efgyk½",null,null,{"$f":"IF(AA228=\"F\",\"\",\"Yes\")","v":"Yes"},"Medium ¼ek/;e½ : (01) HINDI ¼fgUnh½",{"$nulls":3},{"$f":"IF(X228=\"Hindi\",\"Yes\",\"\")","v":"Yes"},"(02) ENGLISH ¼vaxzsth½",null,null,{"$f":"IF(X228=\"english\",\"Yes\",\"\")","v":""},null,null,{"$f":"VLOOKUP(A188,'Deta From Shala Dar. Class-10'!$A$2:$AE$201,10,0)","v":0},{"$f":"Info!$C$8","v":"Hindi"}]
[]
[null,"10-","CWSN-1 ¼Hkkx½ : ekufld eanrk (01)",{"$nulls":4},"vkWfVTe (02)",null,null,"lsfjcy iYlh (03)",null,null,"ekufld jksx (04)",null,null,"Jo.k ckf/kr (05)"]
[]
[null,null,"ewd fu'kDrrk (06)",null,null,"LisfLQd yfuZax fMl,fcfyfV (14)",{"$nulls":4},"ckSf)d fu'kDrrk (15)",{"$nulls":3},"efYViy LDysjksfll (16)",null,null,"cgq fu'kDrrk (21)"]
[]
[null,"11-","CWSN-2 ¼Hkkx½ : n`f\"V ckf/kr (07)",{"$nulls":4},"vYi n`f\"V (08)",null,null,"pyu fu'kDrrk(09)",null,null,"dq\"B jksx (10)",null,null,"ckSukiu (11)"]
[]
[null,null,"rStkc fif³r (12)",null,null,"ekalis'kh nqfoZdkl ¼13½",{"$nulls":3},"ikfdZlkal jksx ¼17½",{"$nulls":3},"fgeksfQfy;k ¼18½",null,null,"FkSyslhfe;k ¼19½"]
[]
[null,null,",fufed@fLdy fMtht (20)",{"$nulls":3},"iksfy;ks@uoZ batjh ¼22½",{"$nulls":3},"lw;Zeq[kh ¼23½",{"$nulls":3}," @lSfud ¼24½"]
[]
[null,"12-","BPL ¼chih,y½ %",{"$nulls":4},"1- YES ¼gk¡½",null,{"$f":"IF(W240=\"N\",\"\",\"Yes\")","v":"Yes"},null,null,"2- NO ¼ugha¡½",null,{"$f":"IF(W240=\"Y\",\"\",\"Yes\")","v":"Yes"},{"$nulls":7},{"$f":"VLOOKUP(A188,'Deta From Shala Dar. Class-10'!$A$2:$AE$201,27,0)","v":0}]
[]
[null,"13-","vukFk oxZ %",{"$nulls":4},"1- YES ¼gk¡½",{"$nulls":4},"2- NO ¼ugha¡½"]
[]
[null,"14-","EWS ¼vkfFkZd n`f\"V ls detksj oxZ½ %",{"$nulls":4},"1- YES ¼gk¡½",{"$nulls":4},"2- NO ¼ugha¡½"]
[]
[null,"15-","CASTE ¼tkfr Js.kh½ %",null,null,"¼05½ Gen ¼lkekU;½",null,null,{"$f":"IF($W$60=\"GEN\",\"YES\",\"\")","v":""},"¼06½ MINORITY ¼lkekU;vYi la[;d½",{"$nulls":3},{"$f":"IF($W$60=\"MIN\",\"YES\",\"\")","v":""},"¼07½ SC ¼vuqlwfpr tkfr½",{"$nulls":4},{"$f":"IF($W$60=\"SC\",\"YES\",\"\")","v":""},null,null,{"$f":"VLOOKUP(A188,'Deta From Shala Dar. Class-10'!$A$2:$AE$201,16,0)","v":0}]
[]
[{"$nulls":5},"¼08½ ST ¼vuqlwfpr tutkfr½",null,null,{"$f":"IF($W$60=\"ST\",\"YES\",\"\")","v":""},"¼09½ OBC ¼vU; fiN³k oxZ½",{"$nulls":3},{"$f":"IF($W$60=\"OBC\",\"YES\",\"\")","v":""},"¼10½ Special OBC ¼fo'ks\"k fiN³k oxZ½@MBC",{"$nulls":4},{"$f":"IF(OR($W$60=\"MBC\",$W$60=\"SBC\"),\"YES\",\"\")","v":""}]
[null,"uksV%& Nk=o`fr@iqjLdkj mijksDr p;fur Js.kh ds vk/kj ij gh nh tk;sxhA"]
[]
[null,"16-","ADDRESS ¼fo|kFkhZ dk iw.kZ irk½ %&"]
[null,null,"House No./Street/Place Name ¼edku ua-@xyh ua-@LFkku½ %",{"$nulls":7},{"$f":"VLOOKUP(A188,'Deta From Shala Dar. Class-12'!$A$2:$AE$201,24,0)","v":0}]
[null,null,"Village/Town/City ¼xzke@dLck@'kgj½ %"]
[null,null,"District ¼ftyk½ %",null,null,"………………………….",null,null,"STATE ¼jkT;½ %",null,null,"…………………………………..",{"$nulls":3},"PIN CODE NO. ¼fiu dksM ua-½ %",null,null,"……………………"]
[]
[null,"17-","fo|kFkhZ dk vk/kkj dkMZ uEcj %",{"$nulls":3},{"$f":"VLOOKUP(A188,'Deta From Shala Dar. Class-12'!$A$2:$AE$201,21,0)","v":{"v":0,"d":"0000"}},{"$nulls":3},"tu vk/kkj uEcj %",null,{"$f":"VLOOKUP(A188,'Deta From Shala Dar. Class-12'!$A$2:$AE$201,22,0)","v":0},null,null,"vfHkHkkod dh okf\"kZd vk; %",null,null,{"$f":"VLOOKUP(A188,'Deta From Shala Dar. Class-12'!$A$2:$AE$201,25,0)","v":{"v":0,"d":"₹ 0"}}]
[]
[null,null,"Student/Guardian's Mobile No. ¼fo|kFkhZ@vfHkHkkod dk eksckby uacj½ %",{"$nulls":9},{"$f":"VLOOKUP(A188,'Deta From Shala Dar. Class-12'!$A$2:$AE$201,23,0)","v":0}]
[]
[null,"18-","Previous Academic Details ¼iwoZ 'kS{kf.kd ;ksX;rk½ %",{"$nulls":9},"---------------------------------------------------------"]
[]
[null,"CLASS ¼d{kk½",null,null,"YEAR ¼oxZ½",null,"ROLL NO. ¼ukekad½",null,null,"RESULT ¼ifj.kke½",null,null,"NAME OF SCHOOL/BOARD ¼Ldwy@cksMZ dk uke½"]
[null,"VIII"]
[null,"IX"]
[null,"X"]
[]
[null,"19-","Student's Photo and Signature ¼fo|kFkhZ dk QksVks ,oa gLrk{kj½",{"$nulls":9}," "]
[{"$nulls":10},"Student's Signature ¼fo|kFkhZ ds gLrk{kj½"]
[{"$nulls":3},"PASTE PASSPORT\nSIZE PHOTO"]
[]
[]
[]
[]
[{"$nulls":11}," 'kkyk ç/kku dk çek.khdj.k %&\ngLrk{kj---------------------------------------------------------------"]
[]
[]
[]
[]
[null,"fo|ky; dk uke %&",null,null,{"$f":"Info!$C$7","v":"Govt. Sr. Sec. School Raimalwada"},{"$nulls":6}," 'kkyk dksM %&",null,{"$f":"Info!$C$10","v":1},{"$f":"Info!$D$10","v":7},{"$f":"Info!$E$10","v":0},{"$f":"Info!$F$10","v":1},{"$f":"Info!$G$10","v":7},{"$f":"Info!$H$10","v":5},{"$f":"Info!$I$10","v":1}]
[]
[{"$f":"A188+1","v":4}]
[null,{"$f":"CONCATENATE(Info!$B$7,Info!$C$7)","v":"School Name :-Govt. Sr. Sec. School Raimalwada"}]
[{"$nulls":3},"Board of Secondary Education, Rajasthan",{"$nulls":12},"Sec. (Reg.)"]
[{"$nulls":3}," Ekk/;fed f’k{kk cksMZ] jktLFkku ",{"$nulls":12},"fu;fer ijh{kkFkhZ"]
[null,"ek/;fed ijh{kk",{"$nulls":3},"APPLICATION FORM FOR SENIOR SECONDARY EXAMINATION-2024",{"$nulls":7},{"$f":"Info!$C$10","v":1},{"$f":"Info!$D$10","v":7},{"$f":"Info!$E$10","v":0},{"$f":"Info!$F$10","v":1},{"$f":"Info!$G$10","v":7},{"$f":"Info!$H$10","v":5},{"$f":"Info!$I$10","v":1}]
[{"$nulls":5}," Ikjh{kk vkosnu i= ek/;fed ijh{kk & 2024"]
[{"$nulls":13}," 'kkyk niZ.k Øekad %&",{"$nulls":3},{"$f":"Info!$C$9","v":12345}]
[null,"Scholar Reg. No. ¼LdkWyj jftLVj Øekad½",{"$nulls":5},{"$f":"VLOOKUP(A281,'Deta From Shala Dar. Class-10'!$A$2:$AE$201,4,0)","v":0}]
[null,"1- Student’s Name (fo|kFkhZ dk uke) :",{"$nulls":5},{"$f":"VLOOKUP(A281,'Deta From Shala Dar. Class-10'!$A$2:$AE$201,6,0)","v":0}]
[null,"2- Mother’s Name ¼ekrk dk uke) :",{"$nulls":5},{"$f":"VLOOKUP(A281,'Deta From Shala Dar. Class-10'!$A$2:$AE$201,8,0)","v":0}]
[null,"3- Father’s Name (firk dk uke) :",{"$nulls":5},{"$f":"VLOOKUP(A281,'Deta From Shala Dar. Class-10'!$A$2:$AE$201,9,0)","v":0}]
[null,"4- Date Of Birth (tUe frfFk vadks esa) :",{"$nulls":3},{"$f":"W292","v":"00:00:00"},{"$nulls":16},{"$f":"VLOOKUP(A281,'Deta From Shala Dar. Class-10'!$A$2:$AE$201,11,0)","v":"00:00:00"}]
[null,"In Words (tUe frfFk 'kCnksa esa) :",{"$nulls":5},"……………………………………………………………"]
[null,"5- Category Code (Js.kh dksM) : ¼Js.kh p;u gsrq ihNs fy[ks fo’k\"sk funsZ’k la[;k 1 ns[ks½ Js.kh dk uke %&",{"$nulls":8},"………………………………………………….",{"$nulls":5},"dksM %&"]
[null,"6- Only for Category IV & VI (dsoy Js.kh 4 o 6 ds fy,)"]
[null,"Table - A : Only for category(dsoy Js.kh 1]2 , o 8 ds fy;s) (I)ALL SUBJECTS (1-lEiw.kZ fo\"k;), (II) DIVISION IMPROVEMENT (2-Js.kh lq/kkj) & (VIII) FACULTY CHANGE (8-oxZ ifjorZu)  OPTIONAL SUBJECTS oSdfYid fo\"k;) :"]
[]
[{"$nulls":3},"As Applicable ",{"$nulls":4},"tks ykxw gks½",{"$nulls":3},"1…………………………………………………………………………….."]
[]
[{"$nulls":3},"(IV) ADDITIONAL SUBJECTS CAT",{"$nulls":4},"¼4½ vfrfjDr fo\"k;",{"$nulls":3},"2…………………………………………………3………………………...…………………….."]
[]
[{"$nulls":3},"(VI) MARKS IMPROVEMENT CAT",{"$nulls":4},"¼6½ vad lq/kkj",{"$nulls":3},"4…………………………………………………5………………………...…………………….."]
[]
[]
[null,null,"√","As Applicable from Number 8 to 15 ¼Øekad 8 ls 15 rd tks ykxw gks",{"$nulls":8},"√","djsa½"]
[]
[null,"7-","Third Language ¼r`rh; Hkk\"kk½ (Only for Category I &II) ¼dsoy Js.kh 1 o 2 ds fy,½ ¼fo\"k; p;u gsrq ihNs fy[ks fo’ks\"k funsZ’k \nla[;k 3 ns[ksa½ %&"]
[]
[null,null,"Third Language Opted (p;fur r`rh; Hkk\"kk) fo\"k; dk uke",{"$nulls":8},"dksM"]
[]
[null,"8-","Name of Vocational Trade ¼O;kolkf;d VªsM dk uke½",{"$nulls":6},"………………………………………………………..",{"$nulls":5},"lgh dk fpUg yxk,aA"]
[null,null,"¼dsoy mu 'kkykvksa ds fy, tgka O;kolkf;d f'k{kk lapkfyr gS ,oa ftu fo|kfFkZ;ksa us d{kk 10 rFkk 11 oha esa O;kolkf;d ijh{kk mRrh.kZ dh gSA½"]
[null,null," (1) Automotive (101)",{"$nulls":3},"(2) Beauty & Wellness (102)",{"$nulls":3},"(3) Health Care (103)",{"$nulls":3},"(4) IT & ITES (104)",null,null,"(5) Retail (105)"]
[]
[null,null," (6) Tourism & Hospitality (106)",{"$nulls":4},"(7) Security (107)",null,null,"(8) Apparel Made up Home Furnishing (108) ",{"$nulls":4},"(9) Electronics & Hardware (109)"]
[]
[null,null," (10) Agriculture (110)",{"$nulls":3},"(11) Plumber (111)",{"$nulls":3},"(12) Telecom (112)",{"$nulls":3},"(13) Banking Financial Services & Insurance (113)"]
[]
[null,null," (14) Construction (114)",{"$nulls":3},"(15) Food Processing (115)"]
[]
[null,"9-","Gender ¼fyax½ : (01) Male ¼iq:\"k½",{"$nulls":3},{"$f":"IF(W321=\"F\",\"\",\"Yes\")","v":"Yes"},"(02) FEMALE ¼efgyk½",null,null,{"$f":"IF(AA321=\"F\",\"\",\"Yes\")","v":"Yes"},"Medium ¼ek/;e½ : (01) HINDI ¼fgUnh½",{"$nulls":3},{"$f":"IF(X321=\"Hindi\",\"Yes\",\"\")","v":"Yes"},"(02) ENGLISH ¼vaxzsth½",null,null,{"$f":"IF(X321=\"english\",\"Yes\",\"\")","v":""},null,null,{"$f":"VLOOKUP(A281,'Deta From Shala Dar. Class-10'!$A$2:$AE$201,10,0)","v":0},{"$f":"Info!$C$8","v":"Hindi"}]
[]
[null,"10-","CWSN-1 ¼Hkkx½ : ekufld eanrk (01)",{"$nulls":4},"vkWfVTe (02)",null,null,"lsfjcy iYlh (03)",null,null,"ekufld jksx (04)",null,null,"Jo.k ckf/kr (05)"]
[]
[null,null,"ewd fu'kDrrk (06)",null,null,"LisfLQd yfuZax fMl,fcfyfV (14)",{"$nulls":4},"ckSf)d fu'kDrrk (15)",{"$nulls":3},"efYViy LDysjksfll (16)",null,null,"cgq fu'kDrrk (21)"]
[]
[null,"11-","CWSN-2 ¼Hkkx½ : n`f\"V ckf/kr (07)",{"$nulls":4},"vYi n`f\"V (08)",null,null,"pyu fu'kDrrk(09)",null,null,"dq\"B jksx (10)",null,null,"ckSukiu (11)"]
[]
[null,null,"rStkc fif³r (12)",null,null,"ekalis'kh nqfoZdkl ¼13½",{"$nulls":3},"ikfdZlkal jksx ¼17½",{"$nulls":3},"fgeksfQfy;k ¼18½",null,null,"FkSyslhfe;k ¼19½"]
[]
[null,null,",fufed@fLdy fMtht (20)",{"$nulls":3},"iksfy;ks@uoZ batjh ¼22½",{"$nulls":3},"lw;Zeq[kh ¼23½",{"$nulls":3}," @lSfud ¼24½"]
[]
[null,"12-","BPL ¼chih,y½ %",{"$nulls":4},"1- YES ¼gk¡½",null,{"$f":"IF(W333=\"N\",\"\",\"Yes\")","v":"Yes"},null,null,"2- NO ¼ugha¡½",null,{"$f":"IF(W333=\"Y\",\"\",\"Yes\")","v":"Yes"},{"$nulls":7},{"$f":"VLOOKUP(A281,'Deta From Shala Dar. Class-10'!$A$2:$AE$201,27,0)","v":0}]
[]
[null,"13-","vukFk oxZ %",{"$nulls":4},"1- YES ¼gk¡½",{"$nulls":4},"2- NO ¼ugha¡½"]
[]
[null,"14-","EWS ¼vkfFkZd n`f\"V ls detksj oxZ½ %",{"$nulls":4},"1- YES ¼gk¡½",{"$nulls":4},"2- NO ¼ugha¡½"]
[]
[null,"15-","CASTE ¼tkfr Js.kh½ %",null,null,"¼05½ Gen ¼lkekU;½",null,null,{"$f":"IF($W$60=\"GEN\",\"YES\",\"\")","v":""},"¼06½ MINORITY ¼lkekU;vYi la[;d½",{"$nulls":3},{"$f":"IF($W$60=\"MIN\",\"YES\",\"\")","v":""},"¼07½ SC ¼vuqlwfpr tkfr½",{"$nulls":4},{"$f":"IF($W$60=\"SC\",\"YES\",\"\")","v":""},null,null,{"$f":"VLOOKUP(A281,'Deta From Shala Dar. Class-10'!$A$2:$AE$201,16,0)","v":0}]
[]
[{"$nulls":5},"¼08½ ST ¼vuqlwfpr tutkfr½",null,null,{"$f":"IF($W$60=\"ST\",\"YES\",\"\")","v":""},"¼09½ OBC ¼vU; fiN³k oxZ½",{"$nulls":3},{"$f":"IF($W$60=\"OBC\",\"YES\",\"\")","v":""},"¼10½ Special OBC ¼fo'ks\"k fiN³k oxZ½@MBC",{"$nulls":4},{"$f":"IF(OR($W$60=\"MBC\",$W$60=\"SBC\"),\"YES\",\"\")","v":""}]
[null,"uksV%& Nk=o`fr@iqjLdkj mijksDr p;fur Js.kh ds vk/kj ij gh nh tk;sxhA"]
[]
[null,"16-","ADDRESS ¼fo|kFkhZ dk iw.kZ irk½ %&"]
[null,null,"House No./Street/Place Name ¼edku ua-@xyh ua-@LFkku½ %",{"$nulls":7},{"$f":"VLOOKUP(A281,'Deta From Shala Dar. Class-12'!$A$2:$AE$201,24,0)","v":0}]
[null,null,"Village/Town/City ¼xzke@dLck@'kgj½ %"]
[null,null,"District ¼ftyk½ %",null,null,"………………………….",null,null,"STATE ¼jkT;½ %",null,null,"…………………………………..",{"$nulls":3},"PIN CODE NO. ¼fiu dksM ua-½ %",null,null,"……………………"]
[]
[null,"17-","fo|kFkhZ dk vk/kkj dkMZ uEcj %",{"$nulls":3},{"$f":"VLOOKUP(A281,'Deta From Shala Dar. Class-12'!$A$2:$AE$201,21,0)","v":{"v":0,"d":"0000"}},{"$nulls":3},"tu vk/kkj uEcj %",null,{"$f":"VLOOKUP(A281,'Deta From Shala Dar. Class-12'!$A$2:$AE$201,22,0)","v":0},null,null,"vfHkHkkod dh okf\"kZd vk; %",null,null,{"$f":"VLOOKUP(A281,'Deta From Shala Dar. Class-12'!$A$2:$AE$201,25,0)","v":{"v":0,"d":"₹ 0"}}]
[]
[null,null,"Student/Guardian's Mobile No. ¼fo|kFkhZ@vfHkHkkod dk eksckby uacj½ %",{"$nulls":9},{"$f":"VLOOKUP(A281,'Deta From Shala Dar. Class-12'!$A$2:$AE$201,23,0)","v":0}]
[]
[null,"18-","Previous Academic Details ¼iwoZ 'kS{kf.kd ;ksX;rk½ %",{"$nulls":9},"---------------------------------------------------------"]
[]
[null,"CLASS ¼d{kk½",null,null,"YEAR ¼oxZ½",null,"ROLL NO. ¼ukekad½",null,null,"RESULT ¼ifj.kke½",null,null,"NAME OF SCHOOL/BOARD ¼Ldwy@cksMZ dk uke½"]
[null,"VIII"]
[null,"IX"]
[null,"X"]
[]
[null,"19-","Student's Photo and Signature ¼fo|kFkhZ dk QksVks ,oa gLrk{kj½",{"$nulls":9}," "]
[{"$nulls":10},"Student's Signature ¼fo|kFkhZ ds gLrk{kj½"]
[{"$nulls":3},"PASTE PASSPORT\nSIZE PHOTO"]
[]
[]
[]
[]
[{"$nulls":11}," 'kkyk ç/kku dk çek.khdj.k %&\ngLrk{kj---------------------------------------------------------------"]
[]
[]
[]
[]
[null,"fo|ky; dk uke %&",null,null,{"$f":"Info!$C$7","v":"Govt. Sr. Sec. School Raimalwada"},{"$nulls":6}," 'kkyk dksM %&",null,{"$f":"Info!$C$10","v":1},{"$f":"Info!$D$10","v":7},{"$f":"Info!$E$10","v":0},{"$f":"Info!$F$10","v":1},{"$f":"Info!$G$10","v":7},{"$f":"Info!$H$10","v":5},{"$f":"Info!$I$10","v":1}]
[]
[{"$f":"A281+1","v":5}]
[null,{"$f":"CONCATENATE(Info!$B$7,Info!$C$7)","v":"School Name :-Govt. Sr. Sec. School Raimalwada"}]
[{"$nulls":3},"Board of Secondary Education, Rajasthan",{"$nulls":12},"Sec. (Reg.)"]
[{"$nulls":3}," Ekk/;fed f’k{kk cksMZ] jktLFkku ",{"$nulls":12},"fu;fer ijh{kkFkhZ"]
[null,"ek/;fed ijh{kk",{"$nulls":3},"APPLICATION FORM FOR SENIOR SECONDARY EXAMINATION-2024",{"$nulls":7},{"$f":"Info!$C$10","v":1},{"$f":"Info!$D$10","v":7},{"$f":"Info!$E$10","v":0},{"$f":"Info!$F$10","v":1},{"$f":"Info!$G$10","v":7},{"$f":"Info!$H$10","v":5},{"$f":"Info!$I$10","v":1}]
[{"$nulls":5}," Ikjh{kk vkosnu i= ek/;fed ijh{kk & 2024"]
[{"$nulls":13}," 'kkyk niZ.k Øekad %&",{"$nulls":3},{"$f":"Info!$C$9","v":12345}]
[null,"Scholar Reg. No. ¼LdkWyj jftLVj Øekad½",{"$nulls":5},{"$f":"VLOOKUP(A374,'Deta From Shala Dar. Class-10'!$A$2:$AE$201,4,0)","v":0}]
[null,"1- Student’s Name (fo|kFkhZ dk uke) :",{"$nulls":5},{"$f":"VLOOKUP(A374,'Deta From Shala Dar. Class-10'!$A$2:$AE$201,6,0)","v":0}]
[null,"2- Mother’s Name ¼ekrk dk uke) :",{"$nulls":5},{"$f":"VLOOKUP(A374,'Deta From Shala Dar. Class-10'!$A$2:$AE$201,8,0)","v":0}]
[null,"3- Father’s Name (firk dk uke) :",{"$nulls":5},{"$f":"VLOOKUP(A374,'Deta From Shala Dar. Class-10'!$A$2:$AE$201,9,0)","v":0}]
[null,"4- Date Of Birth (tUe frfFk vadks esa) :",{"$nulls":3},{"$f":"W385","v":"00:00:00"},{"$nulls":16},{"$f":"VLOOKUP(A374,'Deta From Shala Dar. Class-10'!$A$2:$AE$201,11,0)","v":"00:00:00"}]
[null,"In Words (tUe frfFk 'kCnksa esa) :",{"$nulls":5},"……………………………………………………………"]
[null,"5- Category Code (Js.kh dksM) : ¼Js.kh p;u gsrq ihNs fy[ks fo’k\"sk funsZ’k la[;k 1 ns[ks½ Js.kh dk uke %&",{"$nulls":8},"………………………………………………….",{"$nulls":5},"dksM %&"]
[null,"6- Only for Category IV & VI (dsoy Js.kh 4 o 6 ds fy,)"]
[null,"Table - A : Only for category(dsoy Js.kh 1]2 , o 8 ds fy;s) (I)ALL SUBJECTS (1-lEiw.kZ fo\"k;), (II) DIVISION IMPROVEMENT (2-Js.kh lq/kkj) & (VIII) FACULTY CHANGE (8-oxZ ifjorZu)  OPTIONAL SUBJECTS oSdfYid fo\"k;) :"]
[]
[{"$nulls":3},"As Applicable ",{"$nulls":4},"tks ykxw gks½",{"$nulls":3},"1…………………………………………………………………………….."]
[]
[{"$nulls":3},"(IV) ADDITIONAL SUBJECTS CAT",{"$nulls":4},"¼4½ vfrfjDr fo\"k;",{"$nulls":3},"2…………………………………………………3………………………...…………………….."]
[]
[{"$nulls":3},"(VI) MARKS IMPROVEMENT CAT",{"$nulls":4},"¼6½ vad lq/kkj",{"$nulls":3},"4…………………………………………………5………………………...…………………….."]
[]
[]
[null,null,"√","As Applicable from Number 8 to 15 ¼Øekad 8 ls 15 rd tks ykxw gks",{"$nulls":8},"√","djsa½"]
[]
[null,"7-","Third Language ¼r`rh; Hkk\"kk½ (Only for Category I &II) ¼dsoy Js.kh 1 o 2 ds fy,½ ¼fo\"k; p;u gsrq ihNs fy[ks fo’ks\"k funsZ’k \nla[;k 3 ns[ksa½ %&"]
[]
[null,null,"Third Language Opted (p;fur r`rh; Hkk\"kk) fo\"k; dk uke",{"$nulls":8},"dksM"]
[]
[null,"8-","Name of Vocational Trade ¼O;kolkf;d VªsM dk uke½",{"$nulls":6},"………………………………………………………..",{"$nulls":5},"lgh dk fpUg yxk,aA"]
[null,null,"¼dsoy mu 'kkykvksa ds fy, tgka O;kolkf;d f'k{kk lapkfyr gS ,oa ftu fo|kfFkZ;ksa us d{kk 10 rFkk 11 oha esa O;kolkf;d ijh{kk mRrh.kZ dh gSA½"]
[null,null," (1) Automotive (101)",{"$nulls":3},"(2) Beauty & Wellness (102)",{"$nulls":3},"(3) Health Care (103)",{"$nulls":3},"(4) IT & ITES (104)",null,null,"(5) Retail (105)"]
[]
[null,null," (6) Tourism & Hospitality (106)",{"$nulls":4},"(7) Security (107)",null,null,"(8) Apparel Made up Home Furnishing (108) ",{"$nulls":4},"(9) Electronics & Hardware (109)"]
[]
[null,null," (10) Agriculture (110)",{"$nulls":3},"(11) Plumber (111)",{"$nulls":3},"(12) Telecom (112)",{"$nulls":3},"(13) Banking Financial Services & Insurance (113)"]
[]
[null,null," (14) Construction (114)",{"$nulls":3},"(15) Food Processing (115)"]
[]
[null,"9-","Gender ¼fyax½ : (01) Male ¼iq:\"k½",{"$nulls":3},{"$f":"IF(W414=\"F\",\"\",\"Yes\")","v":"Yes"},"(02) FEMALE ¼efgyk½",null,null,{"$f":"IF(AA414=\"F\",\"\",\"Yes\")","v":"Yes"},"Medium ¼ek/;e½ : (01) HINDI ¼fgUnh½",{"$nulls":3},{"$f":"IF(X414=\"Hindi\",\"Yes\",\"\")","v":"Yes"},"(02) ENGLISH ¼vaxzsth½",null,null,{"$f":"IF(X414=\"english\",\"Yes\",\"\")","v":""},null,null,{"$f":"VLOOKUP(A374,'Deta From Shala Dar. Class-10'!$A$2:$AE$201,10,0)","v":0},{"$f":"Info!$C$8","v":"Hindi"}]
[]
[null,"10-","CWSN-1 ¼Hkkx½ : ekufld eanrk (01)",{"$nulls":4},"vkWfVTe (02)",null,null,"lsfjcy iYlh (03)",null,null,"ekufld jksx (04)",null,null,"Jo.k ckf/kr (05)"]
[]
[null,null,"ewd fu'kDrrk (06)",null,null,"LisfLQd yfuZax fMl,fcfyfV (14)",{"$nulls":4},"ckSf)d fu'kDrrk (15)",{"$nulls":3},"efYViy LDysjksfll (16)",null,null,"cgq fu'kDrrk (21)"]
[]
[null,"11-","CWSN-2 ¼Hkkx½ : n`f\"V ckf/kr (07)",{"$nulls":4},"vYi n`f\"V (08)",null,null,"pyu fu'kDrrk(09)",null,null,"dq\"B jksx (10)",null,null,"ckSukiu (11)"]
[]
[null,null,"rStkc fif³r (12)",null,null,"ekalis'kh nqfoZdkl ¼13½",{"$nulls":3},"ikfdZlkal jksx ¼17½",{"$nulls":3},"fgeksfQfy;k ¼18½",null,null,"FkSyslhfe;k ¼19½"]
[]
[null,null,",fufed@fLdy fMtht (20)",{"$nulls":3},"iksfy;ks@uoZ batjh ¼22½",{"$nulls":3},"lw;Zeq[kh ¼23½",{"$nulls":3}," @lSfud ¼24½"]
[]
[null,"12-","BPL ¼chih,y½ %",{"$nulls":4},"1- YES ¼gk¡½",null,{"$f":"IF(W426=\"N\",\"\",\"Yes\")","v":"Yes"},null,null,"2- NO ¼ugha¡½",null,{"$f":"IF(W426=\"Y\",\"\",\"Yes\")","v":"Yes"},{"$nulls":7},{"$f":"VLOOKUP(A374,'Deta From Shala Dar. Class-10'!$A$2:$AE$201,27,0)","v":0}]
[]
[null,"13-","vukFk oxZ %",{"$nulls":4},"1- YES ¼gk¡½",{"$nulls":4},"2- NO ¼ugha¡½"]
[]
[null,"14-","EWS ¼vkfFkZd n`f\"V ls detksj oxZ½ %",{"$nulls":4},"1- YES ¼gk¡½",{"$nulls":4},"2- NO ¼ugha¡½"]
[]
[null,"15-","CASTE ¼tkfr Js.kh½ %",null,null,"¼05½ Gen ¼lkekU;½",null,null,{"$f":"IF($W$60=\"GEN\",\"YES\",\"\")","v":""},"¼06½ MINORITY ¼lkekU;vYi la[;d½",{"$nulls":3},{"$f":"IF($W$60=\"MIN\",\"YES\",\"\")","v":""},"¼07½ SC ¼vuqlwfpr tkfr½",{"$nulls":4},{"$f":"IF($W$60=\"SC\",\"YES\",\"\")","v":""},null,null,{"$f":"VLOOKUP(A374,'Deta From Shala Dar. Class-10'!$A$2:$AE$201,16,0)","v":0}]
[]
[{"$nulls":5},"¼08½ ST ¼vuqlwfpr tutkfr½",null,null,{"$f":"IF($W$60=\"ST\",\"YES\",\"\")","v":""},"¼09½ OBC ¼vU; fiN³k oxZ½",{"$nulls":3},{"$f":"IF($W$60=\"OBC\",\"YES\",\"\")","v":""},"¼10½ Special OBC ¼fo'ks\"k fiN³k oxZ½@MBC",{"$nulls":4},{"$f":"IF(OR($W$60=\"MBC\",$W$60=\"SBC\"),\"YES\",\"\")","v":""}]
[null,"uksV%& Nk=o`fr@iqjLdkj mijksDr p;fur Js.kh ds vk/kj ij gh nh tk;sxhA"]
[]
[null,"16-","ADDRESS ¼fo|kFkhZ dk iw.kZ irk½ %&"]
[null,null,"House No./Street/Place Name ¼edku ua-@xyh ua-@LFkku½ %",{"$nulls":7},{"$f":"VLOOKUP(A374,'Deta From Shala Dar. Class-12'!$A$2:$AE$201,24,0)","v":0}]
[null,null,"Village/Town/City ¼xzke@dLck@'kgj½ %"]
[null,null,"District ¼ftyk½ %",null,null,"………………………….",null,null,"STATE ¼jkT;½ %",null,null,"…………………………………..",{"$nulls":3},"PIN CODE NO. ¼fiu dksM ua-½ %",null,null,"……………………"]
[]
[null,"17-","fo|kFkhZ dk vk/kkj dkMZ uEcj %",{"$nulls":3},{"$f":"VLOOKUP(A374,'Deta From Shala Dar. Class-12'!$A$2:$AE$201,21,0)","v":{"v":0,"d":"0000"}},{"$nulls":3},"tu vk/kkj uEcj %",null,{"$f":"VLOOKUP(A374,'Deta From Shala Dar. Class-12'!$A$2:$AE$201,22,0)","v":0},null,null,"vfHkHkkod dh okf\"kZd vk; %",null,null,{"$f":"VLOOKUP(A374,'Deta From Shala Dar. Class-12'!$A$2:$AE$201,25,0)","v":{"v":0,"d":"₹ 0"}}]
[]
[null,null,"Student/Guardian's Mobile No. ¼fo|kFkhZ@vfHkHkkod dk eksckby uacj½ %",{"$nulls":9},{"$f":"VLOOKUP(A374,'Deta From Shala Dar. Class-12'!$A$2:$AE$201,23,0)","v":0}]
[]
[null,"18-","Previous Academic Details ¼iwoZ 'kS{kf.kd ;ksX;rk½ %",{"$nulls":9},"---------------------------------------------------------"]
[]
[null,"CLASS ¼d{kk½",null,null,"YEAR ¼oxZ½",null,"ROLL NO. ¼ukekad½",null,null,"RESULT ¼ifj.kke½",null,null,"NAME OF SCHOOL/BOARD ¼Ldwy@cksMZ dk uke½"]
[null,"VIII"]
[null,"IX"]
[null,"X"]
[]
[null,"19-","Student's Photo and Signature ¼fo|kFkhZ dk QksVks ,oa gLrk{kj½",{"$nulls":9}," "]
[{"$nulls":10},"Student's Signature ¼fo|kFkhZ ds gLrk{kj½"]
[{"$nulls":3},"PASTE PASSPORT\nSIZE PHOTO"]
[]
[]
[]
[]
[{"$nulls":11}," 'kkyk ç/kku dk çek.khdj.k %&\ngLrk{kj---------------------------------------------------------------"]
[]
[]
[]
[]
[null,"fo|ky; dk uke %&",null,null,{"$f":"Info!$C$7","v":"Govt. Sr. Sec. School Raimalwada"},{"$nulls":6}," 'kkyk dksM %&",null,{"$f":"Info!$C$10","v":1},{"$f":"Info!$D$10","v":7},{"$f":"Info!$E$10","v":0},{"$f":"Info!$F$10","v":1},{"$f":"Info!$G$10","v":7},{"$f":"Info!$H$10","v":5},{"$f":"Info!$I$10","v":1}]
[]
[{"$f":"A374+1","v":6}]
[null,{"$f":"CONCATENATE(Info!$B$7,Info!$C$7)","v":"School Name :-Govt. Sr. Sec. School Raimalwada"}]
[{"$nulls":3},"Board of Secondary Education, Rajasthan",{"$nulls":12},"Sec. (Reg.)"]
[{"$nulls":3}," Ekk/;fed f’k{kk cksMZ] jktLFkku ",{"$nulls":12},"fu;fer ijh{kkFkhZ"]
[null,"ek/;fed ijh{kk",{"$nulls":3},"APPLICATION FORM FOR SENIOR SECONDARY EXAMINATION-2024",{"$nulls":7},{"$f":"Info!$C$10","v":1},{"$f":"Info!$D$10","v":7},{"$f":"Info!$E$10","v":0},{"$f":"Info!$F$10","v":1},{"$f":"Info!$G$10","v":7},{"$f":"Info!$H$10","v":5},{"$f":"Info!$I$10","v":1}]
[{"$nulls":5}," Ikjh{kk vkosnu i= ek/;fed ijh{kk & 2024"]
[{"$nulls":13}," 'kkyk niZ.k Øekad %&",{"$nulls":3},{"$f":"Info!$C$9","v":12345}]
[null,"Scholar Reg. No. ¼LdkWyj jftLVj Øekad½",{"$nulls":5},{"$f":"VLOOKUP(A467,'Deta From Shala Dar. Class-10'!$A$2:$AE$201,4,0)","v":0}]
[null,"1- Student’s Name (fo|kFkhZ dk uke) :",{"$nulls":5},{"$f":"VLOOKUP(A467,'Deta From Shala Dar. Class-10'!$A$2:$AE$201,6,0)","v":0}]
[null,"2- Mother’s Name ¼ekrk dk uke) :",{"$nulls":5},{"$f":"VLOOKUP(A467,'Deta From Shala Dar. Class-10'!$A$2:$AE$201,8,0)","v":0}]
[null,"3- Father’s Name (firk dk uke) :",{"$nulls":5},{"$f":"VLOOKUP(A467,'Deta From Shala Dar. Class-10'!$A$2:$AE$201,9,0)","v":0}]
[null,"4- Date Of Birth (tUe frfFk vadks esa) :",{"$nulls":3},{"$f":"W478","v":"00:00:00"},{"$nulls":16},{"$f":"VLOOKUP(A467,'Deta From Shala Dar. Class-10'!$A$2:$AE$201,11,0)","v":"00:00:00"}]
[null,"In Words (tUe frfFk 'kCnksa esa) :",{"$nulls":5},"……………………………………………………………"]
[null,"5- Category Code (Js.kh dksM) : ¼Js.kh p;u gsrq ihNs fy[ks fo’k\"sk funsZ’k la[;k 1 ns[ks½ Js.kh dk uke %&",{"$nulls":8},"………………………………………………….",{"$nulls":5},"dksM %&"]
[null,"6- Only for Category IV & VI (dsoy Js.kh 4 o 6 ds fy,)"]
[null,"Table - A : Only for category(dsoy Js.kh 1]2 , o 8 ds fy;s) (I)ALL SUBJECTS (1-lEiw.kZ fo\"k;), (II) DIVISION IMPROVEMENT (2-Js.kh lq/kkj) & (VIII) FACULTY CHANGE (8-oxZ ifjorZu)  OPTIONAL SUBJECTS oSdfYid fo\"k;) :"]
[]
[{"$nulls":3},"As Applicable ",{"$nulls":4},"tks ykxw gks½",{"$nulls":3},"1…………………………………………………………………………….."]
[]
[{"$nulls":3},"(IV) ADDITIONAL SUBJECTS CAT",{"$nulls":4},"¼4½ vfrfjDr fo\"k;",{"$nulls":3},"2…………………………………………………3………………………...…………………….."]
[]
[{"$nulls":3},"(VI) MARKS IMPROVEMENT CAT",{"$nulls":4},"¼6½ vad lq/kkj",{"$nulls":3},"4…………………………………………………5………………………...…………………….."]
[]
[]
[null,null,"√","As Applicable from Number 8 to 15 ¼Øekad 8 ls 15 rd tks ykxw gks",{"$nulls":8},"√","djsa½"]
[]
[null,"7-","Third Language ¼r`rh; Hkk\"kk½ (Only for Category I &II) ¼dsoy Js.kh 1 o 2 ds fy,½ ¼fo\"k; p;u gsrq ihNs fy[ks fo’ks\"k funsZ’k \nla[;k 3 ns[ksa½ %&"]
[]
[null,null,"Third Language Opted (p;fur r`rh; Hkk\"kk) fo\"k; dk uke",{"$nulls":8},"dksM"]
[]
[null,"8-","Name of Vocational Trade ¼O;kolkf;d VªsM dk uke½",{"$nulls":6},"………………………………………………………..",{"$nulls":5},"lgh dk fpUg yxk,aA"]
[null,null,"¼dsoy mu 'kkykvksa ds fy, tgka O;kolkf;d f'k{kk lapkfyr gS ,oa ftu fo|kfFkZ;ksa us d{kk 10 rFkk 11 oha esa O;kolkf;d ijh{kk mRrh.kZ dh gSA½"]
[null,null," (1) Automotive (101)",{"$nulls":3},"(2) Beauty & Wellness (102)",{"$nulls":3},"(3) Health Care (103)",{"$nulls":3},"(4) IT & ITES (104)",null,null,"(5) Retail (105)"]
[]
[null,null," (6) Tourism & Hospitality (106)",{"$nulls":4},"(7) Security (107)",null,null,"(8) Apparel Made up Home Furnishing (108) ",{"$nulls":4},"(9) Electronics & Hardware (109)"]
[]
[null,null," (10) Agriculture (110)",{"$nulls":3},"(11) Plumber (111)",{"$nulls":3},"(12) Telecom (112)",{"$nulls":3},"(13) Banking Financial Services & Insurance (113)"]
[]
[null,null," (14) Construction (114)",{"$nulls":3},"(15) Food Processing (115)"]
[]
[null,"9-","Gender ¼fyax½ : (01) Male ¼iq:\"k½",{"$nulls":3},{"$f":"IF(W507=\"F\",\"\",\"Yes\")","v":"Yes"},"(02) FEMALE ¼efgyk½",null,null,{"$f":"IF(AA507=\"F\",\"\",\"Yes\")","v":"Yes"},"Medium ¼ek/;e½ : (01) HINDI ¼fgUnh½",{"$nulls":3},{"$f":"IF(X507=\"Hindi\",\"Yes\",\"\")","v":"Yes"},"(02) ENGLISH ¼vaxzsth½",null,null,{"$f":"IF(X507=\"english\",\"Yes\",\"\")","v":""},null,null,{"$f":"VLOOKUP(A467,'Deta From Shala Dar. Class-10'!$A$2:$AE$201,10,0)","v":0},{"$f":"Info!$C$8","v":"Hindi"}]
[]
[null,"10-","CWSN-1 ¼Hkkx½ : ekufld eanrk (01)",{"$nulls":4},"vkWfVTe (02)",null,null,"lsfjcy iYlh (03)",null,null,"ekufld jksx (04)",null,null,"Jo.k ckf/kr (05)"]
[]
[null,null,"ewd fu'kDrrk (06)",null,null,"LisfLQd yfuZax fMl,fcfyfV (14)",{"$nulls":4},"ckSf)d fu'kDrrk (15)",{"$nulls":3},"efYViy LDysjksfll (16)",null,null,"cgq fu'kDrrk (21)"]
[]
[null,"11-","CWSN-2 ¼Hkkx½ : n`f\"V ckf/kr (07)",{"$nulls":4},"vYi n`f\"V (08)",null,null,"pyu fu'kDrrk(09)",null,null,"dq\"B jksx (10)",null,null,"ckSukiu (11)"]
[]
[null,null,"rStkc fif³r (12)",null,null,"ekalis'kh nqfoZdkl ¼13½",{"$nulls":3},"ikfdZlkal jksx ¼17½",{"$nulls":3},"fgeksfQfy;k ¼18½",null,null,"FkSyslhfe;k ¼19½"]
[]
[null,null,",fufed@fLdy fMtht (20)",{"$nulls":3},"iksfy;ks@uoZ batjh ¼22½",{"$nulls":3},"lw;Zeq[kh ¼23½",{"$nulls":3}," @lSfud ¼24½"]
[]
[null,"12-","BPL ¼chih,y½ %",{"$nulls":4},"1- YES ¼gk¡½",null,{"$f":"IF(W519=\"N\",\"\",\"Yes\")","v":"Yes"},null,null,"2- NO ¼ugha¡½",null,{"$f":"IF(W519=\"Y\",\"\",\"Yes\")","v":"Yes"},{"$nulls":7},{"$f":"VLOOKUP(A467,'Deta From Shala Dar. Class-10'!$A$2:$AE$201,27,0)","v":0}]
[]
[null,"13-","vukFk oxZ %",{"$nulls":4},"1- YES ¼gk¡½",{"$nulls":4},"2- NO ¼ugha¡½"]
[]
[null,"14-","EWS ¼vkfFkZd n`f\"V ls detksj oxZ½ %",{"$nulls":4},"1- YES ¼gk¡½",{"$nulls":4},"2- NO ¼ugha¡½"]
[]
[null,"15-","CASTE ¼tkfr Js.kh½ %",null,null,"¼05½ Gen ¼lkekU;½",null,null,{"$f":"IF($W$60=\"GEN\",\"YES\",\"\")","v":""},"¼06½ MINORITY ¼lkekU;vYi la[;d½",{"$nulls":3},{"$f":"IF($W$60=\"MIN\",\"YES\",\"\")","v":""},"¼07½ SC ¼vuqlwfpr tkfr½",{"$nulls":4},{"$f":"IF($W$60=\"SC\",\"YES\",\"\")","v":""},null,null,{"$f":"VLOOKUP(A467,'Deta From Shala Dar. Class-10'!$A$2:$AE$201,16,0)","v":0}]
[]
[{"$nulls":5},"¼08½ ST ¼vuqlwfpr tutkfr½",null,null,{"$f":"IF($W$60=\"ST\",\"YES\",\"\")","v":""},"¼09½ OBC ¼vU; fiN³k oxZ½",{"$nulls":3},{"$f":"IF($W$60=\"OBC\",\"YES\",\"\")","v":""},"¼10½ Special OBC ¼fo'ks\"k fiN³k oxZ½@MBC",{"$nulls":4},{"$f":"IF(OR($W$60=\"MBC\",$W$60=\"SBC\"),\"YES\",\"\")","v":""}]
[null,"uksV%& Nk=o`fr@iqjLdkj mijksDr p;fur Js.kh ds vk/kj ij gh nh tk;sxhA"]
[]
[null,"16-","ADDRESS ¼fo|kFkhZ dk iw.kZ irk½ %&"]
[null,null,"House No./Street/Place Name ¼edku ua-@xyh ua-@LFkku½ %",{"$nulls":7},{"$f":"VLOOKUP(A467,'Deta From Shala Dar. Class-12'!$A$2:$AE$201,24,0)","v":0}]
[null,null,"Village/Town/City ¼xzke@dLck@'kgj½ %"]
[null,null,"District ¼ftyk½ %",null,null,"………………………….",null,null,"STATE ¼jkT;½ %",null,null,"…………………………………..",{"$nulls":3},"PIN CODE NO. ¼fiu dksM ua-½ %",null,null,"……………………"]
[]
[null,"17-","fo|kFkhZ dk vk/kkj dkMZ uEcj %",{"$nulls":3},{"$f":"VLOOKUP(A467,'Deta From Shala Dar. Class-12'!$A$2:$AE$201,21,0)","v":{"v":0,"d":"0000"}},{"$nulls":3},"tu vk/kkj uEcj %",null,{"$f":"VLOOKUP(A467,'Deta From Shala Dar. Class-12'!$A$2:$AE$201,22,0)","v":0},null,null,"vfHkHkkod dh okf\"kZd vk; %",null,null,{"$f":"VLOOKUP(A467,'Deta From Shala Dar. Class-12'!$A$2:$AE$201,25,0)","v":{"v":0,"d":"₹ 0"}}]
[]
[null,null,"Student/Guardian's Mobile No. ¼fo|kFkhZ@vfHkHkkod dk eksckby uacj½ %",{"$nulls":9},{"$f":"VLOOKUP(A467,'Deta From Shala Dar. Class-12'!$A$2:$AE$201,23,0)","v":0}]
[]
[null,"18-","Previous Academic Details ¼iwoZ 'kS{kf.kd ;ksX;rk½ %",{"$nulls":9},"---------------------------------------------------------"]
[]
[null,"CLASS ¼d{kk½",null,null,"YEAR ¼oxZ½",null,"ROLL NO. ¼ukekad½",null,null,"RESULT ¼ifj.kke½",null,null,"NAME OF SCHOOL/BOARD ¼Ldwy@cksMZ dk uke½"]
[null,"VIII"]
[null,"IX"]
[null,"X"]
[]
[null,"19-","Student's Photo and Signature ¼fo|kFkhZ dk QksVks ,oa gLrk{kj½",{"$nulls":9}," "]
[{"$nulls":10},"Student's Signature ¼fo|kFkhZ ds gLrk{kj½"]
[{"$nulls":3},"PASTE PASSPORT\nSIZE PHOTO"]
[]
[]
[]
[]
[{"$nulls":11}," 'kkyk ç/kku dk çek.khdj.k %&\ngLrk{kj---------------------------------------------------------------"]
[]
[]
[]
[]
[null,"fo|ky; dk uke %&",null,null,{"$f":"Info!$C$7","v":"Govt. Sr. Sec. School Raimalwada"},{"$nulls":6}," 'kkyk dksM %&",null,{"$f":"Info!$C$10","v":1},{"$f":"Info!$D$10","v":7},{"$f":"Info!$E$10","v":0},{"$f":"Info!$F$10","v":1},{"$f":"Info!$G$10","v":7},{"$f":"Info!$H$10","v":5},{"$f":"Info!$I$10","v":1}]
[]
[{"$f":"A467+1","v":7}]
[null,{"$f":"CONCATENATE(Info!$B$7,Info!$C$7)","v":"School Name :-Govt. Sr. Sec. School Raimalwada"}]
[{"$nulls":3},"Board of Secondary Education, Rajasthan",{"$nulls":12},"Sec. (Reg.)"]
[{"$nulls":3}," Ekk/;fed f’k{kk cksMZ] jktLFkku ",{"$nulls":12},"fu;fer ijh{kkFkhZ"]
[null,"ek/;fed ijh{kk",{"$nulls":3},"APPLICATION FORM FOR SENIOR SECONDARY EXAMINATION-2024",{"$nulls":7},{"$f":"Info!$C$10","v":1},{"$f":"Info!$D$10","v":7},{"$f":"Info!$E$10","v":0},{"$f":"Info!$F$10","v":1},{"$f":"Info!$G$10","v":7},{"$f":"Info!$H$10","v":5},{"$f":"Info!$I$10","v":1}]
[{"$nulls":5}," Ikjh{kk vkosnu i= ek/;fed ijh{kk & 2024"]
[{"$nulls":13}," 'kkyk niZ.k Øekad %&",{"$nulls":3},{"$f":"Info!$C$9","v":12345}]
[null,"Scholar Reg. No. ¼LdkWyj jftLVj Øekad½",{"$nulls":5},{"$f":"VLOOKUP(A560,'Deta From Shala Dar. Class-10'!$A$2:$AE$201,4,0)","v":0}]
[null,"1- Student’s Name (fo|kFkhZ dk uke) :",{"$nulls":5},{"$f":"VLOOKUP(A560,'Deta From Shala Dar. Class-10'!$A$2:$AE$201,6,0)","v":0}]
[null,"2- Mother’s Name ¼ekrk dk uke) :",{"$nulls":5},{"$f":"VLOOKUP(A560,'Deta From Shala Dar. Class-10'!$A$2:$AE$201,8,0)","v":0}]
[null,"3- Father’s Name (firk dk uke) :",{"$nulls":5},{"$f":"VLOOKUP(A560,'Deta From Shala Dar. Class-10'!$A$2:$AE$201,9,0)","v":0}]
[null,"4- Date Of Birth (tUe frfFk vadks esa) :",{"$nulls":3},{"$f":"W571","v":"00:00:00"},{"$nulls":16},{"$f":"VLOOKUP(A560,'Deta From Shala Dar. Class-10'!$A$2:$AE$201,11,0)","v":"00:00:00"}]
[null,"In Words (tUe frfFk 'kCnksa esa) :",{"$nulls":5},"……………………………………………………………"]
[null,"5- Category Code (Js.kh dksM) : ¼Js.kh p;u gsrq ihNs fy[ks fo’k\"sk funsZ’k la[;k 1 ns[ks½ Js.kh dk uke %&",{"$nulls":8},"………………………………………………….",{"$nulls":5},"dksM %&"]
[null,"6- Only for Category IV & VI (dsoy Js.kh 4 o 6 ds fy,)"]
[null,"Table - A : Only for category(dsoy Js.kh 1]2 , o 8 ds fy;s) (I)ALL SUBJECTS (1-lEiw.kZ fo\"k;), (II) DIVISION IMPROVEMENT (2-Js.kh lq/kkj) & (VIII) FACULTY CHANGE (8-oxZ ifjorZu)  OPTIONAL SUBJECTS oSdfYid fo\"k;) :"]
[]
[{"$nulls":3},"As Applicable ",{"$nulls":4},"tks ykxw gks½",{"$nulls":3},"1…………………………………………………………………………….."]
[]
[{"$nulls":3},"(IV) ADDITIONAL SUBJECTS CAT",{"$nulls":4},"¼4½ vfrfjDr fo\"k;",{"$nulls":3},"2…………………………………………………3………………………...…………………….."]
[]
[{"$nulls":3},"(VI) MARKS IMPROVEMENT CAT",{"$nulls":4},"¼6½ vad lq/kkj",{"$nulls":3},"4…………………………………………………5………………………...…………………….."]
[]
[]
[null,null,"√","As Applicable from Number 8 to 15 ¼Øekad 8 ls 15 rd tks ykxw gks",{"$nulls":8},"√","djsa½"]
[]
[null,"7-","Third Language ¼r`rh; Hkk\"kk½ (Only for Category I &II) ¼dsoy Js.kh 1 o 2 ds fy,½ ¼fo\"k; p;u gsrq ihNs fy[ks fo’ks\"k funsZ’k \nla[;k 3 ns[ksa½ %&"]
[]
[null,null,"Third Language Opted (p;fur r`rh; Hkk\"kk) fo\"k; dk uke",{"$nulls":8},"dksM"]
[]
[null,"8-","Name of Vocational Trade ¼O;kolkf;d VªsM dk uke½",{"$nulls":6},"………………………………………………………..",{"$nulls":5},"lgh dk fpUg yxk,aA"]
[null,null,"¼dsoy mu 'kkykvksa ds fy, tgka O;kolkf;d f'k{kk lapkfyr gS ,oa ftu fo|kfFkZ;ksa us d{kk 10 rFkk 11 oha esa O;kolkf;d ijh{kk mRrh.kZ dh gSA½"]
[null,null," (1) Automotive (101)",{"$nulls":3},"(2) Beauty & Wellness (102)",{"$nulls":3},"(3) Health Care (103)",{"$nulls":3},"(4) IT & ITES (104)",null,null,"(5) Retail (105)"]
[]
[null,null," (6) Tourism & Hospitality (106)",{"$nulls":4},"(7) Security (107)",null,null,"(8) Apparel Made up Home Furnishing (108) ",{"$nulls":4},"(9) Electronics & Hardware (109)"]
[]
[null,null," (10) Agriculture (110)",{"$nulls":3},"(11) Plumber (111)",{"$nulls":3},"(12) Telecom (112)",{"$nulls":3},"(13) Banking Financial Services & Insurance (113)"]
[]
[null,null," (14) Construction (114)",{"$nulls":3},"(15) Food Processing (115)"]
[]
[null,"9-","Gender ¼fyax½ : (01) Male ¼iq:\"k½",{"$nulls":3},{"$f":"IF(W600=\"F\",\"\",\"Yes\")","v":"Yes"},"(02) FEMALE ¼efgyk½",null,null,{"$f":"IF(AA600=\"F\",\"\",\"Yes\")","v":"Yes"},"Medium ¼ek/;e½ : (01) HINDI ¼fgUnh½",{"$nulls":3},{"$f":"IF(X600=\"Hindi\",\"Yes\",\"\")","v":"Yes"},"(02) ENGLISH ¼vaxzsth½",null,null,{"$f":"IF(X600=\"english\",\"Yes\",\"\")","v":""},null,null,{"$f":"VLOOKUP(A560,'Deta From Shala Dar. Class-10'!$A$2:$AE$201,10,0)","v":0},{"$f":"Info!$C$8","v":"Hindi"}]
[]
[null,"10-","CWSN-1 ¼Hkkx½ : ekufld eanrk (01)",{"$nulls":4},"vkWfVTe (02)",null,null,"lsfjcy iYlh (03)",null,null,"ekufld jksx (04)",null,null,"Jo.k ckf/kr (05)"]
[]
[null,null,"ewd fu'kDrrk (06)",null,null,"LisfLQd yfuZax fMl,fcfyfV (14)",{"$nulls":4},"ckSf)d fu'kDrrk (15)",{"$nulls":3},"efYViy LDysjksfll (16)",null,null,"cgq fu'kDrrk (21)"]
[]
[null,"11-","CWSN-2 ¼Hkkx½ : n`f\"V ckf/kr (07)",{"$nulls":4},"vYi n`f\"V (08)",null,null,"pyu fu'kDrrk(09)",null,null,"dq\"B jksx (10)",null,null,"ckSukiu (11)"]
[]
[null,null,"rStkc fif³r (12)",null,null,"ekalis'kh nqfoZdkl ¼13½",{"$nulls":3},"ikfdZlkal jksx ¼17½",{"$nulls":3},"fgeksfQfy;k ¼18½",null,null,"FkSyslhfe;k ¼19½"]
[]
[null,null,",fufed@fLdy fMtht (20)",{"$nulls":3},"iksfy;ks@uoZ batjh ¼22½",{"$nulls":3},"lw;Zeq[kh ¼23½",{"$nulls":3}," @lSfud ¼24½"]
[]
[null,"12-","BPL ¼chih,y½ %",{"$nulls":4},"1- YES ¼gk¡½",null,{"$f":"IF(W612=\"N\",\"\",\"Yes\")","v":"Yes"},null,null,"2- NO ¼ugha¡½",null,{"$f":"IF(W612=\"Y\",\"\",\"Yes\")","v":"Yes"},{"$nulls":7},{"$f":"VLOOKUP(A560,'Deta From Shala Dar. Class-10'!$A$2:$AE$201,27,0)","v":0}]
[]
[null,"13-","vukFk oxZ %",{"$nulls":4},"1- YES ¼gk¡½",{"$nulls":4},"2- NO ¼ugha¡½"]
[]
[null,"14-","EWS ¼vkfFkZd n`f\"V ls detksj oxZ½ %",{"$nulls":4},"1- YES ¼gk¡½",{"$nulls":4},"2- NO ¼ugha¡½"]
[]
[null,"15-","CASTE ¼tkfr Js.kh½ %",null,null,"¼05½ Gen ¼lkekU;½",null,null,{"$f":"IF($W$60=\"GEN\",\"YES\",\"\")","v":""},"¼06½ MINORITY ¼lkekU;vYi la[;d½",{"$nulls":3},{"$f":"IF($W$60=\"MIN\",\"YES\",\"\")","v":""},"¼07½ SC ¼vuqlwfpr tkfr½",{"$nulls":4},{"$f":"IF($W$60=\"SC\",\"YES\",\"\")","v":""},null,null,{"$f":"VLOOKUP(A560,'Deta From Shala Dar. Class-10'!$A$2:$AE$201,16,0)","v":0}]
[]
[{"$nulls":5},"¼08½ ST ¼vuqlwfpr tutkfr½",null,null,{"$f":"IF($W$60=\"ST\",\"YES\",\"\")","v":""},"¼09½ OBC ¼vU; fiN³k oxZ½",{"$nulls":3},{"$f":"IF($W$60=\"OBC\",\"YES\",\"\")","v":""},"¼10½ Special OBC ¼fo'ks\"k fiN³k oxZ½@MBC",{"$nulls":4},{"$f":"IF(OR($W$60=\"MBC\",$W$60=\"SBC\"),\"YES\",\"\")","v":""}]
[null,"uksV%& Nk=o`fr@iqjLdkj mijksDr p;fur Js.kh ds vk/kj ij gh nh tk;sxhA"]
[]
[null,"16-","ADDRESS ¼fo|kFkhZ dk iw.kZ irk½ %&"]
[null,null,"House No./Street/Place Name ¼edku ua-@xyh ua-@LFkku½ %",{"$nulls":7},{"$f":"VLOOKUP(A560,'Deta From Shala Dar. Class-12'!$A$2:$AE$201,24,0)","v":0}]
[null,null,"Village/Town/City ¼xzke@dLck@'kgj½ %"]
[null,null,"District ¼ftyk½ %",null,null,"………………………….",null,null,"STATE ¼jkT;½ %",null,null,"…………………………………..",{"$nulls":3},"PIN CODE NO. ¼fiu dksM ua-½ %",null,null,"……………………"]
[]
[null,"17-","fo|kFkhZ dk vk/kkj dkMZ uEcj %",{"$nulls":3},{"$f":"VLOOKUP(A560,'Deta From Shala Dar. Class-12'!$A$2:$AE$201,21,0)","v":{"v":0,"d":"0000"}},{"$nulls":3},"tu vk/kkj uEcj %",null,{"$f":"VLOOKUP(A560,'Deta From Shala Dar. Class-12'!$A$2:$AE$201,22,0)","v":0},null,null,"vfHkHkkod dh okf\"kZd vk; %",null,null,{"$f":"VLOOKUP(A560,'Deta From Shala Dar. Class-12'!$A$2:$AE$201,25,0)","v":{"v":0,"d":"₹ 0"}}]
[]
[null,null,"Student/Guardian's Mobile No. ¼fo|kFkhZ@vfHkHkkod dk eksckby uacj½ %",{"$nulls":9},{"$f":"VLOOKUP(A560,'Deta From Shala Dar. Class-12'!$A$2:$AE$201,23,0)","v":0}]
[]
[null,"18-","Previous Academic Details ¼iwoZ 'kS{kf.kd ;ksX;rk½ %",{"$nulls":9},"---------------------------------------------------------"]
[]
[null,"CLASS ¼d{kk½",null,null,"YEAR ¼oxZ½",null,"ROLL NO. ¼ukekad½",null,null,"RESULT ¼ifj.kke½",null,null,"NAME OF SCHOOL/BOARD ¼Ldwy@cksMZ dk uke½"]
[null,"VIII"]
[null,"IX"]
[null,"X"]
[]
[null,"19-","Student's Photo and Signature ¼fo|kFkhZ dk QksVks ,oa gLrk{kj½",{"$nulls":9}," "]
[{"$nulls":10},"Student's Signature ¼fo|kFkhZ ds gLrk{kj½"]
[{"$nulls":3},"PASTE PASSPORT\nSIZE PHOTO"]
[]
[]
[]
[]
[{"$nulls":11}," 'kkyk ç/kku dk çek.khdj.k %&\ngLrk{kj---------------------------------------------------------------"]
[]
[]
[]
[]
[null,"fo|ky; dk uke %&",null,null,{"$f":"Info!$C$7","v":"Govt. Sr. Sec. School Raimalwada"},{"$nulls":6}," 'kkyk dksM %&",null,{"$f":"Info!$C$10","v":1},{"$f":"Info!$D$10","v":7},{"$f":"Info!$E$10","v":0},{"$f":"Info!$F$10","v":1},{"$f":"Info!$G$10","v":7},{"$f":"Info!$H$10","v":5},{"$f":"Info!$I$10","v":1}]
[]
[{"$f":"A560+1","v":8}]
[null,{"$f":"CONCATENATE(Info!$B$7,Info!$C$7)","v":"School Name :-Govt. Sr. Sec. School Raimalwada"}]
[{"$nulls":3},"Board of Secondary Education, Rajasthan",{"$nulls":12},"Sec. (Reg.)"]
[{"$nulls":3}," Ekk/;fed f’k{kk cksMZ] jktLFkku ",{"$nulls":12},"fu;fer ijh{kkFkhZ"]
[null,"ek/;fed ijh{kk",{"$nulls":3},"APPLICATION FORM FOR SENIOR SECONDARY EXAMINATION-2024",{"$nulls":7},{"$f":"Info!$C$10","v":1},{"$f":"Info!$D$10","v":7},{"$f":"Info!$E$10","v":0},{"$f":"Info!$F$10","v":1},{"$f":"Info!$G$10","v":7},{"$f":"Info!$H$10","v":5},{"$f":"Info!$I$10","v":1}]
[{"$nulls":5}," Ikjh{kk vkosnu i= ek/;fed ijh{kk & 2024"]
[{"$nulls":13}," 'kkyk niZ.k Øekad %&",{"$nulls":3},{"$f":"Info!$C$9","v":12345}]
[null,"Scholar Reg. No. ¼LdkWyj jftLVj Øekad½",{"$nulls":5},{"$f":"VLOOKUP(A653,'Deta From Shala Dar. Class-10'!$A$2:$AE$201,4,0)","v":0}]
[null,"1- Student’s Name (fo|kFkhZ dk uke) :",{"$nulls":5},{"$f":"VLOOKUP(A653,'Deta From Shala Dar. Class-10'!$A$2:$AE$201,6,0)","v":0}]
[null,"2- Mother’s Name ¼ekrk dk uke) :",{"$nulls":5},{"$f":"VLOOKUP(A653,'Deta From Shala Dar. Class-10'!$A$2:$AE$201,8,0)","v":0}]
[null,"3- Father’s Name (firk dk uke) :",{"$nulls":5},{"$f":"VLOOKUP(A653,'Deta From Shala Dar. Class-10'!$A$2:$AE$201,9,0)","v":0}]
[null,"4- Date Of Birth (tUe frfFk vadks esa) :",{"$nulls":3},{"$f":"W664","v":"00:00:00"},{"$nulls":16},{"$f":"VLOOKUP(A653,'Deta From Shala Dar. Class-10'!$A$2:$AE$201,11,0)","v":"00:00:00"}]
[null,"In Words (tUe frfFk 'kCnksa esa) :",{"$nulls":5},"……………………………………………………………"]
[null,"5- Category Code (Js.kh dksM) : ¼Js.kh p;u gsrq ihNs fy[ks fo’k\"sk funsZ’k la[;k 1 ns[ks½ Js.kh dk uke %&",{"$nulls":8},"………………………………………………….",{"$nulls":5},"dksM %&"]
[null,"6- Only for Category IV & VI (dsoy Js.kh 4 o 6 ds fy,)"]
[null,"Table - A : Only for category(dsoy Js.kh 1]2 , o 8 ds fy;s) (I)ALL SUBJECTS (1-lEiw.kZ fo\"k;), (II) DIVISION IMPROVEMENT (2-Js.kh lq/kkj) & (VIII) FACULTY CHANGE (8-oxZ ifjorZu)  OPTIONAL SUBJECTS oSdfYid fo\"k;) :"]
[]
[{"$nulls":3},"As Applicable ",{"$nulls":4},"tks ykxw gks½",{"$nulls":3},"1…………………………………………………………………………….."]
[]
[{"$nulls":3},"(IV) ADDITIONAL SUBJECTS CAT",{"$nulls":4},"¼4½ vfrfjDr fo\"k;",{"$nulls":3},"2…………………………………………………3………………………...…………………….."]
[]
[{"$nulls":3},"(VI) MARKS IMPROVEMENT CAT",{"$nulls":4},"¼6½ vad lq/kkj",{"$nulls":3},"4…………………………………………………5………………………...…………………….."]
[]
[]
[null,null,"√","As Applicable from Number 8 to 15 ¼Øekad 8 ls 15 rd tks ykxw gks",{"$nulls":8},"√","djsa½"]
[]
[null,"7-","Third Language ¼r`rh; Hkk\"kk½ (Only for Category I &II) ¼dsoy Js.kh 1 o 2 ds fy,½ ¼fo\"k; p;u gsrq ihNs fy[ks fo’ks\"k funsZ’k \nla[;k 3 ns[ksa½ %&"]
[]
[null,null,"Third Language Opted (p;fur r`rh; Hkk\"kk) fo\"k; dk uke",{"$nulls":8},"dksM"]
[]
[null,"8-","Name of Vocational Trade ¼O;kolkf;d VªsM dk uke½",{"$nulls":6},"………………………………………………………..",{"$nulls":5},"lgh dk fpUg yxk,aA"]
[null,null,"¼dsoy mu 'kkykvksa ds fy, tgka O;kolkf;d f'k{kk lapkfyr gS ,oa ftu fo|kfFkZ;ksa us d{kk 10 rFkk 11 oha esa O;kolkf;d ijh{kk mRrh.kZ dh gSA½"]
[null,null," (1) Automotive (101)",{"$nulls":3},"(2) Beauty & Wellness (102)",{"$nulls":3},"(3) Health Care (103)",{"$nulls":3},"(4) IT & ITES (104)",null,null,"(5) Retail (105)"]
[]
[null,null," (6) Tourism & Hospitality (106)",{"$nulls":4},"(7) Security (107)",null,null,"(8) Apparel Made up Home Furnishing (108) ",{"$nulls":4},"(9) Electronics & Hardware (109)"]
[]
[null,null," (10) Agriculture (110)",{"$nulls":3},"(11) Plumber (111)",{"$nulls":3},"(12) Telecom (112)",{"$nulls":3},"(13) Banking Financial Services & Insurance (113)"]
[]
[null,null," (14) Construction (114)",{"$nulls":3},"(15) Food Processing (115)"]
[]
[null,"9-","Gender ¼fyax½ : (01) Male ¼iq:\"k½",{"$nulls":3},{"$f":"IF(W693=\"F\",\"\",\"Yes\")","v":"Yes"},"(02) FEMALE ¼efgyk½",null,null,{"$f":"IF(AA693=\"F\",\"\",\"Yes\")","v":"Yes"},"Medium ¼ek/;e½ : (01) HINDI ¼fgUnh½",{"$nulls":3},{"$f":"IF(X693=\"Hindi\",\"Yes\",\"\")","v":"Yes"},"(02) ENGLISH ¼vaxzsth½",null,null,{"$f":"IF(X693=\"english\",\"Yes\",\"\")","v":""},null,null,{"$f":"VLOOKUP(A653,'Deta From Shala Dar. Class-10'!$A$2:$AE$201,10,0)","v":0},{"$f":"Info!$C$8","v":"Hindi"}]
[]
[null,"10-","CWSN-1 ¼Hkkx½ : ekufld eanrk (01)",{"$nulls":4},"vkWfVTe (02)",null,null,"lsfjcy iYlh (03)",null,null,"ekufld jksx (04)",null,null,"Jo.k ckf/kr (05)"]
[]
[null,null,"ewd fu'kDrrk (06)",null,null,"LisfLQd yfuZax fMl,fcfyfV (14)",{"$nulls":4},"ckSf)d fu'kDrrk (15)",{"$nulls":3},"efYViy LDysjksfll (16)",null,null,"cgq fu'kDrrk (21)"]
[]
[null,"11-","CWSN-2 ¼Hkkx½ : n`f\"V ckf/kr (07)",{"$nulls":4},"vYi n`f\"V (08)",null,null,"pyu fu'kDrrk(09)",null,null,"dq\"B jksx (10)",null,null,"ckSukiu (11)"]
[]
[null,null,"rStkc fif³r (12)",null,null,"ekalis'kh nqfoZdkl ¼13½",{"$nulls":3},"ikfdZlkal jksx ¼17½",{"$nulls":3},"fgeksfQfy;k ¼18½",null,null,"FkSyslhfe;k ¼19½"]
[]
[null,null,",fufed@fLdy fMtht (20)",{"$nulls":3},"iksfy;ks@uoZ batjh ¼22½",{"$nulls":3},"lw;Zeq[kh ¼23½",{"$nulls":3}," @lSfud ¼24½"]
[]
[null,"12-","BPL ¼chih,y½ %",{"$nulls":4},"1- YES ¼gk¡½",null,{"$f":"IF(W705=\"N\",\"\",\"Yes\")","v":"Yes"},null,null,"2- NO ¼ugha¡½",null,{"$f":"IF(W705=\"Y\",\"\",\"Yes\")","v":"Yes"},{"$nulls":7},{"$f":"VLOOKUP(A653,'Deta From Shala Dar. Class-10'!$A$2:$AE$201,27,0)","v":0}]
[]
[null,"13-","vukFk oxZ %",{"$nulls":4},"1- YES ¼gk¡½",{"$nulls":4},"2- NO ¼ugha¡½"]
[]
[null,"14-","EWS ¼vkfFkZd n`f\"V ls detksj oxZ½ %",{"$nulls":4},"1- YES ¼gk¡½",{"$nulls":4},"2- NO ¼ugha¡½"]
[]
[null,"15-","CASTE ¼tkfr Js.kh½ %",null,null,"¼05½ Gen ¼lkekU;½",null,null,{"$f":"IF($W$60=\"GEN\",\"YES\",\"\")","v":""},"¼06½ MINORITY ¼lkekU;vYi la[;d½",{"$nulls":3},{"$f":"IF($W$60=\"MIN\",\"YES\",\"\")","v":""},"¼07½ SC ¼vuqlwfpr tkfr½",{"$nulls":4},{"$f":"IF($W$60=\"SC\",\"YES\",\"\")","v":""},null,null,{"$f":"VLOOKUP(A653,'Deta From Shala Dar. Class-10'!$A$2:$AE$201,16,0)","v":0}]
[]
[{"$nulls":5},"¼08½ ST ¼vuqlwfpr tutkfr½",null,null,{"$f":"IF($W$60=\"ST\",\"YES\",\"\")","v":""},"¼09½ OBC ¼vU; fiN³k oxZ½",{"$nulls":3},{"$f":"IF($W$60=\"OBC\",\"YES\",\"\")","v":""},"¼10½ Special OBC ¼fo'ks\"k fiN³k oxZ½@MBC",{"$nulls":4},{"$f":"IF(OR($W$60=\"MBC\",$W$60=\"SBC\"),\"YES\",\"\")","v":""}]
[null,"uksV%& Nk=o`fr@iqjLdkj mijksDr p;fur Js.kh ds vk/kj ij gh nh tk;sxhA"]
[]
[null,"16-","ADDRESS ¼fo|kFkhZ dk iw.kZ irk½ %&"]
[null,null,"House No./Street/Place Name ¼edku ua-@xyh ua-@LFkku½ %",{"$nulls":7},{"$f":"VLOOKUP(A653,'Deta From Shala Dar. Class-12'!$A$2:$AE$201,24,0)","v":0}]
[null,null,"Village/Town/City ¼xzke@dLck@'kgj½ %"]
[null,null,"District ¼ftyk½ %",null,null,"………………………….",null,null,"STATE ¼jkT;½ %",null,null,"…………………………………..",{"$nulls":3},"PIN CODE NO. ¼fiu dksM ua-½ %",null,null,"……………………"]
[]
[null,"17-","fo|kFkhZ dk vk/kkj dkMZ uEcj %",{"$nulls":3},{"$f":"VLOOKUP(A653,'Deta From Shala Dar. Class-12'!$A$2:$AE$201,21,0)","v":{"v":0,"d":"0000"}},{"$nulls":3},"tu vk/kkj uEcj %",null,{"$f":"VLOOKUP(A653,'Deta From Shala Dar. Class-12'!$A$2:$AE$201,22,0)","v":0},null,null,"vfHkHkkod dh okf\"kZd vk; %",null,null,{"$f":"VLOOKUP(A653,'Deta From Shala Dar. Class-12'!$A$2:$AE$201,25,0)","v":{"v":0,"d":"₹ 0"}}]
[]
[null,null,"Student/Guardian's Mobile No. ¼fo|kFkhZ@vfHkHkkod dk eksckby uacj½ %",{"$nulls":9},{"$f":"VLOOKUP(A653,'Deta From Shala Dar. Class-12'!$A$2:$AE$201,23,0)","v":0}]
[]
[null,"18-","Previous Academic Details ¼iwoZ 'kS{kf.kd ;ksX;rk½ %",{"$nulls":9},"---------------------------------------------------------"]
[]
[null,"CLASS ¼d{kk½",null,null,"YEAR ¼oxZ½",null,"ROLL NO. ¼ukekad½",null,null,"RESULT ¼ifj.kke½",null,null,"NAME OF SCHOOL/BOARD ¼Ldwy@cksMZ dk uke½"]
[null,"VIII"]
[null,"IX"]
[null,"X"]
[]
[null,"19-","Student's Photo and Signature ¼fo|kFkhZ dk QksVks ,oa gLrk{kj½",{"$nulls":9}," "]
[{"$nulls":10},"Student's Signature ¼fo|kFkhZ ds gLrk{kj½"]
[{"$nulls":3},"PASTE PASSPORT\nSIZE PHOTO"]
[]
[]
[]
[]
[{"$nulls":11}," 'kkyk ç/kku dk çek.khdj.k %&\ngLrk{kj---------------------------------------------------------------"]
[]
[]
[]
[]
[null,"fo|ky; dk uke %&",null,null,{"$f":"Info!$C$7","v":"Govt. Sr. Sec. School Raimalwada"},{"$nulls":6}," 'kkyk dksM %&",null,{"$f":"Info!$C$10","v":1},{"$f":"Info!$D$10","v":7},{"$f":"Info!$E$10","v":0},{"$f":"Info!$F$10","v":1},{"$f":"Info!$G$10","v":7},{"$f":"Info!$H$10","v":5},{"$f":"Info!$I$10","v":1}]
[]
[{"$f":"A653+1","v":9}]
[null,{"$f":"CONCATENATE(Info!$B$7,Info!$C$7)","v":"School Name :-Govt. Sr. Sec. School Raimalwada"}]
[{"$nulls":3},"Board of Secondary Education, Rajasthan",{"$nulls":12},"Sec. (Reg.)"]
[{"$nulls":3}," Ekk/;fed f’k{kk cksMZ] jktLFkku ",{"$nulls":12},"fu;fer ijh{kkFkhZ"]
[null,"ek/;fed ijh{kk",{"$nulls":3},"APPLICATION FORM FOR SENIOR SECONDARY EXAMINATION-2024",{"$nulls":7},{"$f":"Info!$C$10","v":1},{"$f":"Info!$D$10","v":7},{"$f":"Info!$E$10","v":0},{"$f":"Info!$F$10","v":1},{"$f":"Info!$G$10","v":7},{"$f":"Info!$H$10","v":5},{"$f":"Info!$I$10","v":1}]
[{"$nulls":5}," Ikjh{kk vkosnu i= ek/;fed ijh{kk & 2024"]
[{"$nulls":13}," 'kkyk niZ.k Øekad %&",{"$nulls":3},{"$f":"Info!$C$9","v":12345}]
[null,"Scholar Reg. No. ¼LdkWyj jftLVj Øekad½",{"$nulls":5},{"$f":"VLOOKUP(A746,'Deta From Shala Dar. Class-10'!$A$2:$AE$201,4,0)","v":0}]
[null,"1- Student’s Name (fo|kFkhZ dk uke) :",{"$nulls":5},{"$f":"VLOOKUP(A746,'Deta From Shala Dar. Class-10'!$A$2:$AE$201,6,0)","v":0}]
[null,"2- Mother’s Name ¼ekrk dk uke) :",{"$nulls":5},{"$f":"VLOOKUP(A746,'Deta From Shala Dar. Class-10'!$A$2:$AE$201,8,0)","v":0}]
[null,"3- Father’s Name (firk dk uke) :",{"$nulls":5},{"$f":"VLOOKUP(A746,'Deta From Shala Dar. Class-10'!$A$2:$AE$201,9,0)","v":0}]
[null,"4- Date Of Birth (tUe frfFk vadks esa) :",{"$nulls":3},{"$f":"W757","v":"00:00:00"},{"$nulls":16},{"$f":"VLOOKUP(A746,'Deta From Shala Dar. Class-10'!$A$2:$AE$201,11,0)","v":"00:00:00"}]
[null,"In Words (tUe frfFk 'kCnksa esa) :",{"$nulls":5},"……………………………………………………………"]
[null,"5- Category Code (Js.kh dksM) : ¼Js.kh p;u gsrq ihNs fy[ks fo’k\"sk funsZ’k la[;k 1 ns[ks½ Js.kh dk uke %&",{"$nulls":8},"………………………………………………….",{"$nulls":5},"dksM %&"]
[null,"6- Only for Category IV & VI (dsoy Js.kh 4 o 6 ds fy,)"]
[null,"Table - A : Only for category(dsoy Js.kh 1]2 , o 8 ds fy;s) (I)ALL SUBJECTS (1-lEiw.kZ fo\"k;), (II) DIVISION IMPROVEMENT (2-Js.kh lq/kkj) & (VIII) FACULTY CHANGE (8-oxZ ifjorZu)  OPTIONAL SUBJECTS oSdfYid fo\"k;) :"]
[]
[{"$nulls":3},"As Applicable ",{"$nulls":4},"tks ykxw gks½",{"$nulls":3},"1…………………………………………………………………………….."]
[]
[{"$nulls":3},"(IV) ADDITIONAL SUBJECTS CAT",{"$nulls":4},"¼4½ vfrfjDr fo\"k;",{"$nulls":3},"2…………………………………………………3………………………...…………………….."]
[]
[{"$nulls":3},"(VI) MARKS IMPROVEMENT CAT",{"$nulls":4},"¼6½ vad lq/kkj",{"$nulls":3},"4…………………………………………………5………………………...…………………….."]
[]
[]
[null,null,"√","As Applicable from Number 8 to 15 ¼Øekad 8 ls 15 rd tks ykxw gks",{"$nulls":8},"√","djsa½"]
[]
[null,"7-","Third Language ¼r`rh; Hkk\"kk½ (Only for Category I &II) ¼dsoy Js.kh 1 o 2 ds fy,½ ¼fo\"k; p;u gsrq ihNs fy[ks fo’ks\"k funsZ’k \nla[;k 3 ns[ksa½ %&"]
[]
[null,null,"Third Language Opted (p;fur r`rh; Hkk\"kk) fo\"k; dk uke",{"$nulls":8},"dksM"]
[]
[null,"8-","Name of Vocational Trade ¼O;kolkf;d VªsM dk uke½",{"$nulls":6},"………………………………………………………..",{"$nulls":5},"lgh dk fpUg yxk,aA"]
[null,null,"¼dsoy mu 'kkykvksa ds fy, tgka O;kolkf;d f'k{kk lapkfyr gS ,oa ftu fo|kfFkZ;ksa us d{kk 10 rFkk 11 oha esa O;kolkf;d ijh{kk mRrh.kZ dh gSA½"]
[null,null," (1) Automotive (101)",{"$nulls":3},"(2) Beauty & Wellness (102)",{"$nulls":3},"(3) Health Care (103)",{"$nulls":3},"(4) IT & ITES (104)",null,null,"(5) Retail (105)"]
[]
[null,null," (6) Tourism & Hospitality (106)",{"$nulls":4},"(7) Security (107)",null,null,"(8) Apparel Made up Home Furnishing (108) ",{"$nulls":4},"(9) Electronics & Hardware (109)"]
[]
[null,null," (10) Agriculture (110)",{"$nulls":3},"(11) Plumber (111)",{"$nulls":3},"(12) Telecom (112)",{"$nulls":3},"(13) Banking Financial Services & Insurance (113)"]
[]
[null,null," (14) Construction (114)",{"$nulls":3},"(15) Food Processing (115)"]
[]
[null,"9-","Gender ¼fyax½ : (01) Male ¼iq:\"k½",{"$nulls":3},{"$f":"IF(W786=\"F\",\"\",\"Yes\")","v":"Yes"},"(02) FEMALE ¼efgyk½",null,null,{"$f":"IF(AA786=\"F\",\"\",\"Yes\")","v":"Yes"},"Medium ¼ek/;e½ : (01) HINDI ¼fgUnh½",{"$nulls":3},{"$f":"IF(X786=\"Hindi\",\"Yes\",\"\")","v":"Yes"},"(02) ENGLISH ¼vaxzsth½",null,null,{"$f":"IF(X786=\"english\",\"Yes\",\"\")","v":""},null,null,{"$f":"VLOOKUP(A746,'Deta From Shala Dar. Class-10'!$A$2:$AE$201,10,0)","v":0},{"$f":"Info!$C$8","v":"Hindi"}]
[]
[null,"10-","CWSN-1 ¼Hkkx½ : ekufld eanrk (01)",{"$nulls":4},"vkWfVTe (02)",null,null,"lsfjcy iYlh (03)",null,null,"ekufld jksx (04)",null,null,"Jo.k ckf/kr (05)"]
[]
[null,null,"ewd fu'kDrrk (06)",null,null,"LisfLQd yfuZax fMl,fcfyfV (14)",{"$nulls":4},"ckSf)d fu'kDrrk (15)",{"$nulls":3},"efYViy LDysjksfll (16)",null,null,"cgq fu'kDrrk (21)"]
[]
[null,"11-","CWSN-2 ¼Hkkx½ : n`f\"V ckf/kr (07)",{"$nulls":4},"vYi n`f\"V (08)",null,null,"pyu fu'kDrrk(09)",null,null,"dq\"B jksx (10)",null,null,"ckSukiu (11)"]
[]
[null,null,"rStkc fif³r (12)",null,null,"ekalis'kh nqfoZdkl ¼13½",{"$nulls":3},"ikfdZlkal jksx ¼17½",{"$nulls":3},"fgeksfQfy;k ¼18½",null,null,"FkSyslhfe;k ¼19½"]
[]
[null,null,",fufed@fLdy fMtht (20)",{"$nulls":3},"iksfy;ks@uoZ batjh ¼22½",{"$nulls":3},"lw;Zeq[kh ¼23½",{"$nulls":3}," @lSfud ¼24½"]
[]
[null,"12-","BPL ¼chih,y½ %",{"$nulls":4},"1- YES ¼gk¡½",null,{"$f":"IF(W798=\"N\",\"\",\"Yes\")","v":"Yes"},null,null,"2- NO ¼ugha¡½",null,{"$f":"IF(W798=\"Y\",\"\",\"Yes\")","v":"Yes"},{"$nulls":7},{"$f":"VLOOKUP(A746,'Deta From Shala Dar. Class-10'!$A$2:$AE$201,27,0)","v":0}]
[]
[null,"13-","vukFk oxZ %",{"$nulls":4},"1- YES ¼gk¡½",{"$nulls":4},"2- NO ¼ugha¡½"]
[]
[null,"14-","EWS ¼vkfFkZd n`f\"V ls detksj oxZ½ %",{"$nulls":4},"1- YES ¼gk¡½",{"$nulls":4},"2- NO ¼ugha¡½"]
[]
[null,"15-","CASTE ¼tkfr Js.kh½ %",null,null,"¼05½ Gen ¼lkekU;½",null,null,{"$f":"IF($W$60=\"GEN\",\"YES\",\"\")","v":""},"¼06½ MINORITY ¼lkekU;vYi la[;d½",{"$nulls":3},{"$f":"IF($W$60=\"MIN\",\"YES\",\"\")","v":""},"¼07½ SC ¼vuqlwfpr tkfr½",{"$nulls":4},{"$f":"IF($W$60=\"SC\",\"YES\",\"\")","v":""},null,null,{"$f":"VLOOKUP(A746,'Deta From Shala Dar. Class-10'!$A$2:$AE$201,16,0)","v":0}]
[]
[{"$nulls":5},"¼08½ ST ¼vuqlwfpr tutkfr½",null,null,{"$f":"IF($W$60=\"ST\",\"YES\",\"\")","v":""},"¼09½ OBC ¼vU; fiN³k oxZ½",{"$nulls":3},{"$f":"IF($W$60=\"OBC\",\"YES\",\"\")","v":""},"¼10½ Special OBC ¼fo'ks\"k fiN³k oxZ½@MBC",{"$nulls":4},{"$f":"IF(OR($W$60=\"MBC\",$W$60=\"SBC\"),\"YES\",\"\")","v":""}]
[null,"uksV%& Nk=o`fr@iqjLdkj mijksDr p;fur Js.kh ds vk/kj ij gh nh tk;sxhA"]
[]
[null,"16-","ADDRESS ¼fo|kFkhZ dk iw.kZ irk½ %&"]
[null,null,"House No./Street/Place Name ¼edku ua-@xyh ua-@LFkku½ %",{"$nulls":7},{"$f":"VLOOKUP(A746,'Deta From Shala Dar. Class-12'!$A$2:$AE$201,24,0)","v":0}]
[null,null,"Village/Town/City ¼xzke@dLck@'kgj½ %"]
[null,null,"District ¼ftyk½ %",null,null,"………………………….",null,null,"STATE ¼jkT;½ %",null,null,"…………………………………..",{"$nulls":3},"PIN CODE NO. ¼fiu dksM ua-½ %",null,null,"……………………"]
[]
[null,"17-","fo|kFkhZ dk vk/kkj dkMZ uEcj %",{"$nulls":3},{"$f":"VLOOKUP(A746,'Deta From Shala Dar. Class-12'!$A$2:$AE$201,21,0)","v":{"v":0,"d":"0000"}},{"$nulls":3},"tu vk/kkj uEcj %",null,{"$f":"VLOOKUP(A746,'Deta From Shala Dar. Class-12'!$A$2:$AE$201,22,0)","v":0},null,null,"vfHkHkkod dh okf\"kZd vk; %",null,null,{"$f":"VLOOKUP(A746,'Deta From Shala Dar. Class-12'!$A$2:$AE$201,25,0)","v":{"v":0,"d":"₹ 0"}}]
[]
[null,null,"Student/Guardian's Mobile No. ¼fo|kFkhZ@vfHkHkkod dk eksckby uacj½ %",{"$nulls":9},{"$f":"VLOOKUP(A746,'Deta From Shala Dar. Class-12'!$A$2:$AE$201,23,0)","v":0}]
[]
[null,"18-","Previous Academic Details ¼iwoZ 'kS{kf.kd ;ksX;rk½ %",{"$nulls":9},"---------------------------------------------------------"]
[]
[null,"CLASS ¼d{kk½",null,null,"YEAR ¼oxZ½",null,"ROLL NO. ¼ukekad½",null,null,"RESULT ¼ifj.kke½",null,null,"NAME OF SCHOOL/BOARD ¼Ldwy@cksMZ dk uke½"]
[null,"VIII"]
[null,"IX"]
[null,"X"]
[]
[null,"19-","Student's Photo and Signature ¼fo|kFkhZ dk QksVks ,oa gLrk{kj½",{"$nulls":9}," "]
[{"$nulls":10},"Student's Signature ¼fo|kFkhZ ds gLrk{kj½"]
[{"$nulls":3},"PASTE PASSPORT\nSIZE PHOTO"]
[]
[]
[]
[]
[{"$nulls":11}," 'kkyk ç/kku dk çek.khdj.k %&\ngLrk{kj---------------------------------------------------------------"]
[]
[]
[]
[]
[null,"fo|ky; dk uke %&",null,null,{"$f":"Info!$C$7","v":"Govt. Sr. Sec. School Raimalwada"},{"$nulls":6}," 'kkyk dksM %&",null,{"$f":"Info!$C$10","v":1},{"$f":"Info!$D$10","v":7},{"$f":"Info!$E$10","v":0},{"$f":"Info!$F$10","v":1},{"$f":"Info!$G$10","v":7},{"$f":"Info!$H$10","v":5},{"$f":"Info!$I$10","v":1}]
[]
[{"$f":"A746+1","v":10}]
[null,{"$f":"CONCATENATE(Info!$B$7,Info!$C$7)","v":"School Name :-Govt. Sr. Sec. School Raimalwada"}]
[{"$nulls":3},"Board of Secondary Education, Rajasthan",{"$nulls":12},"Sec. (Reg.)"]
[{"$nulls":3}," Ekk/;fed f’k{kk cksMZ] jktLFkku ",{"$nulls":12},"fu;fer ijh{kkFkhZ"]
[null,"ek/;fed ijh{kk",{"$nulls":3},"APPLICATION FORM FOR SENIOR SECONDARY EXAMINATION-2024",{"$nulls":7},{"$f":"Info!$C$10","v":1},{"$f":"Info!$D$10","v":7},{"$f":"Info!$E$10","v":0},{"$f":"Info!$F$10","v":1},{"$f":"Info!$G$10","v":7},{"$f":"Info!$H$10","v":5},{"$f":"Info!$I$10","v":1}]
[{"$nulls":5}," Ikjh{kk vkosnu i= ek/;fed ijh{kk & 2024"]
[{"$nulls":13}," 'kkyk niZ.k Øekad %&",{"$nulls":3},{"$f":"Info!$C$9","v":12345}]
[null,"Scholar Reg. No. ¼LdkWyj jftLVj Øekad½",{"$nulls":5},{"$f":"VLOOKUP(A839,'Deta From Shala Dar. Class-10'!$A$2:$AE$201,4,0)","v":0}]
[null,"1- Student’s Name (fo|kFkhZ dk uke) :",{"$nulls":5},{"$f":"VLOOKUP(A839,'Deta From Shala Dar. Class-10'!$A$2:$AE$201,6,0)","v":0}]
[null,"2- Mother’s Name ¼ekrk dk uke) :",{"$nulls":5},{"$f":"VLOOKUP(A839,'Deta From Shala Dar. Class-10'!$A$2:$AE$201,8,0)","v":0}]
[null,"3- Father’s Name (firk dk uke) :",{"$nulls":5},{"$f":"VLOOKUP(A839,'Deta From Shala Dar. Class-10'!$A$2:$AE$201,9,0)","v":0}]
[null,"4- Date Of Birth (tUe frfFk vadks esa) :",{"$nulls":3},{"$f":"W850","v":"00:00:00"},{"$nulls":16},{"$f":"VLOOKUP(A839,'Deta From Shala Dar. Class-10'!$A$2:$AE$201,11,0)","v":"00:00:00"}]
[null,"In Words (tUe frfFk 'kCnksa esa) :",{"$nulls":5},"……………………………………………………………"]
[null,"5- Category Code (Js.kh dksM) : ¼Js.kh p;u gsrq ihNs fy[ks fo’k\"sk funsZ’k la[;k 1 ns[ks½ Js.kh dk uke %&",{"$nulls":8},"………………………………………………….",{"$nulls":5},"dksM %&"]
[null,"6- Only for Category IV & VI (dsoy Js.kh 4 o 6 ds fy,)"]
[null,"Table - A : Only for category(dsoy Js.kh 1]2 , o 8 ds fy;s) (I)ALL SUBJECTS (1-lEiw.kZ fo\"k;), (II) DIVISION IMPROVEMENT (2-Js.kh lq/kkj) & (VIII) FACULTY CHANGE (8-oxZ ifjorZu)  OPTIONAL SUBJECTS oSdfYid fo\"k;) :"]
[]
[{"$nulls":3},"As Applicable ",{"$nulls":4},"tks ykxw gks½",{"$nulls":3},"1…………………………………………………………………………….."]
[]
[{"$nulls":3},"(IV) ADDITIONAL SUBJECTS CAT",{"$nulls":4},"¼4½ vfrfjDr fo\"k;",{"$nulls":3},"2…………………………………………………3………………………...…………………….."]
[]
[{"$nulls":3},"(VI) MARKS IMPROVEMENT CAT",{"$nulls":4},"¼6½ vad lq/kkj",{"$nulls":3},"4…………………………………………………5………………………...…………………….."]
[]
[]
[null,null,"√","As Applicable from Number 8 to 15 ¼Øekad 8 ls 15 rd tks ykxw gks",{"$nulls":8},"√","djsa½"]
[]
[null,"7-","Third Language ¼r`rh; Hkk\"kk½ (Only for Category I &II) ¼dsoy Js.kh 1 o 2 ds fy,½ ¼fo\"k; p;u gsrq ihNs fy[ks fo’ks\"k funsZ’k \nla[;k 3 ns[ksa½ %&"]
[]
[null,null,"Third Language Opted (p;fur r`rh; Hkk\"kk) fo\"k; dk uke",{"$nulls":8},"dksM"]
[]
[null,"8-","Name of Vocational Trade ¼O;kolkf;d VªsM dk uke½",{"$nulls":6},"………………………………………………………..",{"$nulls":5},"lgh dk fpUg yxk,aA"]
[null,null,"¼dsoy mu 'kkykvksa ds fy, tgka O;kolkf;d f'k{kk lapkfyr gS ,oa ftu fo|kfFkZ;ksa us d{kk 10 rFkk 11 oha esa O;kolkf;d ijh{kk mRrh.kZ dh gSA½"]
[null,null," (1) Automotive (101)",{"$nulls":3},"(2) Beauty & Wellness (102)",{"$nulls":3},"(3) Health Care (103)",{"$nulls":3},"(4) IT & ITES (104)",null,null,"(5) Retail (105)"]
[]
[null,null," (6) Tourism & Hospitality (106)",{"$nulls":4},"(7) Security (107)",null,null,"(8) Apparel Made up Home Furnishing (108) ",{"$nulls":4},"(9) Electronics & Hardware (109)"]
[]
[null,null," (10) Agriculture (110)",{"$nulls":3},"(11) Plumber (111)",{"$nulls":3},"(12) Telecom (112)",{"$nulls":3},"(13) Banking Financial Services & Insurance (113)"]
[]
[null,null," (14) Construction (114)",{"$nulls":3},"(15) Food Processing (115)"]
[]
[null,"9-","Gender ¼fyax½ : (01) Male ¼iq:\"k½",{"$nulls":3},{"$f":"IF(W879=\"F\",\"\",\"Yes\")","v":"Yes"},"(02) FEMALE ¼efgyk½",null,null,{"$f":"IF(AA879=\"F\",\"\",\"Yes\")","v":"Yes"},"Medium ¼ek/;e½ : (01) HINDI ¼fgUnh½",{"$nulls":3},{"$f":"IF(X879=\"Hindi\",\"Yes\",\"\")","v":"Yes"},"(02) ENGLISH ¼vaxzsth½",null,null,{"$f":"IF(X879=\"english\",\"Yes\",\"\")","v":""},null,null,{"$f":"VLOOKUP(A839,'Deta From Shala Dar. Class-10'!$A$2:$AE$201,10,0)","v":0},{"$f":"Info!$C$8","v":"Hindi"}]
[]
[null,"10-","CWSN-1 ¼Hkkx½ : ekufld eanrk (01)",{"$nulls":4},"vkWfVTe (02)",null,null,"lsfjcy iYlh (03)",null,null,"ekufld jksx (04)",null,null,"Jo.k ckf/kr (05)"]
[]
[null,null,"ewd fu'kDrrk (06)",null,null,"LisfLQd yfuZax fMl,fcfyfV (14)",{"$nulls":4},"ckSf)d fu'kDrrk (15)",{"$nulls":3},"efYViy LDysjksfll (16)",null,null,"cgq fu'kDrrk (21)"]
[]
[null,"11-","CWSN-2 ¼Hkkx½ : n`f\"V ckf/kr (07)",{"$nulls":4},"vYi n`f\"V (08)",null,null,"pyu fu'kDrrk(09)",null,null,"dq\"B jksx (10)",null,null,"ckSukiu (11)"]
[]
[null,null,"rStkc fif³r (12)",null,null,"ekalis'kh nqfoZdkl ¼13½",{"$nulls":3},"ikfdZlkal jksx ¼17½",{"$nulls":3},"fgeksfQfy;k ¼18½",null,null,"FkSyslhfe;k ¼19½"]
[]
[null,null,",fufed@fLdy fMtht (20)",{"$nulls":3},"iksfy;ks@uoZ batjh ¼22½",{"$nulls":3},"lw;Zeq[kh ¼23½",{"$nulls":3}," @lSfud ¼24½"]
[]
[null,"12-","BPL ¼chih,y½ %",{"$nulls":4},"1- YES ¼gk¡½",null,{"$f":"IF(W891=\"N\",\"\",\"Yes\")","v":"Yes"},null,null,"2- NO ¼ugha¡½",null,{"$f":"IF(W891=\"Y\",\"\",\"Yes\")","v":"Yes"},{"$nulls":7},{"$f":"VLOOKUP(A839,'Deta From Shala Dar. Class-10'!$A$2:$AE$201,27,0)","v":0}]
[]
[null,"13-","vukFk oxZ %",{"$nulls":4},"1- YES ¼gk¡½",{"$nulls":4},"2- NO ¼ugha¡½"]
[]
[null,"14-","EWS ¼vkfFkZd n`f\"V ls detksj oxZ½ %",{"$nulls":4},"1- YES ¼gk¡½",{"$nulls":4},"2- NO ¼ugha¡½"]
[]
[null,"15-","CASTE ¼tkfr Js.kh½ %",null,null,"¼05½ Gen ¼lkekU;½",null,null,{"$f":"IF($W$60=\"GEN\",\"YES\",\"\")","v":""},"¼06½ MINORITY ¼lkekU;vYi la[;d½",{"$nulls":3},{"$f":"IF($W$60=\"MIN\",\"YES\",\"\")","v":""},"¼07½ SC ¼vuqlwfpr tkfr½",{"$nulls":4},{"$f":"IF($W$60=\"SC\",\"YES\",\"\")","v":""},null,null,{"$f":"VLOOKUP(A839,'Deta From Shala Dar. Class-10'!$A$2:$AE$201,16,0)","v":0}]
[]
[{"$nulls":5},"¼08½ ST ¼vuqlwfpr tutkfr½",null,null,{"$f":"IF($W$60=\"ST\",\"YES\",\"\")","v":""},"¼09½ OBC ¼vU; fiN³k oxZ½",{"$nulls":3},{"$f":"IF($W$60=\"OBC\",\"YES\",\"\")","v":""},"¼10½ Special OBC ¼fo'ks\"k fiN³k oxZ½@MBC",{"$nulls":4},{"$f":"IF(OR($W$60=\"MBC\",$W$60=\"SBC\"),\"YES\",\"\")","v":""}]
[null,"uksV%& Nk=o`fr@iqjLdkj mijksDr p;fur Js.kh ds vk/kj ij gh nh tk;sxhA"]
[]
[null,"16-","ADDRESS ¼fo|kFkhZ dk iw.kZ irk½ %&"]
[null,null,"House No./Street/Place Name ¼edku ua-@xyh ua-@LFkku½ %",{"$nulls":7},{"$f":"VLOOKUP(A839,'Deta From Shala Dar. Class-12'!$A$2:$AE$201,24,0)","v":0}]
[null,null,"Village/Town/City ¼xzke@dLck@'kgj½ %"]
[null,null,"District ¼ftyk½ %",null,null,"………………………….",null,null,"STATE ¼jkT;½ %",null,null,"…………………………………..",{"$nulls":3},"PIN CODE NO. ¼fiu dksM ua-½ %",null,null,"……………………"]
[]
[null,"17-","fo|kFkhZ dk vk/kkj dkMZ uEcj %",{"$nulls":3},{"$f":"VLOOKUP(A839,'Deta From Shala Dar. Class-12'!$A$2:$AE$201,21,0)","v":{"v":0,"d":"0000"}},{"$nulls":3},"tu vk/kkj uEcj %",null,{"$f":"VLOOKUP(A839,'Deta From Shala Dar. Class-12'!$A$2:$AE$201,22,0)","v":0},null,null,"vfHkHkkod dh okf\"kZd vk; %",null,null,{"$f":"VLOOKUP(A839,'Deta From Shala Dar. Class-12'!$A$2:$AE$201,25,0)","v":{"v":0,"d":"₹ 0"}}]
[]
[null,null,"Student/Guardian's Mobile No. ¼fo|kFkhZ@vfHkHkkod dk eksckby uacj½ %",{"$nulls":9},{"$f":"VLOOKUP(A839,'Deta From Shala Dar. Class-12'!$A$2:$AE$201,23,0)","v":0}]
[]
[null,"18-","Previous Academic Details ¼iwoZ 'kS{kf.kd ;ksX;rk½ %",{"$nulls":9},"---------------------------------------------------------"]
[]
[null,"CLASS ¼d{kk½",null,null,"YEAR ¼oxZ½",null,"ROLL NO. ¼ukekad½",null,null,"RESULT ¼ifj.kke½",null,null,"NAME OF SCHOOL/BOARD ¼Ldwy@cksMZ dk uke½"]
[null,"VIII"]
[null,"IX"]
[null,"X"]
[]
[null,"19-","Student's Photo and Signature ¼fo|kFkhZ dk QksVks ,oa gLrk{kj½",{"$nulls":9}," "]
[{"$nulls":10},"Student's Signature ¼fo|kFkhZ ds gLrk{kj½"]
[{"$nulls":3},"PASTE PASSPORT\nSIZE PHOTO"]
[]
[]
[]
[]
[{"$nulls":11}," 'kkyk ç/kku dk çek.khdj.k %&\ngLrk{kj---------------------------------------------------------------"]
[]
[]
[]
[]
[null,"fo|ky; dk uke %&",null,null,{"$f":"Info!$C$7","v":"Govt. Sr. Sec. School Raimalwada"},{"$nulls":6}," 'kkyk dksM %&",null,{"$f":"Info!$C$10","v":1},{"$f":"Info!$D$10","v":7},{"$f":"Info!$E$10","v":0},{"$f":"Info!$F$10","v":1},{"$f":"Info!$G$10","v":7},{"$f":"Info!$H$10","v":5},{"$f":"Info!$I$10","v":1}]
[]
[{"$f":"A839+1","v":11}]
[null,{"$f":"CONCATENATE(Info!$B$7,Info!$C$7)","v":"School Name :-Govt. Sr. Sec. School Raimalwada"}]
[{"$nulls":3},"Board of Secondary Education, Rajasthan",{"$nulls":12},"Sec. (Reg.)"]
[{"$nulls":3}," Ekk/;fed f’k{kk cksMZ] jktLFkku ",{"$nulls":12},"fu;fer ijh{kkFkhZ"]
[null,"ek/;fed ijh{kk",{"$nulls":3},"APPLICATION FORM FOR SENIOR SECONDARY EXAMINATION-2024",{"$nulls":7},{"$f":"Info!$C$10","v":1},{"$f":"Info!$D$10","v":7},{"$f":"Info!$E$10","v":0},{"$f":"Info!$F$10","v":1},{"$f":"Info!$G$10","v":7},{"$f":"Info!$H$10","v":5},{"$f":"Info!$I$10","v":1}]
[{"$nulls":5}," Ikjh{kk vkosnu i= ek/;fed ijh{kk & 2024"]
[{"$nulls":13}," 'kkyk niZ.k Øekad %&",{"$nulls":3},{"$f":"Info!$C$9","v":12345}]
[null,"Scholar Reg. No. ¼LdkWyj jftLVj Øekad½",{"$nulls":5},{"$f":"VLOOKUP(A932,'Deta From Shala Dar. Class-10'!$A$2:$AE$201,4,0)","v":0}]
[null,"1- Student’s Name (fo|kFkhZ dk uke) :",{"$nulls":5},{"$f":"VLOOKUP(A932,'Deta From Shala Dar. Class-10'!$A$2:$AE$201,6,0)","v":0}]
[null,"2- Mother’s Name ¼ekrk dk uke) :",{"$nulls":5},{"$f":"VLOOKUP(A932,'Deta From Shala Dar. Class-10'!$A$2:$AE$201,8,0)","v":0}]
[null,"3- Father’s Name (firk dk uke) :",{"$nulls":5},{"$f":"VLOOKUP(A932,'Deta From Shala Dar. Class-10'!$A$2:$AE$201,9,0)","v":0}]
[null,"4- Date Of Birth (tUe frfFk vadks esa) :",{"$nulls":3},{"$f":"W943","v":"00:00:00"},{"$nulls":16},{"$f":"VLOOKUP(A932,'Deta From Shala Dar. Class-10'!$A$2:$AE$201,11,0)","v":"00:00:00"}]
[null,"In Words (tUe frfFk 'kCnksa esa) :",{"$nulls":5},"……………………………………………………………"]
[null,"5- Category Code (Js.kh dksM) : ¼Js.kh p;u gsrq ihNs fy[ks fo’k\"sk funsZ’k la[;k 1 ns[ks½ Js.kh dk uke %&",{"$nulls":8},"………………………………………………….",{"$nulls":5},"dksM %&"]
[null,"6- Only for Category IV & VI (dsoy Js.kh 4 o 6 ds fy,)"]
[null,"Table - A : Only for category(dsoy Js.kh 1]2 , o 8 ds fy;s) (I)ALL SUBJECTS (1-lEiw.kZ fo\"k;), (II) DIVISION IMPROVEMENT (2-Js.kh lq/kkj) & (VIII) FACULTY CHANGE (8-oxZ ifjorZu)  OPTIONAL SUBJECTS oSdfYid fo\"k;) :"]
[]
[{"$nulls":3},"As Applicable ",{"$nulls":4},"tks ykxw gks½",{"$nulls":3},"1…………………………………………………………………………….."]
[]
[{"$nulls":3},"(IV) ADDITIONAL SUBJECTS CAT",{"$nulls":4},"¼4½ vfrfjDr fo\"k;",{"$nulls":3},"2…………………………………………………3………………………...…………………….."]
[]
[{"$nulls":3},"(VI) MARKS IMPROVEMENT CAT",{"$nulls":4},"¼6½ vad lq/kkj",{"$nulls":3},"4…………………………………………………5………………………...…………………….."]
[]
[]
[null,null,"√","As Applicable from Number 8 to 15 ¼Øekad 8 ls 15 rd tks ykxw gks",{"$nulls":8},"√","djsa½"]
[]
[null,"7-","Third Language ¼r`rh; Hkk\"kk½ (Only for Category I &II) ¼dsoy Js.kh 1 o 2 ds fy,½ ¼fo\"k; p;u gsrq ihNs fy[ks fo’ks\"k funsZ’k \nla[;k 3 ns[ksa½ %&"]
[]
[null,null,"Third Language Opted (p;fur r`rh; Hkk\"kk) fo\"k; dk uke",{"$nulls":8},"dksM"]
[]
[null,"8-","Name of Vocational Trade ¼O;kolkf;d VªsM dk uke½",{"$nulls":6},"………………………………………………………..",{"$nulls":5},"lgh dk fpUg yxk,aA"]
[null,null,"¼dsoy mu 'kkykvksa ds fy, tgka O;kolkf;d f'k{kk lapkfyr gS ,oa ftu fo|kfFkZ;ksa us d{kk 10 rFkk 11 oha esa O;kolkf;d ijh{kk mRrh.kZ dh gSA½"]
[null,null," (1) Automotive (101)",{"$nulls":3},"(2) Beauty & Wellness (102)",{"$nulls":3},"(3) Health Care (103)",{"$nulls":3},"(4) IT & ITES (104)",null,null,"(5) Retail (105)"]
[]
[null,null," (6) Tourism & Hospitality (106)",{"$nulls":4},"(7) Security (107)",null,null,"(8) Apparel Made up Home Furnishing (108) ",{"$nulls":4},"(9) Electronics & Hardware (109)"]
[]
[null,null," (10) Agriculture (110)",{"$nulls":3},"(11) Plumber (111)",{"$nulls":3},"(12) Telecom (112)",{"$nulls":3},"(13) Banking Financial Services & Insurance (113)"]
[]
[null,null," (14) Construction (114)",{"$nulls":3},"(15) Food Processing (115)"]
[]
[null,"9-","Gender ¼fyax½ : (01) Male ¼iq:\"k½",{"$nulls":3},{"$f":"IF(W972=\"F\",\"\",\"Yes\")","v":"Yes"},"(02) FEMALE ¼efgyk½",null,null,{"$f":"IF(AA972=\"F\",\"\",\"Yes\")","v":"Yes"},"Medium ¼ek/;e½ : (01) HINDI ¼fgUnh½",{"$nulls":3},{"$f":"IF(X972=\"Hindi\",\"Yes\",\"\")","v":"Yes"},"(02) ENGLISH ¼vaxzsth½",null,null,{"$f":"IF(X972=\"english\",\"Yes\",\"\")","v":""},null,null,{"$f":"VLOOKUP(A932,'Deta From Shala Dar. Class-10'!$A$2:$AE$201,10,0)","v":0},{"$f":"Info!$C$8","v":"Hindi"}]
[]
[null,"10-","CWSN-1 ¼Hkkx½ : ekufld eanrk (01)",{"$nulls":4},"vkWfVTe (02)",null,null,"lsfjcy iYlh (03)",null,null,"ekufld jksx (04)",null,null,"Jo.k ckf/kr (05)"]
[]
[null,null,"ewd fu'kDrrk (06)",null,null,"LisfLQd yfuZax fMl,fcfyfV (14)",{"$nulls":4},"ckSf)d fu'kDrrk (15)",{"$nulls":3},"efYViy LDysjksfll (16)",null,null,"cgq fu'kDrrk (21)"]
[]
[null,"11-","CWSN-2 ¼Hkkx½ : n`f\"V ckf/kr (07)",{"$nulls":4},"vYi n`f\"V (08)",null,null,"pyu fu'kDrrk(09)",null,null,"dq\"B jksx (10)",null,null,"ckSukiu (11)"]
[]
[null,null,"rStkc fif³r (12)",null,null,"ekalis'kh nqfoZdkl ¼13½",{"$nulls":3},"ikfdZlkal jksx ¼17½",{"$nulls":3},"fgeksfQfy;k ¼18½",null,null,"FkSyslhfe;k ¼19½"]
[]
[null,null,",fufed@fLdy fMtht (20)",{"$nulls":3},"iksfy;ks@uoZ batjh ¼22½",{"$nulls":3},"lw;Zeq[kh ¼23½",{"$nulls":3}," @lSfud ¼24½"]
[]
[null,"12-","BPL ¼chih,y½ %",{"$nulls":4},"1- YES ¼gk¡½",null,{"$f":"IF(W984=\"N\",\"\",\"Yes\")","v":"Yes"},null,null,"2- NO ¼ugha¡½",null,{"$f":"IF(W984=\"Y\",\"\",\"Yes\")","v":"Yes"},{"$nulls":7},{"$f":"VLOOKUP(A932,'Deta From Shala Dar. Class-10'!$A$2:$AE$201,27,0)","v":0}]
[]
[null,"13-","vukFk oxZ %",{"$nulls":4},"1- YES ¼gk¡½",{"$nulls":4},"2- NO ¼ugha¡½"]
[]
[null,"14-","EWS ¼vkfFkZd n`f\"V ls detksj oxZ½ %",{"$nulls":4},"1- YES ¼gk¡½",{"$nulls":4},"2- NO ¼ugha¡½"]
[]
[null,"15-","CASTE ¼tkfr Js.kh½ %",null,null,"¼05½ Gen ¼lkekU;½",null,null,{"$f":"IF($W$60=\"GEN\",\"YES\",\"\")","v":""},"¼06½ MINORITY ¼lkekU;vYi la[;d½",{"$nulls":3},{"$f":"IF($W$60=\"MIN\",\"YES\",\"\")","v":""},"¼07½ SC ¼vuqlwfpr tkfr½",{"$nulls":4},{"$f":"IF($W$60=\"SC\",\"YES\",\"\")","v":""},null,null,{"$f":"VLOOKUP(A932,'Deta From Shala Dar. Class-10'!$A$2:$AE$201,16,0)","v":0}]
[]
[{"$nulls":5},"¼08½ ST ¼vuqlwfpr tutkfr½",null,null,{"$f":"IF($W$60=\"ST\",\"YES\",\"\")","v":""},"¼09½ OBC ¼vU; fiN³k oxZ½",{"$nulls":3},{"$f":"IF($W$60=\"OBC\",\"YES\",\"\")","v":""},"¼10½ Special OBC ¼fo'ks\"k fiN³k oxZ½@MBC",{"$nulls":4},{"$f":"IF(OR($W$60=\"MBC\",$W$60=\"SBC\"),\"YES\",\"\")","v":""}]
[null,"uksV%& Nk=o`fr@iqjLdkj mijksDr p;fur Js.kh ds vk/kj ij gh nh tk;sxhA"]
[]
[null,"16-","ADDRESS ¼fo|kFkhZ dk iw.kZ irk½ %&"]
[null,null,"House No./Street/Place Name ¼edku ua-@xyh ua-@LFkku½ %",{"$nulls":7},{"$f":"VLOOKUP(A932,'Deta From Shala Dar. Class-12'!$A$2:$AE$201,24,0)","v":0}]
[null,null,"Village/Town/City ¼xzke@dLck@'kgj½ %"]
[null,null,"District ¼ftyk½ %",null,null,"………………………….",null,null,"STATE ¼jkT;½ %",null,null,"…………………………………..",{"$nulls":3},"PIN CODE NO. ¼fiu dksM ua-½ %",null,null,"……………………"]
[]
[null,"17-","fo|kFkhZ dk vk/kkj dkMZ uEcj %",{"$nulls":3},{"$f":"VLOOKUP(A932,'Deta From Shala Dar. Class-12'!$A$2:$AE$201,21,0)","v":{"v":0,"d":"0000"}},{"$nulls":3},"tu vk/kkj uEcj %",null,{"$f":"VLOOKUP(A932,'Deta From Shala Dar. Class-12'!$A$2:$AE$201,22,0)","v":0},null,null,"vfHkHkkod dh okf\"kZd vk; %",null,null,{"$f":"VLOOKUP(A932,'Deta From Shala Dar. Class-12'!$A$2:$AE$201,25,0)","v":{"v":0,"d":"₹ 0"}}]
[]
[null,null,"Student/Guardian's Mobile No. ¼fo|kFkhZ@vfHkHkkod dk eksckby uacj½ %",{"$nulls":9},{"$f":"VLOOKUP(A932,'Deta From Shala Dar. Class-12'!$A$2:$AE$201,23,0)","v":0}]
[]
[null,"18-","Previous Academic Details ¼iwoZ 'kS{kf.kd ;ksX;rk½ %",{"$nulls":9},"---------------------------------------------------------"]
[]
[null,"CLASS ¼d{kk½",null,null,"YEAR ¼oxZ½",null,"ROLL NO. ¼ukekad½",null,null,"RESULT ¼ifj.kke½",null,null,"NAME OF SCHOOL/BOARD ¼Ldwy@cksMZ dk uke½"]
[null,"VIII"]
[null,"IX"]
[null,"X"]
[]
[null,"19-","Student's Photo and Signature ¼fo|kFkhZ dk QksVks ,oa gLrk{kj½",{"$nulls":9}," "]
[{"$nulls":10},"Student's Signature ¼fo|kFkhZ ds gLrk{kj½"]
[{"$nulls":3},"PASTE PASSPORT\nSIZE PHOTO"]
[]
[]
[]
[]
[{"$nulls":11}," 'kkyk ç/kku dk çek.khdj.k %&\ngLrk{kj---------------------------------------------------------------"]
[]
[]
[]
[]
[null,"fo|ky; dk uke %&",null,null,{"$f":"Info!$C$7","v":"Govt. Sr. Sec. School Raimalwada"},{"$nulls":6}," 'kkyk dksM %&",null,{"$f":"Info!$C$10","v":1},{"$f":"Info!$D$10","v":7},{"$f":"Info!$E$10","v":0},{"$f":"Info!$F$10","v":1},{"$f":"Info!$G$10","v":7},{"$f":"Info!$H$10","v":5},{"$f":"Info!$I$10","v":1}]
[]
[{"$f":"A932+1","v":12}]
[null,{"$f":"CONCATENATE(Info!$B$7,Info!$C$7)","v":"School Name :-Govt. Sr. Sec. School Raimalwada"}]
[{"$nulls":3},"Board of Secondary Education, Rajasthan",{"$nulls":12},"Sec. (Reg.)"]
[{"$nulls":3}," Ekk/;fed f’k{kk cksMZ] jktLFkku ",{"$nulls":12},"fu;fer ijh{kkFkhZ"]
[null,"ek/;fed ijh{kk",{"$nulls":3},"APPLICATION FORM FOR SENIOR SECONDARY EXAMINATION-2024",{"$nulls":7},{"$f":"Info!$C$10","v":1},{"$f":"Info!$D$10","v":7},{"$f":"Info!$E$10","v":0},{"$f":"Info!$F$10","v":1},{"$f":"Info!$G$10","v":7},{"$f":"Info!$H$10","v":5},{"$f":"Info!$I$10","v":1}]
[{"$nulls":5}," Ikjh{kk vkosnu i= ek/;fed ijh{kk & 2024"]
[{"$nulls":13}," 'kkyk niZ.k Øekad %&",{"$nulls":3},{"$f":"Info!$C$9","v":12345}]
[null,"Scholar Reg. No. ¼LdkWyj jftLVj Øekad½",{"$nulls":5},{"$f":"VLOOKUP(A1025,'Deta From Shala Dar. Class-10'!$A$2:$AE$201,4,0)","v":0}]
[null,"1- Student’s Name (fo|kFkhZ dk uke) :",{"$nulls":5},{"$f":"VLOOKUP(A1025,'Deta From Shala Dar. Class-10'!$A$2:$AE$201,6,0)","v":0}]
[null,"2- Mother’s Name ¼ekrk dk uke) :",{"$nulls":5},{"$f":"VLOOKUP(A1025,'Deta From Shala Dar. Class-10'!$A$2:$AE$201,8,0)","v":0}]
[null,"3- Father’s Name (firk dk uke) :",{"$nulls":5},{"$f":"VLOOKUP(A1025,'Deta From Shala Dar. Class-10'!$A$2:$AE$201,9,0)","v":0}]
[null,"4- Date Of Birth (tUe frfFk vadks esa) :",{"$nulls":3},{"$f":"W1036","v":"00:00:00"},{"$nulls":16},{"$f":"VLOOKUP(A1025,'Deta From Shala Dar. Class-10'!$A$2:$AE$201,11,0)","v":"00:00:00"}]
[null,"In Words (tUe frfFk 'kCnksa esa) :",{"$nulls":5},"……………………………………………………………"]
[null,"5- Category Code (Js.kh dksM) : ¼Js.kh p;u gsrq ihNs fy[ks fo’k\"sk funsZ’k la[;k 1 ns[ks½ Js.kh dk uke %&",{"$nulls":8},"………………………………………………….",{"$nulls":5},"dksM %&"]
[null,"6- Only for Category IV & VI (dsoy Js.kh 4 o 6 ds fy,)"]
[null,"Table - A : Only for category(dsoy Js.kh 1]2 , o 8 ds fy;s) (I)ALL SUBJECTS (1-lEiw.kZ fo\"k;), (II) DIVISION IMPROVEMENT (2-Js.kh lq/kkj) & (VIII) FACULTY CHANGE (8-oxZ ifjorZu)  OPTIONAL SUBJECTS oSdfYid fo\"k;) :"]
[]
[{"$nulls":3},"As Applicable ",{"$nulls":4},"tks ykxw gks½",{"$nulls":3},"1…………………………………………………………………………….."]
[]
[{"$nulls":3},"(IV) ADDITIONAL SUBJECTS CAT",{"$nulls":4},"¼4½ vfrfjDr fo\"k;",{"$nulls":3},"2…………………………………………………3………………………...…………………….."]
[]
[{"$nulls":3},"(VI) MARKS IMPROVEMENT CAT",{"$nulls":4},"¼6½ vad lq/kkj",{"$nulls":3},"4…………………………………………………5………………………...…………………….."]
[]
[]
[null,null,"√","As Applicable from Number 8 to 15 ¼Øekad 8 ls 15 rd tks ykxw gks",{"$nulls":8},"√","djsa½"]
[]
[null,"7-","Third Language ¼r`rh; Hkk\"kk½ (Only for Category I &II) ¼dsoy Js.kh 1 o 2 ds fy,½ ¼fo\"k; p;u gsrq ihNs fy[ks fo’ks\"k funsZ’k \nla[;k 3 ns[ksa½ %&"]
[]
[null,null,"Third Language Opted (p;fur r`rh; Hkk\"kk) fo\"k; dk uke",{"$nulls":8},"dksM"]
[]
[null,"8-","Name of Vocational Trade ¼O;kolkf;d VªsM dk uke½",{"$nulls":6},"………………………………………………………..",{"$nulls":5},"lgh dk fpUg yxk,aA"]
[null,null,"¼dsoy mu 'kkykvksa ds fy, tgka O;kolkf;d f'k{kk lapkfyr gS ,oa ftu fo|kfFkZ;ksa us d{kk 10 rFkk 11 oha esa O;kolkf;d ijh{kk mRrh.kZ dh gSA½"]
[null,null," (1) Automotive (101)",{"$nulls":3},"(2) Beauty & Wellness (102)",{"$nulls":3},"(3) Health Care (103)",{"$nulls":3},"(4) IT & ITES (104)",null,null,"(5) Retail (105)"]
[]
[null,null," (6) Tourism & Hospitality (106)",{"$nulls":4},"(7) Security (107)",null,null,"(8) Apparel Made up Home Furnishing (108) ",{"$nulls":4},"(9) Electronics & Hardware (109)"]
[]
[null,null," (10) Agriculture (110)",{"$nulls":3},"(11) Plumber (111)",{"$nulls":3},"(12) Telecom (112)",{"$nulls":3},"(13) Banking Financial Services & Insurance (113)"]
[]
[null,null," (14) Construction (114)",{"$nulls":3},"(15) Food Processing (115)"]
[]
[null,"9-","Gender ¼fyax½ : (01) Male ¼iq:\"k½",{"$nulls":3},{"$f":"IF(W1065=\"F\",\"\",\"Yes\")","v":"Yes"},"(02) FEMALE ¼efgyk½",null,null,{"$f":"IF(AA1065=\"F\",\"\",\"Yes\")","v":"Yes"},"Medium ¼ek/;e½ : (01) HINDI ¼fgUnh½",{"$nulls":3},{"$f":"IF(X1065=\"Hindi\",\"Yes\",\"\")","v":"Yes"},"(02) ENGLISH ¼vaxzsth½",null,null,{"$f":"IF(X1065=\"english\",\"Yes\",\"\")","v":""},null,null,{"$f":"VLOOKUP(A1025,'Deta From Shala Dar. Class-10'!$A$2:$AE$201,10,0)","v":0},{"$f":"Info!$C$8","v":"Hindi"}]
[]
[null,"10-","CWSN-1 ¼Hkkx½ : ekufld eanrk (01)",{"$nulls":4},"vkWfVTe (02)",null,null,"lsfjcy iYlh (03)",null,null,"ekufld jksx (04)",null,null,"Jo.k ckf/kr (05)"]
[]
[null,null,"ewd fu'kDrrk (06)",null,null,"LisfLQd yfuZax fMl,fcfyfV (14)",{"$nulls":4},"ckSf)d fu'kDrrk (15)",{"$nulls":3},"efYViy LDysjksfll (16)",null,null,"cgq fu'kDrrk (21)"]
[]
[null,"11-","CWSN-2 ¼Hkkx½ : n`f\"V ckf/kr (07)",{"$nulls":4},"vYi n`f\"V (08)",null,null,"pyu fu'kDrrk(09)",null,null,"dq\"B jksx (10)",null,null,"ckSukiu (11)"]
[]
[null,null,"rStkc fif³r (12)",null,null,"ekalis'kh nqfoZdkl ¼13½",{"$nulls":3},"ikfdZlkal jksx ¼17½",{"$nulls":3},"fgeksfQfy;k ¼18½",null,null,"FkSyslhfe;k ¼19½"]
[]
[null,null,",fufed@fLdy fMtht (20)",{"$nulls":3},"iksfy;ks@uoZ batjh ¼22½",{"$nulls":3},"lw;Zeq[kh ¼23½",{"$nulls":3}," @lSfud ¼24½"]
[]
[null,"12-","BPL ¼chih,y½ %",{"$nulls":4},"1- YES ¼gk¡½",null,{"$f":"IF(W1077=\"N\",\"\",\"Yes\")","v":"Yes"},null,null,"2- NO ¼ugha¡½",null,{"$f":"IF(W1077=\"Y\",\"\",\"Yes\")","v":"Yes"},{"$nulls":7},{"$f":"VLOOKUP(A1025,'Deta From Shala Dar. Class-10'!$A$2:$AE$201,27,0)","v":0}]
[]
[null,"13-","vukFk oxZ %",{"$nulls":4},"1- YES ¼gk¡½",{"$nulls":4},"2- NO ¼ugha¡½"]
[]
[null,"14-","EWS ¼vkfFkZd n`f\"V ls detksj oxZ½ %",{"$nulls":4},"1- YES ¼gk¡½",{"$nulls":4},"2- NO ¼ugha¡½"]
[]
[null,"15-","CASTE ¼tkfr Js.kh½ %",null,null,"¼05½ Gen ¼lkekU;½",null,null,{"$f":"IF($W$60=\"GEN\",\"YES\",\"\")","v":""},"¼06½ MINORITY ¼lkekU;vYi la[;d½",{"$nulls":3},{"$f":"IF($W$60=\"MIN\",\"YES\",\"\")","v":""},"¼07½ SC ¼vuqlwfpr tkfr½",{"$nulls":4},{"$f":"IF($W$60=\"SC\",\"YES\",\"\")","v":""},null,null,{"$f":"VLOOKUP(A1025,'Deta From Shala Dar. Class-10'!$A$2:$AE$201,16,0)","v":0}]
[]
[{"$nulls":5},"¼08½ ST ¼vuqlwfpr tutkfr½",null,null,{"$f":"IF($W$60=\"ST\",\"YES\",\"\")","v":""},"¼09½ OBC ¼vU; fiN³k oxZ½",{"$nulls":3},{"$f":"IF($W$60=\"OBC\",\"YES\",\"\")","v":""},"¼10½ Special OBC ¼fo'ks\"k fiN³k oxZ½@MBC",{"$nulls":4},{"$f":"IF(OR($W$60=\"MBC\",$W$60=\"SBC\"),\"YES\",\"\")","v":""}]
[null,"uksV%& Nk=o`fr@iqjLdkj mijksDr p;fur Js.kh ds vk/kj ij gh nh tk;sxhA"]
[]
[null,"16-","ADDRESS ¼fo|kFkhZ dk iw.kZ irk½ %&"]
[null,null,"House No./Street/Place Name ¼edku ua-@xyh ua-@LFkku½ %",{"$nulls":7},{"$f":"VLOOKUP(A1025,'Deta From Shala Dar. Class-12'!$A$2:$AE$201,24,0)","v":0}]
[null,null,"Village/Town/City ¼xzke@dLck@'kgj½ %"]
[null,null,"District ¼ftyk½ %",null,null,"………………………….",null,null,"STATE ¼jkT;½ %",null,null,"…………………………………..",{"$nulls":3},"PIN CODE NO. ¼fiu dksM ua-½ %",null,null,"……………………"]
[]
[null,"17-","fo|kFkhZ dk vk/kkj dkMZ uEcj %",{"$nulls":3},{"$f":"VLOOKUP(A1025,'Deta From Shala Dar. Class-12'!$A$2:$AE$201,21,0)","v":{"v":0,"d":"0000"}},{"$nulls":3},"tu vk/kkj uEcj %",null,{"$f":"VLOOKUP(A1025,'Deta From Shala Dar. Class-12'!$A$2:$AE$201,22,0)","v":0},null,null,"vfHkHkkod dh okf\"kZd vk; %",null,null,{"$f":"VLOOKUP(A1025,'Deta From Shala Dar. Class-12'!$A$2:$AE$201,25,0)","v":{"v":0,"d":"₹ 0"}}]
[]
[null,null,"Student/Guardian's Mobile No. ¼fo|kFkhZ@vfHkHkkod dk eksckby uacj½ %",{"$nulls":9},{"$f":"VLOOKUP(A1025,'Deta From Shala Dar. Class-12'!$A$2:$AE$201,23,0)","v":0}]
[]
[null,"18-","Previous Academic Details ¼iwoZ 'kS{kf.kd ;ksX;rk½ %",{"$nulls":9},"---------------------------------------------------------"]
[]
[null,"CLASS ¼d{kk½",null,null,"YEAR ¼oxZ½",null,"ROLL NO. ¼ukekad½",null,null,"RESULT ¼ifj.kke½",null,null,"NAME OF SCHOOL/BOARD ¼Ldwy@cksMZ dk uke½"]
[null,"VIII"]
[null,"IX"]
[null,"X"]
[]
[null,"19-","Student's Photo and Signature ¼fo|kFkhZ dk QksVks ,oa gLrk{kj½",{"$nulls":9}," "]
[{"$nulls":10},"Student's Signature ¼fo|kFkhZ ds gLrk{kj½"]
[{"$nulls":3},"PASTE PASSPORT\nSIZE PHOTO"]
[]
[]
[]
[]
[{"$nulls":11}," 'kkyk ç/kku dk çek.khdj.k %&\ngLrk{kj---------------------------------------------------------------"]
[]
[]
[]
[]
[null,"fo|ky; dk uke %&",null,null,{"$f":"Info!$C$7","v":"Govt. Sr. Sec. School Raimalwada"},{"$nulls":6}," 'kkyk dksM %&",null,{"$f":"Info!$C$10","v":1},{"$f":"Info!$D$10","v":7},{"$f":"Info!$E$10","v":0},{"$f":"Info!$F$10","v":1},{"$f":"Info!$G$10","v":7},{"$f":"Info!$H$10","v":5},{"$f":"Info!$I$10","v":1}]
[]
[{"$f":"A1025+1","v":13}]
[null,{"$f":"CONCATENATE(Info!$B$7,Info!$C$7)","v":"School Name :-Govt. Sr. Sec. School Raimalwada"}]
[{"$nulls":3},"Board of Secondary Education, Rajasthan",{"$nulls":12},"Sec. (Reg.)"]
[{"$nulls":3}," Ekk/;fed f’k{kk cksMZ] jktLFkku ",{"$nulls":12},"fu;fer ijh{kkFkhZ"]
[null,"ek/;fed ijh{kk",{"$nulls":3},"APPLICATION FORM FOR SENIOR SECONDARY EXAMINATION-2024",{"$nulls":7},{"$f":"Info!$C$10","v":1},{"$f":"Info!$D$10","v":7},{"$f":"Info!$E$10","v":0},{"$f":"Info!$F$10","v":1},{"$f":"Info!$G$10","v":7},{"$f":"Info!$H$10","v":5},{"$f":"Info!$I$10","v":1}]
[{"$nulls":5}," Ikjh{kk vkosnu i= ek/;fed ijh{kk & 2024"]
[{"$nulls":13}," 'kkyk niZ.k Øekad %&",{"$nulls":3},{"$f":"Info!$C$9","v":12345}]
[null,"Scholar Reg. No. ¼LdkWyj jftLVj Øekad½",{"$nulls":5},{"$f":"VLOOKUP(A1118,'Deta From Shala Dar. Class-10'!$A$2:$AE$201,4,0)","v":0}]
[null,"1- Student’s Name (fo|kFkhZ dk uke) :",{"$nulls":5},{"$f":"VLOOKUP(A1118,'Deta From Shala Dar. Class-10'!$A$2:$AE$201,6,0)","v":0}]
[null,"2- Mother’s Name ¼ekrk dk uke) :",{"$nulls":5},{"$f":"VLOOKUP(A1118,'Deta From Shala Dar. Class-10'!$A$2:$AE$201,8,0)","v":0}]
[null,"3- Father’s Name (firk dk uke) :",{"$nulls":5},{"$f":"VLOOKUP(A1118,'Deta From Shala Dar. Class-10'!$A$2:$AE$201,9,0)","v":0}]
[null,"4- Date Of Birth (tUe frfFk vadks esa) :",{"$nulls":3},{"$f":"W1129","v":"00:00:00"},{"$nulls":16},{"$f":"VLOOKUP(A1118,'Deta From Shala Dar. Class-10'!$A$2:$AE$201,11,0)","v":"00:00:00"}]
[null,"In Words (tUe frfFk 'kCnksa esa) :",{"$nulls":5},"……………………………………………………………"]
[null,"5- Category Code (Js.kh dksM) : ¼Js.kh p;u gsrq ihNs fy[ks fo’k\"sk funsZ’k la[;k 1 ns[ks½ Js.kh dk uke %&",{"$nulls":8},"………………………………………………….",{"$nulls":5},"dksM %&"]
[null,"6- Only for Category IV & VI (dsoy Js.kh 4 o 6 ds fy,)"]
[null,"Table - A : Only for category(dsoy Js.kh 1]2 , o 8 ds fy;s) (I)ALL SUBJECTS (1-lEiw.kZ fo\"k;), (II) DIVISION IMPROVEMENT (2-Js.kh lq/kkj) & (VIII) FACULTY CHANGE (8-oxZ ifjorZu)  OPTIONAL SUBJECTS oSdfYid fo\"k;) :"]
[]
[{"$nulls":3},"As Applicable ",{"$nulls":4},"tks ykxw gks½",{"$nulls":3},"1…………………………………………………………………………….."]
[]
[{"$nulls":3},"(IV) ADDITIONAL SUBJECTS CAT",{"$nulls":4},"¼4½ vfrfjDr fo\"k;",{"$nulls":3},"2…………………………………………………3………………………...…………………….."]
[]
[{"$nulls":3},"(VI) MARKS IMPROVEMENT CAT",{"$nulls":4},"¼6½ vad lq/kkj",{"$nulls":3},"4…………………………………………………5………………………...…………………….."]
[]
[]
[null,null,"√","As Applicable from Number 8 to 15 ¼Øekad 8 ls 15 rd tks ykxw gks",{"$nulls":8},"√","djsa½"]
[]
[null,"7-","Third Language ¼r`rh; Hkk\"kk½ (Only for Category I &II) ¼dsoy Js.kh 1 o 2 ds fy,½ ¼fo\"k; p;u gsrq ihNs fy[ks fo’ks\"k funsZ’k \nla[;k 3 ns[ksa½ %&"]
[]
[null,null,"Third Language Opted (p;fur r`rh; Hkk\"kk) fo\"k; dk uke",{"$nulls":8},"dksM"]
[]
[null,"8-","Name of Vocational Trade ¼O;kolkf;d VªsM dk uke½",{"$nulls":6},"………………………………………………………..",{"$nulls":5},"lgh dk fpUg yxk,aA"]
[null,null,"¼dsoy mu 'kkykvksa ds fy, tgka O;kolkf;d f'k{kk lapkfyr gS ,oa ftu fo|kfFkZ;ksa us d{kk 10 rFkk 11 oha esa O;kolkf;d ijh{kk mRrh.kZ dh gSA½"]
[null,null," (1) Automotive (101)",{"$nulls":3},"(2) Beauty & Wellness (102)",{"$nulls":3},"(3) Health Care (103)",{"$nulls":3},"(4) IT & ITES (104)",null,null,"(5) Retail (105)"]
[]
[null,null," (6) Tourism & Hospitality (106)",{"$nulls":4},"(7) Security (107)",null,null,"(8) Apparel Made up Home Furnishing (108) ",{"$nulls":4},"(9) Electronics & Hardware (109)"]
[]
[null,null," (10) Agriculture (110)",{"$nulls":3},"(11) Plumber (111)",{"$nulls":3},"(12) Telecom (112)",{"$nulls":3},"(13) Banking Financial Services & Insurance (113)"]
[]
[null,null," (14) Construction (114)",{"$nulls":3},"(15) Food Processing (115)"]
[]
[null,"9-","Gender ¼fyax½ : (01) Male ¼iq:\"k½",{"$nulls":3},{"$f":"IF(W1158=\"F\",\"\",\"Yes\")","v":"Yes"},"(02) FEMALE ¼efgyk½",null,null,{"$f":"IF(AA1158=\"F\",\"\",\"Yes\")","v":"Yes"},"Medium ¼ek/;e½ : (01) HINDI ¼fgUnh½",{"$nulls":3},{"$f":"IF(X1158=\"Hindi\",\"Yes\",\"\")","v":"Yes"},"(02) ENGLISH ¼vaxzsth½",null,null,{"$f":"IF(X1158=\"english\",\"Yes\",\"\")","v":""},null,null,{"$f":"VLOOKUP(A1118,'Deta From Shala Dar. Class-10'!$A$2:$AE$201,10,0)","v":0},{"$f":"Info!$C$8","v":"Hindi"}]
[]
[null,"10-","CWSN-1 ¼Hkkx½ : ekufld eanrk (01)",{"$nulls":4},"vkWfVTe (02)",null,null,"lsfjcy iYlh (03)",null,null,"ekufld jksx (04)",null,null,"Jo.k ckf/kr (05)"]
[]
[null,null,"ewd fu'kDrrk (06)",null,null,"LisfLQd yfuZax fMl,fcfyfV (14)",{"$nulls":4},"ckSf)d fu'kDrrk (15)",{"$nulls":3},"efYViy LDysjksfll (16)",null,null,"cgq fu'kDrrk (21)"]
[]
[null,"11-","CWSN-2 ¼Hkkx½ : n`f\"V ckf/kr (07)",{"$nulls":4},"vYi n`f\"V (08)",null,null,"pyu fu'kDrrk(09)",null,null,"dq\"B jksx (10)",null,null,"ckSukiu (11)"]
[]
[null,null,"rStkc fif³r (12)",null,null,"ekalis'kh nqfoZdkl ¼13½",{"$nulls":3},"ikfdZlkal jksx ¼17½",{"$nulls":3},"fgeksfQfy;k ¼18½",null,null,"FkSyslhfe;k ¼19½"]
[]
[null,null,",fufed@fLdy fMtht (20)",{"$nulls":3},"iksfy;ks@uoZ batjh ¼22½",{"$nulls":3},"lw;Zeq[kh ¼23½",{"$nulls":3}," @lSfud ¼24½"]
[]
[null,"12-","BPL ¼chih,y½ %",{"$nulls":4},"1- YES ¼gk¡½",null,{"$f":"IF(W1170=\"N\",\"\",\"Yes\")","v":"Yes"},null,null,"2- NO ¼ugha¡½",null,{"$f":"IF(W1170=\"Y\",\"\",\"Yes\")","v":"Yes"},{"$nulls":7},{"$f":"VLOOKUP(A1118,'Deta From Shala Dar. Class-10'!$A$2:$AE$201,27,0)","v":0}]
[]
[null,"13-","vukFk oxZ %",{"$nulls":4},"1- YES ¼gk¡½",{"$nulls":4},"2- NO ¼ugha¡½"]
[]
[null,"14-","EWS ¼vkfFkZd n`f\"V ls detksj oxZ½ %",{"$nulls":4},"1- YES ¼gk¡½",{"$nulls":4},"2- NO ¼ugha¡½"]
[]
[null,"15-","CASTE ¼tkfr Js.kh½ %",null,null,"¼05½ Gen ¼lkekU;½",null,null,{"$f":"IF($W$60=\"GEN\",\"YES\",\"\")","v":""},"¼06½ MINORITY ¼lkekU;vYi la[;d½",{"$nulls":3},{"$f":"IF($W$60=\"MIN\",\"YES\",\"\")","v":""},"¼07½ SC ¼vuqlwfpr tkfr½",{"$nulls":4},{"$f":"IF($W$60=\"SC\",\"YES\",\"\")","v":""},null,null,{"$f":"VLOOKUP(A1118,'Deta From Shala Dar. Class-10'!$A$2:$AE$201,16,0)","v":0}]
[]
[{"$nulls":5},"¼08½ ST ¼vuqlwfpr tutkfr½",null,null,{"$f":"IF($W$60=\"ST\",\"YES\",\"\")","v":""},"¼09½ OBC ¼vU; fiN³k oxZ½",{"$nulls":3},{"$f":"IF($W$60=\"OBC\",\"YES\",\"\")","v":""},"¼10½ Special OBC ¼fo'ks\"k fiN³k oxZ½@MBC",{"$nulls":4},{"$f":"IF(OR($W$60=\"MBC\",$W$60=\"SBC\"),\"YES\",\"\")","v":""}]
[null,"uksV%& Nk=o`fr@iqjLdkj mijksDr p;fur Js.kh ds vk/kj ij gh nh tk;sxhA"]
[]
[null,"16-","ADDRESS ¼fo|kFkhZ dk iw.kZ irk½ %&"]
[null,null,"House No./Street/Place Name ¼edku ua-@xyh ua-@LFkku½ %",{"$nulls":7},{"$f":"VLOOKUP(A1118,'Deta From Shala Dar. Class-12'!$A$2:$AE$201,24,0)","v":0}]
[null,null,"Village/Town/City ¼xzke@dLck@'kgj½ %"]
[null,null,"District ¼ftyk½ %",null,null,"………………………….",null,null,"STATE ¼jkT;½ %",null,null,"…………………………………..",{"$nulls":3},"PIN CODE NO. ¼fiu dksM ua-½ %",null,null,"……………………"]
[]
[null,"17-","fo|kFkhZ dk vk/kkj dkMZ uEcj %",{"$nulls":3},{"$f":"VLOOKUP(A1118,'Deta From Shala Dar. Class-12'!$A$2:$AE$201,21,0)","v":{"v":0,"d":"0000"}},{"$nulls":3},"tu vk/kkj uEcj %",null,{"$f":"VLOOKUP(A1118,'Deta From Shala Dar. Class-12'!$A$2:$AE$201,22,0)","v":0},null,null,"vfHkHkkod dh okf\"kZd vk; %",null,null,{"$f":"VLOOKUP(A1118,'Deta From Shala Dar. Class-12'!$A$2:$AE$201,25,0)","v":{"v":0,"d":"₹ 0"}}]
[]
[null,null,"Student/Guardian's Mobile No. ¼fo|kFkhZ@vfHkHkkod dk eksckby uacj½ %",{"$nulls":9},{"$f":"VLOOKUP(A1118,'Deta From Shala Dar. Class-12'!$A$2:$AE$201,23,0)","v":0}]
[]
[null,"18-","Previous Academic Details ¼iwoZ 'kS{kf.kd ;ksX;rk½ %",{"$nulls":9},"---------------------------------------------------------"]
[]
[null,"CLASS ¼d{kk½",null,null,"YEAR ¼oxZ½",null,"ROLL NO. ¼ukekad½",null,null,"RESULT ¼ifj.kke½",null,null,"NAME OF SCHOOL/BOARD ¼Ldwy@cksMZ dk uke½"]
[null,"VIII"]
[null,"IX"]
[null,"X"]
[]
[null,"19-","Student's Photo and Signature ¼fo|kFkhZ dk QksVks ,oa gLrk{kj½",{"$nulls":9}," "]
[{"$nulls":10},"Student's Signature ¼fo|kFkhZ ds gLrk{kj½"]
[{"$nulls":3},"PASTE PASSPORT\nSIZE PHOTO"]
[]
[]
[]
[]
[{"$nulls":11}," 'kkyk ç/kku dk çek.khdj.k %&\ngLrk{kj---------------------------------------------------------------"]
[]
[]
[]
[]
[null,"fo|ky; dk uke %&",null,null,{"$f":"Info!$C$7","v":"Govt. Sr. Sec. School Raimalwada"},{"$nulls":6}," 'kkyk dksM %&",null,{"$f":"Info!$C$10","v":1},{"$f":"Info!$D$10","v":7},{"$f":"Info!$E$10","v":0},{"$f":"Info!$F$10","v":1},{"$f":"Info!$G$10","v":7},{"$f":"Info!$H$10","v":5},{"$f":"Info!$I$10","v":1}]
[]
[{"$f":"A1118+1","v":14}]
[null,{"$f":"CONCATENATE(Info!$B$7,Info!$C$7)","v":"School Name :-Govt. Sr. Sec. School Raimalwada"}]
[{"$nulls":3},"Board of Secondary Education, Rajasthan",{"$nulls":12},"Sec. (Reg.)"]
[{"$nulls":3}," Ekk/;fed f’k{kk cksMZ] jktLFkku ",{"$nulls":12},"fu;fer ijh{kkFkhZ"]
[null,"ek/;fed ijh{kk",{"$nulls":3},"APPLICATION FORM FOR SENIOR SECONDARY EXAMINATION-2024",{"$nulls":7},{"$f":"Info!$C$10","v":1},{"$f":"Info!$D$10","v":7},{"$f":"Info!$E$10","v":0},{"$f":"Info!$F$10","v":1},{"$f":"Info!$G$10","v":7},{"$f":"Info!$H$10","v":5},{"$f":"Info!$I$10","v":1}]
[{"$nulls":5}," Ikjh{kk vkosnu i= ek/;fed ijh{kk & 2024"]
[{"$nulls":13}," 'kkyk niZ.k Øekad %&",{"$nulls":3},{"$f":"Info!$C$9","v":12345}]
[null,"Scholar Reg. No. ¼LdkWyj jftLVj Øekad½",{"$nulls":5},{"$f":"VLOOKUP(A1211,'Deta From Shala Dar. Class-10'!$A$2:$AE$201,4,0)","v":0}]
[null,"1- Student’s Name (fo|kFkhZ dk uke) :",{"$nulls":5},{"$f":"VLOOKUP(A1211,'Deta From Shala Dar. Class-10'!$A$2:$AE$201,6,0)","v":0}]
[null,"2- Mother’s Name ¼ekrk dk uke) :",{"$nulls":5},{"$f":"VLOOKUP(A1211,'Deta From Shala Dar. Class-10'!$A$2:$AE$201,8,0)","v":0}]
[null,"3- Father’s Name (firk dk uke) :",{"$nulls":5},{"$f":"VLOOKUP(A1211,'Deta From Shala Dar. Class-10'!$A$2:$AE$201,9,0)","v":0}]
[null,"4- Date Of Birth (tUe frfFk vadks esa) :",{"$nulls":3},{"$f":"W1222","v":"00:00:00"},{"$nulls":16},{"$f":"VLOOKUP(A1211,'Deta From Shala Dar. Class-10'!$A$2:$AE$201,11,0)","v":"00:00:00"}]
[null,"In Words (tUe frfFk 'kCnksa esa) :",{"$nulls":5},"……………………………………………………………"]
[null,"5- Category Code (Js.kh dksM) : ¼Js.kh p;u gsrq ihNs fy[ks fo’k\"sk funsZ’k la[;k 1 ns[ks½ Js.kh dk uke %&",{"$nulls":8},"………………………………………………….",{"$nulls":5},"dksM %&"]
[null,"6- Only for Category IV & VI (dsoy Js.kh 4 o 6 ds fy,)"]
[null,"Table - A : Only for category(dsoy Js.kh 1]2 , o 8 ds fy;s) (I)ALL SUBJECTS (1-lEiw.kZ fo\"k;), (II) DIVISION IMPROVEMENT (2-Js.kh lq/kkj) & (VIII) FACULTY CHANGE (8-oxZ ifjorZu)  OPTIONAL SUBJECTS oSdfYid fo\"k;) :"]
[]
[{"$nulls":3},"As Applicable ",{"$nulls":4},"tks ykxw gks½",{"$nulls":3},"1…………………………………………………………………………….."]
[]
[{"$nulls":3},"(IV) ADDITIONAL SUBJECTS CAT",{"$nulls":4},"¼4½ vfrfjDr fo\"k;",{"$nulls":3},"2…………………………………………………3………………………...…………………….."]
[]
[{"$nulls":3},"(VI) MARKS IMPROVEMENT CAT",{"$nulls":4},"¼6½ vad lq/kkj",{"$nulls":3},"4…………………………………………………5………………………...…………………….."]
[]
[]
[null,null,"√","As Applicable from Number 8 to 15 ¼Øekad 8 ls 15 rd tks ykxw gks",{"$nulls":8},"√","djsa½"]
[]
[null,"7-","Third Language ¼r`rh; Hkk\"kk½ (Only for Category I &II) ¼dsoy Js.kh 1 o 2 ds fy,½ ¼fo\"k; p;u gsrq ihNs fy[ks fo’ks\"k funsZ’k \nla[;k 3 ns[ksa½ %&"]
[]
[null,null,"Third Language Opted (p;fur r`rh; Hkk\"kk) fo\"k; dk uke",{"$nulls":8},"dksM"]
[]
[null,"8-","Name of Vocational Trade ¼O;kolkf;d VªsM dk uke½",{"$nulls":6},"………………………………………………………..",{"$nulls":5},"lgh dk fpUg yxk,aA"]
[null,null,"¼dsoy mu 'kkykvksa ds fy, tgka O;kolkf;d f'k{kk lapkfyr gS ,oa ftu fo|kfFkZ;ksa us d{kk 10 rFkk 11 oha esa O;kolkf;d ijh{kk mRrh.kZ dh gSA½"]
[null,null," (1) Automotive (101)",{"$nulls":3},"(2) Beauty & Wellness (102)",{"$nulls":3},"(3) Health Care (103)",{"$nulls":3},"(4) IT & ITES (104)",null,null,"(5) Retail (105)"]
[]
[null,null," (6) Tourism & Hospitality (106)",{"$nulls":4},"(7) Security (107)",null,null,"(8) Apparel Made up Home Furnishing (108) ",{"$nulls":4},"(9) Electronics & Hardware (109)"]
[]
[null,null," (10) Agriculture (110)",{"$nulls":3},"(11) Plumber (111)",{"$nulls":3},"(12) Telecom (112)",{"$nulls":3},"(13) Banking Financial Services & Insurance (113)"]
[]
[null,null," (14) Construction (114)",{"$nulls":3},"(15) Food Processing (115)"]
[]
[null,"9-","Gender ¼fyax½ : (01) Male ¼iq:\"k½",{"$nulls":3},{"$f":"IF(W1251=\"F\",\"\",\"Yes\")","v":"Yes"},"(02) FEMALE ¼efgyk½",null,null,{"$f":"IF(AA1251=\"F\",\"\",\"Yes\")","v":"Yes"},"Medium ¼ek/;e½ : (01) HINDI ¼fgUnh½",{"$nulls":3},{"$f":"IF(X1251=\"Hindi\",\"Yes\",\"\")","v":"Yes"},"(02) ENGLISH ¼vaxzsth½",null,null,{"$f":"IF(X1251=\"english\",\"Yes\",\"\")","v":""},null,null,{"$f":"VLOOKUP(A1211,'Deta From Shala Dar. Class-10'!$A$2:$AE$201,10,0)","v":0},{"$f":"Info!$C$8","v":"Hindi"}]
[]
[null,"10-","CWSN-1 ¼Hkkx½ : ekufld eanrk (01)",{"$nulls":4},"vkWfVTe (02)",null,null,"lsfjcy iYlh (03)",null,null,"ekufld jksx (04)",null,null,"Jo.k ckf/kr (05)"]
[]
[null,null,"ewd fu'kDrrk (06)",null,null,"LisfLQd yfuZax fMl,fcfyfV (14)",{"$nulls":4},"ckSf)d fu'kDrrk (15)",{"$nulls":3},"efYViy LDysjksfll (16)",null,null,"cgq fu'kDrrk (21)"]
[]
[null,"11-","CWSN-2 ¼Hkkx½ : n`f\"V ckf/kr (07)",{"$nulls":4},"vYi n`f\"V (08)",null,null,"pyu fu'kDrrk(09)",null,null,"dq\"B jksx (10)",null,null,"ckSukiu (11)"]
[]
[null,null,"rStkc fif³r (12)",null,null,"ekalis'kh nqfoZdkl ¼13½",{"$nulls":3},"ikfdZlkal jksx ¼17½",{"$nulls":3},"fgeksfQfy;k ¼18½",null,null,"FkSyslhfe;k ¼19½"]
[]
[null,null,",fufed@fLdy fMtht (20)",{"$nulls":3},"iksfy;ks@uoZ batjh ¼22½",{"$nulls":3},"lw;Zeq[kh ¼23½",{"$nulls":3}," @lSfud ¼24½"]
[]
[null,"12-","BPL ¼chih,y½ %",{"$nulls":4},"1- YES ¼gk¡½",null,{"$f":"IF(W1263=\"N\",\"\",\"Yes\")","v":"Yes"},null,null,"2- NO ¼ugha¡½",null,{"$f":"IF(W1263=\"Y\",\"\",\"Yes\")","v":"Yes"},{"$nulls":7},{"$f":"VLOOKUP(A1211,'Deta From Shala Dar. Class-10'!$A$2:$AE$201,27,0)","v":0}]
[]
[null,"13-","vukFk oxZ %",{"$nulls":4},"1- YES ¼gk¡½",{"$nulls":4},"2- NO ¼ugha¡½"]
[]
[null,"14-","EWS ¼vkfFkZd n`f\"V ls detksj oxZ½ %",{"$nulls":4},"1- YES ¼gk¡½",{"$nulls":4},"2- NO ¼ugha¡½"]
[]
[null,"15-","CASTE ¼tkfr Js.kh½ %",null,null,"¼05½ Gen ¼lkekU;½",null,null,{"$f":"IF($W$60=\"GEN\",\"YES\",\"\")","v":""},"¼06½ MINORITY ¼lkekU;vYi la[;d½",{"$nulls":3},{"$f":"IF($W$60=\"MIN\",\"YES\",\"\")","v":""},"¼07½ SC ¼vuqlwfpr tkfr½",{"$nulls":4},{"$f":"IF($W$60=\"SC\",\"YES\",\"\")","v":""},null,null,{"$f":"VLOOKUP(A1211,'Deta From Shala Dar. Class-10'!$A$2:$AE$201,16,0)","v":0}]
[]
[{"$nulls":5},"¼08½ ST ¼vuqlwfpr tutkfr½",null,null,{"$f":"IF($W$60=\"ST\",\"YES\",\"\")","v":""},"¼09½ OBC ¼vU; fiN³k oxZ½",{"$nulls":3},{"$f":"IF($W$60=\"OBC\",\"YES\",\"\")","v":""},"¼10½ Special OBC ¼fo'ks\"k fiN³k oxZ½@MBC",{"$nulls":4},{"$f":"IF(OR($W$60=\"MBC\",$W$60=\"SBC\"),\"YES\",\"\")","v":""}]
[null,"uksV%& Nk=o`fr@iqjLdkj mijksDr p;fur Js.kh ds vk/kj ij gh nh tk;sxhA"]
[]
[null,"16-","ADDRESS ¼fo|kFkhZ dk iw.kZ irk½ %&"]
[null,null,"House No./Street/Place Name ¼edku ua-@xyh ua-@LFkku½ %",{"$nulls":7},{"$f":"VLOOKUP(A1211,'Deta From Shala Dar. Class-12'!$A$2:$AE$201,24,0)","v":0}]
[null,null,"Village/Town/City ¼xzke@dLck@'kgj½ %"]
[null,null,"District ¼ftyk½ %",null,null,"………………………….",null,null,"STATE ¼jkT;½ %",null,null,"…………………………………..",{"$nulls":3},"PIN CODE NO. ¼fiu dksM ua-½ %",null,null,"……………………"]
[]
[null,"17-","fo|kFkhZ dk vk/kkj dkMZ uEcj %",{"$nulls":3},{"$f":"VLOOKUP(A1211,'Deta From Shala Dar. Class-12'!$A$2:$AE$201,21,0)","v":{"v":0,"d":"0000"}},{"$nulls":3},"tu vk/kkj uEcj %",null,{"$f":"VLOOKUP(A1211,'Deta From Shala Dar. Class-12'!$A$2:$AE$201,22,0)","v":0},null,null,"vfHkHkkod dh okf\"kZd vk; %",null,null,{"$f":"VLOOKUP(A1211,'Deta From Shala Dar. Class-12'!$A$2:$AE$201,25,0)","v":{"v":0,"d":"₹ 0"}}]
[]
[null,null,"Student/Guardian's Mobile No. ¼fo|kFkhZ@vfHkHkkod dk eksckby uacj½ %",{"$nulls":9},{"$f":"VLOOKUP(A1211,'Deta From Shala Dar. Class-12'!$A$2:$AE$201,23,0)","v":0}]
[]
[null,"18-","Previous Academic Details ¼iwoZ 'kS{kf.kd ;ksX;rk½ %",{"$nulls":9},"---------------------------------------------------------"]
[]
[null,"CLASS ¼d{kk½",null,null,"YEAR ¼oxZ½",null,"ROLL NO. ¼ukekad½",null,null,"RESULT ¼ifj.kke½",null,null,"NAME OF SCHOOL/BOARD ¼Ldwy@cksMZ dk uke½"]
[null,"VIII"]
[null,"IX"]
[null,"X"]
[]
[null,"19-","Student's Photo and Signature ¼fo|kFkhZ dk QksVks ,oa gLrk{kj½",{"$nulls":9}," "]
[{"$nulls":10},"Student's Signature ¼fo|kFkhZ ds gLrk{kj½"]
[{"$nulls":3},"PASTE PASSPORT\nSIZE PHOTO"]
[]
[]
[]
[]
[{"$nulls":11}," 'kkyk ç/kku dk çek.khdj.k %&\ngLrk{kj---------------------------------------------------------------"]
[]
[]
[]
[]
[null,"fo|ky; dk uke %&",null,null,{"$f":"Info!$C$7","v":"Govt. Sr. Sec. School Raimalwada"},{"$nulls":6}," 'kkyk dksM %&",null,{"$f":"Info!$C$10","v":1},{"$f":"Info!$D$10","v":7},{"$f":"Info!$E$10","v":0},{"$f":"Info!$F$10","v":1},{"$f":"Info!$G$10","v":7},{"$f":"Info!$H$10","v":5},{"$f":"Info!$I$10","v":1}]
[]
[{"$f":"A1211+1","v":15}]
[null,{"$f":"CONCATENATE(Info!$B$7,Info!$C$7)","v":"School Name :-Govt. Sr. Sec. School Raimalwada"}]
[{"$nulls":3},"Board of Secondary Education, Rajasthan",{"$nulls":12},"Sec. (Reg.)"]
[{"$nulls":3}," Ekk/;fed f’k{kk cksMZ] jktLFkku ",{"$nulls":12},"fu;fer ijh{kkFkhZ"]
[null,"ek/;fed ijh{kk",{"$nulls":3},"APPLICATION FORM FOR SENIOR SECONDARY EXAMINATION-2024",{"$nulls":7},{"$f":"Info!$C$10","v":1},{"$f":"Info!$D$10","v":7},{"$f":"Info!$E$10","v":0},{"$f":"Info!$F$10","v":1},{"$f":"Info!$G$10","v":7},{"$f":"Info!$H$10","v":5},{"$f":"Info!$I$10","v":1}]
[{"$nulls":5}," Ikjh{kk vkosnu i= ek/;fed ijh{kk & 2024"]
[{"$nulls":13}," 'kkyk niZ.k Øekad %&",{"$nulls":3},{"$f":"Info!$C$9","v":12345}]
[null,"Scholar Reg. No. ¼LdkWyj jftLVj Øekad½",{"$nulls":5},{"$f":"VLOOKUP(A1304,'Deta From Shala Dar. Class-10'!$A$2:$AE$201,4,0)","v":0}]
[null,"1- Student’s Name (fo|kFkhZ dk uke) :",{"$nulls":5},{"$f":"VLOOKUP(A1304,'Deta From Shala Dar. Class-10'!$A$2:$AE$201,6,0)","v":0}]
[null,"2- Mother’s Name ¼ekrk dk uke) :",{"$nulls":5},{"$f":"VLOOKUP(A1304,'Deta From Shala Dar. Class-10'!$A$2:$AE$201,8,0)","v":0}]
[null,"3- Father’s Name (firk dk uke) :",{"$nulls":5},{"$f":"VLOOKUP(A1304,'Deta From Shala Dar. Class-10'!$A$2:$AE$201,9,0)","v":0}]
[null,"4- Date Of Birth (tUe frfFk vadks esa) :",{"$nulls":3},{"$f":"W1315","v":"00:00:00"},{"$nulls":16},{"$f":"VLOOKUP(A1304,'Deta From Shala Dar. Class-10'!$A$2:$AE$201,11,0)","v":"00:00:00"}]
[null,"In Words (tUe frfFk 'kCnksa esa) :",{"$nulls":5},"……………………………………………………………"]
[null,"5- Category Code (Js.kh dksM) : ¼Js.kh p;u gsrq ihNs fy[ks fo’k\"sk funsZ’k la[;k 1 ns[ks½ Js.kh dk uke %&",{"$nulls":8},"………………………………………………….",{"$nulls":5},"dksM %&"]
[null,"6- Only for Category IV & VI (dsoy Js.kh 4 o 6 ds fy,)"]
[null,"Table - A : Only for category(dsoy Js.kh 1]2 , o 8 ds fy;s) (I)ALL SUBJECTS (1-lEiw.kZ fo\"k;), (II) DIVISION IMPROVEMENT (2-Js.kh lq/kkj) & (VIII) FACULTY CHANGE (8-oxZ ifjorZu)  OPTIONAL SUBJECTS oSdfYid fo\"k;) :"]
[]
[{"$nulls":3},"As Applicable ",{"$nulls":4},"tks ykxw gks½",{"$nulls":3},"1…………………………………………………………………………….."]
[]
[{"$nulls":3},"(IV) ADDITIONAL SUBJECTS CAT",{"$nulls":4},"¼4½ vfrfjDr fo\"k;",{"$nulls":3},"2…………………………………………………3………………………...…………………….."]
[]
[{"$nulls":3},"(VI) MARKS IMPROVEMENT CAT",{"$nulls":4},"¼6½ vad lq/kkj",{"$nulls":3},"4…………………………………………………5………………………...…………………….."]
[]
[]
[null,null,"√","As Applicable from Number 8 to 15 ¼Øekad 8 ls 15 rd tks ykxw gks",{"$nulls":8},"√","djsa½"]
[]
[null,"7-","Third Language ¼r`rh; Hkk\"kk½ (Only for Category I &II) ¼dsoy Js.kh 1 o 2 ds fy,½ ¼fo\"k; p;u gsrq ihNs fy[ks fo’ks\"k funsZ’k \nla[;k 3 ns[ksa½ %&"]
[]
[null,null,"Third Language Opted (p;fur r`rh; Hkk\"kk) fo\"k; dk uke",{"$nulls":8},"dksM"]
[]
[null,"8-","Name of Vocational Trade ¼O;kolkf;d VªsM dk uke½",{"$nulls":6},"………………………………………………………..",{"$nulls":5},"lgh dk fpUg yxk,aA"]
[null,null,"¼dsoy mu 'kkykvksa ds fy, tgka O;kolkf;d f'k{kk lapkfyr gS ,oa ftu fo|kfFkZ;ksa us d{kk 10 rFkk 11 oha esa O;kolkf;d ijh{kk mRrh.kZ dh gSA½"]
[null,null," (1) Automotive (101)",{"$nulls":3},"(2) Beauty & Wellness (102)",{"$nulls":3},"(3) Health Care (103)",{"$nulls":3},"(4) IT & ITES (104)",null,null,"(5) Retail (105)"]
[]
[null,null," (6) Tourism & Hospitality (106)",{"$nulls":4},"(7) Security (107)",null,null,"(8) Apparel Made up Home Furnishing (108) ",{"$nulls":4},"(9) Electronics & Hardware (109)"]
[]
[null,null," (10) Agriculture (110)",{"$nulls":3},"(11) Plumber (111)",{"$nulls":3},"(12) Telecom (112)",{"$nulls":3},"(13) Banking Financial Services & Insurance (113)"]
[]
[null,null," (14) Construction (114)",{"$nulls":3},"(15) Food Processing (115)"]
[]
[null,"9-","Gender ¼fyax½ : (01) Male ¼iq:\"k½",{"$nulls":3},{"$f":"IF(W1344=\"F\",\"\",\"Yes\")","v":"Yes"},"(02) FEMALE ¼efgyk½",null,null,{"$f":"IF(AA1344=\"F\",\"\",\"Yes\")","v":"Yes"},"Medium ¼ek/;e½ : (01) HINDI ¼fgUnh½",{"$nulls":3},{"$f":"IF(X1344=\"Hindi\",\"Yes\",\"\")","v":"Yes"},"(02) ENGLISH ¼vaxzsth½",null,null,{"$f":"IF(X1344=\"english\",\"Yes\",\"\")","v":""},null,null,{"$f":"VLOOKUP(A1304,'Deta From Shala Dar. Class-10'!$A$2:$AE$201,10,0)","v":0},{"$f":"Info!$C$8","v":"Hindi"}]
[]
[null,"10-","CWSN-1 ¼Hkkx½ : ekufld eanrk (01)",{"$nulls":4},"vkWfVTe (02)",null,null,"lsfjcy iYlh (03)",null,null,"ekufld jksx (04)",null,null,"Jo.k ckf/kr (05)"]
[]
[null,null,"ewd fu'kDrrk (06)",null,null,"LisfLQd yfuZax fMl,fcfyfV (14)",{"$nulls":4},"ckSf)d fu'kDrrk (15)",{"$nulls":3},"efYViy LDysjksfll (16)",null,null,"cgq fu'kDrrk (21)"]
[]
[null,"11-","CWSN-2 ¼Hkkx½ : n`f\"V ckf/kr (07)",{"$nulls":4},"vYi n`f\"V (08)",null,null,"pyu fu'kDrrk(09)",null,null,"dq\"B jksx (10)",null,null,"ckSukiu (11)"]
[]
[null,null,"rStkc fif³r (12)",null,null,"ekalis'kh nqfoZdkl ¼13½",{"$nulls":3},"ikfdZlkal jksx ¼17½",{"$nulls":3},"fgeksfQfy;k ¼18½",null,null,"FkSyslhfe;k ¼19½"]
[]
[null,null,",fufed@fLdy fMtht (20)",{"$nulls":3},"iksfy;ks@uoZ batjh ¼22½",{"$nulls":3},"lw;Zeq[kh ¼23½",{"$nulls":3}," @lSfud ¼24½"]
[]
[null,"12-","BPL ¼chih,y½ %",{"$nulls":4},"1- YES ¼gk¡½",null,{"$f":"IF(W1356=\"N\",\"\",\"Yes\")","v":"Yes"},null,null,"2- NO ¼ugha¡½",null,{"$f":"IF(W1356=\"Y\",\"\",\"Yes\")","v":"Yes"},{"$nulls":7},{"$f":"VLOOKUP(A1304,'Deta From Shala Dar. Class-10'!$A$2:$AE$201,27,0)","v":0}]
[]
[null,"13-","vukFk oxZ %",{"$nulls":4},"1- YES ¼gk¡½",{"$nulls":4},"2- NO ¼ugha¡½"]
[]
[null,"14-","EWS ¼vkfFkZd n`f\"V ls detksj oxZ½ %",{"$nulls":4},"1- YES ¼gk¡½",{"$nulls":4},"2- NO ¼ugha¡½"]
[]
[null,"15-","CASTE ¼tkfr Js.kh½ %",null,null,"¼05½ Gen ¼lkekU;½",null,null,{"$f":"IF($W$60=\"GEN\",\"YES\",\"\")","v":""},"¼06½ MINORITY ¼lkekU;vYi la[;d½",{"$nulls":3},{"$f":"IF($W$60=\"MIN\",\"YES\",\"\")","v":""},"¼07½ SC ¼vuqlwfpr tkfr½",{"$nulls":4},{"$f":"IF($W$60=\"SC\",\"YES\",\"\")","v":""},null,null,{"$f":"VLOOKUP(A1304,'Deta From Shala Dar. Class-10'!$A$2:$AE$201,16,0)","v":0}]
[]
[{"$nulls":5},"¼08½ ST ¼vuqlwfpr tutkfr½",null,null,{"$f":"IF($W$60=\"ST\",\"YES\",\"\")","v":""},"¼09½ OBC ¼vU; fiN³k oxZ½",{"$nulls":3},{"$f":"IF($W$60=\"OBC\",\"YES\",\"\")","v":""},"¼10½ Special OBC ¼fo'ks\"k fiN³k oxZ½@MBC",{"$nulls":4},{"$f":"IF(OR($W$60=\"MBC\",$W$60=\"SBC\"),\"YES\",\"\")","v":""}]
[null,"uksV%& Nk=o`fr@iqjLdkj mijksDr p;fur Js.kh ds vk/kj ij gh nh tk;sxhA"]
[]
[null,"16-","ADDRESS ¼fo|kFkhZ dk iw.kZ irk½ %&"]
[null,null,"House No./Street/Place Name ¼edku ua-@xyh ua-@LFkku½ %",{"$nulls":7},{"$f":"VLOOKUP(A1304,'Deta From Shala Dar. Class-12'!$A$2:$AE$201,24,0)","v":0}]
[null,null,"Village/Town/City ¼xzke@dLck@'kgj½ %"]
[null,null,"District ¼ftyk½ %",null,null,"………………………….",null,null,"STATE ¼jkT;½ %",null,null,"…………………………………..",{"$nulls":3},"PIN CODE NO. ¼fiu dksM ua-½ %",null,null,"……………………"]
[]
[null,"17-","fo|kFkhZ dk vk/kkj dkMZ uEcj %",{"$nulls":3},{"$f":"VLOOKUP(A1304,'Deta From Shala Dar. Class-12'!$A$2:$AE$201,21,0)","v":{"v":0,"d":"0000"}},{"$nulls":3},"tu vk/kkj uEcj %",null,{"$f":"VLOOKUP(A1304,'Deta From Shala Dar. Class-12'!$A$2:$AE$201,22,0)","v":0},null,null,"vfHkHkkod dh okf\"kZd vk; %",null,null,{"$f":"VLOOKUP(A1304,'Deta From Shala Dar. Class-12'!$A$2:$AE$201,25,0)","v":{"v":0,"d":"₹ 0"}}]
[]
[null,null,"Student/Guardian's Mobile No. ¼fo|kFkhZ@vfHkHkkod dk eksckby uacj½ %",{"$nulls":9},{"$f":"VLOOKUP(A1304,'Deta From Shala Dar. Class-12'!$A$2:$AE$201,23,0)","v":0}]
[]
[null,"18-","Previous Academic Details ¼iwoZ 'kS{kf.kd ;ksX;rk½ %",{"$nulls":9},"---------------------------------------------------------"]
[]
[null,"CLASS ¼d{kk½",null,null,"YEAR ¼oxZ½",null,"ROLL NO. ¼ukekad½",null,null,"RESULT ¼ifj.kke½",null,null,"NAME OF SCHOOL/BOARD ¼Ldwy@cksMZ dk uke½"]
[null,"VIII"]
[null,"IX"]
[null,"X"]
[]
[null,"19-","Student's Photo and Signature ¼fo|kFkhZ dk QksVks ,oa gLrk{kj½",{"$nulls":9}," "]
[{"$nulls":10},"Student's Signature ¼fo|kFkhZ ds gLrk{kj½"]
[{"$nulls":3},"PASTE PASSPORT\nSIZE PHOTO"]
[]
[]
[]
[]
[{"$nulls":11}," 'kkyk ç/kku dk çek.khdj.k %&\ngLrk{kj---------------------------------------------------------------"]
[]
[]
[]
[]
[null,"fo|ky; dk uke %&",null,null,{"$f":"Info!$C$7","v":"Govt. Sr. Sec. School Raimalwada"},{"$nulls":6}," 'kkyk dksM %&",null,{"$f":"Info!$C$10","v":1},{"$f":"Info!$D$10","v":7},{"$f":"Info!$E$10","v":0},{"$f":"Info!$F$10","v":1},{"$f":"Info!$G$10","v":7},{"$f":"Info!$H$10","v":5},{"$f":"Info!$I$10","v":1}]
[]
[{"$f":"A1304+1","v":16}]
[null,{"$f":"CONCATENATE(Info!$B$7,Info!$C$7)","v":"School Name :-Govt. Sr. Sec. School Raimalwada"}]
[{"$nulls":3},"Board of Secondary Education, Rajasthan",{"$nulls":12},"Sec. (Reg.)"]
[{"$nulls":3}," Ekk/;fed f’k{kk cksMZ] jktLFkku ",{"$nulls":12},"fu;fer ijh{kkFkhZ"]
[null,"ek/;fed ijh{kk",{"$nulls":3},"APPLICATION FORM FOR SENIOR SECONDARY EXAMINATION-2024",{"$nulls":7},{"$f":"Info!$C$10","v":1},{"$f":"Info!$D$10","v":7},{"$f":"Info!$E$10","v":0},{"$f":"Info!$F$10","v":1},{"$f":"Info!$G$10","v":7},{"$f":"Info!$H$10","v":5},{"$f":"Info!$I$10","v":1}]
[{"$nulls":5}," Ikjh{kk vkosnu i= ek/;fed ijh{kk & 2024"]
[{"$nulls":13}," 'kkyk niZ.k Øekad %&",{"$nulls":3},{"$f":"Info!$C$9","v":12345}]
[null,"Scholar Reg. No. ¼LdkWyj jftLVj Øekad½",{"$nulls":5},{"$f":"VLOOKUP(A1397,'Deta From Shala Dar. Class-10'!$A$2:$AE$201,4,0)","v":0}]
[null,"1- Student’s Name (fo|kFkhZ dk uke) :",{"$nulls":5},{"$f":"VLOOKUP(A1397,'Deta From Shala Dar. Class-10'!$A$2:$AE$201,6,0)","v":0}]
[null,"2- Mother’s Name ¼ekrk dk uke) :",{"$nulls":5},{"$f":"VLOOKUP(A1397,'Deta From Shala Dar. Class-10'!$A$2:$AE$201,8,0)","v":0}]
[null,"3- Father’s Name (firk dk uke) :",{"$nulls":5},{"$f":"VLOOKUP(A1397,'Deta From Shala Dar. Class-10'!$A$2:$AE$201,9,0)","v":0}]
[null,"4- Date Of Birth (tUe frfFk vadks esa) :",{"$nulls":3},{"$f":"W1408","v":"00:00:00"},{"$nulls":16},{"$f":"VLOOKUP(A1397,'Deta From Shala Dar. Class-10'!$A$2:$AE$201,11,0)","v":"00:00:00"}]
[null,"In Words (tUe frfFk 'kCnksa esa) :",{"$nulls":5},"……………………………………………………………"]
[null,"5- Category Code (Js.kh dksM) : ¼Js.kh p;u gsrq ihNs fy[ks fo’k\"sk funsZ’k la[;k 1 ns[ks½ Js.kh dk uke %&",{"$nulls":8},"………………………………………………….",{"$nulls":5},"dksM %&"]
[null,"6- Only for Category IV & VI (dsoy Js.kh 4 o 6 ds fy,)"]
[null,"Table - A : Only for category(dsoy Js.kh 1]2 , o 8 ds fy;s) (I)ALL SUBJECTS (1-lEiw.kZ fo\"k;), (II) DIVISION IMPROVEMENT (2-Js.kh lq/kkj) & (VIII) FACULTY CHANGE (8-oxZ ifjorZu)  OPTIONAL SUBJECTS oSdfYid fo\"k;) :"]
[]
[{"$nulls":3},"As Applicable ",{"$nulls":4},"tks ykxw gks½",{"$nulls":3},"1…………………………………………………………………………….."]
[]
[{"$nulls":3},"(IV) ADDITIONAL SUBJECTS CAT",{"$nulls":4},"¼4½ vfrfjDr fo\"k;",{"$nulls":3},"2…………………………………………………3………………………...…………………….."]
[]
[{"$nulls":3},"(VI) MARKS IMPROVEMENT CAT",{"$nulls":4},"¼6½ vad lq/kkj",{"$nulls":3},"4…………………………………………………5………………………...…………………….."]
[]
[]
[null,null,"√","As Applicable from Number 8 to 15 ¼Øekad 8 ls 15 rd tks ykxw gks",{"$nulls":8},"√","djsa½"]
[]
[null,"7-","Third Language ¼r`rh; Hkk\"kk½ (Only for Category I &II) ¼dsoy Js.kh 1 o 2 ds fy,½ ¼fo\"k; p;u gsrq ihNs fy[ks fo’ks\"k funsZ’k \nla[;k 3 ns[ksa½ %&"]
[]
[null,null,"Third Language Opted (p;fur r`rh; Hkk\"kk) fo\"k; dk uke",{"$nulls":8},"dksM"]
[]
[null,"8-","Name of Vocational Trade ¼O;kolkf;d VªsM dk uke½",{"$nulls":6},"………………………………………………………..",{"$nulls":5},"lgh dk fpUg yxk,aA"]
[null,null,"¼dsoy mu 'kkykvksa ds fy, tgka O;kolkf;d f'k{kk lapkfyr gS ,oa ftu fo|kfFkZ;ksa us d{kk 10 rFkk 11 oha esa O;kolkf;d ijh{kk mRrh.kZ dh gSA½"]
[null,null," (1) Automotive (101)",{"$nulls":3},"(2) Beauty & Wellness (102)",{"$nulls":3},"(3) Health Care (103)",{"$nulls":3},"(4) IT & ITES (104)",null,null,"(5) Retail (105)"]
[]
[null,null," (6) Tourism & Hospitality (106)",{"$nulls":4},"(7) Security (107)",null,null,"(8) Apparel Made up Home Furnishing (108) ",{"$nulls":4},"(9) Electronics & Hardware (109)"]
[]
[null,null," (10) Agriculture (110)",{"$nulls":3},"(11) Plumber (111)",{"$nulls":3},"(12) Telecom (112)",{"$nulls":3},"(13) Banking Financial Services & Insurance (113)"]
[]
[null,null," (14) Construction (114)",{"$nulls":3},"(15) Food Processing (115)"]
[]
[null,"9-","Gender ¼fyax½ : (01) Male ¼iq:\"k½",{"$nulls":3},{"$f":"IF(W1437=\"F\",\"\",\"Yes\")","v":"Yes"},"(02) FEMALE ¼efgyk½",null,null,{"$f":"IF(AA1437=\"F\",\"\",\"Yes\")","v":"Yes"},"Medium ¼ek/;e½ : (01) HINDI ¼fgUnh½",{"$nulls":3},{"$f":"IF(X1437=\"Hindi\",\"Yes\",\"\")","v":"Yes"},"(02) ENGLISH ¼vaxzsth½",null,null,{"$f":"IF(X1437=\"english\",\"Yes\",\"\")","v":""},null,null,{"$f":"VLOOKUP(A1397,'Deta From Shala Dar. Class-10'!$A$2:$AE$201,10,0)","v":0},{"$f":"Info!$C$8","v":"Hindi"}]
[]
[null,"10-","CWSN-1 ¼Hkkx½ : ekufld eanrk (01)",{"$nulls":4},"vkWfVTe (02)",null,null,"lsfjcy iYlh (03)",null,null,"ekufld jksx (04)",null,null,"Jo.k ckf/kr (05)"]
[]
[null,null,"ewd fu'kDrrk (06)",null,null,"LisfLQd yfuZax fMl,fcfyfV (14)",{"$nulls":4},"ckSf)d fu'kDrrk (15)",{"$nulls":3},"efYViy LDysjksfll (16)",null,null,"cgq fu'kDrrk (21)"]
[]
[null,"11-","CWSN-2 ¼Hkkx½ : n`f\"V ckf/kr (07)",{"$nulls":4},"vYi n`f\"V (08)",null,null,"pyu fu'kDrrk(09)",null,null,"dq\"B jksx (10)",null,null,"ckSukiu (11)"]
[]
[null,null,"rStkc fif³r (12)",null,null,"ekalis'kh nqfoZdkl ¼13½",{"$nulls":3},"ikfdZlkal jksx ¼17½",{"$nulls":3},"fgeksfQfy;k ¼18½",null,null,"FkSyslhfe;k ¼19½"]
[]
[null,null,",fufed@fLdy fMtht (20)",{"$nulls":3},"iksfy;ks@uoZ batjh ¼22½",{"$nulls":3},"lw;Zeq[kh ¼23½",{"$nulls":3}," @lSfud ¼24½"]
[]
[null,"12-","BPL ¼chih,y½ %",{"$nulls":4},"1- YES ¼gk¡½",null,{"$f":"IF(W1449=\"N\",\"\",\"Yes\")","v":"Yes"},null,null,"2- NO ¼ugha¡½",null,{"$f":"IF(W1449=\"Y\",\"\",\"Yes\")","v":"Yes"},{"$nulls":7},{"$f":"VLOOKUP(A1397,'Deta From Shala Dar. Class-10'!$A$2:$AE$201,27,0)","v":0}]
[]
[null,"13-","vukFk oxZ %",{"$nulls":4},"1- YES ¼gk¡½",{"$nulls":4},"2- NO ¼ugha¡½"]
[]
[null,"14-","EWS ¼vkfFkZd n`f\"V ls detksj oxZ½ %",{"$nulls":4},"1- YES ¼gk¡½",{"$nulls":4},"2- NO ¼ugha¡½"]
[]
[null,"15-","CASTE ¼tkfr Js.kh½ %",null,null,"¼05½ Gen ¼lkekU;½",null,null,{"$f":"IF($W$60=\"GEN\",\"YES\",\"\")","v":""},"¼06½ MINORITY ¼lkekU;vYi la[;d½",{"$nulls":3},{"$f":"IF($W$60=\"MIN\",\"YES\",\"\")","v":""},"¼07½ SC ¼vuqlwfpr tkfr½",{"$nulls":4},{"$f":"IF($W$60=\"SC\",\"YES\",\"\")","v":""},null,null,{"$f":"VLOOKUP(A1397,'Deta From Shala Dar. Class-10'!$A$2:$AE$201,16,0)","v":0}]
[]
[{"$nulls":5},"¼08½ ST ¼vuqlwfpr tutkfr½",null,null,{"$f":"IF($W$60=\"ST\",\"YES\",\"\")","v":""},"¼09½ OBC ¼vU; fiN³k oxZ½",{"$nulls":3},{"$f":"IF($W$60=\"OBC\",\"YES\",\"\")","v":""},"¼10½ Special OBC ¼fo'ks\"k fiN³k oxZ½@MBC",{"$nulls":4},{"$f":"IF(OR($W$60=\"MBC\",$W$60=\"SBC\"),\"YES\",\"\")","v":""}]
[null,"uksV%& Nk=o`fr@iqjLdkj mijksDr p;fur Js.kh ds vk/kj ij gh nh tk;sxhA"]
[]
[null,"16-","ADDRESS ¼fo|kFkhZ dk iw.kZ irk½ %&"]
[null,null,"House No./Street/Place Name ¼edku ua-@xyh ua-@LFkku½ %",{"$nulls":7},{"$f":"VLOOKUP(A1397,'Deta From Shala Dar. Class-12'!$A$2:$AE$201,24,0)","v":0}]
[null,null,"Village/Town/City ¼xzke@dLck@'kgj½ %"]
[null,null,"District ¼ftyk½ %",null,null,"………………………….",null,null,"STATE ¼jkT;½ %",null,null,"…………………………………..",{"$nulls":3},"PIN CODE NO. ¼fiu dksM ua-½ %",null,null,"……………………"]
[]
[null,"17-","fo|kFkhZ dk vk/kkj dkMZ uEcj %",{"$nulls":3},{"$f":"VLOOKUP(A1397,'Deta From Shala Dar. Class-12'!$A$2:$AE$201,21,0)","v":{"v":0,"d":"0000"}},{"$nulls":3},"tu vk/kkj uEcj %",null,{"$f":"VLOOKUP(A1397,'Deta From Shala Dar. Class-12'!$A$2:$AE$201,22,0)","v":0},null,null,"vfHkHkkod dh okf\"kZd vk; %",null,null,{"$f":"VLOOKUP(A1397,'Deta From Shala Dar. Class-12'!$A$2:$AE$201,25,0)","v":{"v":0,"d":"₹ 0"}}]
[]
[null,null,"Student/Guardian's Mobile No. ¼fo|kFkhZ@vfHkHkkod dk eksckby uacj½ %",{"$nulls":9},{"$f":"VLOOKUP(A1397,'Deta From Shala Dar. Class-12'!$A$2:$AE$201,23,0)","v":0}]
[]
[null,"18-","Previous Academic Details ¼iwoZ 'kS{kf.kd ;ksX;rk½ %",{"$nulls":9},"---------------------------------------------------------"]
[]
[null,"CLASS ¼d{kk½",null,null,"YEAR ¼oxZ½",null,"ROLL NO. ¼ukekad½",null,null,"RESULT ¼ifj.kke½",null,null,"NAME OF SCHOOL/BOARD ¼Ldwy@cksMZ dk uke½"]
[null,"VIII"]
[null,"IX"]
[null,"X"]
[]
[null,"19-","Student's Photo and Signature ¼fo|kFkhZ dk QksVks ,oa gLrk{kj½",{"$nulls":9}," "]
[{"$nulls":10},"Student's Signature ¼fo|kFkhZ ds gLrk{kj½"]
[{"$nulls":3},"PASTE PASSPORT\nSIZE PHOTO"]
[]
[]
[]
[]
[{"$nulls":11}," 'kkyk ç/kku dk çek.khdj.k %&\ngLrk{kj---------------------------------------------------------------"]
[]
[]
[]
[]
[null,"fo|ky; dk uke %&",null,null,{"$f":"Info!$C$7","v":"Govt. Sr. Sec. School Raimalwada"},{"$nulls":6}," 'kkyk dksM %&",null,{"$f":"Info!$C$10","v":1},{"$f":"Info!$D$10","v":7},{"$f":"Info!$E$10","v":0},{"$f":"Info!$F$10","v":1},{"$f":"Info!$G$10","v":7},{"$f":"Info!$H$10","v":5},{"$f":"Info!$I$10","v":1}]
[]
[{"$f":"A1397+1","v":17}]
[null,{"$f":"CONCATENATE(Info!$B$7,Info!$C$7)","v":"School Name :-Govt. Sr. Sec. School Raimalwada"}]
[{"$nulls":3},"Board of Secondary Education, Rajasthan",{"$nulls":12},"Sec. (Reg.)"]
[{"$nulls":3}," Ekk/;fed f’k{kk cksMZ] jktLFkku ",{"$nulls":12},"fu;fer ijh{kkFkhZ"]
[null,"ek/;fed ijh{kk",{"$nulls":3},"APPLICATION FORM FOR SENIOR SECONDARY EXAMINATION-2024",{"$nulls":7},{"$f":"Info!$C$10","v":1},{"$f":"Info!$D$10","v":7},{"$f":"Info!$E$10","v":0},{"$f":"Info!$F$10","v":1},{"$f":"Info!$G$10","v":7},{"$f":"Info!$H$10","v":5},{"$f":"Info!$I$10","v":1}]
[{"$nulls":5}," Ikjh{kk vkosnu i= ek/;fed ijh{kk & 2024"]
[{"$nulls":13}," 'kkyk niZ.k Øekad %&",{"$nulls":3},{"$f":"Info!$C$9","v":12345}]
[null,"Scholar Reg. No. ¼LdkWyj jftLVj Øekad½",{"$nulls":5},{"$f":"VLOOKUP(A1490,'Deta From Shala Dar. Class-10'!$A$2:$AE$201,4,0)","v":0}]
[null,"1- Student’s Name (fo|kFkhZ dk uke) :",{"$nulls":5},{"$f":"VLOOKUP(A1490,'Deta From Shala Dar. Class-10'!$A$2:$AE$201,6,0)","v":0}]
[null,"2- Mother’s Name ¼ekrk dk uke) :",{"$nulls":5},{"$f":"VLOOKUP(A1490,'Deta From Shala Dar. Class-10'!$A$2:$AE$201,8,0)","v":0}]
[null,"3- Father’s Name (firk dk uke) :",{"$nulls":5},{"$f":"VLOOKUP(A1490,'Deta From Shala Dar. Class-10'!$A$2:$AE$201,9,0)","v":0}]
[null,"4- Date Of Birth (tUe frfFk vadks esa) :",{"$nulls":3},{"$f":"W1501","v":"00:00:00"},{"$nulls":16},{"$f":"VLOOKUP(A1490,'Deta From Shala Dar. Class-10'!$A$2:$AE$201,11,0)","v":"00:00:00"}]
[null,"In Words (tUe frfFk 'kCnksa esa) :",{"$nulls":5},"……………………………………………………………"]
[null,"5- Category Code (Js.kh dksM) : ¼Js.kh p;u gsrq ihNs fy[ks fo’k\"sk funsZ’k la[;k 1 ns[ks½ Js.kh dk uke %&",{"$nulls":8},"………………………………………………….",{"$nulls":5},"dksM %&"]
[null,"6- Only for Category IV & VI (dsoy Js.kh 4 o 6 ds fy,)"]
[null,"Table - A : Only for category(dsoy Js.kh 1]2 , o 8 ds fy;s) (I)ALL SUBJECTS (1-lEiw.kZ fo\"k;), (II) DIVISION IMPROVEMENT (2-Js.kh lq/kkj) & (VIII) FACULTY CHANGE (8-oxZ ifjorZu)  OPTIONAL SUBJECTS oSdfYid fo\"k;) :"]
[]
[{"$nulls":3},"As Applicable ",{"$nulls":4},"tks ykxw gks½",{"$nulls":3},"1…………………………………………………………………………….."]
[]
[{"$nulls":3},"(IV) ADDITIONAL SUBJECTS CAT",{"$nulls":4},"¼4½ vfrfjDr fo\"k;",{"$nulls":3},"2…………………………………………………3………………………...…………………….."]
[]
[{"$nulls":3},"(VI) MARKS IMPROVEMENT CAT",{"$nulls":4},"¼6½ vad lq/kkj",{"$nulls":3},"4…………………………………………………5………………………...…………………….."]
[]
[]
[null,null,"√","As Applicable from Number 8 to 15 ¼Øekad 8 ls 15 rd tks ykxw gks",{"$nulls":8},"√","djsa½"]
[]
[null,"7-","Third Language ¼r`rh; Hkk\"kk½ (Only for Category I &II) ¼dsoy Js.kh 1 o 2 ds fy,½ ¼fo\"k; p;u gsrq ihNs fy[ks fo’ks\"k funsZ’k \nla[;k 3 ns[ksa½ %&"]
[]
[null,null,"Third Language Opted (p;fur r`rh; Hkk\"kk) fo\"k; dk uke",{"$nulls":8},"dksM"]
[]
[null,"8-","Name of Vocational Trade ¼O;kolkf;d VªsM dk uke½",{"$nulls":6},"………………………………………………………..",{"$nulls":5},"lgh dk fpUg yxk,aA"]
[null,null,"¼dsoy mu 'kkykvksa ds fy, tgka O;kolkf;d f'k{kk lapkfyr gS ,oa ftu fo|kfFkZ;ksa us d{kk 10 rFkk 11 oha esa O;kolkf;d ijh{kk mRrh.kZ dh gSA½"]
[null,null," (1) Automotive (101)",{"$nulls":3},"(2) Beauty & Wellness (102)",{"$nulls":3},"(3) Health Care (103)",{"$nulls":3},"(4) IT & ITES (104)",null,null,"(5) Retail (105)"]
[]
[null,null," (6) Tourism & Hospitality (106)",{"$nulls":4},"(7) Security (107)",null,null,"(8) Apparel Made up Home Furnishing (108) ",{"$nulls":4},"(9) Electronics & Hardware (109)"]
[]
[null,null," (10) Agriculture (110)",{"$nulls":3},"(11) Plumber (111)",{"$nulls":3},"(12) Telecom (112)",{"$nulls":3},"(13) Banking Financial Services & Insurance (113)"]
[]
[null,null," (14) Construction (114)",{"$nulls":3},"(15) Food Processing (115)"]
[]
[null,"9-","Gender ¼fyax½ : (01) Male ¼iq:\"k½",{"$nulls":3},{"$f":"IF(W1530=\"F\",\"\",\"Yes\")","v":"Yes"},"(02) FEMALE ¼efgyk½",null,null,{"$f":"IF(AA1530=\"F\",\"\",\"Yes\")","v":"Yes"},"Medium ¼ek/;e½ : (01) HINDI ¼fgUnh½",{"$nulls":3},{"$f":"IF(X1530=\"Hindi\",\"Yes\",\"\")","v":"Yes"},"(02) ENGLISH ¼vaxzsth½",null,null,{"$f":"IF(X1530=\"english\",\"Yes\",\"\")","v":""},null,null,{"$f":"VLOOKUP(A1490,'Deta From Shala Dar. Class-10'!$A$2:$AE$201,10,0)","v":0},{"$f":"Info!$C$8","v":"Hindi"}]
[]
[null,"10-","CWSN-1 ¼Hkkx½ : ekufld eanrk (01)",{"$nulls":4},"vkWfVTe (02)",null,null,"lsfjcy iYlh (03)",null,null,"ekufld jksx (04)",null,null,"Jo.k ckf/kr (05)"]
[]
[null,null,"ewd fu'kDrrk (06)",null,null,"LisfLQd yfuZax fMl,fcfyfV (14)",{"$nulls":4},"ckSf)d fu'kDrrk (15)",{"$nulls":3},"efYViy LDysjksfll (16)",null,null,"cgq fu'kDrrk (21)"]
[]
[null,"11-","CWSN-2 ¼Hkkx½ : n`f\"V ckf/kr (07)",{"$nulls":4},"vYi n`f\"V (08)",null,null,"pyu fu'kDrrk(09)",null,null,"dq\"B jksx (10)",null,null,"ckSukiu (11)"]
[]
[null,null,"rStkc fif³r (12)",null,null,"ekalis'kh nqfoZdkl ¼13½",{"$nulls":3},"ikfdZlkal jksx ¼17½",{"$nulls":3},"fgeksfQfy;k ¼18½",null,null,"FkSyslhfe;k ¼19½"]
[]
[null,null,",fufed@fLdy fMtht (20)",{"$nulls":3},"iksfy;ks@uoZ batjh ¼22½",{"$nulls":3},"lw;Zeq[kh ¼23½",{"$nulls":3}," @lSfud ¼24½"]
[]
[null,"12-","BPL ¼chih,y½ %",{"$nulls":4},"1- YES ¼gk¡½",null,{"$f":"IF(W1542=\"N\",\"\",\"Yes\")","v":"Yes"},null,null,"2- NO ¼ugha¡½",null,{"$f":"IF(W1542=\"Y\",\"\",\"Yes\")","v":"Yes"},{"$nulls":7},{"$f":"VLOOKUP(A1490,'Deta From Shala Dar. Class-10'!$A$2:$AE$201,27,0)","v":0}]
[]
[null,"13-","vukFk oxZ %",{"$nulls":4},"1- YES ¼gk¡½",{"$nulls":4},"2- NO ¼ugha¡½"]
[]
[null,"14-","EWS ¼vkfFkZd n`f\"V ls detksj oxZ½ %",{"$nulls":4},"1- YES ¼gk¡½",{"$nulls":4},"2- NO ¼ugha¡½"]
[]
[null,"15-","CASTE ¼tkfr Js.kh½ %",null,null,"¼05½ Gen ¼lkekU;½",null,null,{"$f":"IF($W$60=\"GEN\",\"YES\",\"\")","v":""},"¼06½ MINORITY ¼lkekU;vYi la[;d½",{"$nulls":3},{"$f":"IF($W$60=\"MIN\",\"YES\",\"\")","v":""},"¼07½ SC ¼vuqlwfpr tkfr½",{"$nulls":4},{"$f":"IF($W$60=\"SC\",\"YES\",\"\")","v":""},null,null,{"$f":"VLOOKUP(A1490,'Deta From Shala Dar. Class-10'!$A$2:$AE$201,16,0)","v":0}]
[]
[{"$nulls":5},"¼08½ ST ¼vuqlwfpr tutkfr½",null,null,{"$f":"IF($W$60=\"ST\",\"YES\",\"\")","v":""},"¼09½ OBC ¼vU; fiN³k oxZ½",{"$nulls":3},{"$f":"IF($W$60=\"OBC\",\"YES\",\"\")","v":""},"¼10½ Special OBC ¼fo'ks\"k fiN³k oxZ½@MBC",{"$nulls":4},{"$f":"IF(OR($W$60=\"MBC\",$W$60=\"SBC\"),\"YES\",\"\")","v":""}]
[null,"uksV%& Nk=o`fr@iqjLdkj mijksDr p;fur Js.kh ds vk/kj ij gh nh tk;sxhA"]
[]
[null,"16-","ADDRESS ¼fo|kFkhZ dk iw.kZ irk½ %&"]
[null,null,"House No./Street/Place Name ¼edku ua-@xyh ua-@LFkku½ %",{"$nulls":7},{"$f":"VLOOKUP(A1490,'Deta From Shala Dar. Class-12'!$A$2:$AE$201,24,0)","v":0}]
[null,null,"Village/Town/City ¼xzke@dLck@'kgj½ %"]
[null,null,"District ¼ftyk½ %",null,null,"………………………….",null,null,"STATE ¼jkT;½ %",null,null,"…………………………………..",{"$nulls":3},"PIN CODE NO. ¼fiu dksM ua-½ %",null,null,"……………………"]
[]
[null,"17-","fo|kFkhZ dk vk/kkj dkMZ uEcj %",{"$nulls":3},{"$f":"VLOOKUP(A1490,'Deta From Shala Dar. Class-12'!$A$2:$AE$201,21,0)","v":{"v":0,"d":"0000"}},{"$nulls":3},"tu vk/kkj uEcj %",null,{"$f":"VLOOKUP(A1490,'Deta From Shala Dar. Class-12'!$A$2:$AE$201,22,0)","v":0},null,null,"vfHkHkkod dh okf\"kZd vk; %",null,null,{"$f":"VLOOKUP(A1490,'Deta From Shala Dar. Class-12'!$A$2:$AE$201,25,0)","v":{"v":0,"d":"₹ 0"}}]
[]
[null,null,"Student/Guardian's Mobile No. ¼fo|kFkhZ@vfHkHkkod dk eksckby uacj½ %",{"$nulls":9},{"$f":"VLOOKUP(A1490,'Deta From Shala Dar. Class-12'!$A$2:$AE$201,23,0)","v":0}]
[]
[null,"18-","Previous Academic Details ¼iwoZ 'kS{kf.kd ;ksX;rk½ %",{"$nulls":9},"---------------------------------------------------------"]
[]
[null,"CLASS ¼d{kk½",null,null,"YEAR ¼oxZ½",null,"ROLL NO. ¼ukekad½",null,null,"RESULT ¼ifj.kke½",null,null,"NAME OF SCHOOL/BOARD ¼Ldwy@cksMZ dk uke½"]
[null,"VIII"]
[null,"IX"]
[null,"X"]
[]
[null,"19-","Student's Photo and Signature ¼fo|kFkhZ dk QksVks ,oa gLrk{kj½",{"$nulls":9}," "]
[{"$nulls":10},"Student's Signature ¼fo|kFkhZ ds gLrk{kj½"]
[{"$nulls":3},"PASTE PASSPORT\nSIZE PHOTO"]
[]
[]
[]
[]
[{"$nulls":11}," 'kkyk ç/kku dk çek.khdj.k %&\ngLrk{kj---------------------------------------------------------------"]
[]
[]
[]
[]
[null,"fo|ky; dk uke %&",null,null,{"$f":"Info!$C$7","v":"Govt. Sr. Sec. School Raimalwada"},{"$nulls":6}," 'kkyk dksM %&",null,{"$f":"Info!$C$10","v":1},{"$f":"Info!$D$10","v":7},{"$f":"Info!$E$10","v":0},{"$f":"Info!$F$10","v":1},{"$f":"Info!$G$10","v":7},{"$f":"Info!$H$10","v":5},{"$f":"Info!$I$10","v":1}]
[]
[{"$f":"A1490+1","v":18}]
[null,{"$f":"CONCATENATE(Info!$B$7,Info!$C$7)","v":"School Name :-Govt. Sr. Sec. School Raimalwada"}]
[{"$nulls":3},"Board of Secondary Education, Rajasthan",{"$nulls":12},"Sec. (Reg.)"]
[{"$nulls":3}," Ekk/;fed f’k{kk cksMZ] jktLFkku ",{"$nulls":12},"fu;fer ijh{kkFkhZ"]
[null,"ek/;fed ijh{kk",{"$nulls":3},"APPLICATION FORM FOR SENIOR SECONDARY EXAMINATION-2024",{"$nulls":7},{"$f":"Info!$C$10","v":1},{"$f":"Info!$D$10","v":7},{"$f":"Info!$E$10","v":0},{"$f":"Info!$F$10","v":1},{"$f":"Info!$G$10","v":7},{"$f":"Info!$H$10","v":5},{"$f":"Info!$I$10","v":1}]
[{"$nulls":5}," Ikjh{kk vkosnu i= ek/;fed ijh{kk & 2024"]
[{"$nulls":13}," 'kkyk niZ.k Øekad %&",{"$nulls":3},{"$f":"Info!$C$9","v":12345}]
[null,"Scholar Reg. No. ¼LdkWyj jftLVj Øekad½",{"$nulls":5},{"$f":"VLOOKUP(A1583,'Deta From Shala Dar. Class-10'!$A$2:$AE$201,4,0)","v":0}]
[null,"1- Student’s Name (fo|kFkhZ dk uke) :",{"$nulls":5},{"$f":"VLOOKUP(A1583,'Deta From Shala Dar. Class-10'!$A$2:$AE$201,6,0)","v":0}]
[null,"2- Mother’s Name ¼ekrk dk uke) :",{"$nulls":5},{"$f":"VLOOKUP(A1583,'Deta From Shala Dar. Class-10'!$A$2:$AE$201,8,0)","v":0}]
[null,"3- Father’s Name (firk dk uke) :",{"$nulls":5},{"$f":"VLOOKUP(A1583,'Deta From Shala Dar. Class-10'!$A$2:$AE$201,9,0)","v":0}]
[null,"4- Date Of Birth (tUe frfFk vadks esa) :",{"$nulls":3},{"$f":"W1594","v":"00:00:00"},{"$nulls":16},{"$f":"VLOOKUP(A1583,'Deta From Shala Dar. Class-10'!$A$2:$AE$201,11,0)","v":"00:00:00"}]
[null,"In Words (tUe frfFk 'kCnksa esa) :",{"$nulls":5},"……………………………………………………………"]
[null,"5- Category Code (Js.kh dksM) : ¼Js.kh p;u gsrq ihNs fy[ks fo’k\"sk funsZ’k la[;k 1 ns[ks½ Js.kh dk uke %&",{"$nulls":8},"………………………………………………….",{"$nulls":5},"dksM %&"]
[null,"6- Only for Category IV & VI (dsoy Js.kh 4 o 6 ds fy,)"]
[null,"Table - A : Only for category(dsoy Js.kh 1]2 , o 8 ds fy;s) (I)ALL SUBJECTS (1-lEiw.kZ fo\"k;), (II) DIVISION IMPROVEMENT (2-Js.kh lq/kkj) & (VIII) FACULTY CHANGE (8-oxZ ifjorZu)  OPTIONAL SUBJECTS oSdfYid fo\"k;) :"]
[]
[{"$nulls":3},"As Applicable ",{"$nulls":4},"tks ykxw gks½",{"$nulls":3},"1…………………………………………………………………………….."]
[]
[{"$nulls":3},"(IV) ADDITIONAL SUBJECTS CAT",{"$nulls":4},"¼4½ vfrfjDr fo\"k;",{"$nulls":3},"2…………………………………………………3………………………...…………………….."]
[]
[{"$nulls":3},"(VI) MARKS IMPROVEMENT CAT",{"$nulls":4},"¼6½ vad lq/kkj",{"$nulls":3},"4…………………………………………………5………………………...…………………….."]
[]
[]
[null,null,"√","As Applicable from Number 8 to 15 ¼Øekad 8 ls 15 rd tks ykxw gks",{"$nulls":8},"√","djsa½"]
[]
[null,"7-","Third Language ¼r`rh; Hkk\"kk½ (Only for Category I &II) ¼dsoy Js.kh 1 o 2 ds fy,½ ¼fo\"k; p;u gsrq ihNs fy[ks fo’ks\"k funsZ’k \nla[;k 3 ns[ksa½ %&"]
[]
[null,null,"Third Language Opted (p;fur r`rh; Hkk\"kk) fo\"k; dk uke",{"$nulls":8},"dksM"]
[]
[null,"8-","Name of Vocational Trade ¼O;kolkf;d VªsM dk uke½",{"$nulls":6},"………………………………………………………..",{"$nulls":5},"lgh dk fpUg yxk,aA"]
[null,null,"¼dsoy mu 'kkykvksa ds fy, tgka O;kolkf;d f'k{kk lapkfyr gS ,oa ftu fo|kfFkZ;ksa us d{kk 10 rFkk 11 oha esa O;kolkf;d ijh{kk mRrh.kZ dh gSA½"]
[null,null," (1) Automotive (101)",{"$nulls":3},"(2) Beauty & Wellness (102)",{"$nulls":3},"(3) Health Care (103)",{"$nulls":3},"(4) IT & ITES (104)",null,null,"(5) Retail (105)"]
[]
[null,null," (6) Tourism & Hospitality (106)",{"$nulls":4},"(7) Security (107)",null,null,"(8) Apparel Made up Home Furnishing (108) ",{"$nulls":4},"(9) Electronics & Hardware (109)"]
[]
[null,null," (10) Agriculture (110)",{"$nulls":3},"(11) Plumber (111)",{"$nulls":3},"(12) Telecom (112)",{"$nulls":3},"(13) Banking Financial Services & Insurance (113)"]
[]
[null,null," (14) Construction (114)",{"$nulls":3},"(15) Food Processing (115)"]
[]
[null,"9-","Gender ¼fyax½ : (01) Male ¼iq:\"k½",{"$nulls":3},{"$f":"IF(W1623=\"F\",\"\",\"Yes\")","v":"Yes"},"(02) FEMALE ¼efgyk½",null,null,{"$f":"IF(AA1623=\"F\",\"\",\"Yes\")","v":"Yes"},"Medium ¼ek/;e½ : (01) HINDI ¼fgUnh½",{"$nulls":3},{"$f":"IF(X1623=\"Hindi\",\"Yes\",\"\")","v":"Yes"},"(02) ENGLISH ¼vaxzsth½",null,null,{"$f":"IF(X1623=\"english\",\"Yes\",\"\")","v":""},null,null,{"$f":"VLOOKUP(A1583,'Deta From Shala Dar. Class-10'!$A$2:$AE$201,10,0)","v":0},{"$f":"Info!$C$8","v":"Hindi"}]
[]
[null,"10-","CWSN-1 ¼Hkkx½ : ekufld eanrk (01)",{"$nulls":4},"vkWfVTe (02)",null,null,"lsfjcy iYlh (03)",null,null,"ekufld jksx (04)",null,null,"Jo.k ckf/kr (05)"]
[]
[null,null,"ewd fu'kDrrk (06)",null,null,"LisfLQd yfuZax fMl,fcfyfV (14)",{"$nulls":4},"ckSf)d fu'kDrrk (15)",{"$nulls":3},"efYViy LDysjksfll (16)",null,null,"cgq fu'kDrrk (21)"]
[]
[null,"11-","CWSN-2 ¼Hkkx½ : n`f\"V ckf/kr (07)",{"$nulls":4},"vYi n`f\"V (08)",null,null,"pyu fu'kDrrk(09)",null,null,"dq\"B jksx (10)",null,null,"ckSukiu (11)"]
[]
[null,null,"rStkc fif³r (12)",null,null,"ekalis'kh nqfoZdkl ¼13½",{"$nulls":3},"ikfdZlkal jksx ¼17½",{"$nulls":3},"fgeksfQfy;k ¼18½",null,null,"FkSyslhfe;k ¼19½"]
[]
[null,null,",fufed@fLdy fMtht (20)",{"$nulls":3},"iksfy;ks@uoZ batjh ¼22½",{"$nulls":3},"lw;Zeq[kh ¼23½",{"$nulls":3}," @lSfud ¼24½"]
[]
[null,"12-","BPL ¼chih,y½ %",{"$nulls":4},"1- YES ¼gk¡½",null,{"$f":"IF(W1635=\"N\",\"\",\"Yes\")","v":"Yes"},null,null,"2- NO ¼ugha¡½",null,{"$f":"IF(W1635=\"Y\",\"\",\"Yes\")","v":"Yes"},{"$nulls":7},{"$f":"VLOOKUP(A1583,'Deta From Shala Dar. Class-10'!$A$2:$AE$201,27,0)","v":0}]
[]
[null,"13-","vukFk oxZ %",{"$nulls":4},"1- YES ¼gk¡½",{"$nulls":4},"2- NO ¼ugha¡½"]
[]
[null,"14-","EWS ¼vkfFkZd n`f\"V ls detksj oxZ½ %",{"$nulls":4},"1- YES ¼gk¡½",{"$nulls":4},"2- NO ¼ugha¡½"]
[]
[null,"15-","CASTE ¼tkfr Js.kh½ %",null,null,"¼05½ Gen ¼lkekU;½",null,null,{"$f":"IF($W$60=\"GEN\",\"YES\",\"\")","v":""},"¼06½ MINORITY ¼lkekU;vYi la[;d½",{"$nulls":3},{"$f":"IF($W$60=\"MIN\",\"YES\",\"\")","v":""},"¼07½ SC ¼vuqlwfpr tkfr½",{"$nulls":4},{"$f":"IF($W$60=\"SC\",\"YES\",\"\")","v":""},null,null,{"$f":"VLOOKUP(A1583,'Deta From Shala Dar. Class-10'!$A$2:$AE$201,16,0)","v":0}]
[]
[{"$nulls":5},"¼08½ ST ¼vuqlwfpr tutkfr½",null,null,{"$f":"IF($W$60=\"ST\",\"YES\",\"\")","v":""},"¼09½ OBC ¼vU; fiN³k oxZ½",{"$nulls":3},{"$f":"IF($W$60=\"OBC\",\"YES\",\"\")","v":""},"¼10½ Special OBC ¼fo'ks\"k fiN³k oxZ½@MBC",{"$nulls":4},{"$f":"IF(OR($W$60=\"MBC\",$W$60=\"SBC\"),\"YES\",\"\")","v":""}]
[null,"uksV%& Nk=o`fr@iqjLdkj mijksDr p;fur Js.kh ds vk/kj ij gh nh tk;sxhA"]
[]
[null,"16-","ADDRESS ¼fo|kFkhZ dk iw.kZ irk½ %&"]
[null,null,"House No./Street/Place Name ¼edku ua-@xyh ua-@LFkku½ %",{"$nulls":7},{"$f":"VLOOKUP(A1583,'Deta From Shala Dar. Class-12'!$A$2:$AE$201,24,0)","v":0}]
[null,null,"Village/Town/City ¼xzke@dLck@'kgj½ %"]
[null,null,"District ¼ftyk½ %",null,null,"………………………….",null,null,"STATE ¼jkT;½ %",null,null,"…………………………………..",{"$nulls":3},"PIN CODE NO. ¼fiu dksM ua-½ %",null,null,"……………………"]
[]
[null,"17-","fo|kFkhZ dk vk/kkj dkMZ uEcj %",{"$nulls":3},{"$f":"VLOOKUP(A1583,'Deta From Shala Dar. Class-12'!$A$2:$AE$201,21,0)","v":{"v":0,"d":"0000"}},{"$nulls":3},"tu vk/kkj uEcj %",null,{"$f":"VLOOKUP(A1583,'Deta From Shala Dar. Class-12'!$A$2:$AE$201,22,0)","v":0},null,null,"vfHkHkkod dh okf\"kZd vk; %",null,null,{"$f":"VLOOKUP(A1583,'Deta From Shala Dar. Class-12'!$A$2:$AE$201,25,0)","v":{"v":0,"d":"₹ 0"}}]
[]
[null,null,"Student/Guardian's Mobile No. ¼fo|kFkhZ@vfHkHkkod dk eksckby uacj½ %",{"$nulls":9},{"$f":"VLOOKUP(A1583,'Deta From Shala Dar. Class-12'!$A$2:$AE$201,23,0)","v":0}]
[]
[null,"18-","Previous Academic Details ¼iwoZ 'kS{kf.kd ;ksX;rk½ %",{"$nulls":9},"---------------------------------------------------------"]
[]
[null,"CLASS ¼d{kk½",null,null,"YEAR ¼oxZ½",null,"ROLL NO. ¼ukekad½",null,null,"RESULT ¼ifj.kke½",null,null,"NAME OF SCHOOL/BOARD ¼Ldwy@cksMZ dk uke½"]
[null,"VIII"]
[null,"IX"]
[null,"X"]
[]
[null,"19-","Student's Photo and Signature ¼fo|kFkhZ dk QksVks ,oa gLrk{kj½",{"$nulls":9}," "]
[{"$nulls":10},"Student's Signature ¼fo|kFkhZ ds gLrk{kj½"]
[{"$nulls":3},"PASTE PASSPORT\nSIZE PHOTO"]
[]
[]
[]
[]
[{"$nulls":11}," 'kkyk ç/kku dk çek.khdj.k %&\ngLrk{kj---------------------------------------------------------------"]
[]
[]
[]
[]
[null,"fo|ky; dk uke %&",null,null,{"$f":"Info!$C$7","v":"Govt. Sr. Sec. School Raimalwada"},{"$nulls":6}," 'kkyk dksM %&",null,{"$f":"Info!$C$10","v":1},{"$f":"Info!$D$10","v":7},{"$f":"Info!$E$10","v":0},{"$f":"Info!$F$10","v":1},{"$f":"Info!$G$10","v":7},{"$f":"Info!$H$10","v":5},{"$f":"Info!$I$10","v":1}]
[]
[{"$f":"A1583+1","v":19}]
[null,{"$f":"CONCATENATE(Info!$B$7,Info!$C$7)","v":"School Name :-Govt. Sr. Sec. School Raimalwada"}]
[{"$nulls":3},"Board of Secondary Education, Rajasthan",{"$nulls":12},"Sec. (Reg.)"]
[{"$nulls":3}," Ekk/;fed f’k{kk cksMZ] jktLFkku ",{"$nulls":12},"fu;fer ijh{kkFkhZ"]
[null,"ek/;fed ijh{kk",{"$nulls":3},"APPLICATION FORM FOR SENIOR SECONDARY EXAMINATION-2024",{"$nulls":7},{"$f":"Info!$C$10","v":1},{"$f":"Info!$D$10","v":7},{"$f":"Info!$E$10","v":0},{"$f":"Info!$F$10","v":1},{"$f":"Info!$G$10","v":7},{"$f":"Info!$H$10","v":5},{"$f":"Info!$I$10","v":1}]
[{"$nulls":5}," Ikjh{kk vkosnu i= ek/;fed ijh{kk & 2024"]
[{"$nulls":13}," 'kkyk niZ.k Øekad %&",{"$nulls":3},{"$f":"Info!$C$9","v":12345}]
[null,"Scholar Reg. No. ¼LdkWyj jftLVj Øekad½",{"$nulls":5},{"$f":"VLOOKUP(A1676,'Deta From Shala Dar. Class-10'!$A$2:$AE$201,4,0)","v":0}]
[null,"1- Student’s Name (fo|kFkhZ dk uke) :",{"$nulls":5},{"$f":"VLOOKUP(A1676,'Deta From Shala Dar. Class-10'!$A$2:$AE$201,6,0)","v":0}]
[null,"2- Mother’s Name ¼ekrk dk uke) :",{"$nulls":5},{"$f":"VLOOKUP(A1676,'Deta From Shala Dar. Class-10'!$A$2:$AE$201,8,0)","v":0}]
[null,"3- Father’s Name (firk dk uke) :",{"$nulls":5},{"$f":"VLOOKUP(A1676,'Deta From Shala Dar. Class-10'!$A$2:$AE$201,9,0)","v":0}]
[null,"4- Date Of Birth (tUe frfFk vadks esa) :",{"$nulls":3},{"$f":"W1687","v":"00:00:00"},{"$nulls":16},{"$f":"VLOOKUP(A1676,'Deta From Shala Dar. Class-10'!$A$2:$AE$201,11,0)","v":"00:00:00"}]
[null,"In Words (tUe frfFk 'kCnksa esa) :",{"$nulls":5},"……………………………………………………………"]
[null,"5- Category Code (Js.kh dksM) : ¼Js.kh p;u gsrq ihNs fy[ks fo’k\"sk funsZ’k la[;k 1 ns[ks½ Js.kh dk uke %&",{"$nulls":8},"………………………………………………….",{"$nulls":5},"dksM %&"]
[null,"6- Only for Category IV & VI (dsoy Js.kh 4 o 6 ds fy,)"]
[null,"Table - A : Only for category(dsoy Js.kh 1]2 , o 8 ds fy;s) (I)ALL SUBJECTS (1-lEiw.kZ fo\"k;), (II) DIVISION IMPROVEMENT (2-Js.kh lq/kkj) & (VIII) FACULTY CHANGE (8-oxZ ifjorZu)  OPTIONAL SUBJECTS oSdfYid fo\"k;) :"]
[]
[{"$nulls":3},"As Applicable ",{"$nulls":4},"tks ykxw gks½",{"$nulls":3},"1…………………………………………………………………………….."]
[]
[{"$nulls":3},"(IV) ADDITIONAL SUBJECTS CAT",{"$nulls":4},"¼4½ vfrfjDr fo\"k;",{"$nulls":3},"2…………………………………………………3………………………...…………………….."]
[]
[{"$nulls":3},"(VI) MARKS IMPROVEMENT CAT",{"$nulls":4},"¼6½ vad lq/kkj",{"$nulls":3},"4…………………………………………………5………………………...…………………….."]
[]
[]
[null,null,"√","As Applicable from Number 8 to 15 ¼Øekad 8 ls 15 rd tks ykxw gks",{"$nulls":8},"√","djsa½"]
[]
[null,"7-","Third Language ¼r`rh; Hkk\"kk½ (Only for Category I &II) ¼dsoy Js.kh 1 o 2 ds fy,½ ¼fo\"k; p;u gsrq ihNs fy[ks fo’ks\"k funsZ’k \nla[;k 3 ns[ksa½ %&"]
[]
[null,null,"Third Language Opted (p;fur r`rh; Hkk\"kk) fo\"k; dk uke",{"$nulls":8},"dksM"]
[]
[null,"8-","Name of Vocational Trade ¼O;kolkf;d VªsM dk uke½",{"$nulls":6},"………………………………………………………..",{"$nulls":5},"lgh dk fpUg yxk,aA"]
[null,null,"¼dsoy mu 'kkykvksa ds fy, tgka O;kolkf;d f'k{kk lapkfyr gS ,oa ftu fo|kfFkZ;ksa us d{kk 10 rFkk 11 oha esa O;kolkf;d ijh{kk mRrh.kZ dh gSA½"]
[null,null," (1) Automotive (101)",{"$nulls":3},"(2) Beauty & Wellness (102)",{"$nulls":3},"(3) Health Care (103)",{"$nulls":3},"(4) IT & ITES (104)",null,null,"(5) Retail (105)"]
[]
[null,null," (6) Tourism & Hospitality (106)",{"$nulls":4},"(7) Security (107)",null,null,"(8) Apparel Made up Home Furnishing (108) ",{"$nulls":4},"(9) Electronics & Hardware (109)"]
[]
[null,null," (10) Agriculture (110)",{"$nulls":3},"(11) Plumber (111)",{"$nulls":3},"(12) Telecom (112)",{"$nulls":3},"(13) Banking Financial Services & Insurance (113)"]
[]
[null,null," (14) Construction (114)",{"$nulls":3},"(15) Food Processing (115)"]
[]
[null,"9-","Gender ¼fyax½ : (01) Male ¼iq:\"k½",{"$nulls":3},{"$f":"IF(W1716=\"F\",\"\",\"Yes\")","v":"Yes"},"(02) FEMALE ¼efgyk½",null,null,{"$f":"IF(AA1716=\"F\",\"\",\"Yes\")","v":"Yes"},"Medium ¼ek/;e½ : (01) HINDI ¼fgUnh½",{"$nulls":3},{"$f":"IF(X1716=\"Hindi\",\"Yes\",\"\")","v":"Yes"},"(02) ENGLISH ¼vaxzsth½",null,null,{"$f":"IF(X1716=\"english\",\"Yes\",\"\")","v":""},null,null,{"$f":"VLOOKUP(A1676,'Deta From Shala Dar. Class-10'!$A$2:$AE$201,10,0)","v":0},{"$f":"Info!$C$8","v":"Hindi"}]
[]
[null,"10-","CWSN-1 ¼Hkkx½ : ekufld eanrk (01)",{"$nulls":4},"vkWfVTe (02)",null,null,"lsfjcy iYlh (03)",null,null,"ekufld jksx (04)",null,null,"Jo.k ckf/kr (05)"]
[]
[null,null,"ewd fu'kDrrk (06)",null,null,"LisfLQd yfuZax fMl,fcfyfV (14)",{"$nulls":4},"ckSf)d fu'kDrrk (15)",{"$nulls":3},"efYViy LDysjksfll (16)",null,null,"cgq fu'kDrrk (21)"]
[]
[null,"11-","CWSN-2 ¼Hkkx½ : n`f\"V ckf/kr (07)",{"$nulls":4},"vYi n`f\"V (08)",null,null,"pyu fu'kDrrk(09)",null,null,"dq\"B jksx (10)",null,null,"ckSukiu (11)"]
[]
[null,null,"rStkc fif³r (12)",null,null,"ekalis'kh nqfoZdkl ¼13½",{"$nulls":3},"ikfdZlkal jksx ¼17½",{"$nulls":3},"fgeksfQfy;k ¼18½",null,null,"FkSyslhfe;k ¼19½"]
[]
[null,null,",fufed@fLdy fMtht (20)",{"$nulls":3},"iksfy;ks@uoZ batjh ¼22½",{"$nulls":3},"lw;Zeq[kh ¼23½",{"$nulls":3}," @lSfud ¼24½"]
[]
[null,"12-","BPL ¼chih,y½ %",{"$nulls":4},"1- YES ¼gk¡½",null,{"$f":"IF(W1728=\"N\",\"\",\"Yes\")","v":"Yes"},null,null,"2- NO ¼ugha¡½",null,{"$f":"IF(W1728=\"Y\",\"\",\"Yes\")","v":"Yes"},{"$nulls":7},{"$f":"VLOOKUP(A1676,'Deta From Shala Dar. Class-10'!$A$2:$AE$201,27,0)","v":0}]
[]
[null,"13-","vukFk oxZ %",{"$nulls":4},"1- YES ¼gk¡½",{"$nulls":4},"2- NO ¼ugha¡½"]
[]
[null,"14-","EWS ¼vkfFkZd n`f\"V ls detksj oxZ½ %",{"$nulls":4},"1- YES ¼gk¡½",{"$nulls":4},"2- NO ¼ugha¡½"]
[]
[null,"15-","CASTE ¼tkfr Js.kh½ %",null,null,"¼05½ Gen ¼lkekU;½",null,null,{"$f":"IF($W$60=\"GEN\",\"YES\",\"\")","v":""},"¼06½ MINORITY ¼lkekU;vYi la[;d½",{"$nulls":3},{"$f":"IF($W$60=\"MIN\",\"YES\",\"\")","v":""},"¼07½ SC ¼vuqlwfpr tkfr½",{"$nulls":4},{"$f":"IF($W$60=\"SC\",\"YES\",\"\")","v":""},null,null,{"$f":"VLOOKUP(A1676,'Deta From Shala Dar. Class-10'!$A$2:$AE$201,16,0)","v":0}]
[]
[{"$nulls":5},"¼08½ ST ¼vuqlwfpr tutkfr½",null,null,{"$f":"IF($W$60=\"ST\",\"YES\",\"\")","v":""},"¼09½ OBC ¼vU; fiN³k oxZ½",{"$nulls":3},{"$f":"IF($W$60=\"OBC\",\"YES\",\"\")","v":""},"¼10½ Special OBC ¼fo'ks\"k fiN³k oxZ½@MBC",{"$nulls":4},{"$f":"IF(OR($W$60=\"MBC\",$W$60=\"SBC\"),\"YES\",\"\")","v":""}]
[null,"uksV%& Nk=o`fr@iqjLdkj mijksDr p;fur Js.kh ds vk/kj ij gh nh tk;sxhA"]
[]
[null,"16-","ADDRESS ¼fo|kFkhZ dk iw.kZ irk½ %&"]
[null,null,"House No./Street/Place Name ¼edku ua-@xyh ua-@LFkku½ %",{"$nulls":7},{"$f":"VLOOKUP(A1676,'Deta From Shala Dar. Class-12'!$A$2:$AE$201,24,0)","v":0}]
[null,null,"Village/Town/City ¼xzke@dLck@'kgj½ %"]
[null,null,"District ¼ftyk½ %",null,null,"………………………….",null,null,"STATE ¼jkT;½ %",null,null,"…………………………………..",{"$nulls":3},"PIN CODE NO. ¼fiu dksM ua-½ %",null,null,"……………………"]
[]
[null,"17-","fo|kFkhZ dk vk/kkj dkMZ uEcj %",{"$nulls":3},{"$f":"VLOOKUP(A1676,'Deta From Shala Dar. Class-12'!$A$2:$AE$201,21,0)","v":{"v":0,"d":"0000"}},{"$nulls":3},"tu vk/kkj uEcj %",null,{"$f":"VLOOKUP(A1676,'Deta From Shala Dar. Class-12'!$A$2:$AE$201,22,0)","v":0},null,null,"vfHkHkkod dh okf\"kZd vk; %",null,null,{"$f":"VLOOKUP(A1676,'Deta From Shala Dar. Class-12'!$A$2:$AE$201,25,0)","v":{"v":0,"d":"₹ 0"}}]
[]
[null,null,"Student/Guardian's Mobile No. ¼fo|kFkhZ@vfHkHkkod dk eksckby uacj½ %",{"$nulls":9},{"$f":"VLOOKUP(A1676,'Deta From Shala Dar. Class-12'!$A$2:$AE$201,23,0)","v":0}]
[]
[null,"18-","Previous Academic Details ¼iwoZ 'kS{kf.kd ;ksX;rk½ %",{"$nulls":9},"---------------------------------------------------------"]
[]
[null,"CLASS ¼d{kk½",null,null,"YEAR ¼oxZ½",null,"ROLL NO. ¼ukekad½",null,null,"RESULT ¼ifj.kke½",null,null,"NAME OF SCHOOL/BOARD ¼Ldwy@cksMZ dk uke½"]
[null,"VIII"]
[null,"IX"]
[null,"X"]
[]
[null,"19-","Student's Photo and Signature ¼fo|kFkhZ dk QksVks ,oa gLrk{kj½",{"$nulls":9}," "]
[{"$nulls":10},"Student's Signature ¼fo|kFkhZ ds gLrk{kj½"]
[{"$nulls":3},"PASTE PASSPORT\nSIZE PHOTO"]
[]
[]
[]
[]
[{"$nulls":11}," 'kkyk ç/kku dk çek.khdj.k %&\ngLrk{kj---------------------------------------------------------------"]
[]
[]
[]
[]
[null,"fo|ky; dk uke %&",null,null,{"$f":"Info!$C$7","v":"Govt. Sr. Sec. School Raimalwada"},{"$nulls":6}," 'kkyk dksM %&",null,{"$f":"Info!$C$10","v":1},{"$f":"Info!$D$10","v":7},{"$f":"Info!$E$10","v":0},{"$f":"Info!$F$10","v":1},{"$f":"Info!$G$10","v":7},{"$f":"Info!$H$10","v":5},{"$f":"Info!$I$10","v":1}]
[]
[{"$f":"A1676+1","v":20}]
[null,{"$f":"CONCATENATE(Info!$B$7,Info!$C$7)","v":"School Name :-Govt. Sr. Sec. School Raimalwada"}]
[{"$nulls":3},"Board of Secondary Education, Rajasthan",{"$nulls":12},"Sec. (Reg.)"]
[{"$nulls":3}," Ekk/;fed f’k{kk cksMZ] jktLFkku ",{"$nulls":12},"fu;fer ijh{kkFkhZ"]
[null,"ek/;fed ijh{kk",{"$nulls":3},"APPLICATION FORM FOR SENIOR SECONDARY EXAMINATION-2024",{"$nulls":7},{"$f":"Info!$C$10","v":1},{"$f":"Info!$D$10","v":7},{"$f":"Info!$E$10","v":0},{"$f":"Info!$F$10","v":1},{"$f":"Info!$G$10","v":7},{"$f":"Info!$H$10","v":5},{"$f":"Info!$I$10","v":1}]
[{"$nulls":5}," Ikjh{kk vkosnu i= ek/;fed ijh{kk & 2024"]
[{"$nulls":13}," 'kkyk niZ.k Øekad %&",{"$nulls":3},{"$f":"Info!$C$9","v":12345}]
[null,"Scholar Reg. No. ¼LdkWyj jftLVj Øekad½",{"$nulls":5},{"$f":"VLOOKUP(A1769,'Deta From Shala Dar. Class-10'!$A$2:$AE$201,4,0)","v":0}]
[null,"1- Student’s Name (fo|kFkhZ dk uke) :",{"$nulls":5},{"$f":"VLOOKUP(A1769,'Deta From Shala Dar. Class-10'!$A$2:$AE$201,6,0)","v":0}]
[null,"2- Mother’s Name ¼ekrk dk uke) :",{"$nulls":5},{"$f":"VLOOKUP(A1769,'Deta From Shala Dar. Class-10'!$A$2:$AE$201,8,0)","v":0}]
[null,"3- Father’s Name (firk dk uke) :",{"$nulls":5},{"$f":"VLOOKUP(A1769,'Deta From Shala Dar. Class-10'!$A$2:$AE$201,9,0)","v":0}]
[null,"4- Date Of Birth (tUe frfFk vadks esa) :",{"$nulls":3},{"$f":"W1780","v":"00:00:00"},{"$nulls":16},{"$f":"VLOOKUP(A1769,'Deta From Shala Dar. Class-10'!$A$2:$AE$201,11,0)","v":"00:00:00"}]
[null,"In Words (tUe frfFk 'kCnksa esa) :",{"$nulls":5},"……………………………………………………………"]
[null,"5- Category Code (Js.kh dksM) : ¼Js.kh p;u gsrq ihNs fy[ks fo’k\"sk funsZ’k la[;k 1 ns[ks½ Js.kh dk uke %&",{"$nulls":8},"………………………………………………….",{"$nulls":5},"dksM %&"]
[null,"6- Only for Category IV & VI (dsoy Js.kh 4 o 6 ds fy,)"]
[null,"Table - A : Only for category(dsoy Js.kh 1]2 , o 8 ds fy;s) (I)ALL SUBJECTS (1-lEiw.kZ fo\"k;), (II) DIVISION IMPROVEMENT (2-Js.kh lq/kkj) & (VIII) FACULTY CHANGE (8-oxZ ifjorZu)  OPTIONAL SUBJECTS oSdfYid fo\"k;) :"]
[]
[{"$nulls":3},"As Applicable ",{"$nulls":4},"tks ykxw gks½",{"$nulls":3},"1…………………………………………………………………………….."]
[]
[{"$nulls":3},"(IV) ADDITIONAL SUBJECTS CAT",{"$nulls":4},"¼4½ vfrfjDr fo\"k;",{"$nulls":3},"2…………………………………………………3………………………...…………………….."]
[]
[{"$nulls":3},"(VI) MARKS IMPROVEMENT CAT",{"$nulls":4},"¼6½ vad lq/kkj",{"$nulls":3},"4…………………………………………………5………………………...…………………….."]
[]
[]
[null,null,"√","As Applicable from Number 8 to 15 ¼Øekad 8 ls 15 rd tks ykxw gks",{"$nulls":8},"√","djsa½"]
[]
[null,"7-","Third Language ¼r`rh; Hkk\"kk½ (Only for Category I &II) ¼dsoy Js.kh 1 o 2 ds fy,½ ¼fo\"k; p;u gsrq ihNs fy[ks fo’ks\"k funsZ’k \nla[;k 3 ns[ksa½ %&"]
[]
[null,null,"Third Language Opted (p;fur r`rh; Hkk\"kk) fo\"k; dk uke",{"$nulls":8},"dksM"]
[]
[null,"8-","Name of Vocational Trade ¼O;kolkf;d VªsM dk uke½",{"$nulls":6},"………………………………………………………..",{"$nulls":5},"lgh dk fpUg yxk,aA"]
[null,null,"¼dsoy mu 'kkykvksa ds fy, tgka O;kolkf;d f'k{kk lapkfyr gS ,oa ftu fo|kfFkZ;ksa us d{kk 10 rFkk 11 oha esa O;kolkf;d ijh{kk mRrh.kZ dh gSA½"]
[null,null," (1) Automotive (101)",{"$nulls":3},"(2) Beauty & Wellness (102)",{"$nulls":3},"(3) Health Care (103)",{"$nulls":3},"(4) IT & ITES (104)",null,null,"(5) Retail (105)"]
[]
[null,null," (6) Tourism & Hospitality (106)",{"$nulls":4},"(7) Security (107)",null,null,"(8) Apparel Made up Home Furnishing (108) ",{"$nulls":4},"(9) Electronics & Hardware (109)"]
[]
[null,null," (10) Agriculture (110)",{"$nulls":3},"(11) Plumber (111)",{"$nulls":3},"(12) Telecom (112)",{"$nulls":3},"(13) Banking Financial Services & Insurance (113)"]
[]
[null,null," (14) Construction (114)",{"$nulls":3},"(15) Food Processing (115)"]
[]
[null,"9-","Gender ¼fyax½ : (01) Male ¼iq:\"k½",{"$nulls":3},{"$f":"IF(W1809=\"F\",\"\",\"Yes\")","v":"Yes"},"(02) FEMALE ¼efgyk½",null,null,{"$f":"IF(AA1809=\"F\",\"\",\"Yes\")","v":"Yes"},"Medium ¼ek/;e½ : (01) HINDI ¼fgUnh½",{"$nulls":3},{"$f":"IF(X1809=\"Hindi\",\"Yes\",\"\")","v":"Yes"},"(02) ENGLISH ¼vaxzsth½",null,null,{"$f":"IF(X1809=\"english\",\"Yes\",\"\")","v":""},null,null,{"$f":"VLOOKUP(A1769,'Deta From Shala Dar. Class-10'!$A$2:$AE$201,10,0)","v":0},{"$f":"Info!$C$8","v":"Hindi"}]
[]
[null,"10-","CWSN-1 ¼Hkkx½ : ekufld eanrk (01)",{"$nulls":4},"vkWfVTe (02)",null,null,"lsfjcy iYlh (03)",null,null,"ekufld jksx (04)",null,null,"Jo.k ckf/kr (05)"]
[]
[null,null,"ewd fu'kDrrk (06)",null,null,"LisfLQd yfuZax fMl,fcfyfV (14)",{"$nulls":4},"ckSf)d fu'kDrrk (15)",{"$nulls":3},"efYViy LDysjksfll (16)",null,null,"cgq fu'kDrrk (21)"]
[]
[null,"11-","CWSN-2 ¼Hkkx½ : n`f\"V ckf/kr (07)",{"$nulls":4},"vYi n`f\"V (08)",null,null,"pyu fu'kDrrk(09)",null,null,"dq\"B jksx (10)",null,null,"ckSukiu (11)"]
[]
[null,null,"rStkc fif³r (12)",null,null,"ekalis'kh nqfoZdkl ¼13½",{"$nulls":3},"ikfdZlkal jksx ¼17½",{"$nulls":3},"fgeksfQfy;k ¼18½",null,null,"FkSyslhfe;k ¼19½"]
[]
[null,null,",fufed@fLdy fMtht (20)",{"$nulls":3},"iksfy;ks@uoZ batjh ¼22½",{"$nulls":3},"lw;Zeq[kh ¼23½",{"$nulls":3}," @lSfud ¼24½"]
[]
[null,"12-","BPL ¼chih,y½ %",{"$nulls":4},"1- YES ¼gk¡½",null,{"$f":"IF(W1821=\"N\",\"\",\"Yes\")","v":"Yes"},null,null,"2- NO ¼ugha¡½",null,{"$f":"IF(W1821=\"Y\",\"\",\"Yes\")","v":"Yes"},{"$nulls":7},{"$f":"VLOOKUP(A1769,'Deta From Shala Dar. Class-10'!$A$2:$AE$201,27,0)","v":0}]
[]
[null,"13-","vukFk oxZ %",{"$nulls":4},"1- YES ¼gk¡½",{"$nulls":4},"2- NO ¼ugha¡½"]
[]
[null,"14-","EWS ¼vkfFkZd n`f\"V ls detksj oxZ½ %",{"$nulls":4},"1- YES ¼gk¡½",{"$nulls":4},"2- NO ¼ugha¡½"]
[]
[null,"15-","CASTE ¼tkfr Js.kh½ %",null,null,"¼05½ Gen ¼lkekU;½",null,null,{"$f":"IF($W$60=\"GEN\",\"YES\",\"\")","v":""},"¼06½ MINORITY ¼lkekU;vYi la[;d½",{"$nulls":3},{"$f":"IF($W$60=\"MIN\",\"YES\",\"\")","v":""},"¼07½ SC ¼vuqlwfpr tkfr½",{"$nulls":4},{"$f":"IF($W$60=\"SC\",\"YES\",\"\")","v":""},null,null,{"$f":"VLOOKUP(A1769,'Deta From Shala Dar. Class-10'!$A$2:$AE$201,16,0)","v":0}]
[]
[{"$nulls":5},"¼08½ ST ¼vuqlwfpr tutkfr½",null,null,{"$f":"IF($W$60=\"ST\",\"YES\",\"\")","v":""},"¼09½ OBC ¼vU; fiN³k oxZ½",{"$nulls":3},{"$f":"IF($W$60=\"OBC\",\"YES\",\"\")","v":""},"¼10½ Special OBC ¼fo'ks\"k fiN³k oxZ½@MBC",{"$nulls":4},{"$f":"IF(OR($W$60=\"MBC\",$W$60=\"SBC\"),\"YES\",\"\")","v":""}]
[null,"uksV%& Nk=o`fr@iqjLdkj mijksDr p;fur Js.kh ds vk/kj ij gh nh tk;sxhA"]
[]
[null,"16-","ADDRESS ¼fo|kFkhZ dk iw.kZ irk½ %&"]
[null,null,"House No./Street/Place Name ¼edku ua-@xyh ua-@LFkku½ %",{"$nulls":7},{"$f":"VLOOKUP(A1769,'Deta From Shala Dar. Class-12'!$A$2:$AE$201,24,0)","v":0}]
[null,null,"Village/Town/City ¼xzke@dLck@'kgj½ %"]
[null,null,"District ¼ftyk½ %",null,null,"………………………….",null,null,"STATE ¼jkT;½ %",null,null,"…………………………………..",{"$nulls":3},"PIN CODE NO. ¼fiu dksM ua-½ %",null,null,"……………………"]
[]
[null,"17-","fo|kFkhZ dk vk/kkj dkMZ uEcj %",{"$nulls":3},{"$f":"VLOOKUP(A1769,'Deta From Shala Dar. Class-12'!$A$2:$AE$201,21,0)","v":{"v":0,"d":"0000"}},{"$nulls":3},"tu vk/kkj uEcj %",null,{"$f":"VLOOKUP(A1769,'Deta From Shala Dar. Class-12'!$A$2:$AE$201,22,0)","v":0},null,null,"vfHkHkkod dh okf\"kZd vk; %",null,null,{"$f":"VLOOKUP(A1769,'Deta From Shala Dar. Class-12'!$A$2:$AE$201,25,0)","v":{"v":0,"d":"₹ 0"}}]
[]
[null,null,"Student/Guardian's Mobile No. ¼fo|kFkhZ@vfHkHkkod dk eksckby uacj½ %",{"$nulls":9},{"$f":"VLOOKUP(A1769,'Deta From Shala Dar. Class-12'!$A$2:$AE$201,23,0)","v":0}]
[]
[null,"18-","Previous Academic Details ¼iwoZ 'kS{kf.kd ;ksX;rk½ %",{"$nulls":9},"---------------------------------------------------------"]
[]
[null,"CLASS ¼d{kk½",null,null,"YEAR ¼oxZ½",null,"ROLL NO. ¼ukekad½",null,null,"RESULT ¼ifj.kke½",null,null,"NAME OF SCHOOL/BOARD ¼Ldwy@cksMZ dk uke½"]
[null,"VIII"]
[null,"IX"]
[null,"X"]
[]
[null,"19-","Student's Photo and Signature ¼fo|kFkhZ dk QksVks ,oa gLrk{kj½",{"$nulls":9}," "]
[{"$nulls":10},"Student's Signature ¼fo|kFkhZ ds gLrk{kj½"]
[{"$nulls":3},"PASTE PASSPORT\nSIZE PHOTO"]
[]
[]
[]
[]
[{"$nulls":11}," 'kkyk ç/kku dk çek.khdj.k %&\ngLrk{kj---------------------------------------------------------------"]
[]
[]
[]
[]
[null,"fo|ky; dk uke %&",null,null,{"$f":"Info!$C$7","v":"Govt. Sr. Sec. School Raimalwada"},{"$nulls":6}," 'kkyk dksM %&",null,{"$f":"Info!$C$10","v":1},{"$f":"Info!$D$10","v":7},{"$f":"Info!$E$10","v":0},{"$f":"Info!$F$10","v":1},{"$f":"Info!$G$10","v":7},{"$f":"Info!$H$10","v":5},{"$f":"Info!$I$10","v":1}]