{"text_format":"3","workbook":"xlsx","n_sheets":4,"sheets":["MASTER","STUDENT DETAIL","TIME TABLE","ADMIT CARD"],"not_rendered":{"images":2,"defined_names":3},"read":"whole","date_system":"1900"}

{"sheet":"MASTER","index":0,"n_rows":22,"n_cols":20,"rows_kept":22,"merged":[[0,0,0,14],[1,1,1,3],[1,4,1,6],[1,7,1,9],[1,10,21,10],[1,11,1,13],[1,14,21,14],[2,0,21,0],[2,1,2,9],[2,11,3,13],[3,1,3,9],[4,1,4,9],[4,11,12,13],[5,1,5,2],[5,4,5,9],[6,1,6,9],[7,1,8,2],[7,3,8,3],[7,4,8,9],[9,1,9,9],[10,1,11,2],[10,3,11,3],[10,4,11,9],[12,1,12,9],[13,1,14,2],[13,3,14,3],[13,4,14,9],[14,11,16,13],[15,1,15,9],[16,1,16,2],[16,4,16,9],[17,1,17,9],[17,11,17,13],[18,1,18,2],[18,4,18,9],[18,11,21,13],[19,1,19,9],[20,1,20,2],[20,4,20,9],[21,1,21,9]]}
[]
[null,"t; fgUn",null,null,"oUns ekrje~",null,null,"t; fgUn"]
[]
[null,"ADMIT CARD GENERATOR PROGRAM",{"$nulls":16},"2019-20","PRIMARY"]
[{"$nulls":18},"2019-21","UPPER PRIMARY"]
[null,"SESSION",null,":-","2021-22",{"$nulls":13},"2019-22","SECONDARY"]
[{"$nulls":18},"2019-21","UPPER PRIMARY"]
[null,"Exam Type",null,":-","HALF YEARLY EXAM"]
[{"$nulls":18},"2019-24"]
[]
[null,"SCHOOL'S FULL NAME",null,":-","Govt. Sr. Secondary School Raimalwada"]
[{"$nulls":18},"2019-22","SECONDARY"]
[{"$nulls":18},"2019-23","SR. SECONDARY"]
[null,"ADDRESS",null,":-","P.S.-Bapini (Jodhpur)"]
[{"$nulls":11},"DEVOPED BY:-UMMED TARAD",{"$nulls":6},"2019-24"]
[{"$nulls":18},"2019-23","SR. SECONDARY"]
[null,"U-DISE CODE",null,":-","08151106901",{"$nulls":13},"2019-24"]
[{"$nulls":11},"(GSSS RAIMALWADA)",{"$nulls":6},"2019-25"]
[null,"NAME OF PRINCIPAL",null,":-",{"$nulls":7},"MOBILE NO.-9166973141",{"$nulls":6},"2019-26"]
[]
[null,"SCHOOL TYPE",null,":-","Sr. Secondary"]
[{"$nulls":18},"2019-25"]

{"sheet":"STUDENT DETAIL","index":1,"n_rows":132,"n_cols":38,"rows_kept":132,"merged":[[0,2,0,8],[0,9,0,19],[0,20,106,21],[1,2,1,6],[1,7,1,8],[1,9,1,19],[2,2,2,3],[2,4,2,5],[2,7,2,8],[2,9,3,14],[2,15,5,15],[2,16,5,16],[2,17,5,17],[2,18,5,18],[2,19,5,19],[3,2,3,3],[3,4,3,5],[3,7,3,8],[4,2,4,8],[4,9,5,9],[4,10,5,10],[4,11,5,11],[4,12,5,12],[4,13,5,13],[4,14,5,14]]}
[null,null,{"$f":"MASTER!E11","v":"Govt. Sr. Secondary School Raimalwada"}]
[null,null,"Print Admit Card",{"$nulls":4},"GoTo Time Table"]
[null,null,"School U-Dise Code :-",null,{"$f":"MASTER!E17","v":"08151106901"},null,"Session :-",{"$f":"MASTER!E6","v":"2021-22"},null,"Subject Wise Result",{"$nulls":5},"Subject Which Failed","Subject Which supplymentry","Subject Which 1 Grace","Subject Which 2 Grace","Subject Which Re-Exam"]
[null,null,"Class -",null,4,null,"Saction :-","(A)"]
[null,null,"Student Related Basic Details",{"$nulls":6},"Hindi","English","Sanskrit","Math","Science","social Science"]
[null,null,"Sr. No.","Class","Roll No.","Student's Name","Father's Name","Mother's Name","Date Of Birth"]
[null,null,0,0,null,0,0,0,0,{"$f":"#REF!","v":{"$error":"#REF!"}},{"$f":"#REF!","v":{"$error":"#REF!"}},{"$f":"#REF!","v":{"$error":"#REF!"}},{"$f":"#REF!","v":{"$error":"#REF!"}},{"$f":"#REF!","v":{"$error":"#REF!"}},{"$f":"#REF!","v":{"$error":"#REF!"}},{"$f":"COUNTIF(J7:O7,\"F\")+COUNTIF(J7:O7,\"AB\")","v":0},{"$f":"COUNTIF(J7:O7,\"S\")","v":0},{"$f":"COUNTIF(J7:O7,\"G1\")","v":0},{"$f":"COUNTIF(J7:O7,\"G2\")","v":0}]
[{"$f":"E8","v":901},1,1,{"$f":"IF(E8>0,$E$4,0)","v":4},901,"Akshya","Ram","Seeta","2000-02-05",{"$f":"#REF!","v":{"$error":"#REF!"}},{"$f":"#REF!","v":{"$error":"#REF!"}},{"$f":"#REF!","v":{"$error":"#REF!"}},{"$f":"#REF!","v":{"$error":"#REF!"}},{"$f":"#REF!","v":{"$error":"#REF!"}},{"$f":"#REF!","v":{"$error":"#REF!"}},{"$f":"COUNTIF(J8:O8,\"F\")+COUNTIF(J8:O8,\"AB\")","v":0},{"$f":"COUNTIF(J8:O8,\"S\")","v":0},{"$f":"COUNTIF(J8:O8,\"G1\")","v":0},{"$f":"COUNTIF(J8:O8,\"G2\")","v":0},{"$nulls":3},{"$f":"#REF!","v":{"$error":"#REF!"}},"/",{"$f":"#REF!","v":{"$error":"#REF!"}},{"$f":"CONCATENATE(W8,X8,Y8)","v":{"$error":"#REF!"}},{"$f":"#REF!","v":{"$error":"#REF!"}},"/",{"$f":"#REF!","v":{"$error":"#REF!"}},{"$f":"CONCATENATE(AA8,AB8,AC8)","v":{"$error":"#REF!"}},{"$f":"#REF!","v":{"$error":"#REF!"}},"/",{"$f":"#REF!","v":{"$error":"#REF!"}},{"$f":"CONCATENATE(AE8,AF8,AG8)","v":{"$error":"#REF!"}},{"$f":"#REF!","v":{"$error":"#REF!"}},"/",{"$f":"#REF!","v":{"$error":"#REF!"}},{"$f":"CONCATENATE(AI8,AJ8,AK8)","v":{"$error":"#REF!"}}]
[{"$f":"E9","v":0},2,2,{"$f":"IF(E9>0,$E$4,0)","v":0},{"$nulls":5},{"$f":"#REF!","v":{"$error":"#REF!"}},{"$f":"#REF!","v":{"$error":"#REF!"}},{"$f":"#REF!","v":{"$error":"#REF!"}},{"$f":"#REF!","v":{"$error":"#REF!"}},{"$f":"#REF!","v":{"$error":"#REF!"}},{"$f":"#REF!","v":{"$error":"#REF!"}},{"$f":"COUNTIF(J9:O9,\"F\")+COUNTIF(J9:O9,\"AB\")","v":0},{"$f":"COUNTIF(J9:O9,\"S\")","v":0},{"$f":"COUNTIF(J9:O9,\"G1\")","v":0},{"$f":"COUNTIF(J9:O9,\"G2\")","v":0},{"$nulls":3},{"$f":"#REF!","v":{"$error":"#REF!"}},"/",{"$f":"#REF!","v":{"$error":"#REF!"}},{"$f":"CONCATENATE(W9,X9,Y9)","v":{"$error":"#REF!"}},{"$f":"#REF!","v":{"$error":"#REF!"}},"/",{"$f":"#REF!","v":{"$error":"#REF!"}},{"$f":"CONCATENATE(AA9,AB9,AC9)","v":{"$error":"#REF!"}},{"$f":"#REF!","v":{"$error":"#REF!"}},"/",{"$f":"#REF!","v":{"$error":"#REF!"}},{"$f":"CONCATENATE(AE9,AF9,AG9)","v":{"$error":"#REF!"}},{"$f":"#REF!","v":{"$error":"#REF!"}},"/",{"$f":"#REF!","v":{"$error":"#REF!"}},{"$f":"CONCATENATE(AI9,AJ9,AK9)","v":{"$error":"#REF!"}}]
[0,3,3,0,{"$nulls":5},{"$f":"#REF!","v":{"$error":"#REF!"}},{"$f":"#REF!","v":{"$error":"#REF!"}},{"$f":"#REF!","v":{"$error":"#REF!"}},{"$f":"#REF!","v":{"$error":"#REF!"}},{"$f":"#REF!","v":{"$error":"#REF!"}},{"$f":"#REF!","v":{"$error":"#REF!"}},0,0,0,0,{"$nulls":3},{"$f":"#REF!","v":{"$error":"#REF!"}},"/",{"$f":"#REF!","v":{"$error":"#REF!"}},{"$error":"#REF!"},{"$f":"#REF!","v":{"$error":"#REF!"}},"/",{"$f":"#REF!","v":{"$error":"#REF!"}},{"$error":"#REF!"},{"$f":"#REF!","v":{"$error":"#REF!"}},"/",{"$f":"#REF!","v":{"$error":"#REF!"}},{"$error":"#REF!"},{"$f":"#REF!","v":{"$error":"#REF!"}},"/",{"$f":"#REF!","v":{"$error":"#REF!"}},{"$error":"#REF!"}]
[0,4,4,0,{"$nulls":5},{"$f":"#REF!","v":{"$error":"#REF!"}},{"$f":"#REF!","v":{"$error":"#REF!"}},{"$f":"#REF!","v":{"$error":"#REF!"}},{"$f":"#REF!","v":{"$error":"#REF!"}},{"$f":"#REF!","v":{"$error":"#REF!"}},{"$f":"#REF!","v":{"$error":"#REF!"}},0,0,0,0,{"$nulls":3},{"$f":"#REF!","v":{"$error":"#REF!"}},"/",{"$f":"#REF!","v":{"$error":"#REF!"}},{"$error":"#REF!"},{"$f":"#REF!","v":{"$error":"#REF!"}},"/",{"$f":"#REF!","v":{"$error":"#REF!"}},{"$error":"#REF!"},{"$f":"#REF!","v":{"$error":"#REF!"}},"/",{"$f":"#REF!","v":{"$error":"#REF!"}},{"$error":"#REF!"},{"$f":"#REF!","v":{"$error":"#REF!"}},"/",{"$f":"#REF!","v":{"$error":"#REF!"}},{"$error":"#REF!"}]
[0,5,5,0,{"$nulls":5},{"$f":"#REF!","v":{"$error":"#REF!"}},{"$f":"#REF!","v":{"$error":"#REF!"}},{"$f":"#REF!","v":{"$error":"#REF!"}},{"$f":"#REF!","v":{"$error":"#REF!"}},{"$f":"#REF!","v":{"$error":"#REF!"}},{"$f":"#REF!","v":{"$error":"#REF!"}},0,0,0,0,{"$nulls":3},{"$f":"#REF!","v":{"$error":"#REF!"}},"/",{"$f":"#REF!","v":{"$error":"#REF!"}},{"$error":"#REF!"},{"$f":"#REF!","v":{"$error":"#REF!"}},"/",{"$f":"#REF!","v":{"$error":"#REF!"}},{"$error":"#REF!"},{"$f":"#REF!","v":{"$error":"#REF!"}},"/",{"$f":"#REF!","v":{"$error":"#REF!"}},{"$error":"#REF!"},{"$f":"#REF!","v":{"$error":"#REF!"}},"/",{"$f":"#REF!","v":{"$error":"#REF!"}},{"$error":"#REF!"}]
[0,6,6,0,{"$nulls":5},{"$f":"#REF!","v":{"$error":"#REF!"}},{"$f":"#REF!","v":{"$error":"#REF!"}},{"$f":"#REF!","v":{"$error":"#REF!"}},{"$f":"#REF!","v":{"$error":"#REF!"}},{"$f":"#REF!","v":{"$error":"#REF!"}},{"$f":"#REF!","v":{"$error":"#REF!"}},0,0,0,0,{"$nulls":3},{"$f":"#REF!","v":{"$error":"#REF!"}},"/",{"$f":"#REF!","v":{"$error":"#REF!"}},{"$error":"#REF!"},{"$f":"#REF!","v":{"$error":"#REF!"}},"/",{"$f":"#REF!","v":{"$error":"#REF!"}},{"$error":"#REF!"},{"$f":"#REF!","v":{"$error":"#REF!"}},"/",{"$f":"#REF!","v":{"$error":"#REF!"}},{"$error":"#REF!"},{"$f":"#REF!","v":{"$error":"#REF!"}},"/",{"$f":"#REF!","v":{"$error":"#REF!"}},{"$error":"#REF!"}]
[0,7,7,0,{"$nulls":5},{"$f":"#REF!","v":{"$error":"#REF!"}},{"$f":"#REF!","v":{"$error":"#REF!"}},{"$f":"#REF!","v":{"$error":"#REF!"}},{"$f":"#REF!","v":{"$error":"#REF!"}},{"$f":"#REF!","v":{"$error":"#REF!"}},{"$f":"#REF!","v":{"$error":"#REF!"}},0,0,0,0,{"$nulls":3},{"$f":"#REF!","v":{"$error":"#REF!"}},"/",{"$f":"#REF!","v":{"$error":"#REF!"}},{"$error":"#REF!"},{"$f":"#REF!","v":{"$error":"#REF!"}},"/",{"$f":"#REF!","v":{"$error":"#REF!"}},{"$error":"#REF!"},{"$f":"#REF!","v":{"$error":"#REF!"}},"/",{"$f":"#REF!","v":{"$error":"#REF!"}},{"$error":"#REF!"},{"$f":"#REF!","v":{"$error":"#REF!"}},"/",{"$f":"#REF!","v":{"$error":"#REF!"}},{"$error":"#REF!"}]
[0,8,8,0,{"$nulls":5},{"$f":"#REF!","v":{"$error":"#REF!"}},{"$f":"#REF!","v":{"$error":"#REF!"}},{"$f":"#REF!","v":{"$error":"#REF!"}},{"$f":"#REF!","v":{"$error":"#REF!"}},{"$f":"#REF!","v":{"$error":"#REF!"}},{"$f":"#REF!","v":{"$error":"#REF!"}},0,0,0,0,{"$nulls":3},{"$f":"#REF!","v":{"$error":"#REF!"}},"/",{"$f":"#REF!","v":{"$error":"#REF!"}},{"$error":"#REF!"},{"$f":"#REF!","v":{"$error":"#REF!"}},"/",{"$f":"#REF!","v":{"$error":"#REF!"}},{"$error":"#REF!"},{"$f":"#REF!","v":{"$error":"#REF!"}},"/",{"$f":"#REF!","v":{"$error":"#REF!"}},{"$error":"#REF!"},{"$f":"#REF!","v":{"$error":"#REF!"}},"/",{"$f":"#REF!","v":{"$error":"#REF!"}},{"$error":"#REF!"}]
[0,9,9,0,{"$nulls":5},{"$f":"#REF!","v":{"$error":"#REF!"}},{"$f":"#REF!","v":{"$error":"#REF!"}},{"$f":"#REF!","v":{"$error":"#REF!"}},{"$f":"#REF!","v":{"$error":"#REF!"}},{"$f":"#REF!","v":{"$error":"#REF!"}},{"$f":"#REF!","v":{"$error":"#REF!"}},0,0,0,0,{"$nulls":3},{"$f":"#REF!","v":{"$error":"#REF!"}},"/",{"$f":"#REF!","v":{"$error":"#REF!"}},{"$error":"#REF!"},{"$f":"#REF!","v":{"$error":"#REF!"}},"/",{"$f":"#REF!","v":{"$error":"#REF!"}},{"$error":"#REF!"},{"$f":"#REF!","v":{"$error":"#REF!"}},"/",{"$f":"#REF!","v":{"$error":"#REF!"}},{"$error":"#REF!"},{"$f":"#REF!","v":{"$error":"#REF!"}},"/",{"$f":"#REF!","v":{"$error":"#REF!"}},{"$error":"#REF!"}]
[0,10,10,0,{"$nulls":5},{"$f":"#REF!","v":{"$error":"#REF!"}},{"$f":"#REF!","v":{"$error":"#REF!"}},{"$f":"#REF!","v":{"$error":"#REF!"}},{"$f":"#REF!","v":{"$error":"#REF!"}},{"$f":"#REF!","v":{"$error":"#REF!"}},{"$f":"#REF!","v":{"$error":"#REF!"}},0,0,0,0,{"$nulls":3},{"$f":"#REF!","v":{"$error":"#REF!"}},"/",{"$f":"#REF!","v":{"$error":"#REF!"}},{"$error":"#REF!"},{"$f":"#REF!","v":{"$error":"#REF!"}},"/",{"$f":"#REF!","v":{"$error":"#REF!"}},{"$error":"#REF!"},{"$f":"#REF!","v":{"$error":"#REF!"}},"/",{"$f":"#REF!","v":{"$error":"#REF!"}},{"$error":"#REF!"},{"$f":"#REF!","v":{"$error":"#REF!"}},"/",{"$f":"#REF!","v":{"$error":"#REF!"}},{"$error":"#REF!"}]
[0,11,11,0,{"$nulls":5},{"$f":"#REF!","v":{"$error":"#REF!"}},{"$f":"#REF!","v":{"$error":"#REF!"}},{"$f":"#REF!","v":{"$error":"#REF!"}},{"$f":"#REF!","v":{"$error":"#REF!"}},{"$f":"#REF!","v":{"$error":"#REF!"}},{"$f":"#REF!","v":{"$error":"#REF!"}},0,0,0,0,{"$nulls":3},{"$f":"#REF!","v":{"$error":"#REF!"}},"/",{"$f":"#REF!","v":{"$error":"#REF!"}},{"$error":"#REF!"},{"$f":"#REF!","v":{"$error":"#REF!"}},"/",{"$f":"#REF!","v":{"$error":"#REF!"}},{"$error":"#REF!"},{"$f":"#REF!","v":{"$error":"#REF!"}},"/",{"$f":"#REF!","v":{"$error":"#REF!"}},{"$error":"#REF!"},{"$f":"#REF!","v":{"$error":"#REF!"}},"/",{"$f":"#REF!","v":{"$error":"#REF!"}},{"$error":"#REF!"}]
[0,12,12,0,{"$nulls":5},{"$f":"#REF!","v":{"$error":"#REF!"}},{"$f":"#REF!","v":{"$error":"#REF!"}},{"$f":"#REF!","v":{"$error":"#REF!"}},{"$f":"#REF!","v":{"$error":"#REF!"}},{"$f":"#REF!","v":{"$error":"#REF!"}},{"$f":"#REF!","v":{"$error":"#REF!"}},0,0,0,0,{"$nulls":3},{"$f":"#REF!","v":{"$error":"#REF!"}},"/",{"$f":"#REF!","v":{"$error":"#REF!"}},{"$error":"#REF!"},{"$f":"#REF!","v":{"$error":"#REF!"}},"/",{"$f":"#REF!","v":{"$error":"#REF!"}},{"$error":"#REF!"},{"$f":"#REF!","v":{"$error":"#REF!"}},"/",{"$f":"#REF!","v":{"$error":"#REF!"}},{"$error":"#REF!"},{"$f":"#REF!","v":{"$error":"#REF!"}},"/",{"$f":"#REF!","v":{"$error":"#REF!"}},{"$error":"#REF!"}]
[0,13,13,0,{"$nulls":5},{"$f":"#REF!","v":{"$error":"#REF!"}},{"$f":"#REF!","v":{"$error":"#REF!"}},{"$f":"#REF!","v":{"$error":"#REF!"}},{"$f":"#REF!","v":{"$error":"#REF!"}},{"$f":"#REF!","v":{"$error":"#REF!"}},{"$f":"#REF!","v":{"$error":"#REF!"}},0,0,0,0,{"$nulls":3},{"$f":"#REF!","v":{"$error":"#REF!"}},"/",{"$f":"#REF!","v":{"$error":"#REF!"}},{"$error":"#REF!"},{"$f":"#REF!","v":{"$error":"#REF!"}},"/",{"$f":"#REF!","v":{"$error":"#REF!"}},{"$error":"#REF!"},{"$f":"#REF!","v":{"$error":"#REF!"}},"/",{"$f":"#REF!","v":{"$error":"#REF!"}},{"$error":"#REF!"},{"$f":"#REF!","v":{"$error":"#REF!"}},"/",{"$f":"#REF!","v":{"$error":"#REF!"}},{"$error":"#REF!"}]
[0,14,14,0,{"$nulls":5},{"$f":"#REF!","v":{"$error":"#REF!"}},{"$f":"#REF!","v":{"$error":"#REF!"}},{"$f":"#REF!","v":{"$error":"#REF!"}},{"$f":"#REF!","v":{"$error":"#REF!"}},{"$f":"#REF!","v":{"$error":"#REF!"}},{"$f":"#REF!","v":{"$error":"#REF!"}},0,0,0,0,{"$nulls":3},{"$f":"#REF!","v":{"$error":"#REF!"}},"/",{"$f":"#REF!","v":{"$error":"#REF!"}},{"$error":"#REF!"},{"$f":"#REF!","v":{"$error":"#REF!"}},"/",{"$f":"#REF!","v":{"$error":"#REF!"}},{"$error":"#REF!"},{"$f":"#REF!","v":{"$error":"#REF!"}},"/",{"$f":"#REF!","v":{"$error":"#REF!"}},{"$error":"#REF!"},{"$f":"#REF!","v":{"$error":"#REF!"}},"/",{"$f":"#REF!","v":{"$error":"#REF!"}},{"$error":"#REF!"}]
[0,15,15,0,{"$nulls":5},{"$f":"#REF!","v":{"$error":"#REF!"}},{"$f":"#REF!","v":{"$error":"#REF!"}},{"$f":"#REF!","v":{"$error":"#REF!"}},{"$f":"#REF!","v":{"$error":"#REF!"}},{"$f":"#REF!","v":{"$error":"#REF!"}},{"$f":"#REF!","v":{"$error":"#REF!"}},0,0,0,0,{"$nulls":3},{"$f":"#REF!","v":{"$error":"#REF!"}},"/",{"$f":"#REF!","v":{"$error":"#REF!"}},{"$error":"#REF!"},{"$f":"#REF!","v":{"$error":"#REF!"}},"/",{"$f":"#REF!","v":{"$error":"#REF!"}},{"$error":"#REF!"},{"$f":"#REF!","v":{"$error":"#REF!"}},"/",{"$f":"#REF!","v":{"$error":"#REF!"}},{"$error":"#REF!"},{"$f":"#REF!","v":{"$error":"#REF!"}},"/",{"$f":"#REF!","v":{"$error":"#REF!"}},{"$error":"#REF!"}]
[0,16,16,0,{"$nulls":5},{"$f":"#REF!","v":{"$error":"#REF!"}},{"$f":"#REF!","v":{"$error":"#REF!"}},{"$f":"#REF!","v":{"$error":"#REF!"}},{"$f":"#REF!","v":{"$error":"#REF!"}},{"$f":"#REF!","v":{"$error":"#REF!"}},{"$f":"#REF!","v":{"$error":"#REF!"}},0,0,0,0,{"$nulls":3},{"$f":"#REF!","v":{"$error":"#REF!"}},"/",{"$f":"#REF!","v":{"$error":"#REF!"}},{"$error":"#REF!"},{"$f":"#REF!","v":{"$error":"#REF!"}},"/",{"$f":"#REF!","v":{"$error":"#REF!"}},{"$error":"#REF!"},{"$f":"#REF!","v":{"$error":"#REF!"}},"/",{"$f":"#REF!","v":{"$error":"#REF!"}},{"$error":"#REF!"},{"$f":"#REF!","v":{"$error":"#REF!"}},"/",{"$f":"#REF!","v":{"$error":"#REF!"}},{"$error":"#REF!"}]
[0,17,17,0,{"$nulls":5},{"$f":"#REF!","v":{"$error":"#REF!"}},{"$f":"#REF!","v":{"$error":"#REF!"}},{"$f":"#REF!","v":{"$error":"#REF!"}},{"$f":"#REF!","v":{"$error":"#REF!"}},{"$f":"#REF!","v":{"$error":"#REF!"}},{"$f":"#REF!","v":{"$error":"#REF!"}},0,0,0,0,{"$nulls":3},{"$f":"#REF!","v":{"$error":"#REF!"}},"/",{"$f":"#REF!","v":{"$error":"#REF!"}},{"$error":"#REF!"},{"$f":"#REF!","v":{"$error":"#REF!"}},"/",{"$f":"#REF!","v":{"$error":"#REF!"}},{"$error":"#REF!"},{"$f":"#REF!","v":{"$error":"#REF!"}},"/",{"$f":"#REF!","v":{"$error":"#REF!"}},{"$error":"#REF!"},{"$f":"#REF!","v":{"$error":"#REF!"}},"/",{"$f":"#REF!","v":{"$error":"#REF!"}},{"$error":"#REF!"}]
[0,18,18,0,{"$nulls":5},{"$f":"#REF!","v":{"$error":"#REF!"}},{"$f":"#REF!","v":{"$error":"#REF!"}},{"$f":"#REF!","v":{"$error":"#REF!"}},{"$f":"#REF!","v":{"$error":"#REF!"}},{"$f":"#REF!","v":{"$error":"#REF!"}},{"$f":"#REF!","v":{"$error":"#REF!"}},0,0,0,0,{"$nulls":3},{"$f":"#REF!","v":{"$error":"#REF!"}},"/",{"$f":"#REF!","v":{"$error":"#REF!"}},{"$error":"#REF!"},{"$f":"#REF!","v":{"$error":"#REF!"}},"/",{"$f":"#REF!","v":{"$error":"#REF!"}},{"$error":"#REF!"},{"$f":"#REF!","v":{"$error":"#REF!"}},"/",{"$f":"#REF!","v":{"$error":"#REF!"}},{"$error":"#REF!"},{"$f":"#REF!","v":{"$error":"#REF!"}},"/",{"$f":"#REF!","v":{"$error":"#REF!"}},{"$error":"#REF!"}]
[0,19,19,0,{"$nulls":5},{"$f":"#REF!","v":{"$error":"#REF!"}},{"$f":"#REF!","v":{"$error":"#REF!"}},{"$f":"#REF!","v":{"$error":"#REF!"}},{"$f":"#REF!","v":{"$error":"#REF!"}},{"$f":"#REF!","v":{"$error":"#REF!"}},{"$f":"#REF!","v":{"$error":"#REF!"}},0,0,0,0,{"$nulls":3},{"$f":"#REF!","v":{"$error":"#REF!"}},"/",{"$f":"#REF!","v":{"$error":"#REF!"}},{"$error":"#REF!"},{"$f":"#REF!","v":{"$error":"#REF!"}},"/",{"$f":"#REF!","v":{"$error":"#REF!"}},{"$error":"#REF!"},{"$f":"#REF!","v":{"$error":"#REF!"}},"/",{"$f":"#REF!","v":{"$error":"#REF!"}},{"$error":"#REF!"},{"$f":"#REF!","v":{"$error":"#REF!"}},"/",{"$f":"#REF!","v":{"$error":"#REF!"}},{"$error":"#REF!"}]
[0,20,20,0,{"$nulls":5},{"$f":"#REF!","v":{"$error":"#REF!"}},{"$f":"#REF!","v":{"$error":"#REF!"}},{"$f":"#REF!","v":{"$error":"#REF!"}},{"$f":"#REF!","v":{"$error":"#REF!"}},{"$f":"#REF!","v":{"$error":"#REF!"}},{"$f":"#REF!","v":{"$error":"#REF!"}},0,0,0,0,{"$nulls":3},{"$f":"#REF!","v":{"$error":"#REF!"}},"/",{"$f":"#REF!","v":{"$error":"#REF!"}},{"$error":"#REF!"},{"$f":"#REF!","v":{"$error":"#REF!"}},"/",{"$f":"#REF!","v":{"$error":"#REF!"}},{"$error":"#REF!"},{"$f":"#REF!","v":{"$error":"#REF!"}},"/",{"$f":"#REF!","v":{"$error":"#REF!"}},{"$error":"#REF!"},{"$f":"#REF!","v":{"$error":"#REF!"}},"/",{"$f":"#REF!","v":{"$error":"#REF!"}},{"$error":"#REF!"}]
[0,21,21,0,{"$nulls":5},{"$f":"#REF!","v":{"$error":"#REF!"}},{"$f":"#REF!","v":{"$error":"#REF!"}},{"$f":"#REF!","v":{"$error":"#REF!"}},{"$f":"#REF!","v":{"$error":"#REF!"}},{"$f":"#REF!","v":{"$error":"#REF!"}},{"$f":"#REF!","v":{"$error":"#REF!"}},0,0,0,0,{"$nulls":3},{"$f":"#REF!","v":{"$error":"#REF!"}},"/",{"$f":"#REF!","v":{"$error":"#REF!"}},{"$error":"#REF!"},{"$f":"#REF!","v":{"$error":"#REF!"}},"/",{"$f":"#REF!","v":{"$error":"#REF!"}},{"$error":"#REF!"},{"$f":"#REF!","v":{"$error":"#REF!"}},"/",{"$f":"#REF!","v":{"$error":"#REF!"}},{"$error":"#REF!"},{"$f":"#REF!","v":{"$error":"#REF!"}},"/",{"$f":"#REF!","v":{"$error":"#REF!"}},{"$error":"#REF!"}]
[0,22,22,0,{"$nulls":5},{"$f":"#REF!","v":{"$error":"#REF!"}},{"$f":"#REF!","v":{"$error":"#REF!"}},{"$f":"#REF!","v":{"$error":"#REF!"}},{"$f":"#REF!","v":{"$error":"#REF!"}},{"$f":"#REF!","v":{"$error":"#REF!"}},{"$f":"#REF!","v":{"$error":"#REF!"}},0,0,0,0,{"$nulls":3},{"$f":"#REF!","v":{"$error":"#REF!"}},"/",{"$f":"#REF!","v":{"$error":"#REF!"}},{"$error":"#REF!"},{"$f":"#REF!","v":{"$error":"#REF!"}},"/",{"$f":"#REF!","v":{"$error":"#REF!"}},{"$error":"#REF!"},{"$f":"#REF!","v":{"$error":"#REF!"}},"/",{"$f":"#REF!","v":{"$error":"#REF!"}},{"$error":"#REF!"},{"$f":"#REF!","v":{"$error":"#REF!"}},"/",{"$f":"#REF!","v":{"$error":"#REF!"}},{"$error":"#REF!"}]
[0,23,23,0,{"$nulls":5},{"$f":"#REF!","v":{"$error":"#REF!"}},{"$f":"#REF!","v":{"$error":"#REF!"}},{"$f":"#REF!","v":{"$error":"#REF!"}},{"$f":"#REF!","v":{"$error":"#REF!"}},{"$f":"#REF!","v":{"$error":"#REF!"}},{"$f":"#REF!","v":{"$error":"#REF!"}},0,0,0,0,{"$nulls":3},{"$f":"#REF!","v":{"$error":"#REF!"}},"/",{"$f":"#REF!","v":{"$error":"#REF!"}},{"$error":"#REF!"},{"$f":"#REF!","v":{"$error":"#REF!"}},"/",{"$f":"#REF!","v":{"$error":"#REF!"}},{"$error":"#REF!"},{"$f":"#REF!","v":{"$error":"#REF!"}},"/",{"$f":"#REF!","v":{"$error":"#REF!"}},{"$error":"#REF!"},{"$f":"#REF!","v":{"$error":"#REF!"}},"/",{"$f":"#REF!","v":{"$error":"#REF!"}},{"$error":"#REF!"}]
[0,24,24,0,{"$nulls":5},{"$f":"#REF!","v":{"$error":"#REF!"}},{"$f":"#REF!","v":{"$error":"#REF!"}},{"$f":"#REF!","v":{"$error":"#REF!"}},{"$f":"#REF!","v":{"$error":"#REF!"}},{"$f":"#REF!","v":{"$error":"#REF!"}},{"$f":"#REF!","v":{"$error":"#REF!"}},0,0,0,0,{"$nulls":3},{"$f":"#REF!","v":{"$error":"#REF!"}},"/",{"$f":"#REF!","v":{"$error":"#REF!"}},{"$error":"#REF!"},{"$f":"#REF!","v":{"$error":"#REF!"}},"/",{"$f":"#REF!","v":{"$error":"#REF!"}},{"$error":"#REF!"},{"$f":"#REF!","v":{"$error":"#REF!"}},"/",{"$f":"#REF!","v":{"$error":"#REF!"}},{"$error":"#REF!"},{"$f":"#REF!","v":{"$error":"#REF!"}},"/",{"$f":"#REF!","v":{"$error":"#REF!"}},{"$error":"#REF!"}]
[0,25,25,0,{"$nulls":5},{"$f":"#REF!","v":{"$error":"#REF!"}},{"$f":"#REF!","v":{"$error":"#REF!"}},{"$f":"#REF!","v":{"$error":"#REF!"}},{"$f":"#REF!","v":{"$error":"#REF!"}},{"$f":"#REF!","v":{"$error":"#REF!"}},{"$f":"#REF!","v":{"$error":"#REF!"}},0,0,0,0,{"$nulls":3},{"$f":"#REF!","v":{"$error":"#REF!"}},"/",{"$f":"#REF!","v":{"$error":"#REF!"}},{"$error":"#REF!"},{"$f":"#REF!","v":{"$error":"#REF!"}},"/",{"$f":"#REF!","v":{"$error":"#REF!"}},{"$error":"#REF!"},{"$f":"#REF!","v":{"$error":"#REF!"}},"/",{"$f":"#REF!","v":{"$error":"#REF!"}},{"$error":"#REF!"},{"$f":"#REF!","v":{"$error":"#REF!"}},"/",{"$f":"#REF!","v":{"$error":"#REF!"}},{"$error":"#REF!"}]
[0,26,26,0,{"$nulls":5},{"$f":"#REF!","v":{"$error":"#REF!"}},{"$f":"#REF!","v":{"$error":"#REF!"}},{"$f":"#REF!","v":{"$error":"#REF!"}},{"$f":"#REF!","v":{"$error":"#REF!"}},{"$f":"#REF!","v":{"$error":"#REF!"}},{"$f":"#REF!","v":{"$error":"#REF!"}},0,0,0,0,{"$nulls":3},{"$f":"#REF!","v":{"$error":"#REF!"}},"/",{"$f":"#REF!","v":{"$error":"#REF!"}},{"$error":"#REF!"},{"$f":"#REF!","v":{"$error":"#REF!"}},"/",{"$f":"#REF!","v":{"$error":"#REF!"}},{"$error":"#REF!"},{"$f":"#REF!","v":{"$error":"#REF!"}},"/",{"$f":"#REF!","v":{"$error":"#REF!"}},{"$error":"#REF!"},{"$f":"#REF!","v":{"$error":"#REF!"}},"/",{"$f":"#REF!","v":{"$error":"#REF!"}},{"$error":"#REF!"}]
[0,27,27,0,{"$nulls":5},{"$f":"#REF!","v":{"$error":"#REF!"}},{"$f":"#REF!","v":{"$error":"#REF!"}},{"$f":"#REF!","v":{"$error":"#REF!"}},{"$f":"#REF!","v":{"$error":"#REF!"}},{"$f":"#REF!","v":{"$error":"#REF!"}},{"$f":"#REF!","v":{"$error":"#REF!"}},0,0,0,0,{"$nulls":3},{"$f":"#REF!","v":{"$error":"#REF!"}},"/",{"$f":"#REF!","v":{"$error":"#REF!"}},{"$error":"#REF!"},{"$f":"#REF!","v":{"$error":"#REF!"}},"/",{"$f":"#REF!","v":{"$error":"#REF!"}},{"$error":"#REF!"},{"$f":"#REF!","v":{"$error":"#REF!"}},"/",{"$f":"#REF!","v":{"$error":"#REF!"}},{"$error":"#REF!"},{"$f":"#REF!","v":{"$error":"#REF!"}},"/",{"$f":"#REF!","v":{"$error":"#REF!"}},{"$error":"#REF!"}]
[0,28,28,0,{"$nulls":5},{"$f":"#REF!","v":{"$error":"#REF!"}},{"$f":"#REF!","v":{"$error":"#REF!"}},{"$f":"#REF!","v":{"$error":"#REF!"}},{"$f":"#REF!","v":{"$error":"#REF!"}},{"$f":"#REF!","v":{"$error":"#REF!"}},{"$f":"#REF!","v":{"$error":"#REF!"}},0,0,0,0,{"$nulls":3},{"$f":"#REF!","v":{"$error":"#REF!"}},"/",{"$f":"#REF!","v":{"$error":"#REF!"}},{"$error":"#REF!"},{"$f":"#REF!","v":{"$error":"#REF!"}},"/",{"$f":"#REF!","v":{"$error":"#REF!"}},{"$error":"#REF!"},{"$f":"#REF!","v":{"$error":"#REF!"}},"/",{"$f":"#REF!","v":{"$error":"#REF!"}},{"$error":"#REF!"},{"$f":"#REF!","v":{"$error":"#REF!"}},"/",{"$f":"#REF!","v":{"$error":"#REF!"}},{"$error":"#REF!"}]
[0,29,29,0,{"$nulls":5},{"$f":"#REF!","v":{"$error":"#REF!"}},{"$f":"#REF!","v":{"$error":"#REF!"}},{"$f":"#REF!","v":{"$error":"#REF!"}},{"$f":"#REF!","v":{"$error":"#REF!"}},{"$f":"#REF!","v":{"$error":"#REF!"}},{"$f":"#REF!","v":{"$error":"#REF!"}},0,0,0,0,{"$nulls":3},{"$f":"#REF!","v":{"$error":"#REF!"}},"/",{"$f":"#REF!","v":{"$error":"#REF!"}},{"$error":"#REF!"},{"$f":"#REF!","v":{"$error":"#REF!"}},"/",{"$f":"#REF!","v":{"$error":"#REF!"}},{"$error":"#REF!"},{"$f":"#REF!","v":{"$error":"#REF!"}},"/",{"$f":"#REF!","v":{"$error":"#REF!"}},{"$error":"#REF!"},{"$f":"#REF!","v":{"$error":"#REF!"}},"/",{"$f":"#REF!","v":{"$error":"#REF!"}},{"$error":"#REF!"}]
[0,30,30,0,{"$nulls":5},{"$f":"#REF!","v":{"$error":"#REF!"}},{"$f":"#REF!","v":{"$error":"#REF!"}},{"$f":"#REF!","v":{"$error":"#REF!"}},{"$f":"#REF!","v":{"$error":"#REF!"}},{"$f":"#REF!","v":{"$error":"#REF!"}},{"$f":"#REF!","v":{"$error":"#REF!"}},0,0,0,0,{"$nulls":3},{"$f":"#REF!","v":{"$error":"#REF!"}},"/",{"$f":"#REF!","v":{"$error":"#REF!"}},{"$error":"#REF!"},{"$f":"#REF!","v":{"$error":"#REF!"}},"/",{"$f":"#REF!","v":{"$error":"#REF!"}},{"$error":"#REF!"},{"$f":"#REF!","v":{"$error":"#REF!"}},"/",{"$f":"#REF!","v":{"$error":"#REF!"}},{"$error":"#REF!"},{"$f":"#REF!","v":{"$error":"#REF!"}},"/",{"$f":"#REF!","v":{"$error":"#REF!"}},{"$error":"#REF!"}]
[0,31,31,0,{"$nulls":5},{"$f":"#REF!","v":{"$error":"#REF!"}},{"$f":"#REF!","v":{"$error":"#REF!"}},{"$f":"#REF!","v":{"$error":"#REF!"}},{"$f":"#REF!","v":{"$error":"#REF!"}},{"$f":"#REF!","v":{"$error":"#REF!"}},{"$f":"#REF!","v":{"$error":"#REF!"}},0,0,0,0,{"$nulls":3},{"$f":"#REF!","v":{"$error":"#REF!"}},"/",{"$f":"#REF!","v":{"$error":"#REF!"}},{"$error":"#REF!"},{"$f":"#REF!","v":{"$error":"#REF!"}},"/",{"$f":"#REF!","v":{"$error":"#REF!"}},{"$error":"#REF!"},{"$f":"#REF!","v":{"$error":"#REF!"}},"/",{"$f":"#REF!","v":{"$error":"#REF!"}},{"$error":"#REF!"},{"$f":"#REF!","v":{"$error":"#REF!"}},"/",{"$f":"#REF!","v":{"$error":"#REF!"}},{"$error":"#REF!"}]
[0,32,32,0,{"$nulls":5},{"$f":"#REF!","v":{"$error":"#REF!"}},{"$f":"#REF!","v":{"$error":"#REF!"}},{"$f":"#REF!","v":{"$error":"#REF!"}},{"$f":"#REF!","v":{"$error":"#REF!"}},{"$f":"#REF!","v":{"$error":"#REF!"}},{"$f":"#REF!","v":{"$error":"#REF!"}},0,0,0,0,{"$nulls":3},{"$f":"#REF!","v":{"$error":"#REF!"}},"/",{"$f":"#REF!","v":{"$error":"#REF!"}},{"$error":"#REF!"},{"$f":"#REF!","v":{"$error":"#REF!"}},"/",{"$f":"#REF!","v":{"$error":"#REF!"}},{"$error":"#REF!"},{"$f":"#REF!","v":{"$error":"#REF!"}},"/",{"$f":"#REF!","v":{"$error":"#REF!"}},{"$error":"#REF!"},{"$f":"#REF!","v":{"$error":"#REF!"}},"/",{"$f":"#REF!","v":{"$error":"#REF!"}},{"$error":"#REF!"}]
[0,33,33,0,{"$nulls":5},{"$f":"#REF!","v":{"$error":"#REF!"}},{"$f":"#REF!","v":{"$error":"#REF!"}},{"$f":"#REF!","v":{"$error":"#REF!"}},{"$f":"#REF!","v":{"$error":"#REF!"}},{"$f":"#REF!","v":{"$error":"#REF!"}},{"$f":"#REF!","v":{"$error":"#REF!"}},0,0,0,0,{"$nulls":3},{"$f":"#REF!","v":{"$error":"#REF!"}},"/",{"$f":"#REF!","v":{"$error":"#REF!"}},{"$error":"#REF!"},{"$f":"#REF!","v":{"$error":"#REF!"}},"/",{"$f":"#REF!","v":{"$error":"#REF!"}},{"$error":"#REF!"},{"$f":"#REF!","v":{"$error":"#REF!"}},"/",{"$f":"#REF!","v":{"$error":"#REF!"}},{"$error":"#REF!"},{"$f":"#REF!","v":{"$error":"#REF!"}},"/",{"$f":"#REF!","v":{"$error":"#REF!"}},{"$error":"#REF!"}]
[0,34,34,0,{"$nulls":5},{"$f":"#REF!","v":{"$error":"#REF!"}},{"$f":"#REF!","v":{"$error":"#REF!"}},{"$f":"#REF!","v":{"$error":"#REF!"}},{"$f":"#REF!","v":{"$error":"#REF!"}},{"$f":"#REF!","v":{"$error":"#REF!"}},{"$f":"#REF!","v":{"$error":"#REF!"}},0,0,0,0,{"$nulls":3},{"$f":"#REF!","v":{"$error":"#REF!"}},"/",{"$f":"#REF!","v":{"$error":"#REF!"}},{"$error":"#REF!"},{"$f":"#REF!","v":{"$error":"#REF!"}},"/",{"$f":"#REF!","v":{"$error":"#REF!"}},{"$error":"#REF!"},{"$f":"#REF!","v":{"$error":"#REF!"}},"/",{"$f":"#REF!","v":{"$error":"#REF!"}},{"$error":"#REF!"},{"$f":"#REF!","v":{"$error":"#REF!"}},"/",{"$f":"#REF!","v":{"$error":"#REF!"}},{"$error":"#REF!"}]
[0,35,35,0,{"$nulls":5},{"$f":"#REF!","v":{"$error":"#REF!"}},{"$f":"#REF!","v":{"$error":"#REF!"}},{"$f":"#REF!","v":{"$error":"#REF!"}},{"$f":"#REF!","v":{"$error":"#REF!"}},{"$f":"#REF!","v":{"$error":"#REF!"}},{"$f":"#REF!","v":{"$error":"#REF!"}},0,0,0,0,{"$nulls":3},{"$f":"#REF!","v":{"$error":"#REF!"}},"/",{"$f":"#REF!","v":{"$error":"#REF!"}},{"$error":"#REF!"},{"$f":"#REF!","v":{"$error":"#REF!"}},"/",{"$f":"#REF!","v":{"$error":"#REF!"}},{"$error":"#REF!"},{"$f":"#REF!","v":{"$error":"#REF!"}},"/",{"$f":"#REF!","v":{"$error":"#REF!"}},{"$error":"#REF!"},{"$f":"#REF!","v":{"$error":"#REF!"}},"/",{"$f":"#REF!","v":{"$error":"#REF!"}},{"$error":"#REF!"}]
[0,36,36,0,{"$nulls":5},{"$f":"#REF!","v":{"$error":"#REF!"}},{"$f":"#REF!","v":{"$error":"#REF!"}},{"$f":"#REF!","v":{"$error":"#REF!"}},{"$f":"#REF!","v":{"$error":"#REF!"}},{"$f":"#REF!","v":{"$error":"#REF!"}},{"$f":"#REF!","v":{"$error":"#REF!"}},0,0,0,0,{"$nulls":3},{"$f":"#REF!","v":{"$error":"#REF!"}},"/",{"$f":"#REF!","v":{"$error":"#REF!"}},{"$error":"#REF!"},{"$f":"#REF!","v":{"$error":"#REF!"}},"/",{"$f":"#REF!","v":{"$error":"#REF!"}},{"$error":"#REF!"},{"$f":"#REF!","v":{"$error":"#REF!"}},"/",{"$f":"#REF!","v":{"$error":"#REF!"}},{"$error":"#REF!"},{"$f":"#REF!","v":{"$error":"#REF!"}},"/",{"$f":"#REF!","v":{"$error":"#REF!"}},{"$error":"#REF!"}]
[0,37,37,0,{"$nulls":5},{"$f":"#REF!","v":{"$error":"#REF!"}},{"$f":"#REF!","v":{"$error":"#REF!"}},{"$f":"#REF!","v":{"$error":"#REF!"}},{"$f":"#REF!","v":{"$error":"#REF!"}},{"$f":"#REF!","v":{"$error":"#REF!"}},{"$f":"#REF!","v":{"$error":"#REF!"}},0,0,0,0,{"$nulls":3},{"$f":"#REF!","v":{"$error":"#REF!"}},"/",{"$f":"#REF!","v":{"$error":"#REF!"}},{"$error":"#REF!"},{"$f":"#REF!","v":{"$error":"#REF!"}},"/",{"$f":"#REF!","v":{"$error":"#REF!"}},{"$error":"#REF!"},{"$f":"#REF!","v":{"$error":"#REF!"}},"/",{"$f":"#REF!","v":{"$error":"#REF!"}},{"$error":"#REF!"},{"$f":"#REF!","v":{"$error":"#REF!"}},"/",{"$f":"#REF!","v":{"$error":"#REF!"}},{"$error":"#REF!"}]
[0,38,38,0,{"$nulls":5},{"$f":"#REF!","v":{"$error":"#REF!"}},{"$f":"#REF!","v":{"$error":"#REF!"}},{"$f":"#REF!","v":{"$error":"#REF!"}},{"$f":"#REF!","v":{"$error":"#REF!"}},{"$f":"#REF!","v":{"$error":"#REF!"}},{"$f":"#REF!","v":{"$error":"#REF!"}},0,0,0,0,{"$nulls":3},{"$f":"#REF!","v":{"$error":"#REF!"}},"/",{"$f":"#REF!","v":{"$error":"#REF!"}},{"$error":"#REF!"},{"$f":"#REF!","v":{"$error":"#REF!"}},"/",{"$f":"#REF!","v":{"$error":"#REF!"}},{"$error":"#REF!"},{"$f":"#REF!","v":{"$error":"#REF!"}},"/",{"$f":"#REF!","v":{"$error":"#REF!"}},{"$error":"#REF!"},{"$f":"#REF!","v":{"$error":"#REF!"}},"/",{"$f":"#REF!","v":{"$error":"#REF!"}},{"$error":"#REF!"}]
[0,39,39,0,{"$nulls":5},{"$f":"#REF!","v":{"$error":"#REF!"}},{"$f":"#REF!","v":{"$error":"#REF!"}},{"$f":"#REF!","v":{"$error":"#REF!"}},{"$f":"#REF!","v":{"$error":"#REF!"}},{"$f":"#REF!","v":{"$error":"#REF!"}},{"$f":"#REF!","v":{"$error":"#REF!"}},0,0,0,0,{"$nulls":3},{"$f":"#REF!","v":{"$error":"#REF!"}},"/",{"$f":"#REF!","v":{"$error":"#REF!"}},{"$error":"#REF!"},{"$f":"#REF!","v":{"$error":"#REF!"}},"/",{"$f":"#REF!","v":{"$error":"#REF!"}},{"$error":"#REF!"},{"$f":"#REF!","v":{"$error":"#REF!"}},"/",{"$f":"#REF!","v":{"$error":"#REF!"}},{"$error":"#REF!"},{"$f":"#REF!","v":{"$error":"#REF!"}},"/",{"$f":"#REF!","v":{"$error":"#REF!"}},{"$error":"#REF!"}]
[0,40,40,0,{"$nulls":5},{"$f":"#REF!","v":{"$error":"#REF!"}},{"$f":"#REF!","v":{"$error":"#REF!"}},{"$f":"#REF!","v":{"$error":"#REF!"}},{"$f":"#REF!","v":{"$error":"#REF!"}},{"$f":"#REF!","v":{"$error":"#REF!"}},{"$f":"#REF!","v":{"$error":"#REF!"}},0,0,0,0,{"$nulls":3},{"$f":"#REF!","v":{"$error":"#REF!"}},"/",{"$f":"#REF!","v":{"$error":"#REF!"}},{"$error":"#REF!"},{"$f":"#REF!","v":{"$error":"#REF!"}},"/",{"$f":"#REF!","v":{"$error":"#REF!"}},{"$error":"#REF!"},{"$f":"#REF!","v":{"$error":"#REF!"}},"/",{"$f":"#REF!","v":{"$error":"#REF!"}},{"$error":"#REF!"},{"$f":"#REF!","v":{"$error":"#REF!"}},"/",{"$f":"#REF!","v":{"$error":"#REF!"}},{"$error":"#REF!"}]
[0,41,41,0,{"$nulls":5},{"$f":"#REF!","v":{"$error":"#REF!"}},{"$f":"#REF!","v":{"$error":"#REF!"}},{"$f":"#REF!","v":{"$error":"#REF!"}},{"$f":"#REF!","v":{"$error":"#REF!"}},{"$f":"#REF!","v":{"$error":"#REF!"}},{"$f":"#REF!","v":{"$error":"#REF!"}},0,0,0,0,{"$nulls":3},{"$f":"#REF!","v":{"$error":"#REF!"}},"/",{"$f":"#REF!","v":{"$error":"#REF!"}},{"$error":"#REF!"},{"$f":"#REF!","v":{"$error":"#REF!"}},"/",{"$f":"#REF!","v":{"$error":"#REF!"}},{"$error":"#REF!"},{"$f":"#REF!","v":{"$error":"#REF!"}},"/",{"$f":"#REF!","v":{"$error":"#REF!"}},{"$error":"#REF!"},{"$f":"#REF!","v":{"$error":"#REF!"}},"/",{"$f":"#REF!","v":{"$error":"#REF!"}},{"$error":"#REF!"}]
[0,42,42,0,{"$nulls":5},{"$f":"#REF!","v":{"$error":"#REF!"}},{"$f":"#REF!","v":{"$error":"#REF!"}},{"$f":"#REF!","v":{"$error":"#REF!"}},{"$f":"#REF!","v":{"$error":"#REF!"}},{"$f":"#REF!","v":{"$error":"#REF!"}},{"$f":"#REF!","v":{"$error":"#REF!"}},0,0,0,0,{"$nulls":3},{"$f":"#REF!","v":{"$error":"#REF!"}},"/",{"$f":"#REF!","v":{"$error":"#REF!"}},{"$error":"#REF!"},{"$f":"#REF!","v":{"$error":"#REF!"}},"/",{"$f":"#REF!","v":{"$error":"#REF!"}},{"$error":"#REF!"},{"$f":"#REF!","v":{"$error":"#REF!"}},"/",{"$f":"#REF!","v":{"$error":"#REF!"}},{"$error":"#REF!"},{"$f":"#REF!","v":{"$error":"#REF!"}},"/",{"$f":"#REF!","v":{"$error":"#REF!"}},{"$error":"#REF!"}]
[0,43,43,0,{"$nulls":5},{"$f":"#REF!","v":{"$error":"#REF!"}},{"$f":"#REF!","v":{"$error":"#REF!"}},{"$f":"#REF!","v":{"$error":"#REF!"}},{"$f":"#REF!","v":{"$error":"#REF!"}},{"$f":"#REF!","v":{"$error":"#REF!"}},{"$f":"#REF!","v":{"$error":"#REF!"}},0,0,0,0,{"$nulls":3},{"$f":"#REF!","v":{"$error":"#REF!"}},"/",{"$f":"#REF!","v":{"$error":"#REF!"}},{"$error":"#REF!"},{"$f":"#REF!","v":{"$error":"#REF!"}},"/",{"$f":"#REF!","v":{"$error":"#REF!"}},{"$error":"#REF!"},{"$f":"#REF!","v":{"$error":"#REF!"}},"/",{"$f":"#REF!","v":{"$error":"#REF!"}},{"$error":"#REF!"},{"$f":"#REF!","v":{"$error":"#REF!"}},"/",{"$f":"#REF!","v":{"$error":"#REF!"}},{"$error":"#REF!"}]
[0,44,44,0,{"$nulls":5},{"$f":"#REF!","v":{"$error":"#REF!"}},{"$f":"#REF!","v":{"$error":"#REF!"}},{"$f":"#REF!","v":{"$error":"#REF!"}},{"$f":"#REF!","v":{"$error":"#REF!"}},{"$f":"#REF!","v":{"$error":"#REF!"}},{"$f":"#REF!","v":{"$error":"#REF!"}},0,0,0,0,{"$nulls":3},{"$f":"#REF!","v":{"$error":"#REF!"}},"/",{"$f":"#REF!","v":{"$error":"#REF!"}},{"$error":"#REF!"},{"$f":"#REF!","v":{"$error":"#REF!"}},"/",{"$f":"#REF!","v":{"$error":"#REF!"}},{"$error":"#REF!"},{"$f":"#REF!","v":{"$error":"#REF!"}},"/",{"$f":"#REF!","v":{"$error":"#REF!"}},{"$error":"#REF!"},{"$f":"#REF!","v":{"$error":"#REF!"}},"/",{"$f":"#REF!","v":{"$error":"#REF!"}},{"$error":"#REF!"}]
[0,45,45,0,{"$nulls":5},{"$f":"#REF!","v":{"$error":"#REF!"}},{"$f":"#REF!","v":{"$error":"#REF!"}},{"$f":"#REF!","v":{"$error":"#REF!"}},{"$f":"#REF!","v":{"$error":"#REF!"}},{"$f":"#REF!","v":{"$error":"#REF!"}},{"$f":"#REF!","v":{"$error":"#REF!"}},0,0,0,0,{"$nulls":3},{"$f":"#REF!","v":{"$error":"#REF!"}},"/",{"$f":"#REF!","v":{"$error":"#REF!"}},{"$error":"#REF!"},{"$f":"#REF!","v":{"$error":"#REF!"}},"/",{"$f":"#REF!","v":{"$error":"#REF!"}},{"$error":"#REF!"},{"$f":"#REF!","v":{"$error":"#REF!"}},"/",{"$f":"#REF!","v":{"$error":"#REF!"}},{"$error":"#REF!"},{"$f":"#REF!","v":{"$error":"#REF!"}},"/",{"$f":"#REF!","v":{"$error":"#REF!"}},{"$error":"#REF!"}]
[0,46,46,0,{"$nulls":5},{"$f":"#REF!","v":{"$error":"#REF!"}},{"$f":"#REF!","v":{"$error":"#REF!"}},{"$f":"#REF!","v":{"$error":"#REF!"}},{"$f":"#REF!","v":{"$error":"#REF!"}},{"$f":"#REF!","v":{"$error":"#REF!"}},{"$f":"#REF!","v":{"$error":"#REF!"}},0,0,0,0,{"$nulls":3},{"$f":"#REF!","v":{"$error":"#REF!"}},"/",{"$f":"#REF!","v":{"$error":"#REF!"}},{"$error":"#REF!"},{"$f":"#REF!","v":{"$error":"#REF!"}},"/",{"$f":"#REF!","v":{"$error":"#REF!"}},{"$error":"#REF!"},{"$f":"#REF!","v":{"$error":"#REF!"}},"/",{"$f":"#REF!","v":{"$error":"#REF!"}},{"$error":"#REF!"},{"$f":"#REF!","v":{"$error":"#REF!"}},"/",{"$f":"#REF!","v":{"$error":"#REF!"}},{"$error":"#REF!"}]
[0,47,47,0,{"$nulls":5},{"$f":"#REF!","v":{"$error":"#REF!"}},{"$f":"#REF!","v":{"$error":"#REF!"}},{"$f":"#REF!","v":{"$error":"#REF!"}},{"$f":"#REF!","v":{"$error":"#REF!"}},{"$f":"#REF!","v":{"$error":"#REF!"}},{"$f":"#REF!","v":{"$error":"#REF!"}},0,0,0,0,{"$nulls":3},{"$f":"#REF!","v":{"$error":"#REF!"}},"/",{"$f":"#REF!","v":{"$error":"#REF!"}},{"$error":"#REF!"},{"$f":"#REF!","v":{"$error":"#REF!"}},"/",{"$f":"#REF!","v":{"$error":"#REF!"}},{"$error":"#REF!"},{"$f":"#REF!","v":{"$error":"#REF!"}},"/",{"$f":"#REF!","v":{"$error":"#REF!"}},{"$error":"#REF!"},{"$f":"#REF!","v":{"$error":"#REF!"}},"/",{"$f":"#REF!","v":{"$error":"#REF!"}},{"$error":"#REF!"}]
[0,48,48,0,{"$nulls":5},{"$f":"#REF!","v":{"$error":"#REF!"}},{"$f":"#REF!","v":{"$error":"#REF!"}},{"$f":"#REF!","v":{"$error":"#REF!"}},{"$f":"#REF!","v":{"$error":"#REF!"}},{"$f":"#REF!","v":{"$error":"#REF!"}},{"$f":"#REF!","v":{"$error":"#REF!"}},0,0,0,0,{"$nulls":3},{"$f":"#REF!","v":{"$error":"#REF!"}},"/",{"$f":"#REF!","v":{"$error":"#REF!"}},{"$error":"#REF!"},{"$f":"#REF!","v":{"$error":"#REF!"}},"/",{"$f":"#REF!","v":{"$error":"#REF!"}},{"$error":"#REF!"},{"$f":"#REF!","v":{"$error":"#REF!"}},"/",{"$f":"#REF!","v":{"$error":"#REF!"}},{"$error":"#REF!"},{"$f":"#REF!","v":{"$error":"#REF!"}},"/",{"$f":"#REF!","v":{"$error":"#REF!"}},{"$error":"#REF!"}]
[0,49,49,0,{"$nulls":5},{"$f":"#REF!","v":{"$error":"#REF!"}},{"$f":"#REF!","v":{"$error":"#REF!"}},{"$f":"#REF!","v":{"$error":"#REF!"}},{"$f":"#REF!","v":{"$error":"#REF!"}},{"$f":"#REF!","v":{"$error":"#REF!"}},{"$f":"#REF!","v":{"$error":"#REF!"}},0,0,0,0,{"$nulls":3},{"$f":"#REF!","v":{"$error":"#REF!"}},"/",{"$f":"#REF!","v":{"$error":"#REF!"}},{"$error":"#REF!"},{"$f":"#REF!","v":{"$error":"#REF!"}},"/",{"$f":"#REF!","v":{"$error":"#REF!"}},{"$error":"#REF!"},{"$f":"#REF!","v":{"$error":"#REF!"}},"/",{"$f":"#REF!","v":{"$error":"#REF!"}},{"$error":"#REF!"},{"$f":"#REF!","v":{"$error":"#REF!"}},"/",{"$f":"#REF!","v":{"$error":"#REF!"}},{"$error":"#REF!"}]
[0,50,50,0,{"$nulls":5},{"$f":"#REF!","v":{"$error":"#REF!"}},{"$f":"#REF!","v":{"$error":"#REF!"}},{"$f":"#REF!","v":{"$error":"#REF!"}},{"$f":"#REF!","v":{"$error":"#REF!"}},{"$f":"#REF!","v":{"$error":"#REF!"}},{"$f":"#REF!","v":{"$error":"#REF!"}},0,0,0,0,{"$nulls":3},{"$f":"#REF!","v":{"$error":"#REF!"}},"/",{"$f":"#REF!","v":{"$error":"#REF!"}},{"$error":"#REF!"},{"$f":"#REF!","v":{"$error":"#REF!"}},"/",{"$f":"#REF!","v":{"$error":"#REF!"}},{"$error":"#REF!"},{"$f":"#REF!","v":{"$error":"#REF!"}},"/",{"$f":"#REF!","v":{"$error":"#REF!"}},{"$error":"#REF!"},{"$f":"#REF!","v":{"$error":"#REF!"}},"/",{"$f":"#REF!","v":{"$error":"#REF!"}},{"$error":"#REF!"}]
[0,51,51,0,{"$nulls":5},{"$f":"#REF!","v":{"$error":"#REF!"}},{"$f":"#REF!","v":{"$error":"#REF!"}},{"$f":"#REF!","v":{"$error":"#REF!"}},{"$f":"#REF!","v":{"$error":"#REF!"}},{"$f":"#REF!","v":{"$error":"#REF!"}},{"$f":"#REF!","v":{"$error":"#REF!"}},0,0,0,0,{"$nulls":3},{"$f":"#REF!","v":{"$error":"#REF!"}},"/",{"$f":"#REF!","v":{"$error":"#REF!"}},{"$error":"#REF!"},{"$f":"#REF!","v":{"$error":"#REF!"}},"/",{"$f":"#REF!","v":{"$error":"#REF!"}},{"$error":"#REF!"},{"$f":"#REF!","v":{"$error":"#REF!"}},"/",{"$f":"#REF!","v":{"$error":"#REF!"}},{"$error":"#REF!"},{"$f":"#REF!","v":{"$error":"#REF!"}},"/",{"$f":"#REF!","v":{"$error":"#REF!"}},{"$error":"#REF!"}]
[0,52,52,0,{"$nulls":5},{"$f":"#REF!","v":{"$error":"#REF!"}},{"$f":"#REF!","v":{"$error":"#REF!"}},{"$f":"#REF!","v":{"$error":"#REF!"}},{"$f":"#REF!","v":{"$error":"#REF!"}},{"$f":"#REF!","v":{"$error":"#REF!"}},{"$f":"#REF!","v":{"$error":"#REF!"}},0,0,0,0,{"$nulls":3},{"$f":"#REF!","v":{"$error":"#REF!"}},"/",{"$f":"#REF!","v":{"$error":"#REF!"}},{"$error":"#REF!"},{"$f":"#REF!","v":{"$error":"#REF!"}},"/",{"$f":"#REF!","v":{"$error":"#REF!"}},{"$error":"#REF!"},{"$f":"#REF!","v":{"$error":"#REF!"}},"/",{"$f":"#REF!","v":{"$error":"#REF!"}},{"$error":"#REF!"},{"$f":"#REF!","v":{"$error":"#REF!"}},"/",{"$f":"#REF!","v":{"$error":"#REF!"}},{"$error":"#REF!"}]
[0,53,53,0,{"$nulls":5},{"$f":"#REF!","v":{"$error":"#REF!"}},{"$f":"#REF!","v":{"$error":"#REF!"}},{"$f":"#REF!","v":{"$error":"#REF!"}},{"$f":"#REF!","v":{"$error":"#REF!"}},{"$f":"#REF!","v":{"$error":"#REF!"}},{"$f":"#REF!","v":{"$error":"#REF!"}},0,0,0,0,{"$nulls":3},{"$f":"#REF!","v":{"$error":"#REF!"}},"/",{"$f":"#REF!","v":{"$error":"#REF!"}},{"$error":"#REF!"},{"$f":"#REF!","v":{"$error":"#REF!"}},"/",{"$f":"#REF!","v":{"$error":"#REF!"}},{"$error":"#REF!"},{"$f":"#REF!","v":{"$error":"#REF!"}},"/",{"$f":"#REF!","v":{"$error":"#REF!"}},{"$error":"#REF!"},{"$f":"#REF!","v":{"$error":"#REF!"}},"/",{"$f":"#REF!","v":{"$error":"#REF!"}},{"$error":"#REF!"}]
[0,54,54,0,{"$nulls":5},{"$f":"#REF!","v":{"$error":"#REF!"}},{"$f":"#REF!","v":{"$error":"#REF!"}},{"$f":"#REF!","v":{"$error":"#REF!"}},{"$f":"#REF!","v":{"$error":"#REF!"}},{"$f":"#REF!","v":{"$error":"#REF!"}},{"$f":"#REF!","v":{"$error":"#REF!"}},0,0,0,0,{"$nulls":3},{"$f":"#REF!","v":{"$error":"#REF!"}},"/",{"$f":"#REF!","v":{"$error":"#REF!"}},{"$error":"#REF!"},{"$f":"#REF!","v":{"$error":"#REF!"}},"/",{"$f":"#REF!","v":{"$error":"#REF!"}},{"$error":"#REF!"},{"$f":"#REF!","v":{"$error":"#REF!"}},"/",{"$f":"#REF!","v":{"$error":"#REF!"}},{"$error":"#REF!"},{"$f":"#REF!","v":{"$error":"#REF!"}},"/",{"$f":"#REF!","v":{"$error":"#REF!"}},{"$error":"#REF!"}]
[0,55,55,0,{"$nulls":5},{"$f":"#REF!","v":{"$error":"#REF!"}},{"$f":"#REF!","v":{"$error":"#REF!"}},{"$f":"#REF!","v":{"$error":"#REF!"}},{"$f":"#REF!","v":{"$error":"#REF!"}},{"$f":"#REF!","v":{"$error":"#REF!"}},{"$f":"#REF!","v":{"$error":"#REF!"}},0,0,0,0,{"$nulls":3},{"$f":"#REF!","v":{"$error":"#REF!"}},"/",{"$f":"#REF!","v":{"$error":"#REF!"}},{"$error":"#REF!"},{"$f":"#REF!","v":{"$error":"#REF!"}},"/",{"$f":"#REF!","v":{"$error":"#REF!"}},{"$error":"#REF!"},{"$f":"#REF!","v":{"$error":"#REF!"}},"/",{"$f":"#REF!","v":{"$error":"#REF!"}},{"$error":"#REF!"},{"$f":"#REF!","v":{"$error":"#REF!"}},"/",{"$f":"#REF!","v":{"$error":"#REF!"}},{"$error":"#REF!"}]
[0,56,56,0,{"$nulls":5},{"$f":"#REF!","v":{"$error":"#REF!"}},{"$f":"#REF!","v":{"$error":"#REF!"}},{"$f":"#REF!","v":{"$error":"#REF!"}},{"$f":"#REF!","v":{"$error":"#REF!"}},{"$f":"#REF!","v":{"$error":"#REF!"}},{"$f":"#REF!","v":{"$error":"#REF!"}},0,0,0,0,{"$nulls":3},{"$f":"#REF!","v":{"$error":"#REF!"}},"/",{"$f":"#REF!","v":{"$error":"#REF!"}},{"$error":"#REF!"},{"$f":"#REF!","v":{"$error":"#REF!"}},"/",{"$f":"#REF!","v":{"$error":"#REF!"}},{"$error":"#REF!"},{"$f":"#REF!","v":{"$error":"#REF!"}},"/",{"$f":"#REF!","v":{"$error":"#REF!"}},{"$error":"#REF!"},{"$f":"#REF!","v":{"$error":"#REF!"}},"/",{"$f":"#REF!","v":{"$error":"#REF!"}},{"$error":"#REF!"}]
[0,57,57,0,{"$nulls":5},{"$f":"#REF!","v":{"$error":"#REF!"}},{"$f":"#REF!","v":{"$error":"#REF!"}},{"$f":"#REF!","v":{"$error":"#REF!"}},{"$f":"#REF!","v":{"$error":"#REF!"}},{"$f":"#REF!","v":{"$error":"#REF!"}},{"$f":"#REF!","v":{"$error":"#REF!"}},0,0,0,0,{"$nulls":3},{"$f":"#REF!","v":{"$error":"#REF!"}},"/",{"$f":"#REF!","v":{"$error":"#REF!"}},{"$error":"#REF!"},{"$f":"#REF!","v":{"$error":"#REF!"}},"/",{"$f":"#REF!","v":{"$error":"#REF!"}},{"$error":"#REF!"},{"$f":"#REF!","v":{"$error":"#REF!"}},"/",{"$f":"#REF!","v":{"$error":"#REF!"}},{"$error":"#REF!"},{"$f":"#REF!","v":{"$error":"#REF!"}},"/",{"$f":"#REF!","v":{"$error":"#REF!"}},{"$error":"#REF!"}]
[0,58,58,0,{"$nulls":5},{"$f":"#REF!","v":{"$error":"#REF!"}},{"$f":"#REF!","v":{"$error":"#REF!"}},{"$f":"#REF!","v":{"$error":"#REF!"}},{"$f":"#REF!","v":{"$error":"#REF!"}},{"$f":"#REF!","v":{"$error":"#REF!"}},{"$f":"#REF!","v":{"$error":"#REF!"}},0,0,0,0,{"$nulls":3},{"$f":"#REF!","v":{"$error":"#REF!"}},"/",{"$f":"#REF!","v":{"$error":"#REF!"}},{"$error":"#REF!"},{"$f":"#REF!","v":{"$error":"#REF!"}},"/",{"$f":"#REF!","v":{"$error":"#REF!"}},{"$error":"#REF!"},{"$f":"#REF!","v":{"$error":"#REF!"}},"/",{"$f":"#REF!","v":{"$error":"#REF!"}},{"$error":"#REF!"},{"$f":"#REF!","v":{"$error":"#REF!"}},"/",{"$f":"#REF!","v":{"$error":"#REF!"}},{"$error":"#REF!"}]
[0,59,59,0,{"$nulls":5},{"$f":"#REF!","v":{"$error":"#REF!"}},{"$f":"#REF!","v":{"$error":"#REF!"}},{"$f":"#REF!","v":{"$error":"#REF!"}},{"$f":"#REF!","v":{"$error":"#REF!"}},{"$f":"#REF!","v":{"$error":"#REF!"}},{"$f":"#REF!","v":{"$error":"#REF!"}},0,0,0,0,{"$nulls":3},{"$f":"#REF!","v":{"$error":"#REF!"}},"/",{"$f":"#REF!","v":{"$error":"#REF!"}},{"$error":"#REF!"},{"$f":"#REF!","v":{"$error":"#REF!"}},"/",{"$f":"#REF!","v":{"$error":"#REF!"}},{"$error":"#REF!"},{"$f":"#REF!","v":{"$error":"#REF!"}},"/",{"$f":"#REF!","v":{"$error":"#REF!"}},{"$error":"#REF!"},{"$f":"#REF!","v":{"$error":"#REF!"}},"/",{"$f":"#REF!","v":{"$error":"#REF!"}},{"$error":"#REF!"}]
[0,60,60,0,{"$nulls":5},{"$f":"#REF!","v":{"$error":"#REF!"}},{"$f":"#REF!","v":{"$error":"#REF!"}},{"$f":"#REF!","v":{"$error":"#REF!"}},{"$f":"#REF!","v":{"$error":"#REF!"}},{"$f":"#REF!","v":{"$error":"#REF!"}},{"$f":"#REF!","v":{"$error":"#REF!"}},0,0,0,0,{"$nulls":3},{"$f":"#REF!","v":{"$error":"#REF!"}},"/",{"$f":"#REF!","v":{"$error":"#REF!"}},{"$error":"#REF!"},{"$f":"#REF!","v":{"$error":"#REF!"}},"/",{"$f":"#REF!","v":{"$error":"#REF!"}},{"$error":"#REF!"},{"$f":"#REF!","v":{"$error":"#REF!"}},"/",{"$f":"#REF!","v":{"$error":"#REF!"}},{"$error":"#REF!"},{"$f":"#REF!","v":{"$error":"#REF!"}},"/",{"$f":"#REF!","v":{"$error":"#REF!"}},{"$error":"#REF!"}]
[0,61,61,0,{"$nulls":5},{"$f":"#REF!","v":{"$error":"#REF!"}},{"$f":"#REF!","v":{"$error":"#REF!"}},{"$f":"#REF!","v":{"$error":"#REF!"}},{"$f":"#REF!","v":{"$error":"#REF!"}},{"$f":"#REF!","v":{"$error":"#REF!"}},{"$f":"#REF!","v":{"$error":"#REF!"}},0,0,0,0,{"$nulls":3},{"$f":"#REF!","v":{"$error":"#REF!"}},"/",{"$f":"#REF!","v":{"$error":"#REF!"}},{"$error":"#REF!"},{"$f":"#REF!","v":{"$error":"#REF!"}},"/",{"$f":"#REF!","v":{"$error":"#REF!"}},{"$error":"#REF!"},{"$f":"#REF!","v":{"$error":"#REF!"}},"/",{"$f":"#REF!","v":{"$error":"#REF!"}},{"$error":"#REF!"},{"$f":"#REF!","v":{"$error":"#REF!"}},"/",{"$f":"#REF!","v":{"$error":"#REF!"}},{"$error":"#REF!"}]
[0,62,62,0,{"$nulls":5},{"$f":"#REF!","v":{"$error":"#REF!"}},{"$f":"#REF!","v":{"$error":"#REF!"}},{"$f":"#REF!","v":{"$error":"#REF!"}},{"$f":"#REF!","v":{"$error":"#REF!"}},{"$f":"#REF!","v":{"$error":"#REF!"}},{"$f":"#REF!","v":{"$error":"#REF!"}},0,0,0,0,{"$nulls":3},{"$f":"#REF!","v":{"$error":"#REF!"}},"/",{"$f":"#REF!","v":{"$error":"#REF!"}},{"$error":"#REF!"},{"$f":"#REF!","v":{"$error":"#REF!"}},"/",{"$f":"#REF!","v":{"$error":"#REF!"}},{"$error":"#REF!"},{"$f":"#REF!","v":{"$error":"#REF!"}},"/",{"$f":"#REF!","v":{"$error":"#REF!"}},{"$error":"#REF!"},{"$f":"#REF!","v":{"$error":"#REF!"}},"/",{"$f":"#REF!","v":{"$error":"#REF!"}},{"$error":"#REF!"}]
[0,63,63,0,{"$nulls":5},{"$f":"#REF!","v":{"$error":"#REF!"}},{"$f":"#REF!","v":{"$error":"#REF!"}},{"$f":"#REF!","v":{"$error":"#REF!"}},{"$f":"#REF!","v":{"$error":"#REF!"}},{"$f":"#REF!","v":{"$error":"#REF!"}},{"$f":"#REF!","v":{"$error":"#REF!"}},0,0,0,0,{"$nulls":3},{"$f":"#REF!","v":{"$error":"#REF!"}},"/",{"$f":"#REF!","v":{"$error":"#REF!"}},{"$error":"#REF!"},{"$f":"#REF!","v":{"$error":"#REF!"}},"/",{"$f":"#REF!","v":{"$error":"#REF!"}},{"$error":"#REF!"},{"$f":"#REF!","v":{"$error":"#REF!"}},"/",{"$f":"#REF!","v":{"$error":"#REF!"}},{"$error":"#REF!"},{"$f":"#REF!","v":{"$error":"#REF!"}},"/",{"$f":"#REF!","v":{"$error":"#REF!"}},{"$error":"#REF!"}]
[0,64,64,0,{"$nulls":5},{"$f":"#REF!","v":{"$error":"#REF!"}},{"$f":"#REF!","v":{"$error":"#REF!"}},{"$f":"#REF!","v":{"$error":"#REF!"}},{"$f":"#REF!","v":{"$error":"#REF!"}},{"$f":"#REF!","v":{"$error":"#REF!"}},{"$f":"#REF!","v":{"$error":"#REF!"}},0,0,0,0,{"$nulls":3},{"$f":"#REF!","v":{"$error":"#REF!"}},"/",{"$f":"#REF!","v":{"$error":"#REF!"}},{"$error":"#REF!"},{"$f":"#REF!","v":{"$error":"#REF!"}},"/",{"$f":"#REF!","v":{"$error":"#REF!"}},{"$error":"#REF!"},{"$f":"#REF!","v":{"$error":"#REF!"}},"/",{"$f":"#REF!","v":{"$error":"#REF!"}},{"$error":"#REF!"},{"$f":"#REF!","v":{"$error":"#REF!"}},"/",{"$f":"#REF!","v":{"$error":"#REF!"}},{"$error":"#REF!"}]
[0,65,65,0,{"$nulls":5},{"$f":"#REF!","v":{"$error":"#REF!"}},{"$f":"#REF!","v":{"$error":"#REF!"}},{"$f":"#REF!","v":{"$error":"#REF!"}},{"$f":"#REF!","v":{"$error":"#REF!"}},{"$f":"#REF!","v":{"$error":"#REF!"}},{"$f":"#REF!","v":{"$error":"#REF!"}},0,0,0,0,{"$nulls":3},{"$f":"#REF!","v":{"$error":"#REF!"}},"/",{"$f":"#REF!","v":{"$error":"#REF!"}},{"$error":"#REF!"},{"$f":"#REF!","v":{"$error":"#REF!"}},"/",{"$f":"#REF!","v":{"$error":"#REF!"}},{"$error":"#REF!"},{"$f":"#REF!","v":{"$error":"#REF!"}},"/",{"$f":"#REF!","v":{"$error":"#REF!"}},{"$error":"#REF!"},{"$f":"#REF!","v":{"$error":"#REF!"}},"/",{"$f":"#REF!","v":{"$error":"#REF!"}},{"$error":"#REF!"}]
[{"$f":"E73","v":0},66,66,{"$f":"IF(E73>0,$E$4,0)","v":0},{"$nulls":5},{"$f":"#REF!","v":{"$error":"#REF!"}},{"$f":"#REF!","v":{"$error":"#REF!"}},{"$f":"#REF!","v":{"$error":"#REF!"}},{"$f":"#REF!","v":{"$error":"#REF!"}},{"$f":"#REF!","v":{"$error":"#REF!"}},{"$f":"#REF!","v":{"$error":"#REF!"}},{"$f":"COUNTIF(J73:O73,\"F\")+COUNTIF(J73:O73,\"AB\")","v":0},{"$f":"COUNTIF(J73:O73,\"S\")","v":0},{"$f":"COUNTIF(J73:O73,\"G1\")","v":0},{"$f":"COUNTIF(J73:O73,\"G2\")","v":0},{"$nulls":3},{"$f":"#REF!","v":{"$error":"#REF!"}},"/",{"$f":"#REF!","v":{"$error":"#REF!"}},{"$f":"CONCATENATE(W73,X73,Y73)","v":{"$error":"#REF!"}},{"$f":"#REF!","v":{"$error":"#REF!"}},"/",{"$f":"#REF!","v":{"$error":"#REF!"}},{"$f":"CONCATENATE(AA73,AB73,AC73)","v":{"$error":"#REF!"}},{"$f":"#REF!","v":{"$error":"#REF!"}},"/",{"$f":"#REF!","v":{"$error":"#REF!"}},{"$f":"CONCATENATE(AE73,AF73,AG73)","v":{"$error":"#REF!"}},{"$f":"#REF!","v":{"$error":"#REF!"}},"/",{"$f":"#REF!","v":{"$error":"#REF!"}},{"$f":"CONCATENATE(AI73,AJ73,AK73)","v":{"$error":"#REF!"}}]
[0,67,67,0,{"$nulls":5},{"$f":"#REF!","v":{"$error":"#REF!"}},{"$f":"#REF!","v":{"$error":"#REF!"}},{"$f":"#REF!","v":{"$error":"#REF!"}},{"$f":"#REF!","v":{"$error":"#REF!"}},{"$f":"#REF!","v":{"$error":"#REF!"}},{"$f":"#REF!","v":{"$error":"#REF!"}},0,0,0,0,{"$nulls":3},{"$f":"#REF!","v":{"$error":"#REF!"}},"/",{"$f":"#REF!","v":{"$error":"#REF!"}},{"$error":"#REF!"},{"$f":"#REF!","v":{"$error":"#REF!"}},"/",{"$f":"#REF!","v":{"$error":"#REF!"}},{"$error":"#REF!"},{"$f":"#REF!","v":{"$error":"#REF!"}},"/",{"$f":"#REF!","v":{"$error":"#REF!"}},{"$error":"#REF!"},{"$f":"#REF!","v":{"$error":"#REF!"}},"/",{"$f":"#REF!","v":{"$error":"#REF!"}},{"$error":"#REF!"}]
[0,68,68,0,{"$nulls":5},{"$f":"#REF!","v":{"$error":"#REF!"}},{"$f":"#REF!","v":{"$error":"#REF!"}},{"$f":"#REF!","v":{"$error":"#REF!"}},{"$f":"#REF!","v":{"$error":"#REF!"}},{"$f":"#REF!","v":{"$error":"#REF!"}},{"$f":"#REF!","v":{"$error":"#REF!"}},0,0,0,0,{"$nulls":3},{"$f":"#REF!","v":{"$error":"#REF!"}},"/",{"$f":"#REF!","v":{"$error":"#REF!"}},{"$error":"#REF!"},{"$f":"#REF!","v":{"$error":"#REF!"}},"/",{"$f":"#REF!","v":{"$error":"#REF!"}},{"$error":"#REF!"},{"$f":"#REF!","v":{"$error":"#REF!"}},"/",{"$f":"#REF!","v":{"$error":"#REF!"}},{"$error":"#REF!"},{"$f":"#REF!","v":{"$error":"#REF!"}},"/",{"$f":"#REF!","v":{"$error":"#REF!"}},{"$error":"#REF!"}]
[0,69,69,0,{"$nulls":5},{"$f":"#REF!","v":{"$error":"#REF!"}},{"$f":"#REF!","v":{"$error":"#REF!"}},{"$f":"#REF!","v":{"$error":"#REF!"}},{"$f":"#REF!","v":{"$error":"#REF!"}},{"$f":"#REF!","v":{"$error":"#REF!"}},{"$f":"#REF!","v":{"$error":"#REF!"}},0,0,0,0,{"$nulls":3},{"$f":"#REF!","v":{"$error":"#REF!"}},"/",{"$f":"#REF!","v":{"$error":"#REF!"}},{"$error":"#REF!"},{"$f":"#REF!","v":{"$error":"#REF!"}},"/",{"$f":"#REF!","v":{"$error":"#REF!"}},{"$error":"#REF!"},{"$f":"#REF!","v":{"$error":"#REF!"}},"/",{"$f":"#REF!","v":{"$error":"#REF!"}},{"$error":"#REF!"},{"$f":"#REF!","v":{"$error":"#REF!"}},"/",{"$f":"#REF!","v":{"$error":"#REF!"}},{"$error":"#REF!"}]
[0,70,70,0,{"$nulls":5},{"$f":"#REF!","v":{"$error":"#REF!"}},{"$f":"#REF!","v":{"$error":"#REF!"}},{"$f":"#REF!","v":{"$error":"#REF!"}},{"$f":"#REF!","v":{"$error":"#REF!"}},{"$f":"#REF!","v":{"$error":"#REF!"}},{"$f":"#REF!","v":{"$error":"#REF!"}},0,0,0,0,{"$nulls":3},{"$f":"#REF!","v":{"$error":"#REF!"}},"/",{"$f":"#REF!","v":{"$error":"#REF!"}},{"$error":"#REF!"},{"$f":"#REF!","v":{"$error":"#REF!"}},"/",{"$f":"#REF!","v":{"$error":"#REF!"}},{"$error":"#REF!"},{"$f":"#REF!","v":{"$error":"#REF!"}},"/",{"$f":"#REF!","v":{"$error":"#REF!"}},{"$error":"#REF!"},{"$f":"#REF!","v":{"$error":"#REF!"}},"/",{"$f":"#REF!","v":{"$error":"#REF!"}},{"$error":"#REF!"}]
[0,71,71,0,{"$nulls":5},{"$f":"#REF!","v":{"$error":"#REF!"}},{"$f":"#REF!","v":{"$error":"#REF!"}},{"$f":"#REF!","v":{"$error":"#REF!"}},{"$f":"#REF!","v":{"$error":"#REF!"}},{"$f":"#REF!","v":{"$error":"#REF!"}},{"$f":"#REF!","v":{"$error":"#REF!"}},0,0,0,0,{"$nulls":3},{"$f":"#REF!","v":{"$error":"#REF!"}},"/",{"$f":"#REF!","v":{"$error":"#REF!"}},{"$error":"#REF!"},{"$f":"#REF!","v":{"$error":"#REF!"}},"/",{"$f":"#REF!","v":{"$error":"#REF!"}},{"$error":"#REF!"},{"$f":"#REF!","v":{"$error":"#REF!"}},"/",{"$f":"#REF!","v":{"$error":"#REF!"}},{"$error":"#REF!"},{"$f":"#REF!","v":{"$error":"#REF!"}},"/",{"$f":"#REF!","v":{"$error":"#REF!"}},{"$error":"#REF!"}]
[0,72,72,0,{"$nulls":5},{"$f":"#REF!","v":{"$error":"#REF!"}},{"$f":"#REF!","v":{"$error":"#REF!"}},{"$f":"#REF!","v":{"$error":"#REF!"}},{"$f":"#REF!","v":{"$error":"#REF!"}},{"$f":"#REF!","v":{"$error":"#REF!"}},{"$f":"#REF!","v":{"$error":"#REF!"}},0,0,0,0,{"$nulls":3},{"$f":"#REF!","v":{"$error":"#REF!"}},"/",{"$f":"#REF!","v":{"$error":"#REF!"}},{"$error":"#REF!"},{"$f":"#REF!","v":{"$error":"#REF!"}},"/",{"$f":"#REF!","v":{"$error":"#REF!"}},{"$error":"#REF!"},{"$f":"#REF!","v":{"$error":"#REF!"}},"/",{"$f":"#REF!","v":{"$error":"#REF!"}},{"$error":"#REF!"},{"$f":"#REF!","v":{"$error":"#REF!"}},"/",{"$f":"#REF!","v":{"$error":"#REF!"}},{"$error":"#REF!"}]
[0,73,73,0,{"$nulls":5},{"$f":"#REF!","v":{"$error":"#REF!"}},{"$f":"#REF!","v":{"$error":"#REF!"}},{"$f":"#REF!","v":{"$error":"#REF!"}},{"$f":"#REF!","v":{"$error":"#REF!"}},{"$f":"#REF!","v":{"$error":"#REF!"}},{"$f":"#REF!","v":{"$error":"#REF!"}},0,0,0,0,{"$nulls":3},{"$f":"#REF!","v":{"$error":"#REF!"}},"/",{"$f":"#REF!","v":{"$error":"#REF!"}},{"$error":"#REF!"},{"$f":"#REF!","v":{"$error":"#REF!"}},"/",{"$f":"#REF!","v":{"$error":"#REF!"}},{"$error":"#REF!"},{"$f":"#REF!","v":{"$error":"#REF!"}},"/",{"$f":"#REF!","v":{"$error":"#REF!"}},{"$error":"#REF!"},{"$f":"#REF!","v":{"$error":"#REF!"}},"/",{"$f":"#REF!","v":{"$error":"#REF!"}},{"$error":"#REF!"}]
[0,74,74,0,{"$nulls":5},{"$f":"#REF!","v":{"$error":"#REF!"}},{"$f":"#REF!","v":{"$error":"#REF!"}},{"$f":"#REF!","v":{"$error":"#REF!"}},{"$f":"#REF!","v":{"$error":"#REF!"}},{"$f":"#REF!","v":{"$error":"#REF!"}},{"$f":"#REF!","v":{"$error":"#REF!"}},0,0,0,0,{"$nulls":3},{"$f":"#REF!","v":{"$error":"#REF!"}},"/",{"$f":"#REF!","v":{"$error":"#REF!"}},{"$error":"#REF!"},{"$f":"#REF!","v":{"$error":"#REF!"}},"/",{"$f":"#REF!","v":{"$error":"#REF!"}},{"$error":"#REF!"},{"$f":"#REF!","v":{"$error":"#REF!"}},"/",{"$f":"#REF!","v":{"$error":"#REF!"}},{"$error":"#REF!"},{"$f":"#REF!","v":{"$error":"#REF!"}},"/",{"$f":"#REF!","v":{"$error":"#REF!"}},{"$error":"#REF!"}]
[0,75,75,0,{"$nulls":5},{"$f":"#REF!","v":{"$error":"#REF!"}},{"$f":"#REF!","v":{"$error":"#REF!"}},{"$f":"#REF!","v":{"$error":"#REF!"}},{"$f":"#REF!","v":{"$error":"#REF!"}},{"$f":"#REF!","v":{"$error":"#REF!"}},{"$f":"#REF!","v":{"$error":"#REF!"}},0,0,0,0,{"$nulls":3},{"$f":"#REF!","v":{"$error":"#REF!"}},"/",{"$f":"#REF!","v":{"$error":"#REF!"}},{"$error":"#REF!"},{"$f":"#REF!","v":{"$error":"#REF!"}},"/",{"$f":"#REF!","v":{"$error":"#REF!"}},{"$error":"#REF!"},{"$f":"#REF!","v":{"$error":"#REF!"}},"/",{"$f":"#REF!","v":{"$error":"#REF!"}},{"$error":"#REF!"},{"$f":"#REF!","v":{"$error":"#REF!"}},"/",{"$f":"#REF!","v":{"$error":"#REF!"}},{"$error":"#REF!"}]
[0,76,76,0,{"$nulls":5},{"$f":"#REF!","v":{"$error":"#REF!"}},{"$f":"#REF!","v":{"$error":"#REF!"}},{"$f":"#REF!","v":{"$error":"#REF!"}},{"$f":"#REF!","v":{"$error":"#REF!"}},{"$f":"#REF!","v":{"$error":"#REF!"}},{"$f":"#REF!","v":{"$error":"#REF!"}},0,0,0,0,{"$nulls":3},{"$f":"#REF!","v":{"$error":"#REF!"}},"/",{"$f":"#REF!","v":{"$error":"#REF!"}},{"$error":"#REF!"},{"$f":"#REF!","v":{"$error":"#REF!"}},"/",{"$f":"#REF!","v":{"$error":"#REF!"}},{"$error":"#REF!"},{"$f":"#REF!","v":{"$error":"#REF!"}},"/",{"$f":"#REF!","v":{"$error":"#REF!"}},{"$error":"#REF!"},{"$f":"#REF!","v":{"$error":"#REF!"}},"/",{"$f":"#REF!","v":{"$error":"#REF!"}},{"$error":"#REF!"}]
[0,77,77,0,{"$nulls":5},{"$f":"#REF!","v":{"$error":"#REF!"}},{"$f":"#REF!","v":{"$error":"#REF!"}},{"$f":"#REF!","v":{"$error":"#REF!"}},{"$f":"#REF!","v":{"$error":"#REF!"}},{"$f":"#REF!","v":{"$error":"#REF!"}},{"$f":"#REF!","v":{"$error":"#REF!"}},0,0,0,0,{"$nulls":3},{"$f":"#REF!","v":{"$error":"#REF!"}},"/",{"$f":"#REF!","v":{"$error":"#REF!"}},{"$error":"#REF!"},{"$f":"#REF!","v":{"$error":"#REF!"}},"/",{"$f":"#REF!","v":{"$error":"#REF!"}},{"$error":"#REF!"},{"$f":"#REF!","v":{"$error":"#REF!"}},"/",{"$f":"#REF!","v":{"$error":"#REF!"}},{"$error":"#REF!"},{"$f":"#REF!","v":{"$error":"#REF!"}},"/",{"$f":"#REF!","v":{"$error":"#REF!"}},{"$error":"#REF!"}]
[0,78,78,0,{"$nulls":5},{"$f":"#REF!","v":{"$error":"#REF!"}},{"$f":"#REF!","v":{"$error":"#REF!"}},{"$f":"#REF!","v":{"$error":"#REF!"}},{"$f":"#REF!","v":{"$error":"#REF!"}},{"$f":"#REF!","v":{"$error":"#REF!"}},{"$f":"#REF!","v":{"$error":"#REF!"}},0,0,0,0,{"$nulls":3},{"$f":"#REF!","v":{"$error":"#REF!"}},"/",{"$f":"#REF!","v":{"$error":"#REF!"}},{"$error":"#REF!"},{"$f":"#REF!","v":{"$error":"#REF!"}},"/",{"$f":"#REF!","v":{"$error":"#REF!"}},{"$error":"#REF!"},{"$f":"#REF!","v":{"$error":"#REF!"}},"/",{"$f":"#REF!","v":{"$error":"#REF!"}},{"$error":"#REF!"},{"$f":"#REF!","v":{"$error":"#REF!"}},"/",{"$f":"#REF!","v":{"$error":"#REF!"}},{"$error":"#REF!"}]
[0,79,79,0,{"$nulls":5},{"$f":"#REF!","v":{"$error":"#REF!"}},{"$f":"#REF!","v":{"$error":"#REF!"}},{"$f":"#REF!","v":{"$error":"#REF!"}},{"$f":"#REF!","v":{"$error":"#REF!"}},{"$f":"#REF!","v":{"$error":"#REF!"}},{"$f":"#REF!","v":{"$error":"#REF!"}},0,0,0,0,{"$nulls":3},{"$f":"#REF!","v":{"$error":"#REF!"}},"/",{"$f":"#REF!","v":{"$error":"#REF!"}},{"$error":"#REF!"},{"$f":"#REF!","v":{"$error":"#REF!"}},"/",{"$f":"#REF!","v":{"$error":"#REF!"}},{"$error":"#REF!"},{"$f":"#REF!","v":{"$error":"#REF!"}},"/",{"$f":"#REF!","v":{"$error":"#REF!"}},{"$error":"#REF!"},{"$f":"#REF!","v":{"$error":"#REF!"}},"/",{"$f":"#REF!","v":{"$error":"#REF!"}},{"$error":"#REF!"}]
[0,80,80,0,{"$nulls":5},{"$f":"#REF!","v":{"$error":"#REF!"}},{"$f":"#REF!","v":{"$error":"#REF!"}},{"$f":"#REF!","v":{"$error":"#REF!"}},{"$f":"#REF!","v":{"$error":"#REF!"}},{"$f":"#REF!","v":{"$error":"#REF!"}},{"$f":"#REF!","v":{"$error":"#REF!"}},0,0,0,0,{"$nulls":3},{"$f":"#REF!","v":{"$error":"#REF!"}},"/",{"$f":"#REF!","v":{"$error":"#REF!"}},{"$error":"#REF!"},{"$f":"#REF!","v":{"$error":"#REF!"}},"/",{"$f":"#REF!","v":{"$error":"#REF!"}},{"$error":"#REF!"},{"$f":"#REF!","v":{"$error":"#REF!"}},"/",{"$f":"#REF!","v":{"$error":"#REF!"}},{"$error":"#REF!"},{"$f":"#REF!","v":{"$error":"#REF!"}},"/",{"$f":"#REF!","v":{"$error":"#REF!"}},{"$error":"#REF!"}]
[0,81,81,0,{"$nulls":5},{"$f":"#REF!","v":{"$error":"#REF!"}},{"$f":"#REF!","v":{"$error":"#REF!"}},{"$f":"#REF!","v":{"$error":"#REF!"}},{"$f":"#REF!","v":{"$error":"#REF!"}},{"$f":"#REF!","v":{"$error":"#REF!"}},{"$f":"#REF!","v":{"$error":"#REF!"}},0,0,0,0,{"$nulls":3},{"$f":"#REF!","v":{"$error":"#REF!"}},"/",{"$f":"#REF!","v":{"$error":"#REF!"}},{"$error":"#REF!"},{"$f":"#REF!","v":{"$error":"#REF!"}},"/",{"$f":"#REF!","v":{"$error":"#REF!"}},{"$error":"#REF!"},{"$f":"#REF!","v":{"$error":"#REF!"}},"/",{"$f":"#REF!","v":{"$error":"#REF!"}},{"$error":"#REF!"},{"$f":"#REF!","v":{"$error":"#REF!"}},"/",{"$f":"#REF!","v":{"$error":"#REF!"}},{"$error":"#REF!"}]
[0,82,82,0,{"$nulls":5},{"$f":"#REF!","v":{"$error":"#REF!"}},{"$f":"#REF!","v":{"$error":"#REF!"}},{"$f":"#REF!","v":{"$error":"#REF!"}},{"$f":"#REF!","v":{"$error":"#REF!"}},{"$f":"#REF!","v":{"$error":"#REF!"}},{"$f":"#REF!","v":{"$error":"#REF!"}},0,0,0,0,{"$nulls":3},{"$f":"#REF!","v":{"$error":"#REF!"}},"/",{"$f":"#REF!","v":{"$error":"#REF!"}},{"$error":"#REF!"},{"$f":"#REF!","v":{"$error":"#REF!"}},"/",{"$f":"#REF!","v":{"$error":"#REF!"}},{"$error":"#REF!"},{"$f":"#REF!","v":{"$error":"#REF!"}},"/",{"$f":"#REF!","v":{"$error":"#REF!"}},{"$error":"#REF!"},{"$f":"#REF!","v":{"$error":"#REF!"}},"/",{"$f":"#REF!","v":{"$error":"#REF!"}},{"$error":"#REF!"}]
[0,83,83,0,{"$nulls":5},{"$f":"#REF!","v":{"$error":"#REF!"}},{"$f":"#REF!","v":{"$error":"#REF!"}},{"$f":"#REF!","v":{"$error":"#REF!"}},{"$f":"#REF!","v":{"$error":"#REF!"}},{"$f":"#REF!","v":{"$error":"#REF!"}},{"$f":"#REF!","v":{"$error":"#REF!"}},0,0,0,0,{"$nulls":3},{"$f":"#REF!","v":{"$error":"#REF!"}},"/",{"$f":"#REF!","v":{"$error":"#REF!"}},{"$error":"#REF!"},{"$f":"#REF!","v":{"$error":"#REF!"}},"/",{"$f":"#REF!","v":{"$error":"#REF!"}},{"$error":"#REF!"},{"$f":"#REF!","v":{"$error":"#REF!"}},"/",{"$f":"#REF!","v":{"$error":"#REF!"}},{"$error":"#REF!"},{"$f":"#REF!","v":{"$error":"#REF!"}},"/",{"$f":"#REF!","v":{"$error":"#REF!"}},{"$error":"#REF!"}]
[0,84,84,0,{"$nulls":5},{"$f":"#REF!","v":{"$error":"#REF!"}},{"$f":"#REF!","v":{"$error":"#REF!"}},{"$f":"#REF!","v":{"$error":"#REF!"}},{"$f":"#REF!","v":{"$error":"#REF!"}},{"$f":"#REF!","v":{"$error":"#REF!"}},{"$f":"#REF!","v":{"$error":"#REF!"}},0,0,0,0,{"$nulls":3},{"$f":"#REF!","v":{"$error":"#REF!"}},"/",{"$f":"#REF!","v":{"$error":"#REF!"}},{"$error":"#REF!"},{"$f":"#REF!","v":{"$error":"#REF!"}},"/",{"$f":"#REF!","v":{"$error":"#REF!"}},{"$error":"#REF!"},{"$f":"#REF!","v":{"$error":"#REF!"}},"/",{"$f":"#REF!","v":{"$error":"#REF!"}},{"$error":"#REF!"},{"$f":"#REF!","v":{"$error":"#REF!"}},"/",{"$f":"#REF!","v":{"$error":"#REF!"}},{"$error":"#REF!"}]
[0,85,85,0,{"$nulls":5},{"$f":"#REF!","v":{"$error":"#REF!"}},{"$f":"#REF!","v":{"$error":"#REF!"}},{"$f":"#REF!","v":{"$error":"#REF!"}},{"$f":"#REF!","v":{"$error":"#REF!"}},{"$f":"#REF!","v":{"$error":"#REF!"}},{"$f":"#REF!","v":{"$error":"#REF!"}},0,0,0,0,{"$nulls":3},{"$f":"#REF!","v":{"$error":"#REF!"}},"/",{"$f":"#REF!","v":{"$error":"#REF!"}},{"$error":"#REF!"},{"$f":"#REF!","v":{"$error":"#REF!"}},"/",{"$f":"#REF!","v":{"$error":"#REF!"}},{"$error":"#REF!"},{"$f":"#REF!","v":{"$error":"#REF!"}},"/",{"$f":"#REF!","v":{"$error":"#REF!"}},{"$error":"#REF!"},{"$f":"#REF!","v":{"$error":"#REF!"}},"/",{"$f":"#REF!","v":{"$error":"#REF!"}},{"$error":"#REF!"}]
[0,86,86,0,{"$nulls":5},{"$f":"#REF!","v":{"$error":"#REF!"}},{"$f":"#REF!","v":{"$error":"#REF!"}},{"$f":"#REF!","v":{"$error":"#REF!"}},{"$f":"#REF!","v":{"$error":"#REF!"}},{"$f":"#REF!","v":{"$error":"#REF!"}},{"$f":"#REF!","v":{"$error":"#REF!"}},0,0,0,0,{"$nulls":3},{"$f":"#REF!","v":{"$error":"#REF!"}},"/",{"$f":"#REF!","v":{"$error":"#REF!"}},{"$error":"#REF!"},{"$f":"#REF!","v":{"$error":"#REF!"}},"/",{"$f":"#REF!","v":{"$error":"#REF!"}},{"$error":"#REF!"},{"$f":"#REF!","v":{"$error":"#REF!"}},"/",{"$f":"#REF!","v":{"$error":"#REF!"}},{"$error":"#REF!"},{"$f":"#REF!","v":{"$error":"#REF!"}},"/",{"$f":"#REF!","v":{"$error":"#REF!"}},{"$error":"#REF!"}]
[0,87,87,0,{"$nulls":5},{"$f":"#REF!","v":{"$error":"#REF!"}},{"$f":"#REF!","v":{"$error":"#REF!"}},{"$f":"#REF!","v":{"$error":"#REF!"}},{"$f":"#REF!","v":{"$error":"#REF!"}},{"$f":"#REF!","v":{"$error":"#REF!"}},{"$f":"#REF!","v":{"$error":"#REF!"}},0,0,0,0,{"$nulls":3},{"$f":"#REF!","v":{"$error":"#REF!"}},"/",{"$f":"#REF!","v":{"$error":"#REF!"}},{"$error":"#REF!"},{"$f":"#REF!","v":{"$error":"#REF!"}},"/",{"$f":"#REF!","v":{"$error":"#REF!"}},{"$error":"#REF!"},{"$f":"#REF!","v":{"$error":"#REF!"}},"/",{"$f":"#REF!","v":{"$error":"#REF!"}},{"$error":"#REF!"},{"$f":"#REF!","v":{"$error":"#REF!"}},"/",{"$f":"#REF!","v":{"$error":"#REF!"}},{"$error":"#REF!"}]
[0,88,88,0,{"$nulls":5},{"$f":"#REF!","v":{"$error":"#REF!"}},{"$f":"#REF!","v":{"$error":"#REF!"}},{"$f":"#REF!","v":{"$error":"#REF!"}},{"$f":"#REF!","v":{"$error":"#REF!"}},{"$f":"#REF!","v":{"$error":"#REF!"}},{"$f":"#REF!","v":{"$error":"#REF!"}},0,0,0,0,{"$nulls":3},{"$f":"#REF!","v":{"$error":"#REF!"}},"/",{"$f":"#REF!","v":{"$error":"#REF!"}},{"$error":"#REF!"},{"$f":"#REF!","v":{"$error":"#REF!"}},"/",{"$f":"#REF!","v":{"$error":"#REF!"}},{"$error":"#REF!"},{"$f":"#REF!","v":{"$error":"#REF!"}},"/",{"$f":"#REF!","v":{"$error":"#REF!"}},{"$error":"#REF!"},{"$f":"#REF!","v":{"$error":"#REF!"}},"/",{"$f":"#REF!","v":{"$error":"#REF!"}},{"$error":"#REF!"}]
[0,89,89,0,{"$nulls":5},{"$f":"#REF!","v":{"$error":"#REF!"}},{"$f":"#REF!","v":{"$error":"#REF!"}},{"$f":"#REF!","v":{"$error":"#REF!"}},{"$f":"#REF!","v":{"$error":"#REF!"}},{"$f":"#REF!","v":{"$error":"#REF!"}},{"$f":"#REF!","v":{"$error":"#REF!"}},0,0,0,0,{"$nulls":3},{"$f":"#REF!","v":{"$error":"#REF!"}},"/",{"$f":"#REF!","v":{"$error":"#REF!"}},{"$error":"#REF!"},{"$f":"#REF!","v":{"$error":"#REF!"}},"/",{"$f":"#REF!","v":{"$error":"#REF!"}},{"$error":"#REF!"},{"$f":"#REF!","v":{"$error":"#REF!"}},"/",{"$f":"#REF!","v":{"$error":"#REF!"}},{"$error":"#REF!"},{"$f":"#REF!","v":{"$error":"#REF!"}},"/",{"$f":"#REF!","v":{"$error":"#REF!"}},{"$error":"#REF!"}]
[0,90,90,0,{"$nulls":5},{"$f":"#REF!","v":{"$error":"#REF!"}},{"$f":"#REF!","v":{"$error":"#REF!"}},{"$f":"#REF!","v":{"$error":"#REF!"}},{"$f":"#REF!","v":{"$error":"#REF!"}},{"$f":"#REF!","v":{"$error":"#REF!"}},{"$f":"#REF!","v":{"$error":"#REF!"}},0,0,0,0,{"$nulls":3},{"$f":"#REF!","v":{"$error":"#REF!"}},"/",{"$f":"#REF!","v":{"$error":"#REF!"}},{"$error":"#REF!"},{"$f":"#REF!","v":{"$error":"#REF!"}},"/",{"$f":"#REF!","v":{"$error":"#REF!"}},{"$error":"#REF!"},{"$f":"#REF!","v":{"$error":"#REF!"}},"/",{"$f":"#REF!","v":{"$error":"#REF!"}},{"$error":"#REF!"},{"$f":"#REF!","v":{"$error":"#REF!"}},"/",{"$f":"#REF!","v":{"$error":"#REF!"}},{"$error":"#REF!"}]
[0,91,91,0,{"$nulls":5},{"$f":"#REF!","v":{"$error":"#REF!"}},{"$f":"#REF!","v":{"$error":"#REF!"}},{"$f":"#REF!","v":{"$error":"#REF!"}},{"$f":"#REF!","v":{"$error":"#REF!"}},{"$f":"#REF!","v":{"$error":"#REF!"}},{"$f":"#REF!","v":{"$error":"#REF!"}},0,0,0,0,{"$nulls":3},{"$f":"#REF!","v":{"$error":"#REF!"}},"/",{"$f":"#REF!","v":{"$error":"#REF!"}},{"$error":"#REF!"},{"$f":"#REF!","v":{"$error":"#REF!"}},"/",{"$f":"#REF!","v":{"$error":"#REF!"}},{"$error":"#REF!"},{"$f":"#REF!","v":{"$error":"#REF!"}},"/",{"$f":"#REF!","v":{"$error":"#REF!"}},{"$error":"#REF!"},{"$f":"#REF!","v":{"$error":"#REF!"}},"/",{"$f":"#REF!","v":{"$error":"#REF!"}},{"$error":"#REF!"}]
[0,92,92,0,{"$nulls":5},{"$f":"#REF!","v":{"$error":"#REF!"}},{"$f":"#REF!","v":{"$error":"#REF!"}},{"$f":"#REF!","v":{"$error":"#REF!"}},{"$f":"#REF!","v":{"$error":"#REF!"}},{"$f":"#REF!","v":{"$error":"#REF!"}},{"$f":"#REF!","v":{"$error":"#REF!"}},0,0,0,0,{"$nulls":3},{"$f":"#REF!","v":{"$error":"#REF!"}},"/",{"$f":"#REF!","v":{"$error":"#REF!"}},{"$error":"#REF!"},{"$f":"#REF!","v":{"$error":"#REF!"}},"/",{"$f":"#REF!","v":{"$error":"#REF!"}},{"$error":"#REF!"},{"$f":"#REF!","v":{"$error":"#REF!"}},"/",{"$f":"#REF!","v":{"$error":"#REF!"}},{"$error":"#REF!"},{"$f":"#REF!","v":{"$error":"#REF!"}},"/",{"$f":"#REF!","v":{"$error":"#REF!"}},{"$error":"#REF!"}]
[0,93,93,0,{"$nulls":5},{"$f":"#REF!","v":{"$error":"#REF!"}},{"$f":"#REF!","v":{"$error":"#REF!"}},{"$f":"#REF!","v":{"$error":"#REF!"}},{"$f":"#REF!","v":{"$error":"#REF!"}},{"$f":"#REF!","v":{"$error":"#REF!"}},{"$f":"#REF!","v":{"$error":"#REF!"}},0,0,0,0,{"$nulls":3},{"$f":"#REF!","v":{"$error":"#REF!"}},"/",{"$f":"#REF!","v":{"$error":"#REF!"}},{"$error":"#REF!"},{"$f":"#REF!","v":{"$error":"#REF!"}},"/",{"$f":"#REF!","v":{"$error":"#REF!"}},{"$error":"#REF!"},{"$f":"#REF!","v":{"$error":"#REF!"}},"/",{"$f":"#REF!","v":{"$error":"#REF!"}},{"$error":"#REF!"},{"$f":"#REF!","v":{"$error":"#REF!"}},"/",{"$f":"#REF!","v":{"$error":"#REF!"}},{"$error":"#REF!"}]
[0,94,94,0,{"$nulls":5},{"$f":"#REF!","v":{"$error":"#REF!"}},{"$f":"#REF!","v":{"$error":"#REF!"}},{"$f":"#REF!","v":{"$error":"#REF!"}},{"$f":"#REF!","v":{"$error":"#REF!"}},{"$f":"#REF!","v":{"$error":"#REF!"}},{"$f":"#REF!","v":{"$error":"#REF!"}},0,0,0,0,{"$nulls":3},{"$f":"#REF!","v":{"$error":"#REF!"}},"/",{"$f":"#REF!","v":{"$error":"#REF!"}},{"$error":"#REF!"},{"$f":"#REF!","v":{"$error":"#REF!"}},"/",{"$f":"#REF!","v":{"$error":"#REF!"}},{"$error":"#REF!"},{"$f":"#REF!","v":{"$error":"#REF!"}},"/",{"$f":"#REF!","v":{"$error":"#REF!"}},{"$error":"#REF!"},{"$f":"#REF!","v":{"$error":"#REF!"}},"/",{"$f":"#REF!","v":{"$error":"#REF!"}},{"$error":"#REF!"}]
[0,95,95,0,{"$nulls":5},{"$f":"#REF!","v":{"$error":"#REF!"}},{"$f":"#REF!","v":{"$error":"#REF!"}},{"$f":"#REF!","v":{"$error":"#REF!"}},{"$f":"#REF!","v":{"$error":"#REF!"}},{"$f":"#REF!","v":{"$error":"#REF!"}},{"$f":"#REF!","v":{"$error":"#REF!"}},0,0,0,0,{"$nulls":3},{"$f":"#REF!","v":{"$error":"#REF!"}},"/",{"$f":"#REF!","v":{"$error":"#REF!"}},{"$error":"#REF!"},{"$f":"#REF!","v":{"$error":"#REF!"}},"/",{"$f":"#REF!","v":{"$error":"#REF!"}},{"$error":"#REF!"},{"$f":"#REF!","v":{"$error":"#REF!"}},"/",{"$f":"#REF!","v":{"$error":"#REF!"}},{"$error":"#REF!"},{"$f":"#REF!","v":{"$error":"#REF!"}},"/",{"$f":"#REF!","v":{"$error":"#REF!"}},{"$error":"#REF!"}]
[0,96,96,0,{"$nulls":5},{"$f":"#REF!","v":{"$error":"#REF!"}},{"$f":"#REF!","v":{"$error":"#REF!"}},{"$f":"#REF!","v":{"$error":"#REF!"}},{"$f":"#REF!","v":{"$error":"#REF!"}},{"$f":"#REF!","v":{"$error":"#REF!"}},{"$f":"#REF!","v":{"$error":"#REF!"}},0,0,0,0,{"$nulls":3},{"$f":"#REF!","v":{"$error":"#REF!"}},"/",{"$f":"#REF!","v":{"$error":"#REF!"}},{"$error":"#REF!"},{"$f":"#REF!","v":{"$error":"#REF!"}},"/",{"$f":"#REF!","v":{"$error":"#REF!"}},{"$error":"#REF!"},{"$f":"#REF!","v":{"$error":"#REF!"}},"/",{"$f":"#REF!","v":{"$error":"#REF!"}},{"$error":"#REF!"},{"$f":"#REF!","v":{"$error":"#REF!"}},"/",{"$f":"#REF!","v":{"$error":"#REF!"}},{"$error":"#REF!"}]
[0,97,97,0,{"$nulls":5},{"$f":"#REF!","v":{"$error":"#REF!"}},{"$f":"#REF!","v":{"$error":"#REF!"}},{"$f":"#REF!","v":{"$error":"#REF!"}},{"$f":"#REF!","v":{"$error":"#REF!"}},{"$f":"#REF!","v":{"$error":"#REF!"}},{"$f":"#REF!","v":{"$error":"#REF!"}},0,0,0,0,{"$nulls":3},{"$f":"#REF!","v":{"$error":"#REF!"}},"/",{"$f":"#REF!","v":{"$error":"#REF!"}},{"$error":"#REF!"},{"$f":"#REF!","v":{"$error":"#REF!"}},"/",{"$f":"#REF!","v":{"$error":"#REF!"}},{"$error":"#REF!"},{"$f":"#REF!","v":{"$error":"#REF!"}},"/",{"$f":"#REF!","v":{"$error":"#REF!"}},{"$error":"#REF!"},{"$f":"#REF!","v":{"$error":"#REF!"}},"/",{"$f":"#REF!","v":{"$error":"#REF!"}},{"$error":"#REF!"}]
[0,98,98,0,{"$nulls":5},{"$f":"#REF!","v":{"$error":"#REF!"}},{"$f":"#REF!","v":{"$error":"#REF!"}},{"$f":"#REF!","v":{"$error":"#REF!"}},{"$f":"#REF!","v":{"$error":"#REF!"}},{"$f":"#REF!","v":{"$error":"#REF!"}},{"$f":"#REF!","v":{"$error":"#REF!"}},0,0,0,0,{"$nulls":3},{"$f":"#REF!","v":{"$error":"#REF!"}},"/",{"$f":"#REF!","v":{"$error":"#REF!"}},{"$error":"#REF!"},{"$f":"#REF!","v":{"$error":"#REF!"}},"/",{"$f":"#REF!","v":{"$error":"#REF!"}},{"$error":"#REF!"},{"$f":"#REF!","v":{"$error":"#REF!"}},"/",{"$f":"#REF!","v":{"$error":"#REF!"}},{"$error":"#REF!"},{"$f":"#REF!","v":{"$error":"#REF!"}},"/",{"$f":"#REF!","v":{"$error":"#REF!"}},{"$error":"#REF!"}]
[0,99,99,0,{"$nulls":5},{"$f":"#REF!","v":{"$error":"#REF!"}},{"$f":"#REF!","v":{"$error":"#REF!"}},{"$f":"#REF!","v":{"$error":"#REF!"}},{"$f":"#REF!","v":{"$error":"#REF!"}},{"$f":"#REF!","v":{"$error":"#REF!"}},{"$f":"#REF!","v":{"$error":"#REF!"}},0,0,0,0,{"$nulls":3},{"$f":"#REF!","v":{"$error":"#REF!"}},"/",{"$f":"#REF!","v":{"$error":"#REF!"}},{"$error":"#REF!"},{"$f":"#REF!","v":{"$error":"#REF!"}},"/",{"$f":"#REF!","v":{"$error":"#REF!"}},{"$error":"#REF!"},{"$f":"#REF!","v":{"$error":"#REF!"}},"/",{"$f":"#REF!","v":{"$error":"#REF!"}},{"$error":"#REF!"},{"$f":"#REF!","v":{"$error":"#REF!"}},"/",{"$f":"#REF!","v":{"$error":"#REF!"}},{"$error":"#REF!"}]
[0,100,100,0,{"$nulls":5},{"$f":"#REF!","v":{"$error":"#REF!"}},{"$f":"#REF!","v":{"$error":"#REF!"}},{"$f":"#REF!","v":{"$error":"#REF!"}},{"$f":"#REF!","v":{"$error":"#REF!"}},{"$f":"#REF!","v":{"$error":"#REF!"}},{"$f":"#REF!","v":{"$error":"#REF!"}},0,0,0,0,{"$nulls":3},{"$f":"#REF!","v":{"$error":"#REF!"}},"/",{"$f":"#REF!","v":{"$error":"#REF!"}},{"$error":"#REF!"},{"$f":"#REF!","v":{"$error":"#REF!"}},"/",{"$f":"#REF!","v":{"$error":"#REF!"}},{"$error":"#REF!"},{"$f":"#REF!","v":{"$error":"#REF!"}},"/",{"$f":"#REF!","v":{"$error":"#REF!"}},{"$error":"#REF!"},{"$f":"#REF!","v":{"$error":"#REF!"}},"/",{"$f":"#REF!","v":{"$error":"#REF!"}},{"$error":"#REF!"}]
[null,1,2,4,6,7,8,9,10,142,143,144,145,146,147,148,149,150,151,152,153,154,155,156,157,158,159,160,161,162,163,164,165,166,167,168,169,170]
[{"$nulls":6},{"$f":"MASTER!#REF!","v":{"$error":"#REF!"}},{"$f":"MASTER!#REF!","v":{"$error":"#REF!"}}]
[{"$nulls":6},{"$f":"MASTER!#REF!","v":{"$error":"#REF!"}},{"$f":"MASTER!#REF!","v":{"$error":"#REF!"}}]
[{"$nulls":6},{"$f":"MASTER!#REF!","v":{"$error":"#REF!"}},{"$f":"MASTER!#REF!","v":{"$error":"#REF!"}}]
[{"$nulls":6},{"$f":"MASTER!#REF!","v":{"$error":"#REF!"}},{"$f":"MASTER!#REF!","v":{"$error":"#REF!"}}]
[{"$nulls":6},{"$f":"MASTER!#REF!","v":{"$error":"#REF!"}},{"$f":"MASTER!#REF!","v":{"$error":"#REF!"}}]
[{"$nulls":6},{"$f":"MASTER!#REF!","v":{"$error":"#REF!"}},{"$f":"MASTER!#REF!","v":{"$error":"#REF!"}}]
[{"$nulls":6},{"$f":"MASTER!#REF!","v":{"$error":"#REF!"}},{"$f":"MASTER!#REF!","v":{"$error":"#REF!"}}]
[{"$nulls":6},{"$f":"MASTER!#REF!","v":{"$error":"#REF!"}},{"$f":"MASTER!#REF!","v":{"$error":"#REF!"}}]
[{"$nulls":6},{"$f":"MASTER!#REF!","v":{"$error":"#REF!"}},{"$f":"MASTER!#REF!","v":{"$error":"#REF!"}}]
[{"$nulls":6},{"$f":"MASTER!#REF!","v":{"$error":"#REF!"}},{"$f":"MASTER!#REF!","v":{"$error":"#REF!"}}]
[{"$nulls":6},{"$f":"MASTER!#REF!","v":{"$error":"#REF!"}},{"$f":"MASTER!#REF!","v":{"$error":"#REF!"}}]
[{"$nulls":6},{"$f":"MASTER!#REF!","v":{"$error":"#REF!"}},{"$f":"MASTER!#REF!","v":{"$error":"#REF!"}}]
[{"$nulls":6},{"$f":"MASTER!#REF!","v":{"$error":"#REF!"}},{"$f":"MASTER!#REF!","v":{"$error":"#REF!"}}]
[{"$nulls":6},{"$f":"MASTER!#REF!","v":{"$error":"#REF!"}},{"$f":"MASTER!#REF!","v":{"$error":"#REF!"}}]
[{"$nulls":7},{"$f":"MASTER!#REF!","v":{"$error":"#REF!"}}]
[{"$nulls":7},{"$f":"MASTER!#REF!","v":{"$error":"#REF!"}}]
[{"$nulls":7},{"$f":"MASTER!#REF!","v":{"$error":"#REF!"}}]
[{"$nulls":7},{"$f":"MASTER!#REF!","v":{"$error":"#REF!"}}]
[{"$nulls":7},{"$f":"MASTER!#REF!","v":{"$error":"#REF!"}}]
[{"$nulls":7},{"$f":"MASTER!#REF!","v":{"$error":"#REF!"}}]
[{"$nulls":7},{"$f":"MASTER!#REF!","v":{"$error":"#REF!"}}]
[{"$nulls":7},{"$f":"MASTER!#REF!","v":{"$error":"#REF!"}}]
[{"$nulls":7},{"$f":"MASTER!#REF!","v":{"$error":"#REF!"}}]
[{"$nulls":7},{"$f":"MASTER!#REF!","v":{"$error":"#REF!"}}]

{"sheet":"TIME TABLE","index":2,"n_rows":14,"n_cols":7,"rows_kept":14,"merged":[[0,0,14,0],[0,1,0,6],[0,7,14,7],[1,1,1,5],[2,2,2,4],[2,6,3,6],[3,1,3,4],[4,5,4,6],[5,5,5,6],[6,5,6,6],[7,5,7,6],[8,5,8,6],[9,5,9,6],[10,5,10,6],[11,5,11,6],[12,5,12,6],[13,5,13,6],[14,1,14,6]]}
[null,{"$f":"MASTER!E11","v":"Govt. Sr. Secondary School Raimalwada"}]
[null,{"$f":"CONCATENATE(MASTER!E8,\":\",MASTER!E6)","v":"HALF YEARLY EXAM:2021-22"},{"$nulls":4},"TIME TABLE"]
[null,"Exam Time:-","09:00 AM to 11:45 AM",null,null,"Class","Subjects"]
[null,"Date (Day) ↓",{"$nulls":3},{"$f":"'STUDENT DETAIL'!E4","v":4}]
[null,"2022-03-31","(",{"$f":"IF(B5=0,0,TEXT(B5,\"dddd\"))","v":"Thursday"},")","Hindi"]
[null,{"$f":"B5+1","v":"2022-04-01"},"(",{"$f":"IF(B6=0,0,TEXT(B6,\"dddd\"))","v":"Friday"},")","English"]
[null,{"$f":"B6+1","v":"2022-04-02"},"(","Saturday",")","Science"]
[null,"2022-04-03","(","Sunday",")","Mathematics"]
[null,"2022-04-04","(","Monday",")","Social Study"]
[null,"2022-04-05","(","Tuesday",")","Sanskrit"]
[null,"00:00:00","(",0,")"]
[null,null,"(",0,")"]
[null,null,"(",0,")"]
[null,null,"(",0,")"]

{"sheet":"ADMIT CARD","index":3,"n_rows":3350,"n_cols":10,"rows_kept":3350,"merged":[[1672,3,1672,8],[1673,3,1673,8],[1674,3,1674,8],[1675,1,1675,8],[1676,0,1707,0],[1676,1,1677,3],[1676,4,1676,8],[1677,4,1677,8],[1678,1,1707,1],[1678,2,1678,8],[1679,2,1679,8],[1680,2,1680,4],[1680,6,1680,7],[1680,8,1685,8],[1694,2,1694,4],[1696,2,1696,4],[1696,7,1696,8],[1697,2,1697,4],[1697,7,1697,8],[1701,3,1701,8],[1703,3,1703,8],[1704,3,1704,8],[1705,3,1705,8],[1706,3,1706,8],[1708,0,1708,8],[1709,1,1709,8],[1710,0,1741,0],[1710,1,1711,3],[1710,4,1710,8],[1711,4,1711,8],[1712,1,1741,1],[1712,2,1712,8],[1713,2,1713,8],[1714,2,1714,4],[1714,6,1714,7],[1714,8,1719,8],[1715,2,1715,4],[1715,6,1715,7],[1716,2,1716,4],[1716,6,1716,7],[1717,2,1717,4],[1717,6,1717,7],[1718,2,1718,4],[1718,6,1718,7],[1719,2,1719,4],[1719,6,1719,7],[1720,2,1720,8],[1721,2,1721,4],[1721,5,1721,6],[1723,2,1723,4],[1723,7,1723,8],[1724,2,1724,4],[1724,7,1724,8],[1725,2,1725,4],[1725,7,1725,8],[1726,2,1726,4],[1726,7,1726,8],[1727,2,1727,4],[1727,7,1727,8],[1728,2,1728,4],[1728,7,1728,8],[1729,2,1729,4],[1729,7,1729,8],[1733,3,1733,8],[1734,3,1734,8],[1735,3,1735,8],[1736,3,1736,8],[1737,3,1737,8],[1738,3,1738,8],[1739,3,1739,8],[1743,4,1743,8],[1745,2,1745,8],[1747,2,1747,4],[1747,6,1747,7],[1748,2,1748,4],[1748,6,1748,7],[1749,2,1749,4],[1749,6,1749,7],[1750,2,1750,4],[1750,6,1750,7],[1751,2,1751,4],[1751,6,1751,7],[1754,2,1754,4],[1754,7,1754,8],[1755,2,1755,4],[1755,7,1755,8],[1756,2,1756,4],[1756,7,1756,8],[1757,2,1757,4],[1757,7,1757,8],[1758,2,1758,4],[1758,7,1758,8],[1759,2,1759,4],[1759,7,1759,8],[1766,3,1766,8],[1767,3,1767,8],[1768,3,1768,8],[1769,3,1769,8],[1770,3,1770,8],[1771,3,1771,8],[1772,3,1772,8],[1773,3,1773,8],[1774,3,1774,8],[1775,0,1775,8],[1776,1,1776,8],[1777,0,1808,0],[1777,1,1778,3],[1777,4,1777,8],[1778,4,1778,8],[1779,1,1808,1],[1779,2,1779,8],[1780,2,1780,8],[1781,2,1781,4],[1781,6,1781,7],[1781,8,1786,8],[1782,2,1782,4],[1782,6,1782,7],[1783,2,1783,4],[1808,3,1808,8],[1809,1,1809,8],[1810,0,1841,0],[1810,1,1811,3],[1810,4,1810,8],[1814,2,1814,4],[1815,2,1815,4],[1816,2,1816,4],[1817,2,1817,4],[1818,2,1818,4],[1830,2,1830,4],[1830,7,1830,8],[1831,2,1831,4],[1831,7,1831,8],[1832,2,1832,8],[1833,3,1833,8],[1834,3,1834,8],[1855,7,1855,8],[1856,2,1856,4],[1856,7,1856,8],[1857,2,1857,4],[1857,7,1857,8],[1858,2,1858,4],[1858,7,1858,8],[1859,2,1859,4],[1859,7,1859,8],[1860,2,1860,4],[1860,7,1860,8],[1861,2,1861,4],[1864,2,1864,4],[1865,2,1865,4],[1876,1,1876,8],[1877,0,1908,0],[1877,1,1878,3],[1877,4,1877,8],[1878,4,1878,8],[1879,1,1908,1],[1879,2,1879,8],[1880,2,1880,8],[1881,2,1881,4],[1881,6,1881,7],[1881,8,1886,8],[1882,2,1882,4],[1882,6,1882,7],[1883,2,1883,4],[1883,6,1883,7],[1884,2,1884,4],[1884,6,1884,7],[1893,2,1893,4],[1894,2,1894,4],[1895,2,1895,4],[1896,2,1896,4],[1897,2,1897,4],[1898,2,1898,4],[1899,2,1899,8],[1908,3,1908,8],[1919,6,1919,7],[1920,2,1920,4],[1920,6,1920,7],[1921,2,1921,8],[1922,2,1922,4],[1922,5,1922,6],[1923,2,1923,4],[1924,2,1924,4],[1925,2,1925,4],[1926,2,1926,4],[1927,2,1927,4],[1928,2,1928,4],[1930,2,1930,4],[1930,7,1930,8],[1931,2,1931,4],[1931,7,1931,8],[1932,2,1932,4],[1932,7,1932,8],[1938,3,1938,8],[1939,3,1939,8],[1940,3,1940,8],[1941,3,1941,8],[1942,3,1942,8],[1952,2,1952,4],[1952,6,1952,7],[1953,2,1953,4],[1953,6,1953,7],[1955,2,1955,4],[1955,5,1955,6],[1955,7,1955,8],[1956,2,1956,4],[1956,7,1956,8],[1957,2,1957,4],[1957,7,1957,8],[1958,2,1958,4],[1958,7,1958,8],[1959,2,1959,4],[1959,7,1959,8],[1960,2,1960,4],[1960,7,1960,8],[1961,2,1961,4],[1961,7,1961,8],[1962,2,1962,4],[1962,7,1962,8],[1963,2,1963,4],[1963,7,1963,8],[1964,2,1964,4],[1964,7,1964,8],[1965,2,1965,4],[1965,7,1965,8],[1966,2,1966,8],[1967,3,1967,8],[1968,3,1968,8],[1969,3,1969,8],[1970,3,1970,8],[1971,3,1971,8],[1972,3,1972,8],[1973,3,1973,8],[1974,3,1974,8],[1975,3,1975,8],[1976,0,1976,8],[1977,1,1977,8],[1978,0,2009,0],[1978,1,1979,3],[1978,4,1978,8],[1979,4,1979,8],[1980,1,2009,1],[1980,2,1980,8],[1981,2,1981,8],[1982,2,1982,4],[1982,6,1982,7],[1982,8,1987,8],[1983,2,1983,4],[1983,6,1983,7],[1984,2,1984,4],[1984,6,1984,7],[1985,2,1985,4],[1985,6,1985,7],[1986,2,1986,4],[1986,6,1986,7],[1987,2,1987,4],[1987,6,1987,7],[1988,2,1988,8],[1989,2,1989,4],[1989,5,1989,6],[1989,7,1989,8],[1990,2,1990,4],[1990,7,1990,8],[1991,2,1991,4],[1991,7,1991,8],[1992,2,1992,4],[1992,7,1992,8],[1993,2,1993,4],[1993,7,1993,8],[1994,2,1994,4],[1994,7,1994,8],[1995,2,1995,4],[1995,7,1995,8],[1996,2,1996,4],[1996,7,1996,8],[1997,2,1997,4],[1997,7,1997,8],[1998,2,1998,4],[1998,7,1998,8],[1999,2,1999,4],[1999,7,1999,8],[2000,2,2000,8],[2001,3,2001,8],[2002,3,2002,8],[2003,3,2003,8],[2004,3,2004,8],[2005,3,2005,8],[2006,3,2006,8],[2007,3,2007,8],[2008,3,2008,8],[2009,3,2009,8],[2010,1,2010,8],[2011,0,2042,0],[2011,1,2012,3],[2015,2,2015,4],[2015,6,2015,7],[2016,2,2016,4],[2016,6,2016,7],[2018,2,2018,4],[2019,2,2019,4],[2020,2,2020,4],[2022,2,2022,4],[2022,7,2022,8],[2023,2,2023,4],[2023,7,2023,8],[2024,2,2024,4],[2024,7,2024,8],[2034,3,2034,8],[2037,3,2037,8],[2038,3,2038,8],[2039,3,2039,8],[2040,3,2040,8],[2041,3,2041,8],[2047,2,2047,8],[2049,2,2049,4],[2050,2,2050,4],[2051,2,2051,4],[2052,2,2052,4],[2053,2,2053,4],[2054,2,2054,4],[2055,2,2055,8],[2063,7,2063,8],[2064,2,2064,4],[2064,7,2064,8],[2065,2,2065,4],[2065,7,2065,8],[2066,2,2066,4],[2066,7,2066,8],[2067,2,2067,8],[2068,3,2068,8],[2069,3,2069,8],[2070,3,2070,8],[2082,2,2082,4],[2083,2,2083,4],[2091,7,2091,8],[2092,2,2092,4],[2092,7,2092,8],[2093,2,2093,4],[2093,7,2093,8],[2094,2,2094,4],[2094,7,2094,8],[2095,2,2095,4],[2095,7,2095,8],[2096,2,2096,4],[2096,7,2096,8],[2097,2,2097,4],[2112,0,2143,0],[2112,1,2113,3],[2112,4,2112,8],[2113,4,2113,8],[2114,1,2143,1],[2114,2,2114,8],[2115,2,2115,8],[2116,2,2116,4],[2116,6,2116,7],[2116,8,2121,8],[2117,2,2117,4],[2117,6,2117,7],[2118,2,2118,4],[2118,6,2118,7],[2119,2,2119,4],[2119,6,2119,7],[2120,2,2120,4],[2120,6,2120,7],[2129,2,2129,4],[2130,2,2130,4],[2131,2,2131,4],[2132,2,2132,4],[2133,2,2133,4],[2153,6,2153,7],[2154,2,2154,4],[2154,6,2154,7],[2155,2,2155,8],[2156,2,2156,4],[2156,5,2156,6],[2159,2,2159,4],[2160,2,2160,4],[2161,2,2161,4],[2162,2,2162,4],[2163,2,2163,4],[2164,2,2164,4],[2166,2,2166,4],[2166,7,2166,8],[2171,3,2171,8],[2172,3,2172,8],[2173,3,2173,8],[2174,3,2174,8],[2175,3,2175,8],[2176,3,2176,8],[2177,0,2177,8],[2178,1,2178,8],[2179,0,2210,0],[2179,1,2180,3],[2179,4,2179,8],[2180,4,2180,8],[2181,1,2210,1],[2181,2,2181,8],[2188,2,2188,4],[2188,6,2188,7],[2190,2,2190,4],[2191,2,2191,4],[2192,2,2192,4],[2193,2,2193,4],[2193,7,2193,8],[2194,2,2194,4],[2194,7,2194,8],[2195,2,2195,4],[2195,7,2195,8],[2196,2,2196,4],[2196,7,2196,8],[2197,2,2197,4],[2197,7,2197,8],[2198,2,2198,4],[2198,7,2198,8],[2199,2,2199,4],[2199,7,2199,8],[2200,2,2200,4],[2200,7,2200,8],[2201,2,2201,8],[2202,3,2202,8],[2203,3,2203,8],[2204,3,2204,8],[2205,3,2205,8],[2206,3,2206,8],[2207,3,2207,8],[2208,3,2208,8],[2209,3,2209,8],[2210,3,2210,8],[2218,2,2218,4],[2218,6,2218,7],[2219,2,2219,4],[2219,6,2219,7],[2220,2,2220,4],[2220,6,2220,7],[2221,2,2221,4],[2221,6,2221,7],[2223,2,2223,4],[2225,2,2225,4],[2225,7,2225,8],[2226,2,2226,4],[2226,7,2226,8],[2227,2,2227,4],[2227,7,2227,8],[2228,2,2228,4],[2228,7,2228,8],[2229,2,2229,4],[2229,7,2229,8],[2230,2,2230,4],[2230,7,2230,8],[2231,2,2231,4],[2231,7,2231,8],[2244,0,2244,8],[2245,1,2245,8],[2246,0,2277,0],[2246,1,2247,3],[2246,4,2246,8],[2247,4,2247,8],[2248,1,2277,1],[2248,2,2248,8],[2249,2,2249,8],[2250,2,2250,4],[2250,6,2250,7],[2250,8,2255,8],[2251,2,2251,4],[2251,6,2251,7],[2252,2,2252,4],[2252,6,2252,7],[2253,2,2253,4],[2253,6,2253,7],[2254,2,2254,4],[2254,6,2254,7],[2255,2,2255,4],[2255,6,2255,7],[2256,2,2256,8],[2257,2,2257,4],[2257,5,2257,6],[2257,7,2257,8],[2258,2,2258,4],[2258,7,2258,8],[2259,2,2259,4],[2259,7,2259,8],[2260,2,2260,4],[2260,7,2260,8],[2261,2,2261,4],[2269,3,2269,8],[2270,3,2270,8],[2274,3,2274,8],[2275,3,2275,8],[2276,3,2276,8],[2277,3,2277,8],[2278,1,2278,8],[2279,0,2310,0],[2279,1,2280,3],[2279,4,2279,8],[2280,4,2280,8],[2281,1,2310,1],[2281,2,2281,8],[2282,2,2282,8],[2283,2,2283,4],[2283,6,2283,7],[2283,8,2288,8],[2284,2,2284,4],[2284,6,2284,7],[2285,2,2285,4],[2285,6,2285,7],[2286,2,2286,4],[2286,6,2286,7],[2287,2,2287,4],[2287,6,2287,7],[2288,2,2288,4],[2288,6,2288,7],[2289,2,2289,8],[2290,2,2290,4],[2290,5,2290,6],[2290,7,2290,8],[2317,2,2317,4],[2318,2,2318,4],[2319,2,2319,4],[2324,2,2324,4],[2324,5,2324,6],[2324,7,2324,8],[2325,2,2325,4],[2325,7,2325,8],[2326,2,2326,4],[2326,7,2326,8],[2327,2,2327,4],[2327,7,2327,8],[2328,2,2328,4],[2328,7,2328,8],[2335,2,2335,8],[2341,3,2341,8],[2342,3,2342,8],[2343,3,2343,8],[2344,3,2344,8],[2345,1,2345,8],[2346,0,2377,0],[2346,1,2347,3],[2346,4,2346,8],[2347,4,2347,8],[2348,1,2377,1],[2348,2,2348,8],[2349,2,2349,8],[2350,2,2350,4],[2350,6,2350,7],[2350,8,2355,8],[2351,2,2351,4],[2351,6,2351,7],[2352,2,2352,4],[2352,6,2352,7],[2353,2,2353,4],[2353,6,2353,7],[2354,2,2354,4],[2365,2,2365,4],[2366,2,2366,4],[2367,2,2367,4],[2378,0,2378,8],[2379,1,2379,8],[2380,0,2411,0],[2380,1,2381,3],[2380,4,2380,8],[2381,4,2381,8],[2382,1,2411,1],[2382,2,2382,8],[2383,2,2383,8],[2384,2,2384,4],[2384,6,2384,7],[2393,2,2393,4],[2393,7,2393,8],[2394,2,2394,4],[2394,7,2394,8],[2395,2,2395,4],[2395,7,2395,8],[2396,2,2396,4],[2397,2,2397,4],[2398,2,2398,4],[2399,2,2399,4],[2400,2,2400,4],[2410,3,2410,8],[2411,3,2411,8],[2421,2,2421,4],[2421,6,2421,7],[2422,2,2422,4],[2422,6,2422,7],[2423,2,2423,8],[2424,2,2424,4],[2424,5,2424,6],[2424,7,2424,8],[2425,2,2425,4],[2426,2,2426,4],[2427,2,2427,4],[2428,2,2428,4],[2429,2,2429,4],[2431,2,2431,4],[2431,7,2431,8],[2432,2,2432,4],[2432,7,2432,8],[2433,2,2433,4],[2433,7,2433,8],[2434,2,2434,4],[2434,7,2434,8],[2439,3,2439,8],[2440,3,2440,8],[2441,3,2441,8],[2442,3,2442,8],[2443,3,2443,8],[2444,3,2444,8],[2454,2,2454,4],[2454,6,2454,7],[2455,2,2455,4],[2455,6,2455,7],[2456,2,2456,4],[2456,6,2456,7],[2458,2,2458,4],[2459,2,2459,4],[2460,7,2460,8],[2461,2,2461,4],[2461,7,2461,8],[2462,2,2462,4],[2462,7,2462,8],[2463,2,2463,4],[2463,7,2463,8],[2464,2,2464,4],[2464,7,2464,8],[2465,2,2465,4],[2465,7,2465,8],[2466,2,2466,4],[2466,7,2466,8],[2467,2,2467,4],[2467,7,2467,8],[2468,2,2468,4],[2468,7,2468,8],[2469,2,2469,8],[2470,3,2470,8],[2471,3,2471,8],[2472,3,2472,8],[2473,3,2473,8],[2474,3,2474,8],[2475,3,2475,8],[2476,3,2476,8],[2477,3,2477,8],[2478,3,2478,8],[2479,1,2479,8],[2480,0,2511,0],[2480,1,2481,3],[2480,4,2480,8],[2481,4,2481,8],[2482,1,2511,1],[2482,2,2482,8],[2483,2,2483,8],[2484,2,2484,4],[2484,6,2484,7],[2485,2,2485,4],[2485,6,2485,7],[2486,2,2486,4],[2486,6,2486,7],[2487,2,2487,4],[2487,6,2487,7],[2488,2,2488,4],[2488,6,2488,7],[2491,2,2491,4],[2491,7,2491,8],[2492,2,2492,4],[2492,7,2492,8],[2493,2,2493,4],[2495,2,2495,4],[2495,7,2495,8],[2496,2,2496,4],[2496,7,2496,8],[2503,3,2503,8],[2504,3,2504,8],[2505,3,2505,8],[2506,3,2506,8],[2508,3,2508,8],[2509,3,2509,8],[2510,3,2510,8],[2511,3,2511,8],[2512,0,2512,8],[2518,2,2518,4],[2518,6,2518,7],[2520,2,2520,4],[2521,2,2521,4],[2522,2,2522,4],[2523,2,2523,4],[2525,2,2525,4],[2525,7,2525,8],[2526,2,2526,4],[2526,7,2526,8],[2534,7,2534,8],[2535,2,2535,4],[2535,7,2535,8],[2536,2,2536,8],[2537,3,2537,8],[2538,3,2538,8],[2539,3,2539,8],[2540,3,2540,8],[2541,3,2541,8],[2542,3,2542,8],[2543,3,2543,8],[2551,2,2551,4],[2552,2,2552,4],[2553,2,2553,4],[2554,2,2554,4],[2555,2,2555,4],[2564,2,2564,4],[2564,7,2564,8],[2565,2,2565,4],[2565,7,2565,8],[2566,2,2566,4],[2566,7,2566,8],[2567,2,2567,4],[2567,7,2567,8],[2568,2,2568,4],[2568,7,2568,8],[2569,2,2569,8],[2585,2,2585,4],[2592,5,2592,6],[2592,7,2592,8],[2593,2,2593,4],[2593,7,2593,8],[2594,2,2594,4],[2594,7,2594,8],[2595,2,2595,4],[2595,7,2595,8],[2596,2,2596,4],[2596,7,2596,8],[2597,2,2597,4],[2597,7,2597,8],[2598,2,2598,4],[2598,7,2598,8],[2599,2,2599,4],[2599,7,2599,8],[2601,2,2601,4],[2602,2,2602,4],[2622,6,2622,7],[2623,2,2623,4],[2623,6,2623,7],[2624,2,2624,8],[2625,2,2625,4],[2625,5,2625,6],[2625,7,2625,8],[2626,2,2626,4],[2626,7,2626,8],[2627,2,2627,4],[2627,7,2627,8],[2628,2,2628,4],[2631,2,2631,4],[2632,2,2632,4],[2633,2,2633,4],[2634,2,2634,4],[2635,2,2635,4],[2643,3,2643,8],[2644,3,2644,8],[2645,3,2645,8],[2646,0,2646,8],[2647,1,2647,8],[2648,0,2679,0],[2648,1,2649,3],[2648,4,2648,8],[2649,4,2649,8],[2650,1,2679,1],[2650,2,2650,8],[2658,2,2658,8],[2660,2,2660,4],[2660,7,2660,8],[2661,2,2661,4],[2661,7,2661,8],[2662,2,2662,4],[2662,7,2662,8],[2663,2,2663,4],[2663,7,2663,8],[2664,2,2664,4],[2664,7,2664,8],[2665,2,2665,4],[2665,7,2665,8],[2667,2,2667,4],[2667,7,2667,8],[2668,2,2668,4],[2668,7,2668,8],[2669,2,2669,4],[2669,7,2669,8],[2675,3,2675,8],[2676,3,2676,8],[2677,3,2677,8],[2678,3,2678,8],[2679,3,2679,8],[2690,2,2690,4],[2690,6,2690,7],[2692,2,2692,4],[2693,2,2693,4],[2694,2,2694,4],[2695,2,2695,4],[2696,2,2696,4],[2696,7,2696,8],[2697,2,2697,4],[2697,7,2697,8],[2698,2,2698,4],[2698,7,2698,8],[2699,2,2699,4],[2699,7,2699,8],[2700,2,2700,4],[2700,7,2700,8],[2701,2,2701,4],[2701,7,2701,8],[2702,2,2702,4],[2702,7,2702,8],[2703,2,2703,8],[2704,3,2704,8],[2705,3,2705,8],[2706,3,2706,8],[2707,3,2707,8],[2708,3,2708,8],[2709,3,2709,8],[2710,3,2710,8],[2711,3,2711,8],[2712,3,2712,8],[2713,0,2713,8],[2714,1,2714,8],[2715,0,2746,0],[2715,1,2716,3],[2715,4,2715,8],[2716,4,2716,8],[2717,1,2746,1],[2717,2,2717,8],[2718,2,2718,8],[2719,2,2719,4],[2719,6,2719,7],[2719,8,2724,8],[2720,2,2720,4],[2720,6,2720,7],[2721,2,2721,4],[2721,6,2721,7],[2722,2,2722,4],[2722,6,2722,7],[2723,2,2723,4],[2723,6,2723,7],[2724,2,2724,4],[2724,6,2724,7],[2725,2,2725,8],[2726,2,2726,4],[2726,5,2726,6],[2726,7,2726,8],[2727,2,2727,4],[2727,7,2727,8],[2728,2,2728,4],[2728,7,2728,8],[2729,2,2729,4],[2729,7,2729,8],[2730,2,2730,4],[2730,7,2730,8],[2731,2,2731,4],[2731,7,2731,8],[2732,2,2732,4],[2732,7,2732,8],[2733,2,2733,4],[2733,7,2733,8],[2734,2,2734,4],[2734,7,2734,8],[2735,2,2735,4],[2735,7,2735,8],[2736,2,2736,4],[2736,7,2736,8],[2737,2,2737,8],[2738,3,2738,8],[2739,3,2739,8],[2740,3,2740,8],[2741,3,2741,8],[2742,3,2742,8],[2743,3,2743,8],[2744,3,2744,8],[2745,3,2745,8],[2746,3,2746,8],[2747,1,2747,8],[2748,0,2779,0],[2752,2,2752,4],[2752,6,2752,7],[2753,2,2753,4],[2753,6,2753,7],[2754,2,2754,4],[2754,6,2754,7],[2756,2,2756,4],[2757,2,2757,4],[2759,2,2759,4],[2759,7,2759,8],[2760,2,2760,4],[2760,7,2760,8],[2761,2,2761,4],[2761,7,2761,8],[2762,2,2762,4],[2762,7,2762,8],[2771,3,2771,8],[2772,3,2772,8],[2777,3,2777,8],[2778,3,2778,8],[2779,3,2779,8],[2780,0,2780,8],[2781,1,2781,8],[2782,0,2813,0],[2784,2,2784,8],[2786,2,2786,4],[2787,2,2787,4],[2788,2,2788,4],[2789,2,2789,4],[2790,2,2790,4],[2791,2,2791,4],[2792,2,2792,8],[2802,7,2802,8],[2803,2,2803,4],[2803,7,2803,8],[2804,2,2804,8],[2805,3,2805,8],[2806,3,2806,8],[2819,2,2819,4],[2820,2,2820,4],[2821,2,2821,4],[2828,7,2828,8],[2829,2,2829,4],[2829,7,2829,8],[2830,2,2830,4],[2830,7,2830,8],[2831,2,2831,4],[2831,7,2831,8],[2832,2,2832,4],[2832,7,2832,8],[2833,2,2833,4],[2833,7,2833,8],[2834,2,2834,4],[2834,7,2834,8],[2835,2,2835,4],[2835,7,2835,8],[2851,2,2851,8],[2858,6,2858,7],[2859,2,2859,8],[2860,2,2860,4],[2860,5,2860,6],[2860,7,2860,8],[2861,2,2861,4],[2861,7,2861,8],[2862,2,2862,4],[2862,7,2862,8],[2863,2,2863,4],[2863,7,2863,8],[2864,2,2864,4],[2867,2,2867,4],[2868,2,2868,4],[2869,2,2869,4],[2870,2,2870,4],[2879,3,2879,8],[2880,3,2880,8],[2881,1,2881,8],[2882,0,2913,0],[2882,1,2883,3],[2882,4,2882,8],[2883,4,2883,8],[2884,1,2913,1],[2884,2,2884,8],[2885,2,2885,8],[2886,2,2886,4],[2886,6,2886,7],[2886,8,2891,8],[2887,2,2887,4],[2887,6,2887,7],[2888,2,2888,4],[2888,6,2888,7],[2896,2,2896,4],[2897,2,2897,4],[2898,2,2898,4],[2899,2,2899,4],[2900,2,2900,4],[2901,2,2901,4],[2903,2,2903,4],[2903,7,2903,8],[2911,3,2911,8],[2912,3,2912,8],[2913,3,2913,8],[2925,2,2925,4],[2925,6,2925,7],[2926,2,2926,8],[2927,2,2927,4],[2927,5,2927,6],[2927,7,2927,8],[2928,2,2928,4],[2929,2,2929,4],[2930,2,2930,4],[2931,2,2931,4],[2933,2,2933,4],[2933,7,2933,8],[2934,2,2934,4],[2934,7,2934,8],[2935,2,2935,4],[2935,7,2935,8],[2936,2,2936,4],[2936,7,2936,8],[2937,2,2937,4],[2937,7,2937,8],[2941,3,2941,8],[2942,3,2942,8],[2943,3,2943,8],[2944,3,2944,8],[2945,3,2945,8],[2946,3,2946,8],[2947,3,2947,8]],"merged_total":5550,"flags":["merged_cut"]}
[1]
[{"$nulls":4},{"$f":"MASTER!$E$11","v":"Govt. Sr. Secondary School Raimalwada"}]
[{"$nulls":4},{"$f":"MASTER!$E$14","v":"P.S.-Bapini (Jodhpur)"}]
[null,{"$f":"CONCATENATE(C5,'TIME TABLE'!$C$5,'ADMIT CARD'!$C6,$F6,'ADMIT CARD'!$G6,'TIME TABLE'!$E$5)","v":"ADMIT CARD(Roll Number●→901)"},{"$f":"CONCATENATE('TIME TABLE'!$B$2,'TIME TABLE'!$F$2)","v":"HALF YEARLY EXAM:2021-22"}]
[null,null,"ADMIT CARD",{"$nulls":6}," "]
[null,null,"Roll Number",null,null,"●→",{"$f":"VLOOKUP(A1,'STUDENT DETAIL'!$C$8:$I$107,3)","v":901},null,"Seal and Signature of Head of Institution"]
[null,null,"Student's Name",null,null,"●→",{"$f":"VLOOKUP(A1,'STUDENT DETAIL'!$C$8:$I$107,4)","v":"Akshya"}]
[null,null,"Father's Name",null,null,"●→",{"$f":"VLOOKUP(A1,'STUDENT DETAIL'!$C$8:$I$107,5)","v":"Ram"}]
[null,null,"Mother's Name ",null,null,"●→",{"$f":"VLOOKUP(A1,'STUDENT DETAIL'!$C$8:$I$107,6)","v":"Seeta"}]
[null,null,"Class & Section",null,null,"●→",{"$f":"IF(G6=0,0,CONCATENATE('STUDENT DETAIL'!$E$4,'STUDENT DETAIL'!$H$4))","v":"4(A)"}]
[null,null,"Date Of Birth",null,null,"●→",{"$f":"VLOOKUP(A1,'STUDENT DETAIL'!$C$8:$I$107,7)","v":"2000-02-05"}]
[null,null,"Time Table"]
[null,null,"Subject",null,null,"Date (Day)",null,"Time"]
[null,null,{"$f":"'TIME TABLE'!$F$5","v":"Hindi"},null,null,{"$f":"IF(C14=0,0,'TIME TABLE'!$B$5)","v":"2022-03-31"},{"$f":"IF(C14=0,0,CONCATENATE('TIME TABLE'!$C$5,'TIME TABLE'!$D$5,'TIME TABLE'!$E$5))","v":"(Thursday)"},{"$f":"IF(C14=0,0,'TIME TABLE'!$C$3)","v":"09:00 AM to 11:45 AM"}]
[null,null,{"$f":"'TIME TABLE'!$F$6","v":"English"},null,null,{"$f":"IF(C15=0,0,'TIME TABLE'!$B$6)","v":"2022-04-01"},{"$f":"IF(C15=0,0,CONCATENATE('TIME TABLE'!$C$6,'TIME TABLE'!$D$6,'TIME TABLE'!$E$6))","v":"(Friday)"},{"$f":"IF(C15=0,0,'TIME TABLE'!$C$3)","v":"09:00 AM to 11:45 AM"}]
[null,null,{"$f":"'TIME TABLE'!$F$7","v":"Science"},null,null,{"$f":"IF(C16=0,0,'TIME TABLE'!$B$7)","v":"2022-04-02"},{"$f":"IF(C16=0,0,CONCATENATE('TIME TABLE'!$C$7,'TIME TABLE'!$D$7,'TIME TABLE'!$E$7))","v":"(Saturday)"},{"$f":"IF(C16=0,0,'TIME TABLE'!$C$3)","v":"09:00 AM to 11:45 AM"}]
[null,null,{"$f":"'TIME TABLE'!$F$8","v":"Mathematics"},null,null,{"$f":"IF(C17=0,0,'TIME TABLE'!$B$8)","v":"2022-04-03"},{"$f":"IF(C17=0,0,CONCATENATE('TIME TABLE'!$C$8,'TIME TABLE'!$D$8,'TIME TABLE'!$E$8))","v":"(Sunday)"},{"$f":"IF(C17=0,0,'TIME TABLE'!$C$3)","v":"09:00 AM to 11:45 AM"}]
[null,null,{"$f":"'TIME TABLE'!$F$9","v":"Social Study"},null,null,{"$f":"IF(C18=0,0,'TIME TABLE'!$B$9)","v":"2022-04-04"},{"$f":"IF(C18=0,0,CONCATENATE('TIME TABLE'!$C$9,'TIME TABLE'!$D$9,'TIME TABLE'!$E$9))","v":"(Monday)"},{"$f":"IF(C18=0,0,'TIME TABLE'!$C$3)","v":"09:00 AM to 11:45 AM"}]
[null,null,{"$f":"'TIME TABLE'!$F$10","v":"Sanskrit"},null,null,{"$f":"IF(C19=0,0,'TIME TABLE'!$B$10)","v":"2022-04-05"},{"$f":"IF(C19=0,0,CONCATENATE('TIME TABLE'!$C$10,'TIME TABLE'!$D$10,'TIME TABLE'!$E$10))","v":"(Tuesday)"},{"$f":"IF(C19=0,0,'TIME TABLE'!$C$3)","v":"09:00 AM to 11:45 AM"}]
[null,null,{"$f":"'TIME TABLE'!$F$11","v":0},null,null,{"$f":"IF(C20=0,0,'TIME TABLE'!$B$11)","v":"00:00:00"},{"$f":"IF(C20=0,0,CONCATENATE('TIME TABLE'!$C$11,'TIME TABLE'!$D$11,'TIME TABLE'!$E$11))","v":0},{"$f":"IF(C20=0,0,'TIME TABLE'!$C$3)","v":0}]
[null,null,{"$f":"'TIME TABLE'!$F$12","v":0},null,null,{"$f":"IF(C21=0,0,'TIME TABLE'!$B$12)","v":"00:00:00"},{"$f":"IF(C21=0,0,CONCATENATE('TIME TABLE'!$C$12,'TIME TABLE'!$D$12,'TIME TABLE'!$E$12))","v":0},{"$f":"IF(C21=0,0,'TIME TABLE'!$C$3)","v":0}]
[null,null,{"$f":"'TIME TABLE'!$F$13","v":0},null,null,{"$f":"IF(C22=0,0,'TIME TABLE'!$B$13)","v":"00:00:00"},{"$f":"IF(C22=0,0,CONCATENATE('TIME TABLE'!$C$13,'TIME TABLE'!$D$13,'TIME TABLE'!$E$13))","v":0},{"$f":"IF(C22=0,0,'TIME TABLE'!$C$3)","v":0}]
[null,null,{"$f":"'TIME TABLE'!$F$14","v":0},null,null,{"$f":"IF(C23=0,0,'TIME TABLE'!$B$14)","v":"00:00:00"},{"$f":"IF(C23=0,0,CONCATENATE('TIME TABLE'!$C$14,'TIME TABLE'!$D$14,'TIME TABLE'!$E$14))","v":0},{"$f":"IF(C23=0,0,'TIME TABLE'!$C$3)","v":0}]
[null,null,"Instructions"]
[null,null,1,"Check the exam time table carefully."]
[null,null,2,"Students must bring the 'Admit Card' and show it to the invigilator(s) on duty and should preserve it for future requirements."]
[null,null,3,"Mobile Phone, Calculator, Digital Watch or any Electronic Device is NOT ALLOWED."]
[null,null,4,"Arrive at the School at least 15 minutes before the start examination."]
[null,null,5,"Student is barred from entering the examination hall 15 minutes after the written examination starts."]
[null,null,6,"Ensure that you use the washroom before arriving for your exam as you will not be permitted to leave during the first hour."]
[null,null,7,"Normally, you are required to answer questionsusing blue or black in . Make sure you bring some spare pens with you."]
[null,null,8,"Keep your eyes on your own paper. Remember, copying is cheating!"]
[null,null,9,"You must remain silent until after you have exited the school building."]
[]
[{"$f":"A1+1","v":2}]
[{"$nulls":4},{"$f":"MASTER!$E$11","v":"Govt. Sr. Secondary School Raimalwada"}]
[{"$nulls":4},{"$f":"MASTER!$E$14","v":"P.S.-Bapini (Jodhpur)"}]
[null,{"$f":"CONCATENATE(C39,'TIME TABLE'!$C$5,'ADMIT CARD'!$C40,$F40,'ADMIT CARD'!$G40,'TIME TABLE'!$E$5)","v":"ADMIT CARD(Roll Number●→0)"},{"$f":"CONCATENATE('TIME TABLE'!$B$2,'TIME TABLE'!$F$2)","v":"HALF YEARLY EXAM:2021-22"}]
[null,null,"ADMIT CARD",{"$nulls":6}," "]
[null,null,"Roll Number",null,null,"●→",{"$f":"VLOOKUP(A35,'STUDENT DETAIL'!$C$8:$I$107,3)","v":0},null,"Seal and Signature of Head of Institution"]
[null,null,"Student's Name",null,null,"●→",{"$f":"VLOOKUP(A35,'STUDENT DETAIL'!$C$8:$I$107,4)","v":0}]
[null,null,"Father's Name",null,null,"●→",{"$f":"VLOOKUP(A35,'STUDENT DETAIL'!$C$8:$I$107,5)","v":0}]
[null,null,"Mother's Name ",null,null,"●→",{"$f":"VLOOKUP(A35,'STUDENT DETAIL'!$C$8:$I$107,6)","v":0}]
[null,null,"Class & Section",null,null,"●→",{"$f":"IF(G40=0,0,CONCATENATE('STUDENT DETAIL'!$E$4,'STUDENT DETAIL'!$H$4))","v":0}]
[null,null,"Date Of Birth",null,null,"●→",{"$f":"VLOOKUP(A35,'STUDENT DETAIL'!$C$8:$I$107,7)","v":"00:00:00"}]
[null,null,"Time Table"]
[null,null,"Subject",null,null,"Date (Day)",null,"Time"]
[null,null,{"$f":"'TIME TABLE'!$F$5","v":"Hindi"},null,null,{"$f":"IF(C48=0,0,'TIME TABLE'!$B$5)","v":"2022-03-31"},{"$f":"IF(C48=0,0,CONCATENATE('TIME TABLE'!$C$5,'TIME TABLE'!$D$5,'TIME TABLE'!$E$5))","v":"(Thursday)"},{"$f":"IF(C48=0,0,'TIME TABLE'!$C$3)","v":"09:00 AM to 11:45 AM"}]
[null,null,{"$f":"'TIME TABLE'!$F$6","v":"English"},null,null,{"$f":"IF(C49=0,0,'TIME TABLE'!$B$6)","v":"2022-04-01"},{"$f":"IF(C49=0,0,CONCATENATE('TIME TABLE'!$C$6,'TIME TABLE'!$D$6,'TIME TABLE'!$E$6))","v":"(Friday)"},{"$f":"IF(C49=0,0,'TIME TABLE'!$C$3)","v":"09:00 AM to 11:45 AM"}]
[null,null,{"$f":"'TIME TABLE'!$F$7","v":"Science"},null,null,{"$f":"IF(C50=0,0,'TIME TABLE'!$B$7)","v":"2022-04-02"},{"$f":"IF(C50=0,0,CONCATENATE('TIME TABLE'!$C$7,'TIME TABLE'!$D$7,'TIME TABLE'!$E$7))","v":"(Saturday)"},{"$f":"IF(C50=0,0,'TIME TABLE'!$C$3)","v":"09:00 AM to 11:45 AM"}]
[null,null,{"$f":"'TIME TABLE'!$F$8","v":"Mathematics"},null,null,{"$f":"IF(C51=0,0,'TIME TABLE'!$B$8)","v":"2022-04-03"},{"$f":"IF(C51=0,0,CONCATENATE('TIME TABLE'!$C$8,'TIME TABLE'!$D$8,'TIME TABLE'!$E$8))","v":"(Sunday)"},{"$f":"IF(C51=0,0,'TIME TABLE'!$C$3)","v":"09:00 AM to 11:45 AM"}]
[null,null,{"$f":"'TIME TABLE'!$F$9","v":"Social Study"},null,null,{"$f":"IF(C52=0,0,'TIME TABLE'!$B$9)","v":"2022-04-04"},{"$f":"IF(C52=0,0,CONCATENATE('TIME TABLE'!$C$9,'TIME TABLE'!$D$9,'TIME TABLE'!$E$9))","v":"(Monday)"},{"$f":"IF(C52=0,0,'TIME TABLE'!$C$3)","v":"09:00 AM to 11:45 AM"}]
[null,null,{"$f":"'TIME TABLE'!$F$10","v":"Sanskrit"},null,null,{"$f":"IF(C53=0,0,'TIME TABLE'!$B$10)","v":"2022-04-05"},{"$f":"IF(C53=0,0,CONCATENATE('TIME TABLE'!$C$10,'TIME TABLE'!$D$10,'TIME TABLE'!$E$10))","v":"(Tuesday)"},{"$f":"IF(C53=0,0,'TIME TABLE'!$C$3)","v":"09:00 AM to 11:45 AM"}]
[null,null,{"$f":"'TIME TABLE'!$F$11","v":0},null,null,{"$f":"IF(C54=0,0,'TIME TABLE'!$B$11)","v":"00:00:00"},{"$f":"IF(C54=0,0,CONCATENATE('TIME TABLE'!$C$11,'TIME TABLE'!$D$11,'TIME TABLE'!$E$11))","v":0},{"$f":"IF(C54=0,0,'TIME TABLE'!$C$3)","v":0}]
[null,null,{"$f":"'TIME TABLE'!$F$12","v":0},null,null,{"$f":"IF(C55=0,0,'TIME TABLE'!$B$12)","v":"00:00:00"},{"$f":"IF(C55=0,0,CONCATENATE('TIME TABLE'!$C$12,'TIME TABLE'!$D$12,'TIME TABLE'!$E$12))","v":0},{"$f":"IF(C55=0,0,'TIME TABLE'!$C$3)","v":0}]
[null,null,{"$f":"'TIME TABLE'!$F$13","v":0},null,null,{"$f":"IF(C56=0,0,'TIME TABLE'!$B$13)","v":"00:00:00"},{"$f":"IF(C56=0,0,CONCATENATE('TIME TABLE'!$C$13,'TIME TABLE'!$D$13,'TIME TABLE'!$E$13))","v":0},{"$f":"IF(C56=0,0,'TIME TABLE'!$C$3)","v":0}]
[null,null,{"$f":"'TIME TABLE'!$F$14","v":0},null,null,{"$f":"IF(C57=0,0,'TIME TABLE'!$B$14)","v":"00:00:00"},{"$f":"IF(C57=0,0,CONCATENATE('TIME TABLE'!$C$14,'TIME TABLE'!$D$14,'TIME TABLE'!$E$14))","v":0},{"$f":"IF(C57=0,0,'TIME TABLE'!$C$3)","v":0}]
[null,null,"Instructions"]
[null,null,1,"Check the exam time table carefully."]
[null,null,2,"Students must bring the 'Admit Card' and show it to the invigilator(s) on duty and should preserve it for future requirements."]
[null,null,3,"Mobile Phone, Calculator, Digital Watch or any Electronic Device is NOT ALLOWED."]
[null,null,4,"Arrive at the School at least 15 minutes before the start examination."]
[null,null,5,"Student is barred from entering the examination hall 15 minutes after the written examination starts."]
[null,null,6,"Ensure that you use the washroom before arriving for your exam as you will not be permitted to leave during the first hour."]
[null,null,7,"Normally, you are required to answer questionsusing blue or black in . Make sure you bring some spare pens with you."]
[null,null,8,"Keep your eyes on your own paper. Remember, copying is cheating!"]
[null,null,9,"You must remain silent until after you have exited the school building."]
[{"$f":"A35+1","v":3}]
[{"$nulls":4},{"$f":"MASTER!$E$11","v":"Govt. Sr. Secondary School Raimalwada"}]
[{"$nulls":4},{"$f":"MASTER!$E$14","v":"P.S.-Bapini (Jodhpur)"}]
[null,{"$f":"CONCATENATE(C72,'TIME TABLE'!$C$5,'ADMIT CARD'!$C73,$F73,'ADMIT CARD'!$G73,'TIME TABLE'!$E$5)","v":"ADMIT CARD(Roll Number●→0)"},{"$f":"CONCATENATE('TIME TABLE'!$B$2,'TIME TABLE'!$F$2)","v":"HALF YEARLY EXAM:2021-22"}]
[null,null,"ADMIT CARD",{"$nulls":6}," "]
[null,null,"Roll Number",null,null,"●→",{"$f":"VLOOKUP(A68,'STUDENT DETAIL'!$C$8:$I$107,3)","v":0},null,"Seal and Signature of Head of Institution"]
[null,null,"Student's Name",null,null,"●→",{"$f":"VLOOKUP(A68,'STUDENT DETAIL'!$C$8:$I$107,4)","v":0}]
[null,null,"Father's Name",null,null,"●→",{"$f":"VLOOKUP(A68,'STUDENT DETAIL'!$C$8:$I$107,5)","v":0}]
[null,null,"Mother's Name ",null,null,"●→",{"$f":"VLOOKUP(A68,'STUDENT DETAIL'!$C$8:$I$107,6)","v":0}]
[null,null,"Class & Section",null,null,"●→",{"$f":"IF(G73=0,0,CONCATENATE('STUDENT DETAIL'!$E$4,'STUDENT DETAIL'!$H$4))","v":0}]
[null,null,"Date Of Birth",null,null,"●→",{"$f":"VLOOKUP(A68,'STUDENT DETAIL'!$C$8:$I$107,7)","v":"00:00:00"}]
[null,null,"Time Table"]
[null,null,"Subject",null,null,"Date (Day)",null,"Time"]
[null,null,{"$f":"'TIME TABLE'!$F$5","v":"Hindi"},null,null,{"$f":"IF(C81=0,0,'TIME TABLE'!$B$5)","v":"2022-03-31"},{"$f":"IF(C81=0,0,CONCATENATE('TIME TABLE'!$C$5,'TIME TABLE'!$D$5,'TIME TABLE'!$E$5))","v":"(Thursday)"},{"$f":"IF(C81=0,0,'TIME TABLE'!$C$3)","v":"09:00 AM to 11:45 AM"}]
[null,null,{"$f":"'TIME TABLE'!$F$6","v":"English"},null,null,{"$f":"IF(C82=0,0,'TIME TABLE'!$B$6)","v":"2022-04-01"},{"$f":"IF(C82=0,0,CONCATENATE('TIME TABLE'!$C$6,'TIME TABLE'!$D$6,'TIME TABLE'!$E$6))","v":"(Friday)"},{"$f":"IF(C82=0,0,'TIME TABLE'!$C$3)","v":"09:00 AM to 11:45 AM"}]
[null,null,{"$f":"'TIME TABLE'!$F$7","v":"Science"},null,null,{"$f":"IF(C83=0,0,'TIME TABLE'!$B$7)","v":"2022-04-02"},{"$f":"IF(C83=0,0,CONCATENATE('TIME TABLE'!$C$7,'TIME TABLE'!$D$7,'TIME TABLE'!$E$7))","v":"(Saturday)"},{"$f":"IF(C83=0,0,'TIME TABLE'!$C$3)","v":"09:00 AM to 11:45 AM"}]
[null,null,{"$f":"'TIME TABLE'!$F$8","v":"Mathematics"},null,null,{"$f":"IF(C84=0,0,'TIME TABLE'!$B$8)","v":"2022-04-03"},{"$f":"IF(C84=0,0,CONCATENATE('TIME TABLE'!$C$8,'TIME TABLE'!$D$8,'TIME TABLE'!$E$8))","v":"(Sunday)"},{"$f":"IF(C84=0,0,'TIME TABLE'!$C$3)","v":"09:00 AM to 11:45 AM"}]
[null,null,{"$f":"'TIME TABLE'!$F$9","v":"Social Study"},null,null,{"$f":"IF(C85=0,0,'TIME TABLE'!$B$9)","v":"2022-04-04"},{"$f":"IF(C85=0,0,CONCATENATE('TIME TABLE'!$C$9,'TIME TABLE'!$D$9,'TIME TABLE'!$E$9))","v":"(Monday)"},{"$f":"IF(C85=0,0,'TIME TABLE'!$C$3)","v":"09:00 AM to 11:45 AM"}]
[null,null,{"$f":"'TIME TABLE'!$F$10","v":"Sanskrit"},null,null,{"$f":"IF(C86=0,0,'TIME TABLE'!$B$10)","v":"2022-04-05"},{"$f":"IF(C86=0,0,CONCATENATE('TIME TABLE'!$C$10,'TIME TABLE'!$D$10,'TIME TABLE'!$E$10))","v":"(Tuesday)"},{"$f":"IF(C86=0,0,'TIME TABLE'!$C$3)","v":"09:00 AM to 11:45 AM"}]
[null,null,{"$f":"'TIME TABLE'!$F$11","v":0},null,null,{"$f":"IF(C87=0,0,'TIME TABLE'!$B$11)","v":"00:00:00"},{"$f":"IF(C87=0,0,CONCATENATE('TIME TABLE'!$C$11,'TIME TABLE'!$D$11,'TIME TABLE'!$E$11))","v":0},{"$f":"IF(C87=0,0,'TIME TABLE'!$C$3)","v":0}]
[null,null,{"$f":"'TIME TABLE'!$F$12","v":0},null,null,{"$f":"IF(C88=0,0,'TIME TABLE'!$B$12)","v":"00:00:00"},{"$f":"IF(C88=0,0,CONCATENATE('TIME TABLE'!$C$12,'TIME TABLE'!$D$12,'TIME TABLE'!$E$12))","v":0},{"$f":"IF(C88=0,0,'TIME TABLE'!$C$3)","v":0}]
[null,null,{"$f":"'TIME TABLE'!$F$13","v":0},null,null,{"$f":"IF(C89=0,0,'TIME TABLE'!$B$13)","v":"00:00:00"},{"$f":"IF(C89=0,0,CONCATENATE('TIME TABLE'!$C$13,'TIME TABLE'!$D$13,'TIME TABLE'!$E$13))","v":0},{"$f":"IF(C89=0,0,'TIME TABLE'!$C$3)","v":0}]
[null,null,{"$f":"'TIME TABLE'!$F$14","v":0},null,null,{"$f":"IF(C90=0,0,'TIME TABLE'!$B$14)","v":"00:00:00"},{"$f":"IF(C90=0,0,CONCATENATE('TIME TABLE'!$C$14,'TIME TABLE'!$D$14,'TIME TABLE'!$E$14))","v":0},{"$f":"IF(C90=0,0,'TIME TABLE'!$C$3)","v":0}]
[null,null,"Instructions"]
[null,null,1,"Check the exam time table carefully."]
[null,null,2,"Students must bring the 'Admit Card' and show it to the invigilator(s) on duty and should preserve it for future requirements."]
[null,null,3,"Mobile Phone, Calculator, Digital Watch or any Electronic Device is NOT ALLOWED."]
[null,null,4,"Arrive at the School at least 15 minutes before the start examination."]
[null,null,5,"Student is barred from entering the examination hall 15 minutes after the written examination starts."]
[null,null,6,"Ensure that you use the washroom before arriving for your exam as you will not be permitted to leave during the first hour."]
[null,null,7,"Normally, you are required to answer questionsusing blue or black in . Make sure you bring some spare pens with you."]
[null,null,8,"Keep your eyes on your own paper. Remember, copying is cheating!"]
[null,null,9,"You must remain silent until after you have exited the school building."]
[]
[{"$f":"A68+1","v":4}]
[{"$nulls":4},{"$f":"MASTER!$E$11","v":"Govt. Sr. Secondary School Raimalwada"}]
[{"$nulls":4},{"$f":"MASTER!$E$14","v":"P.S.-Bapini (Jodhpur)"}]
[null,{"$f":"CONCATENATE(C106,'TIME TABLE'!$C$5,'ADMIT CARD'!$C107,$F107,'ADMIT CARD'!$G107,'TIME TABLE'!$E$5)","v":"ADMIT CARD(Roll Number●→0)"},{"$f":"CONCATENATE('TIME TABLE'!$B$2,'TIME TABLE'!$F$2)","v":"HALF YEARLY EXAM:2021-22"}]
[null,null,"ADMIT CARD",{"$nulls":6}," "]
[null,null,"Roll Number",null,null,"●→",{"$f":"VLOOKUP(A102,'STUDENT DETAIL'!$C$8:$I$107,3)","v":0},null,"Seal and Signature of Head of Institution"]
[null,null,"Student's Name",null,null,"●→",{"$f":"VLOOKUP(A102,'STUDENT DETAIL'!$C$8:$I$107,4)","v":0}]
[null,null,"Father's Name",null,null,"●→",{"$f":"VLOOKUP(A102,'STUDENT DETAIL'!$C$8:$I$107,5)","v":0}]
[null,null,"Mother's Name ",null,null,"●→",{"$f":"VLOOKUP(A102,'STUDENT DETAIL'!$C$8:$I$107,6)","v":0}]
[null,null,"Class & Section",null,null,"●→",{"$f":"IF(G107=0,0,CONCATENATE('STUDENT DETAIL'!$E$4,'STUDENT DETAIL'!$H$4))","v":0}]
[null,null,"Date Of Birth",null,null,"●→",{"$f":"VLOOKUP(A102,'STUDENT DETAIL'!$C$8:$I$107,7)","v":"00:00:00"}]
[null,null,"Time Table"]
[null,null,"Subject",null,null,"Date (Day)",null,"Time"]
[null,null,{"$f":"'TIME TABLE'!$F$5","v":"Hindi"},null,null,{"$f":"IF(C115=0,0,'TIME TABLE'!$B$5)","v":"2022-03-31"},{"$f":"IF(C115=0,0,CONCATENATE('TIME TABLE'!$C$5,'TIME TABLE'!$D$5,'TIME TABLE'!$E$5))","v":"(Thursday)"},{"$f":"IF(C115=0,0,'TIME TABLE'!$C$3)","v":"09:00 AM to 11:45 AM"}]
[null,null,{"$f":"'TIME TABLE'!$F$6","v":"English"},null,null,{"$f":"IF(C116=0,0,'TIME TABLE'!$B$6)","v":"2022-04-01"},{"$f":"IF(C116=0,0,CONCATENATE('TIME TABLE'!$C$6,'TIME TABLE'!$D$6,'TIME TABLE'!$E$6))","v":"(Friday)"},{"$f":"IF(C116=0,0,'TIME TABLE'!$C$3)","v":"09:00 AM to 11:45 AM"}]
[null,null,{"$f":"'TIME TABLE'!$F$7","v":"Science"},null,null,{"$f":"IF(C117=0,0,'TIME TABLE'!$B$7)","v":"2022-04-02"},{"$f":"IF(C117=0,0,CONCATENATE('TIME TABLE'!$C$7,'TIME TABLE'!$D$7,'TIME TABLE'!$E$7))","v":"(Saturday)"},{"$f":"IF(C117=0,0,'TIME TABLE'!$C$3)","v":"09:00 AM to 11:45 AM"}]
[null,null,{"$f":"'TIME TABLE'!$F$8","v":"Mathematics"},null,null,{"$f":"IF(C118=0,0,'TIME TABLE'!$B$8)","v":"2022-04-03"},{"$f":"IF(C118=0,0,CONCATENATE('TIME TABLE'!$C$8,'TIME TABLE'!$D$8,'TIME TABLE'!$E$8))","v":"(Sunday)"},{"$f":"IF(C118=0,0,'TIME TABLE'!$C$3)","v":"09:00 AM to 11:45 AM"}]
[null,null,{"$f":"'TIME TABLE'!$F$9","v":"Social Study"},null,null,{"$f":"IF(C119=0,0,'TIME TABLE'!$B$9)","v":"2022-04-04"},{"$f":"IF(C119=0,0,CONCATENATE('TIME TABLE'!$C$9,'TIME TABLE'!$D$9,'TIME TABLE'!$E$9))","v":"(Monday)"},{"$f":"IF(C119=0,0,'TIME TABLE'!$C$3)","v":"09:00 AM to 11:45 AM"}]
[null,null,{"$f":"'TIME TABLE'!$F$10","v":"Sanskrit"},null,null,{"$f":"IF(C120=0,0,'TIME TABLE'!$B$10)","v":"2022-04-05"},{"$f":"IF(C120=0,0,CONCATENATE('TIME TABLE'!$C$10,'TIME TABLE'!$D$10,'TIME TABLE'!$E$10))","v":"(Tuesday)"},{"$f":"IF(C120=0,0,'TIME TABLE'!$C$3)","v":"09:00 AM to 11:45 AM"}]
[null,null,{"$f":"'TIME TABLE'!$F$11","v":0},null,null,{"$f":"IF(C121=0,0,'TIME TABLE'!$B$11)","v":"00:00:00"},{"$f":"IF(C121=0,0,CONCATENATE('TIME TABLE'!$C$11,'TIME TABLE'!$D$11,'TIME TABLE'!$E$11))","v":0},{"$f":"IF(C121=0,0,'TIME TABLE'!$C$3)","v":0}]
[null,null,{"$f":"'TIME TABLE'!$F$12","v":0},null,null,{"$f":"IF(C122=0,0,'TIME TABLE'!$B$12)","v":"00:00:00"},{"$f":"IF(C122=0,0,CONCATENATE('TIME TABLE'!$C$12,'TIME TABLE'!$D$12,'TIME TABLE'!$E$12))","v":0},{"$f":"IF(C122=0,0,'TIME TABLE'!$C$3)","v":0}]
[null,null,{"$f":"'TIME TABLE'!$F$13","v":0},null,null,{"$f":"IF(C123=0,0,'TIME TABLE'!$B$13)","v":"00:00:00"},{"$f":"IF(C123=0,0,CONCATENATE('TIME TABLE'!$C$13,'TIME TABLE'!$D$13,'TIME TABLE'!$E$13))","v":0},{"$f":"IF(C123=0,0,'TIME TABLE'!$C$3)","v":0}]
[null,null,{"$f":"'TIME TABLE'!$F$14","v":0},null,null,{"$f":"IF(C124=0,0,'TIME TABLE'!$B$14)","v":"00:00:00"},{"$f":"IF(C124=0,0,CONCATENATE('TIME TABLE'!$C$14,'TIME TABLE'!$D$14,'TIME TABLE'!$E$14))","v":0},{"$f":"IF(C124=0,0,'TIME TABLE'!$C$3)","v":0}]
[null,null,"Instructions"]
[null,null,1,"Check the exam time table carefully."]
[null,null,2,"Students must bring the 'Admit Card' and show it to the invigilator(s) on duty and should preserve it for future requirements."]
[null,null,3,"Mobile Phone, Calculator, Digital Watch or any Electronic Device is NOT ALLOWED."]
[null,null,4,"Arrive at the School at least 15 minutes before the start examination."]
[null,null,5,"Student is barred from entering the examination hall 15 minutes after the written examination starts."]
[null,null,6,"Ensure that you use the washroom before arriving for your exam as you will not be permitted to leave during the first hour."]
[null,null,7,"Normally, you are required to answer questionsusing blue or black in . Make sure you bring some spare pens with you."]
[null,null,8,"Keep your eyes on your own paper. Remember, copying is cheating!"]
[null,null,9,"You must remain silent until after you have exited the school building."]
[{"$f":"A102+1","v":5}]
[{"$nulls":4},{"$f":"MASTER!$E$11","v":"Govt. Sr. Secondary School Raimalwada"}]
[{"$nulls":4},{"$f":"MASTER!$E$14","v":"P.S.-Bapini (Jodhpur)"}]
[null,{"$f":"CONCATENATE(C139,'TIME TABLE'!$C$5,'ADMIT CARD'!$C140,$F140,'ADMIT CARD'!$G140,'TIME TABLE'!$E$5)","v":"ADMIT CARD(Roll Number●→0)"},{"$f":"CONCATENATE('TIME TABLE'!$B$2,'TIME TABLE'!$F$2)","v":"HALF YEARLY EXAM:2021-22"}]
[null,null,"ADMIT CARD",{"$nulls":6}," "]
[null,null,"Roll Number",null,null,"●→",{"$f":"VLOOKUP(A135,'STUDENT DETAIL'!$C$8:$I$107,3)","v":0},null,"Seal and Signature of Head of Institution"]
[null,null,"Student's Name",null,null,"●→",{"$f":"VLOOKUP(A135,'STUDENT DETAIL'!$C$8:$I$107,4)","v":0}]
[null,null,"Father's Name",null,null,"●→",{"$f":"VLOOKUP(A135,'STUDENT DETAIL'!$C$8:$I$107,5)","v":0}]
[null,null,"Mother's Name ",null,null,"●→",{"$f":"VLOOKUP(A135,'STUDENT DETAIL'!$C$8:$I$107,6)","v":0}]
[null,null,"Class & Section",null,null,"●→",{"$f":"IF(G140=0,0,CONCATENATE('STUDENT DETAIL'!$E$4,'STUDENT DETAIL'!$H$4))","v":0}]
[null,null,"Date Of Birth",null,null,"●→",{"$f":"VLOOKUP(A135,'STUDENT DETAIL'!$C$8:$I$107,7)","v":"00:00:00"}]
[null,null,"Time Table"]
[null,null,"Subject",null,null,"Date (Day)",null,"Time"]
[null,null,{"$f":"'TIME TABLE'!$F$5","v":"Hindi"},null,null,{"$f":"IF(C148=0,0,'TIME TABLE'!$B$5)","v":"2022-03-31"},{"$f":"IF(C148=0,0,CONCATENATE('TIME TABLE'!$C$5,'TIME TABLE'!$D$5,'TIME TABLE'!$E$5))","v":"(Thursday)"},{"$f":"IF(C148=0,0,'TIME TABLE'!$C$3)","v":"09:00 AM to 11:45 AM"}]
[null,null,{"$f":"'TIME TABLE'!$F$6","v":"English"},null,null,{"$f":"IF(C149=0,0,'TIME TABLE'!$B$6)","v":"2022-04-01"},{"$f":"IF(C149=0,0,CONCATENATE('TIME TABLE'!$C$6,'TIME TABLE'!$D$6,'TIME TABLE'!$E$6))","v":"(Friday)"},{"$f":"IF(C149=0,0,'TIME TABLE'!$C$3)","v":"09:00 AM to 11:45 AM"}]
[null,null,{"$f":"'TIME TABLE'!$F$7","v":"Science"},null,null,{"$f":"IF(C150=0,0,'TIME TABLE'!$B$7)","v":"2022-04-02"},{"$f":"IF(C150=0,0,CONCATENATE('TIME TABLE'!$C$7,'TIME TABLE'!$D$7,'TIME TABLE'!$E$7))","v":"(Saturday)"},{"$f":"IF(C150=0,0,'TIME TABLE'!$C$3)","v":"09:00 AM to 11:45 AM"}]
[null,null,{"$f":"'TIME TABLE'!$F$8","v":"Mathematics"},null,null,{"$f":"IF(C151=0,0,'TIME TABLE'!$B$8)","v":"2022-04-03"},{"$f":"IF(C151=0,0,CONCATENATE('TIME TABLE'!$C$8,'TIME TABLE'!$D$8,'TIME TABLE'!$E$8))","v":"(Sunday)"},{"$f":"IF(C151=0,0,'TIME TABLE'!$C$3)","v":"09:00 AM to 11:45 AM"}]
[null,null,{"$f":"'TIME TABLE'!$F$9","v":"Social Study"},null,null,{"$f":"IF(C152=0,0,'TIME TABLE'!$B$9)","v":"2022-04-04"},{"$f":"IF(C152=0,0,CONCATENATE('TIME TABLE'!$C$9,'TIME TABLE'!$D$9,'TIME TABLE'!$E$9))","v":"(Monday)"},{"$f":"IF(C152=0,0,'TIME TABLE'!$C$3)","v":"09:00 AM to 11:45 AM"}]
[null,null,{"$f":"'TIME TABLE'!$F$10","v":"Sanskrit"},null,null,{"$f":"IF(C153=0,0,'TIME TABLE'!$B$10)","v":"2022-04-05"},{"$f":"IF(C153=0,0,CONCATENATE('TIME TABLE'!$C$10,'TIME TABLE'!$D$10,'TIME TABLE'!$E$10))","v":"(Tuesday)"},{"$f":"IF(C153=0,0,'TIME TABLE'!$C$3)","v":"09:00 AM to 11:45 AM"}]
[null,null,{"$f":"'TIME TABLE'!$F$11","v":0},null,null,{"$f":"IF(C154=0,0,'TIME TABLE'!$B$11)","v":"00:00:00"},{"$f":"IF(C154=0,0,CONCATENATE('TIME TABLE'!$C$11,'TIME TABLE'!$D$11,'TIME TABLE'!$E$11))","v":0},{"$f":"IF(C154=0,0,'TIME TABLE'!$C$3)","v":0}]
[null,null,{"$f":"'TIME TABLE'!$F$12","v":0},null,null,{"$f":"IF(C155=0,0,'TIME TABLE'!$B$12)","v":"00:00:00"},{"$f":"IF(C155=0,0,CONCATENATE('TIME TABLE'!$C$12,'TIME TABLE'!$D$12,'TIME TABLE'!$E$12))","v":0},{"$f":"IF(C155=0,0,'TIME TABLE'!$C$3)","v":0}]
[null,null,{"$f":"'TIME TABLE'!$F$13","v":0},null,null,{"$f":"IF(C156=0,0,'TIME TABLE'!$B$13)","v":"00:00:00"},{"$f":"IF(C156=0,0,CONCATENATE('TIME TABLE'!$C$13,'TIME TABLE'!$D$13,'TIME TABLE'!$E$13))","v":0},{"$f":"IF(C156=0,0,'TIME TABLE'!$C$3)","v":0}]
[null,null,{"$f":"'TIME TABLE'!$F$14","v":0},null,null,{"$f":"IF(C157=0,0,'TIME TABLE'!$B$14)","v":"00:00:00"},{"$f":"IF(C157=0,0,CONCATENATE('TIME TABLE'!$C$14,'TIME TABLE'!$D$14,'TIME TABLE'!$E$14))","v":0},{"$f":"IF(C157=0,0,'TIME TABLE'!$C$3)","v":0}]
[null,null,"Instructions"]
[null,null,1,"Check the exam time table carefully."]
[null,null,2,"Students must bring the 'Admit Card' and show it to the invigilator(s) on duty and should preserve it for future requirements."]
[null,null,3,"Mobile Phone, Calculator, Digital Watch or any Electronic Device is NOT ALLOWED."]
[null,null,4,"Arrive at the School at least 15 minutes before the start examination."]
[null,null,5,"Student is barred from entering the examination hall 15 minutes after the written examination starts."]
[null,null,6,"Ensure that you use the washroom before arriving for your exam as you will not be permitted to leave during the first hour."]
[null,null,7,"Normally, you are required to answer questionsusing blue or black in . Make sure you bring some spare pens with you."]
[null,null,8,"Keep your eyes on your own paper. Remember, copying is cheating!"]
[null,null,9,"You must remain silent until after you have exited the school building."]
[]
[{"$f":"A135+1","v":6}]
[{"$nulls":4},{"$f":"MASTER!$E$11","v":"Govt. Sr. Secondary School Raimalwada"}]
[{"$nulls":4},{"$f":"MASTER!$E$14","v":"P.S.-Bapini (Jodhpur)"}]
[null,{"$f":"CONCATENATE(C173,'TIME TABLE'!$C$5,'ADMIT CARD'!$C174,$F174,'ADMIT CARD'!$G174,'TIME TABLE'!$E$5)","v":"ADMIT CARD(Roll Number●→0)"},{"$f":"CONCATENATE('TIME TABLE'!$B$2,'TIME TABLE'!$F$2)","v":"HALF YEARLY EXAM:2021-22"}]
[null,null,"ADMIT CARD",{"$nulls":6}," "]
[null,null,"Roll Number",null,null,"●→",{"$f":"VLOOKUP(A169,'STUDENT DETAIL'!$C$8:$I$107,3)","v":0},null,"Seal and Signature of Head of Institution"]
[null,null,"Student's Name",null,null,"●→",{"$f":"VLOOKUP(A169,'STUDENT DETAIL'!$C$8:$I$107,4)","v":0}]
[null,null,"Father's Name",null,null,"●→",{"$f":"VLOOKUP(A169,'STUDENT DETAIL'!$C$8:$I$107,5)","v":0}]
[null,null,"Mother's Name ",null,null,"●→",{"$f":"VLOOKUP(A169,'STUDENT DETAIL'!$C$8:$I$107,6)","v":0}]
[null,null,"Class & Section",null,null,"●→",{"$f":"IF(G174=0,0,CONCATENATE('STUDENT DETAIL'!$E$4,'STUDENT DETAIL'!$H$4))","v":0}]
[null,null,"Date Of Birth",null,null,"●→",{"$f":"VLOOKUP(A169,'STUDENT DETAIL'!$C$8:$I$107,7)","v":"00:00:00"}]
[null,null,"Time Table"]
[null,null,"Subject",null,null,"Date (Day)",null,"Time"]
[null,null,{"$f":"'TIME TABLE'!$F$5","v":"Hindi"},null,null,{"$f":"IF(C182=0,0,'TIME TABLE'!$B$5)","v":"2022-03-31"},{"$f":"IF(C182=0,0,CONCATENATE('TIME TABLE'!$C$5,'TIME TABLE'!$D$5,'TIME TABLE'!$E$5))","v":"(Thursday)"},{"$f":"IF(C182=0,0,'TIME TABLE'!$C$3)","v":"09:00 AM to 11:45 AM"}]
[null,null,{"$f":"'TIME TABLE'!$F$6","v":"English"},null,null,{"$f":"IF(C183=0,0,'TIME TABLE'!$B$6)","v":"2022-04-01"},{"$f":"IF(C183=0,0,CONCATENATE('TIME TABLE'!$C$6,'TIME TABLE'!$D$6,'TIME TABLE'!$E$6))","v":"(Friday)"},{"$f":"IF(C183=0,0,'TIME TABLE'!$C$3)","v":"09:00 AM to 11:45 AM"}]
[null,null,{"$f":"'TIME TABLE'!$F$7","v":"Science"},null,null,{"$f":"IF(C184=0,0,'TIME TABLE'!$B$7)","v":"2022-04-02"},{"$f":"IF(C184=0,0,CONCATENATE('TIME TABLE'!$C$7,'TIME TABLE'!$D$7,'TIME TABLE'!$E$7))","v":"(Saturday)"},{"$f":"IF(C184=0,0,'TIME TABLE'!$C$3)","v":"09:00 AM to 11:45 AM"}]
[null,null,{"$f":"'TIME TABLE'!$F$8","v":"Mathematics"},null,null,{"$f":"IF(C185=0,0,'TIME TABLE'!$B$8)","v":"2022-04-03"},{"$f":"IF(C185=0,0,CONCATENATE('TIME TABLE'!$C$8,'TIME TABLE'!$D$8,'TIME TABLE'!$E$8))","v":"(Sunday)"},{"$f":"IF(C185=0,0,'TIME TABLE'!$C$3)","v":"09:00 AM to 11:45 AM"}]
[null,null,{"$f":"'TIME TABLE'!$F$9","v":"Social Study"},null,null,{"$f":"IF(C186=0,0,'TIME TABLE'!$B$9)","v":"2022-04-04"},{"$f":"IF(C186=0,0,CONCATENATE('TIME TABLE'!$C$9,'TIME TABLE'!$D$9,'TIME TABLE'!$E$9))","v":"(Monday)"},{"$f":"IF(C186=0,0,'TIME TABLE'!$C$3)","v":"09:00 AM to 11:45 AM"}]
[null,null,{"$f":"'TIME TABLE'!$F$10","v":"Sanskrit"},null,null,{"$f":"IF(C187=0,0,'TIME TABLE'!$B$10)","v":"2022-04-05"},{"$f":"IF(C187=0,0,CONCATENATE('TIME TABLE'!$C$10,'TIME TABLE'!$D$10,'TIME TABLE'!$E$10))","v":"(Tuesday)"},{"$f":"IF(C187=0,0,'TIME TABLE'!$C$3)","v":"09:00 AM to 11:45 AM"}]
[null,null,{"$f":"'TIME TABLE'!$F$11","v":0},null,null,{"$f":"IF(C188=0,0,'TIME TABLE'!$B$11)","v":"00:00:00"},{"$f":"IF(C188=0,0,CONCATENATE('TIME TABLE'!$C$11,'TIME TABLE'!$D$11,'TIME TABLE'!$E$11))","v":0},{"$f":"IF(C188=0,0,'TIME TABLE'!$C$3)","v":0}]
[null,null,{"$f":"'TIME TABLE'!$F$12","v":0},null,null,{"$f":"IF(C189=0,0,'TIME TABLE'!$B$12)","v":"00:00:00"},{"$f":"IF(C189=0,0,CONCATENATE('TIME TABLE'!$C$12,'TIME TABLE'!$D$12,'TIME TABLE'!$E$12))","v":0},{"$f":"IF(C189=0,0,'TIME TABLE'!$C$3)","v":0}]
[null,null,{"$f":"'TIME TABLE'!$F$13","v":0},null,null,{"$f":"IF(C190=0,0,'TIME TABLE'!$B$13)","v":"00:00:00"},{"$f":"IF(C190=0,0,CONCATENATE('TIME TABLE'!$C$13,'TIME TABLE'!$D$13,'TIME TABLE'!$E$13))","v":0},{"$f":"IF(C190=0,0,'TIME TABLE'!$C$3)","v":0}]
[null,null,{"$f":"'TIME TABLE'!$F$14","v":0},null,null,{"$f":"IF(C191=0,0,'TIME TABLE'!$B$14)","v":"00:00:00"},{"$f":"IF(C191=0,0,CONCATENATE('TIME TABLE'!$C$14,'TIME TABLE'!$D$14,'TIME TABLE'!$E$14))","v":0},{"$f":"IF(C191=0,0,'TIME TABLE'!$C$3)","v":0}]
[null,null,"Instructions"]
[null,null,1,"Check the exam time table carefully."]
[null,null,2,"Students must bring the 'Admit Card' and show it to the invigilator(s) on duty and should preserve it for future requirements."]
[null,null,3,"Mobile Phone, Calculator, Digital Watch or any Electronic Device is NOT ALLOWED."]
[null,null,4,"Arrive at the School at least 15 minutes before the start examination."]
[null,null,5,"Student is barred from entering the examination hall 15 minutes after the written examination starts."]
[null,null,6,"Ensure that you use the washroom before arriving for your exam as you will not be permitted to leave during the first hour."]
[null,null,7,"Normally, you are required to answer questionsusing blue or black in . Make sure you bring some spare pens with you."]
[null,null,8,"Keep your eyes on your own paper. Remember, copying is cheating!"]
[null,null,9,"You must remain silent until after you have exited the school building."]
[{"$f":"A169+1","v":7}]
[{"$nulls":4},{"$f":"MASTER!$E$11","v":"Govt. Sr. Secondary School Raimalwada"}]
[{"$nulls":4},{"$f":"MASTER!$E$14","v":"P.S.-Bapini (Jodhpur)"}]
[null,{"$f":"CONCATENATE(C206,'TIME TABLE'!$C$5,'ADMIT CARD'!$C207,$F207,'ADMIT CARD'!$G207,'TIME TABLE'!$E$5)","v":"ADMIT CARD(Roll Number●→0)"},{"$f":"CONCATENATE('TIME TABLE'!$B$2,'TIME TABLE'!$F$2)","v":"HALF YEARLY EXAM:2021-22"}]
[null,null,"ADMIT CARD",{"$nulls":6}," "]
[null,null,"Roll Number",null,null,"●→",{"$f":"VLOOKUP(A202,'STUDENT DETAIL'!$C$8:$I$107,3)","v":0},null,"Seal and Signature of Head of Institution"]
[null,null,"Student's Name",null,null,"●→",{"$f":"VLOOKUP(A202,'STUDENT DETAIL'!$C$8:$I$107,4)","v":0}]
[null,null,"Father's Name",null,null,"●→",{"$f":"VLOOKUP(A202,'STUDENT DETAIL'!$C$8:$I$107,5)","v":0}]
[null,null,"Mother's Name ",null,null,"●→",{"$f":"VLOOKUP(A202,'STUDENT DETAIL'!$C$8:$I$107,6)","v":0}]
[null,null,"Class & Section",null,null,"●→",{"$f":"IF(G207=0,0,CONCATENATE('STUDENT DETAIL'!$E$4,'STUDENT DETAIL'!$H$4))","v":0}]
[null,null,"Date Of Birth",null,null,"●→",{"$f":"VLOOKUP(A202,'STUDENT DETAIL'!$C$8:$I$107,7)","v":"00:00:00"}]
[null,null,"Time Table"]
[null,null,"Subject",null,null,"Date (Day)",null,"Time"]
[null,null,{"$f":"'TIME TABLE'!$F$5","v":"Hindi"},null,null,{"$f":"IF(C215=0,0,'TIME TABLE'!$B$5)","v":"2022-03-31"},{"$f":"IF(C215=0,0,CONCATENATE('TIME TABLE'!$C$5,'TIME TABLE'!$D$5,'TIME TABLE'!$E$5))","v":"(Thursday)"},{"$f":"IF(C215=0,0,'TIME TABLE'!$C$3)","v":"09:00 AM to 11:45 AM"}]
[null,null,{"$f":"'TIME TABLE'!$F$6","v":"English"},null,null,{"$f":"IF(C216=0,0,'TIME TABLE'!$B$6)","v":"2022-04-01"},{"$f":"IF(C216=0,0,CONCATENATE('TIME TABLE'!$C$6,'TIME TABLE'!$D$6,'TIME TABLE'!$E$6))","v":"(Friday)"},{"$f":"IF(C216=0,0,'TIME TABLE'!$C$3)","v":"09:00 AM to 11:45 AM"}]
[null,null,{"$f":"'TIME TABLE'!$F$7","v":"Science"},null,null,{"$f":"IF(C217=0,0,'TIME TABLE'!$B$7)","v":"2022-04-02"},{"$f":"IF(C217=0,0,CONCATENATE('TIME TABLE'!$C$7,'TIME TABLE'!$D$7,'TIME TABLE'!$E$7))","v":"(Saturday)"},{"$f":"IF(C217=0,0,'TIME TABLE'!$C$3)","v":"09:00 AM to 11:45 AM"}]
[null,null,{"$f":"'TIME TABLE'!$F$8","v":"Mathematics"},null,null,{"$f":"IF(C218=0,0,'TIME TABLE'!$B$8)","v":"2022-04-03"},{"$f":"IF(C218=0,0,CONCATENATE('TIME TABLE'!$C$8,'TIME TABLE'!$D$8,'TIME TABLE'!$E$8))","v":"(Sunday)"},{"$f":"IF(C218=0,0,'TIME TABLE'!$C$3)","v":"09:00 AM to 11:45 AM"}]
[null,null,{"$f":"'TIME TABLE'!$F$9","v":"Social Study"},null,null,{"$f":"IF(C219=0,0,'TIME TABLE'!$B$9)","v":"2022-04-04"},{"$f":"IF(C219=0,0,CONCATENATE('TIME TABLE'!$C$9,'TIME TABLE'!$D$9,'TIME TABLE'!$E$9))","v":"(Monday)"},{"$f":"IF(C219=0,0,'TIME TABLE'!$C$3)","v":"09:00 AM to 11:45 AM"}]
[null,null,{"$f":"'TIME TABLE'!$F$10","v":"Sanskrit"},null,null,{"$f":"IF(C220=0,0,'TIME TABLE'!$B$10)","v":"2022-04-05"},{"$f":"IF(C220=0,0,CONCATENATE('TIME TABLE'!$C$10,'TIME TABLE'!$D$10,'TIME TABLE'!$E$10))","v":"(Tuesday)"},{"$f":"IF(C220=0,0,'TIME TABLE'!$C$3)","v":"09:00 AM to 11:45 AM"}]
[null,null,{"$f":"'TIME TABLE'!$F$11","v":0},null,null,{"$f":"IF(C221=0,0,'TIME TABLE'!$B$11)","v":"00:00:00"},{"$f":"IF(C221=0,0,CONCATENATE('TIME TABLE'!$C$11,'TIME TABLE'!$D$11,'TIME TABLE'!$E$11))","v":0},{"$f":"IF(C221=0,0,'TIME TABLE'!$C$3)","v":0}]
[null,null,{"$f":"'TIME TABLE'!$F$12","v":0},null,null,{"$f":"IF(C222=0,0,'TIME TABLE'!$B$12)","v":"00:00:00"},{"$f":"IF(C222=0,0,CONCATENATE('TIME TABLE'!$C$12,'TIME TABLE'!$D$12,'TIME TABLE'!$E$12))","v":0},{"$f":"IF(C222=0,0,'TIME TABLE'!$C$3)","v":0}]
[null,null,{"$f":"'TIME TABLE'!$F$13","v":0},null,null,{"$f":"IF(C223=0,0,'TIME TABLE'!$B$13)","v":"00:00:00"},{"$f":"IF(C223=0,0,CONCATENATE('TIME TABLE'!$C$13,'TIME TABLE'!$D$13,'TIME TABLE'!$E$13))","v":0},{"$f":"IF(C223=0,0,'TIME TABLE'!$C$3)","v":0}]
[null,null,{"$f":"'TIME TABLE'!$F$14","v":0},null,null,{"$f":"IF(C224=0,0,'TIME TABLE'!$B$14)","v":"00:00:00"},{"$f":"IF(C224=0,0,CONCATENATE('TIME TABLE'!$C$14,'TIME TABLE'!$D$14,'TIME TABLE'!$E$14))","v":0},{"$f":"IF(C224=0,0,'TIME TABLE'!$C$3)","v":0}]
[null,null,"Instructions"]
[null,null,1,"Check the exam time table carefully."]
[null,null,2,"Students must bring the 'Admit Card' and show it to the invigilator(s) on duty and should preserve it for future requirements."]
[null,null,3,"Mobile Phone, Calculator, Digital Watch or any Electronic Device is NOT ALLOWED."]
[null,null,4,"Arrive at the School at least 15 minutes before the start examination."]
[null,null,5,"Student is barred from entering the examination hall 15 minutes after the written examination starts."]
[null,null,6,"Ensure that you use the washroom before arriving for your exam as you will not be permitted to leave during the first hour."]
[null,null,7,"Normally, you are required to answer questionsusing blue or black in . Make sure you bring some spare pens with you."]
[null,null,8,"Keep your eyes on your own paper. Remember, copying is cheating!"]
[null,null,9,"You must remain silent until after you have exited the school building."]
[]
[{"$f":"A202+1","v":8}]
[{"$nulls":4},{"$f":"MASTER!$E$11","v":"Govt. Sr. Secondary School Raimalwada"}]
[{"$nulls":4},{"$f":"MASTER!$E$14","v":"P.S.-Bapini (Jodhpur)"}]
[null,{"$f":"CONCATENATE(C240,'TIME TABLE'!$C$5,'ADMIT CARD'!$C241,$F241,'ADMIT CARD'!$G241,'TIME TABLE'!$E$5)","v":"ADMIT CARD(Roll Number●→0)"},{"$f":"CONCATENATE('TIME TABLE'!$B$2,'TIME TABLE'!$F$2)","v":"HALF YEARLY EXAM:2021-22"}]
[null,null,"ADMIT CARD",{"$nulls":6}," "]
[null,null,"Roll Number",null,null,"●→",{"$f":"VLOOKUP(A236,'STUDENT DETAIL'!$C$8:$I$107,3)","v":0},null,"Seal and Signature of Head of Institution"]
[null,null,"Student's Name",null,null,"●→",{"$f":"VLOOKUP(A236,'STUDENT DETAIL'!$C$8:$I$107,4)","v":0}]
[null,null,"Father's Name",null,null,"●→",{"$f":"VLOOKUP(A236,'STUDENT DETAIL'!$C$8:$I$107,5)","v":0}]
[null,null,"Mother's Name ",null,null,"●→",{"$f":"VLOOKUP(A236,'STUDENT DETAIL'!$C$8:$I$107,6)","v":0}]
[null,null,"Class & Section",null,null,"●→",{"$f":"IF(G241=0,0,CONCATENATE('STUDENT DETAIL'!$E$4,'STUDENT DETAIL'!$H$4))","v":0}]
[null,null,"Date Of Birth",null,null,"●→",{"$f":"VLOOKUP(A236,'STUDENT DETAIL'!$C$8:$I$107,7)","v":"00:00:00"}]
[null,null,"Time Table"]
[null,null,"Subject",null,null,"Date (Day)",null,"Time"]
[null,null,{"$f":"'TIME TABLE'!$F$5","v":"Hindi"},null,null,{"$f":"IF(C249=0,0,'TIME TABLE'!$B$5)","v":"2022-03-31"},{"$f":"IF(C249=0,0,CONCATENATE('TIME TABLE'!$C$5,'TIME TABLE'!$D$5,'TIME TABLE'!$E$5))","v":"(Thursday)"},{"$f":"IF(C249=0,0,'TIME TABLE'!$C$3)","v":"09:00 AM to 11:45 AM"}]
[null,null,{"$f":"'TIME TABLE'!$F$6","v":"English"},null,null,{"$f":"IF(C250=0,0,'TIME TABLE'!$B$6)","v":"2022-04-01"},{"$f":"IF(C250=0,0,CONCATENATE('TIME TABLE'!$C$6,'TIME TABLE'!$D$6,'TIME TABLE'!$E$6))","v":"(Friday)"},{"$f":"IF(C250=0,0,'TIME TABLE'!$C$3)","v":"09:00 AM to 11:45 AM"}]
[null,null,{"$f":"'TIME TABLE'!$F$7","v":"Science"},null,null,{"$f":"IF(C251=0,0,'TIME TABLE'!$B$7)","v":"2022-04-02"},{"$f":"IF(C251=0,0,CONCATENATE('TIME TABLE'!$C$7,'TIME TABLE'!$D$7,'TIME TABLE'!$E$7))","v":"(Saturday)"},{"$f":"IF(C251=0,0,'TIME TABLE'!$C$3)","v":"09:00 AM to 11:45 AM"}]
[null,null,{"$f":"'TIME TABLE'!$F$8","v":"Mathematics"},null,null,{"$f":"IF(C252=0,0,'TIME TABLE'!$B$8)","v":"2022-04-03"},{"$f":"IF(C252=0,0,CONCATENATE('TIME TABLE'!$C$8,'TIME TABLE'!$D$8,'TIME TABLE'!$E$8))","v":"(Sunday)"},{"$f":"IF(C252=0,0,'TIME TABLE'!$C$3)","v":"09:00 AM to 11:45 AM"}]
[null,null,{"$f":"'TIME TABLE'!$F$9","v":"Social Study"},null,null,{"$f":"IF(C253=0,0,'TIME TABLE'!$B$9)","v":"2022-04-04"},{"$f":"IF(C253=0,0,CONCATENATE('TIME TABLE'!$C$9,'TIME TABLE'!$D$9,'TIME TABLE'!$E$9))","v":"(Monday)"},{"$f":"IF(C253=0,0,'TIME TABLE'!$C$3)","v":"09:00 AM to 11:45 AM"}]
[null,null,{"$f":"'TIME TABLE'!$F$10","v":"Sanskrit"},null,null,{"$f":"IF(C254=0,0,'TIME TABLE'!$B$10)","v":"2022-04-05"},{"$f":"IF(C254=0,0,CONCATENATE('TIME TABLE'!$C$10,'TIME TABLE'!$D$10,'TIME TABLE'!$E$10))","v":"(Tuesday)"},{"$f":"IF(C254=0,0,'TIME TABLE'!$C$3)","v":"09:00 AM to 11:45 AM"}]
[null,null,{"$f":"'TIME TABLE'!$F$11","v":0},null,null,{"$f":"IF(C255=0,0,'TIME TABLE'!$B$11)","v":"00:00:00"},{"$f":"IF(C255=0,0,CONCATENATE('TIME TABLE'!$C$11,'TIME TABLE'!$D$11,'TIME TABLE'!$E$11))","v":0},{"$f":"IF(C255=0,0,'TIME TABLE'!$C$3)","v":0}]
[null,null,{"$f":"'TIME TABLE'!$F$12","v":0},null,null,{"$f":"IF(C256=0,0,'TIME TABLE'!$B$12)","v":"00:00:00"},{"$f":"IF(C256=0,0,CONCATENATE('TIME TABLE'!$C$12,'TIME TABLE'!$D$12,'TIME TABLE'!$E$12))","v":0},{"$f":"IF(C256=0,0,'TIME TABLE'!$C$3)","v":0}]
[null,null,{"$f":"'TIME TABLE'!$F$13","v":0},null,null,{"$f":"IF(C257=0,0,'TIME TABLE'!$B$13)","v":"00:00:00"},{"$f":"IF(C257=0,0,CONCATENATE('TIME TABLE'!$C$13,'TIME TABLE'!$D$13,'TIME TABLE'!$E$13))","v":0},{"$f":"IF(C257=0,0,'TIME TABLE'!$C$3)","v":0}]
[null,null,{"$f":"'TIME TABLE'!$F$14","v":0},null,null,{"$f":"IF(C258=0,0,'TIME TABLE'!$B$14)","v":"00:00:00"},{"$f":"IF(C258=0,0,CONCATENATE('TIME TABLE'!$C$14,'TIME TABLE'!$D$14,'TIME TABLE'!$E$14))","v":0},{"$f":"IF(C258=0,0,'TIME TABLE'!$C$3)","v":0}]
[null,null,"Instructions"]
[null,null,1,"Check the exam time table carefully."]
[null,null,2,"Students must bring the 'Admit Card' and show it to the invigilator(s) on duty and should preserve it for future requirements."]
[null,null,3,"Mobile Phone, Calculator, Digital Watch or any Electronic Device is NOT ALLOWED."]
[null,null,4,"Arrive at the School at least 15 minutes before the start examination."]
[null,null,5,"Student is barred from entering the examination hall 15 minutes after the written examination starts."]
[null,null,6,"Ensure that you use the washroom before arriving for your exam as you will not be permitted to leave during the first hour."]
[null,null,7,"Normally, you are required to answer questionsusing blue or black in . Make sure you bring some spare pens with you."]
[null,null,8,"Keep your eyes on your own paper. Remember, copying is cheating!"]
[null,null,9,"You must remain silent until after you have exited the school building."]
[{"$f":"A236+1","v":9}]
[{"$nulls":4},{"$f":"MASTER!$E$11","v":"Govt. Sr. Secondary School Raimalwada"}]
[{"$nulls":4},{"$f":"MASTER!$E$14","v":"P.S.-Bapini (Jodhpur)"}]
[null,{"$f":"CONCATENATE(C273,'TIME TABLE'!$C$5,'ADMIT CARD'!$C274,$F274,'ADMIT CARD'!$G274,'TIME TABLE'!$E$5)","v":"ADMIT CARD(Roll Number●→0)"},{"$f":"CONCATENATE('TIME TABLE'!$B$2,'TIME TABLE'!$F$2)","v":"HALF YEARLY EXAM:2021-22"}]
[null,null,"ADMIT CARD",{"$nulls":6}," "]
[null,null,"Roll Number",null,null,"●→",{"$f":"VLOOKUP(A269,'STUDENT DETAIL'!$C$8:$I$107,3)","v":0},null,"Seal and Signature of Head of Institution"]
[null,null,"Student's Name",null,null,"●→",{"$f":"VLOOKUP(A269,'STUDENT DETAIL'!$C$8:$I$107,4)","v":0}]
[null,null,"Father's Name",null,null,"●→",{"$f":"VLOOKUP(A269,'STUDENT DETAIL'!$C$8:$I$107,5)","v":0}]
[null,null,"Mother's Name ",null,null,"●→",{"$f":"VLOOKUP(A269,'STUDENT DETAIL'!$C$8:$I$107,6)","v":0}]
[null,null,"Class & Section",null,null,"●→",{"$f":"IF(G274=0,0,CONCATENATE('STUDENT DETAIL'!$E$4,'STUDENT DETAIL'!$H$4))","v":0}]
[null,null,"Date Of Birth",null,null,"●→",{"$f":"VLOOKUP(A269,'STUDENT DETAIL'!$C$8:$I$107,7)","v":"00:00:00"}]
[null,null,"Time Table"]
[null,null,"Subject",null,null,"Date (Day)",null,"Time"]
[null,null,{"$f":"'TIME TABLE'!$F$5","v":"Hindi"},null,null,{"$f":"IF(C282=0,0,'TIME TABLE'!$B$5)","v":"2022-03-31"},{"$f":"IF(C282=0,0,CONCATENATE('TIME TABLE'!$C$5,'TIME TABLE'!$D$5,'TIME TABLE'!$E$5))","v":"(Thursday)"},{"$f":"IF(C282=0,0,'TIME TABLE'!$C$3)","v":"09:00 AM to 11:45 AM"}]
[null,null,{"$f":"'TIME TABLE'!$F$6","v":"English"},null,null,{"$f":"IF(C283=0,0,'TIME TABLE'!$B$6)","v":"2022-04-01"},{"$f":"IF(C283=0,0,CONCATENATE('TIME TABLE'!$C$6,'TIME TABLE'!$D$6,'TIME TABLE'!$E$6))","v":"(Friday)"},{"$f":"IF(C283=0,0,'TIME TABLE'!$C$3)","v":"09:00 AM to 11:45 AM"}]
[null,null,{"$f":"'TIME TABLE'!$F$7","v":"Science"},null,null,{"$f":"IF(C284=0,0,'TIME TABLE'!$B$7)","v":"2022-04-02"},{"$f":"IF(C284=0,0,CONCATENATE('TIME TABLE'!$C$7,'TIME TABLE'!$D$7,'TIME TABLE'!$E$7))","v":"(Saturday)"},{"$f":"IF(C284=0,0,'TIME TABLE'!$C$3)","v":"09:00 AM to 11:45 AM"}]
[null,null,{"$f":"'TIME TABLE'!$F$8","v":"Mathematics"},null,null,{"$f":"IF(C285=0,0,'TIME TABLE'!$B$8)","v":"2022-04-03"},{"$f":"IF(C285=0,0,CONCATENATE('TIME TABLE'!$C$8,'TIME TABLE'!$D$8,'TIME TABLE'!$E$8))","v":"(Sunday)"},{"$f":"IF(C285=0,0,'TIME TABLE'!$C$3)","v":"09:00 AM to 11:45 AM"}]
[null,null,{"$f":"'TIME TABLE'!$F$9","v":"Social Study"},null,null,{"$f":"IF(C286=0,0,'TIME TABLE'!$B$9)","v":"2022-04-04"},{"$f":"IF(C286=0,0,CONCATENATE('TIME TABLE'!$C$9,'TIME TABLE'!$D$9,'TIME TABLE'!$E$9))","v":"(Monday)"},{"$f":"IF(C286=0,0,'TIME TABLE'!$C$3)","v":"09:00 AM to 11:45 AM"}]
[null,null,{"$f":"'TIME TABLE'!$F$10","v":"Sanskrit"},null,null,{"$f":"IF(C287=0,0,'TIME TABLE'!$B$10)","v":"2022-04-05"},{"$f":"IF(C287=0,0,CONCATENATE('TIME TABLE'!$C$10,'TIME TABLE'!$D$10,'TIME TABLE'!$E$10))","v":"(Tuesday)"},{"$f":"IF(C287=0,0,'TIME TABLE'!$C$3)","v":"09:00 AM to 11:45 AM"}]
[null,null,{"$f":"'TIME TABLE'!$F$11","v":0},null,null,{"$f":"IF(C288=0,0,'TIME TABLE'!$B$11)","v":"00:00:00"},{"$f":"IF(C288=0,0,CONCATENATE('TIME TABLE'!$C$11,'TIME TABLE'!$D$11,'TIME TABLE'!$E$11))","v":0},{"$f":"IF(C288=0,0,'TIME TABLE'!$C$3)","v":0}]
[null,null,{"$f":"'TIME TABLE'!$F$12","v":0},null,null,{"$f":"IF(C289=0,0,'TIME TABLE'!$B$12)","v":"00:00:00"},{"$f":"IF(C289=0,0,CONCATENATE('TIME TABLE'!$C$12,'TIME TABLE'!$D$12,'TIME TABLE'!$E$12))","v":0},{"$f":"IF(C289=0,0,'TIME TABLE'!$C$3)","v":0}]
[null,null,{"$f":"'TIME TABLE'!$F$13","v":0},null,null,{"$f":"IF(C290=0,0,'TIME TABLE'!$B$13)","v":"00:00:00"},{"$f":"IF(C290=0,0,CONCATENATE('TIME TABLE'!$C$13,'TIME TABLE'!$D$13,'TIME TABLE'!$E$13))","v":0},{"$f":"IF(C290=0,0,'TIME TABLE'!$C$3)","v":0}]
[null,null,{"$f":"'TIME TABLE'!$F$14","v":0},null,null,{"$f":"IF(C291=0,0,'TIME TABLE'!$B$14)","v":"00:00:00"},{"$f":"IF(C291=0,0,CONCATENATE('TIME TABLE'!$C$14,'TIME TABLE'!$D$14,'TIME TABLE'!$E$14))","v":0},{"$f":"IF(C291=0,0,'TIME TABLE'!$C$3)","v":0}]
[null,null,"Instructions"]
[null,null,1,"Check the exam time table carefully."]
[null,null,2,"Students must bring the 'Admit Card' and show it to the invigilator(s) on duty and should preserve it for future requirements."]
[null,null,3,"Mobile Phone, Calculator, Digital Watch or any Electronic Device is NOT ALLOWED."]
[null,null,4,"Arrive at the School at least 15 minutes before the start examination."]
[null,null,5,"Student is barred from entering the examination hall 15 minutes after the written examination starts."]
[null,null,6,"Ensure that you use the washroom before arriving for your exam as you will not be permitted to leave during the first hour."]
[null,null,7,"Normally, you are required to answer questionsusing blue or black in . Make sure you bring some spare pens with you."]
[null,null,8,"Keep your eyes on your own paper. Remember, copying is cheating!"]
[null,null,9,"You must remain silent until after you have exited the school building."]
[]
[{"$f":"A269+1","v":10}]
[{"$nulls":4},{"$f":"MASTER!$E$11","v":"Govt. Sr. Secondary School Raimalwada"}]
[{"$nulls":4},{"$f":"MASTER!$E$14","v":"P.S.-Bapini (Jodhpur)"}]
[null,{"$f":"CONCATENATE(C307,'TIME TABLE'!$C$5,'ADMIT CARD'!$C308,$F308,'ADMIT CARD'!$G308,'TIME TABLE'!$E$5)","v":"ADMIT CARD(Roll Number●→0)"},{"$f":"CONCATENATE('TIME TABLE'!$B$2,'TIME TABLE'!$F$2)","v":"HALF YEARLY EXAM:2021-22"}]
[null,null,"ADMIT CARD",{"$nulls":6}," "]
[null,null,"Roll Number",null,null,"●→",{"$f":"VLOOKUP(A303,'STUDENT DETAIL'!$C$8:$I$107,3)","v":0},null,"Seal and Signature of Head of Institution"]
[null,null,"Student's Name",null,null,"●→",{"$f":"VLOOKUP(A303,'STUDENT DETAIL'!$C$8:$I$107,4)","v":0}]
[null,null,"Father's Name",null,null,"●→",{"$f":"VLOOKUP(A303,'STUDENT DETAIL'!$C$8:$I$107,5)","v":0}]
[null,null,"Mother's Name ",null,null,"●→",{"$f":"VLOOKUP(A303,'STUDENT DETAIL'!$C$8:$I$107,6)","v":0}]
[null,null,"Class & Section",null,null,"●→",{"$f":"IF(G308=0,0,CONCATENATE('STUDENT DETAIL'!$E$4,'STUDENT DETAIL'!$H$4))","v":0}]
[null,null,"Date Of Birth",null,null,"●→",{"$f":"VLOOKUP(A303,'STUDENT DETAIL'!$C$8:$I$107,7)","v":"00:00:00"}]
[null,null,"Time Table"]
[null,null,"Subject",null,null,"Date (Day)",null,"Time"]
[null,null,{"$f":"'TIME TABLE'!$F$5","v":"Hindi"},null,null,{"$f":"IF(C316=0,0,'TIME TABLE'!$B$5)","v":"2022-03-31"},{"$f":"IF(C316=0,0,CONCATENATE('TIME TABLE'!$C$5,'TIME TABLE'!$D$5,'TIME TABLE'!$E$5))","v":"(Thursday)"},{"$f":"IF(C316=0,0,'TIME TABLE'!$C$3)","v":"09:00 AM to 11:45 AM"}]
[null,null,{"$f":"'TIME TABLE'!$F$6","v":"English"},null,null,{"$f":"IF(C317=0,0,'TIME TABLE'!$B$6)","v":"2022-04-01"},{"$f":"IF(C317=0,0,CONCATENATE('TIME TABLE'!$C$6,'TIME TABLE'!$D$6,'TIME TABLE'!$E$6))","v":"(Friday)"},{"$f":"IF(C317=0,0,'TIME TABLE'!$C$3)","v":"09:00 AM to 11:45 AM"}]
[null,null,{"$f":"'TIME TABLE'!$F$7","v":"Science"},null,null,{"$f":"IF(C318=0,0,'TIME TABLE'!$B$7)","v":"2022-04-02"},{"$f":"IF(C318=0,0,CONCATENATE('TIME TABLE'!$C$7,'TIME TABLE'!$D$7,'TIME TABLE'!$E$7))","v":"(Saturday)"},{"$f":"IF(C318=0,0,'TIME TABLE'!$C$3)","v":"09:00 AM to 11:45 AM"}]
[null,null,{"$f":"'TIME TABLE'!$F$8","v":"Mathematics"},null,null,{"$f":"IF(C319=0,0,'TIME TABLE'!$B$8)","v":"2022-04-03"},{"$f":"IF(C319=0,0,CONCATENATE('TIME TABLE'!$C$8,'TIME TABLE'!$D$8,'TIME TABLE'!$E$8))","v":"(Sunday)"},{"$f":"IF(C319=0,0,'TIME TABLE'!$C$3)","v":"09:00 AM to 11:45 AM"}]
[null,null,{"$f":"'TIME TABLE'!$F$9","v":"Social Study"},null,null,{"$f":"IF(C320=0,0,'TIME TABLE'!$B$9)","v":"2022-04-04"},{"$f":"IF(C320=0,0,CONCATENATE('TIME TABLE'!$C$9,'TIME TABLE'!$D$9,'TIME TABLE'!$E$9))","v":"(Monday)"},{"$f":"IF(C320=0,0,'TIME TABLE'!$C$3)","v":"09:00 AM to 11:45 AM"}]
[null,null,{"$f":"'TIME TABLE'!$F$10","v":"Sanskrit"},null,null,{"$f":"IF(C321=0,0,'TIME TABLE'!$B$10)","v":"2022-04-05"},{"$f":"IF(C321=0,0,CONCATENATE('TIME TABLE'!$C$10,'TIME TABLE'!$D$10,'TIME TABLE'!$E$10))","v":"(Tuesday)"},{"$f":"IF(C321=0,0,'TIME TABLE'!$C$3)","v":"09:00 AM to 11:45 AM"}]
[null,null,{"$f":"'TIME TABLE'!$F$11","v":0},null,null,{"$f":"IF(C322=0,0,'TIME TABLE'!$B$11)","v":"00:00:00"},{"$f":"IF(C322=0,0,CONCATENATE('TIME TABLE'!$C$11,'TIME TABLE'!$D$11,'TIME TABLE'!$E$11))","v":0},{"$f":"IF(C322=0,0,'TIME TABLE'!$C$3)","v":0}]
[null,null,{"$f":"'TIME TABLE'!$F$12","v":0},null,null,{"$f":"IF(C323=0,0,'TIME TABLE'!$B$12)","v":"00:00:00"},{"$f":"IF(C323=0,0,CONCATENATE('TIME TABLE'!$C$12,'TIME TABLE'!$D$12,'TIME TABLE'!$E$12))","v":0},{"$f":"IF(C323=0,0,'TIME TABLE'!$C$3)","v":0}]
[null,null,{"$f":"'TIME TABLE'!$F$13","v":0},null,null,{"$f":"IF(C324=0,0,'TIME TABLE'!$B$13)","v":"00:00:00"},{"$f":"IF(C324=0,0,CONCATENATE('TIME TABLE'!$C$13,'TIME TABLE'!$D$13,'TIME TABLE'!$E$13))","v":0},{"$f":"IF(C324=0,0,'TIME TABLE'!$C$3)","v":0}]
[null,null,{"$f":"'TIME TABLE'!$F$14","v":0},null,null,{"$f":"IF(C325=0,0,'TIME TABLE'!$B$14)","v":"00:00:00"},{"$f":"IF(C325=0,0,CONCATENATE('TIME TABLE'!$C$14,'TIME TABLE'!$D$14,'TIME TABLE'!$E$14))","v":0},{"$f":"IF(C325=0,0,'TIME TABLE'!$C$3)","v":0}]
[null,null,"Instructions"]
[null,null,1,"Check the exam time table carefully."]
[null,null,2,"Students must bring the 'Admit Card' and show it to the invigilator(s) on duty and should preserve it for future requirements."]
[null,null,3,"Mobile Phone, Calculator, Digital Watch or any Electronic Device is NOT ALLOWED."]
[null,null,4,"Arrive at the School at least 15 minutes before the start examination."]
[null,null,5,"Student is barred from entering the examination hall 15 minutes after the written examination starts."]
[null,null,6,"Ensure that you use the washroom before arriving for your exam as you will not be permitted to leave during the first hour."]
[null,null,7,"Normally, you are required to answer questionsusing blue or black in . Make sure you bring some spare pens with you."]
[null,null,8,"Keep your eyes on your own paper. Remember, copying is cheating!"]
[null,null,9,"You must remain silent until after you have exited the school building."]
[{"$f":"A303+1","v":11}]
[{"$nulls":4},{"$f":"MASTER!$E$11","v":"Govt. Sr. Secondary School Raimalwada"}]
[{"$nulls":4},{"$f":"MASTER!$E$14","v":"P.S.-Bapini (Jodhpur)"}]
[null,{"$f":"CONCATENATE(C340,'TIME TABLE'!$C$5,'ADMIT CARD'!$C341,$F341,'ADMIT CARD'!$G341,'TIME TABLE'!$E$5)","v":"ADMIT CARD(Roll Number●→0)"},{"$f":"CONCATENATE('TIME TABLE'!$B$2,'TIME TABLE'!$F$2)","v":"HALF YEARLY EXAM:2021-22"}]
[null,null,"ADMIT CARD",{"$nulls":6}," "]
[null,null,"Roll Number",null,null,"●→",{"$f":"VLOOKUP(A336,'STUDENT DETAIL'!$C$8:$I$107,3)","v":0},null,"Seal and Signature of Head of Institution"]
[null,null,"Student's Name",null,null,"●→",{"$f":"VLOOKUP(A336,'STUDENT DETAIL'!$C$8:$I$107,4)","v":0}]
[null,null,"Father's Name",null,null,"●→",{"$f":"VLOOKUP(A336,'STUDENT DETAIL'!$C$8:$I$107,5)","v":0}]
[null,null,"Mother's Name ",null,null,"●→",{"$f":"VLOOKUP(A336,'STUDENT DETAIL'!$C$8:$I$107,6)","v":0}]
[null,null,"Class & Section",null,null,"●→",{"$f":"IF(G341=0,0,CONCATENATE('STUDENT DETAIL'!$E$4,'STUDENT DETAIL'!$H$4))","v":0}]
[null,null,"Date Of Birth",null,null,"●→",{"$f":"VLOOKUP(A336,'STUDENT DETAIL'!$C$8:$I$107,7)","v":"00:00:00"}]
[null,null,"Time Table"]
[null,null,"Subject",null,null,"Date (Day)",null,"Time"]
[null,null,{"$f":"'TIME TABLE'!$F$5","v":"Hindi"},null,null,{"$f":"IF(C349=0,0,'TIME TABLE'!$B$5)","v":"2022-03-31"},{"$f":"IF(C349=0,0,CONCATENATE('TIME TABLE'!$C$5,'TIME TABLE'!$D$5,'TIME TABLE'!$E$5))","v":"(Thursday)"},{"$f":"IF(C349=0,0,'TIME TABLE'!$C$3)","v":"09:00 AM to 11:45 AM"}]
[null,null,{"$f":"'TIME TABLE'!$F$6","v":"English"},null,null,{"$f":"IF(C350=0,0,'TIME TABLE'!$B$6)","v":"2022-04-01"},{"$f":"IF(C350=0,0,CONCATENATE('TIME TABLE'!$C$6,'TIME TABLE'!$D$6,'TIME TABLE'!$E$6))","v":"(Friday)"},{"$f":"IF(C350=0,0,'TIME TABLE'!$C$3)","v":"09:00 AM to 11:45 AM"}]
[null,null,{"$f":"'TIME TABLE'!$F$7","v":"Science"},null,null,{"$f":"IF(C351=0,0,'TIME TABLE'!$B$7)","v":"2022-04-02"},{"$f":"IF(C351=0,0,CONCATENATE('TIME TABLE'!$C$7,'TIME TABLE'!$D$7,'TIME TABLE'!$E$7))","v":"(Saturday)"},{"$f":"IF(C351=0,0,'TIME TABLE'!$C$3)","v":"09:00 AM to 11:45 AM"}]
[null,null,{"$f":"'TIME TABLE'!$F$8","v":"Mathematics"},null,null,{"$f":"IF(C352=0,0,'TIME TABLE'!$B$8)","v":"2022-04-03"},{"$f":"IF(C352=0,0,CONCATENATE('TIME TABLE'!$C$8,'TIME TABLE'!$D$8,'TIME TABLE'!$E$8))","v":"(Sunday)"},{"$f":"IF(C352=0,0,'TIME TABLE'!$C$3)","v":"09:00 AM to 11:45 AM"}]
[null,null,{"$f":"'TIME TABLE'!$F$9","v":"Social Study"},null,null,{"$f":"IF(C353=0,0,'TIME TABLE'!$B$9)","v":"2022-04-04"},{"$f":"IF(C353=0,0,CONCATENATE('TIME TABLE'!$C$9,'TIME TABLE'!$D$9,'TIME TABLE'!$E$9))","v":"(Monday)"},{"$f":"IF(C353=0,0,'TIME TABLE'!$C$3)","v":"09:00 AM to 11:45 AM"}]
[null,null,{"$f":"'TIME TABLE'!$F$10","v":"Sanskrit"},null,null,{"$f":"IF(C354=0,0,'TIME TABLE'!$B$10)","v":"2022-04-05"},{"$f":"IF(C354=0,0,CONCATENATE('TIME TABLE'!$C$10,'TIME TABLE'!$D$10,'TIME TABLE'!$E$10))","v":"(Tuesday)"},{"$f":"IF(C354=0,0,'TIME TABLE'!$C$3)","v":"09:00 AM to 11:45 AM"}]
[null,null,{"$f":"'TIME TABLE'!$F$11","v":0},null,null,{"$f":"IF(C355=0,0,'TIME TABLE'!$B$11)","v":"00:00:00"},{"$f":"IF(C355=0,0,CONCATENATE('TIME TABLE'!$C$11,'TIME TABLE'!$D$11,'TIME TABLE'!$E$11))","v":0},{"$f":"IF(C355=0,0,'TIME TABLE'!$C$3)","v":0}]
[null,null,{"$f":"'TIME TABLE'!$F$12","v":0},null,null,{"$f":"IF(C356=0,0,'TIME TABLE'!$B$12)","v":"00:00:00"},{"$f":"IF(C356=0,0,CONCATENATE('TIME TABLE'!$C$12,'TIME TABLE'!$D$12,'TIME TABLE'!$E$12))","v":0},{"$f":"IF(C356=0,0,'TIME TABLE'!$C$3)","v":0}]
[null,null,{"$f":"'TIME TABLE'!$F$13","v":0},null,null,{"$f":"IF(C357=0,0,'TIME TABLE'!$B$13)","v":"00:00:00"},{"$f":"IF(C357=0,0,CONCATENATE('TIME TABLE'!$C$13,'TIME TABLE'!$D$13,'TIME TABLE'!$E$13))","v":0},{"$f":"IF(C357=0,0,'TIME TABLE'!$C$3)","v":0}]
[null,null,{"$f":"'TIME TABLE'!$F$14","v":0},null,null,{"$f":"IF(C358=0,0,'TIME TABLE'!$B$14)","v":"00:00:00"},{"$f":"IF(C358=0,0,CONCATENATE('TIME TABLE'!$C$14,'TIME TABLE'!$D$14,'TIME TABLE'!$E$14))","v":0},{"$f":"IF(C358=0,0,'TIME TABLE'!$C$3)","v":0}]
[null,null,"Instructions"]
[null,null,1,"Check the exam time table carefully."]
[null,null,2,"Students must bring the 'Admit Card' and show it to the invigilator(s) on duty and should preserve it for future requirements."]
[null,null,3,"Mobile Phone, Calculator, Digital Watch or any Electronic Device is NOT ALLOWED."]
[null,null,4,"Arrive at the School at least 15 minutes before the start examination."]
[null,null,5,"Student is barred from entering the examination hall 15 minutes after the written examination starts."]
[null,null,6,"Ensure that you use the washroom before arriving for your exam as you will not be permitted to leave during the first hour."]
[null,null,7,"Normally, you are required to answer questionsusing blue or black in . Make sure you bring some spare pens with you."]
[null,null,8,"Keep your eyes on your own paper. Remember, copying is cheating!"]
[null,null,9,"You must remain silent until after you have exited the school building."]
[]
[{"$f":"A336+1","v":12}]
[{"$nulls":4},{"$f":"MASTER!$E$11","v":"Govt. Sr. Secondary School Raimalwada"}]
[{"$nulls":4},{"$f":"MASTER!$E$14","v":"P.S.-Bapini (Jodhpur)"}]
[null,{"$f":"CONCATENATE(C374,'TIME TABLE'!$C$5,'ADMIT CARD'!$C375,$F375,'ADMIT CARD'!$G375,'TIME TABLE'!$E$5)","v":"ADMIT CARD(Roll Number●→0)"},{"$f":"CONCATENATE('TIME TABLE'!$B$2,'TIME TABLE'!$F$2)","v":"HALF YEARLY EXAM:2021-22"}]
[null,null,"ADMIT CARD",{"$nulls":6}," "]
[null,null,"Roll Number",null,null,"●→",{"$f":"VLOOKUP(A370,'STUDENT DETAIL'!$C$8:$I$107,3)","v":0},null,"Seal and Signature of Head of Institution"]
[null,null,"Student's Name",null,null,"●→",{"$f":"VLOOKUP(A370,'STUDENT DETAIL'!$C$8:$I$107,4)","v":0}]
[null,null,"Father's Name",null,null,"●→",{"$f":"VLOOKUP(A370,'STUDENT DETAIL'!$C$8:$I$107,5)","v":0}]
[null,null,"Mother's Name ",null,null,"●→",{"$f":"VLOOKUP(A370,'STUDENT DETAIL'!$C$8:$I$107,6)","v":0}]
[null,null,"Class & Section",null,null,"●→",{"$f":"IF(G375=0,0,CONCATENATE('STUDENT DETAIL'!$E$4,'STUDENT DETAIL'!$H$4))","v":0}]
[null,null,"Date Of Birth",null,null,"●→",{"$f":"VLOOKUP(A370,'STUDENT DETAIL'!$C$8:$I$107,7)","v":"00:00:00"}]
[null,null,"Time Table"]
[null,null,"Subject",null,null,"Date (Day)",null,"Time"]
[null,null,{"$f":"'TIME TABLE'!$F$5","v":"Hindi"},null,null,{"$f":"IF(C383=0,0,'TIME TABLE'!$B$5)","v":"2022-03-31"},{"$f":"IF(C383=0,0,CONCATENATE('TIME TABLE'!$C$5,'TIME TABLE'!$D$5,'TIME TABLE'!$E$5))","v":"(Thursday)"},{"$f":"IF(C383=0,0,'TIME TABLE'!$C$3)","v":"09:00 AM to 11:45 AM"}]
[null,null,{"$f":"'TIME TABLE'!$F$6","v":"English"},null,null,{"$f":"IF(C384=0,0,'TIME TABLE'!$B$6)","v":"2022-04-01"},{"$f":"IF(C384=0,0,CONCATENATE('TIME TABLE'!$C$6,'TIME TABLE'!$D$6,'TIME TABLE'!$E$6))","v":"(Friday)"},{"$f":"IF(C384=0,0,'TIME TABLE'!$C$3)","v":"09:00 AM to 11:45 AM"}]
[null,null,{"$f":"'TIME TABLE'!$F$7","v":"Science"},null,null,{"$f":"IF(C385=0,0,'TIME TABLE'!$B$7)","v":"2022-04-02"},{"$f":"IF(C385=0,0,CONCATENATE('TIME TABLE'!$C$7,'TIME TABLE'!$D$7,'TIME TABLE'!$E$7))","v":"(Saturday)"},{"$f":"IF(C385=0,0,'TIME TABLE'!$C$3)","v":"09:00 AM to 11:45 AM"}]
[null,null,{"$f":"'TIME TABLE'!$F$8","v":"Mathematics"},null,null,{"$f":"IF(C386=0,0,'TIME TABLE'!$B$8)","v":"2022-04-03"},{"$f":"IF(C386=0,0,CONCATENATE('TIME TABLE'!$C$8,'TIME TABLE'!$D$8,'TIME TABLE'!$E$8))","v":"(Sunday)"},{"$f":"IF(C386=0,0,'TIME TABLE'!$C$3)","v":"09:00 AM to 11:45 AM"}]
[null,null,{"$f":"'TIME TABLE'!$F$9","v":"Social Study"},null,null,{"$f":"IF(C387=0,0,'TIME TABLE'!$B$9)","v":"2022-04-04"},{"$f":"IF(C387=0,0,CONCATENATE('TIME TABLE'!$C$9,'TIME TABLE'!$D$9,'TIME TABLE'!$E$9))","v":"(Monday)"},{"$f":"IF(C387=0,0,'TIME TABLE'!$C$3)","v":"09:00 AM to 11:45 AM"}]
[null,null,{"$f":"'TIME TABLE'!$F$10","v":"Sanskrit"},null,null,{"$f":"IF(C388=0,0,'TIME TABLE'!$B$10)","v":"2022-04-05"},{"$f":"IF(C388=0,0,CONCATENATE('TIME TABLE'!$C$10,'TIME TABLE'!$D$10,'TIME TABLE'!$E$10))","v":"(Tuesday)"},{"$f":"IF(C388=0,0,'TIME TABLE'!$C$3)","v":"09:00 AM to 11:45 AM"}]
[null,null,{"$f":"'TIME TABLE'!$F$11","v":0},null,null,{"$f":"IF(C389=0,0,'TIME TABLE'!$B$11)","v":"00:00:00"},{"$f":"IF(C389=0,0,CONCATENATE('TIME TABLE'!$C$11,'TIME TABLE'!$D$11,'TIME TABLE'!$E$11))","v":0},{"$f":"IF(C389=0,0,'TIME TABLE'!$C$3)","v":0}]
[null,null,{"$f":"'TIME TABLE'!$F$12","v":0},null,null,{"$f":"IF(C390=0,0,'TIME TABLE'!$B$12)","v":"00:00:00"},{"$f":"IF(C390=0,0,CONCATENATE('TIME TABLE'!$C$12,'TIME TABLE'!$D$12,'TIME TABLE'!$E$12))","v":0},{"$f":"IF(C390=0,0,'TIME TABLE'!$C$3)","v":0}]
[null,null,{"$f":"'TIME TABLE'!$F$13","v":0},null,null,{"$f":"IF(C391=0,0,'TIME TABLE'!$B$13)","v":"00:00:00"},{"$f":"IF(C391=0,0,CONCATENATE('TIME TABLE'!$C$13,'TIME TABLE'!$D$13,'TIME TABLE'!$E$13))","v":0},{"$f":"IF(C391=0,0,'TIME TABLE'!$C$3)","v":0}]
[null,null,{"$f":"'TIME TABLE'!$F$14","v":0},null,null,{"$f":"IF(C392=0,0,'TIME TABLE'!$B$14)","v":"00:00:00"},{"$f":"IF(C392=0,0,CONCATENATE('TIME TABLE'!$C$14,'TIME TABLE'!$D$14,'TIME TABLE'!$E$14))","v":0},{"$f":"IF(C392=0,0,'TIME TABLE'!$C$3)","v":0}]
[null,null,"Instructions"]
[null,null,1,"Check the exam time table carefully."]
[null,null,2,"Students must bring the 'Admit Card' and show it to the invigilator(s) on duty and should preserve it for future requirements."]
[null,null,3,"Mobile Phone, Calculator, Digital Watch or any Electronic Device is NOT ALLOWED."]
[null,null,4,"Arrive at the School at least 15 minutes before the start examination."]
[null,null,5,"Student is barred from entering the examination hall 15 minutes after the written examination starts."]
[null,null,6,"Ensure that you use the washroom before arriving for your exam as you will not be permitted to leave during the first hour."]
[null,null,7,"Normally, you are required to answer questionsusing blue or black in . Make sure you bring some spare pens with you."]
[null,null,8,"Keep your eyes on your own paper. Remember, copying is cheating!"]
[null,null,9,"You must remain silent until after you have exited the school building."]
[{"$f":"A370+1","v":13}]
[{"$nulls":4},{"$f":"MASTER!$E$11","v":"Govt. Sr. Secondary School Raimalwada"}]
[{"$nulls":4},{"$f":"MASTER!$E$14","v":"P.S.-Bapini (Jodhpur)"}]
[null,{"$f":"CONCATENATE(C407,'TIME TABLE'!$C$5,'ADMIT CARD'!$C408,$F408,'ADMIT CARD'!$G408,'TIME TABLE'!$E$5)","v":"ADMIT CARD(Roll Number●→0)"},{"$f":"CONCATENATE('TIME TABLE'!$B$2,'TIME TABLE'!$F$2)","v":"HALF YEARLY EXAM:2021-22"}]
[null,null,"ADMIT CARD",{"$nulls":6}," "]
[null,null,"Roll Number",null,null,"●→",{"$f":"VLOOKUP(A403,'STUDENT DETAIL'!$C$8:$I$107,3)","v":0},null,"Seal and Signature of Head of Institution"]
[null,null,"Student's Name",null,null,"●→",{"$f":"VLOOKUP(A403,'STUDENT DETAIL'!$C$8:$I$107,4)","v":0}]
[null,null,"Father's Name",null,null,"●→",{"$f":"VLOOKUP(A403,'STUDENT DETAIL'!$C$8:$I$107,5)","v":0}]
[null,null,"Mother's Name ",null,null,"●→",{"$f":"VLOOKUP(A403,'STUDENT DETAIL'!$C$8:$I$107,6)","v":0}]
[null,null,"Class & Section",null,null,"●→",{"$f":"IF(G408=0,0,CONCATENATE('STUDENT DETAIL'!$E$4,'STUDENT DETAIL'!$H$4))","v":0}]
[null,null,"Date Of Birth",null,null,"●→",{"$f":"VLOOKUP(A403,'STUDENT DETAIL'!$C$8:$I$107,7)","v":"00:00:00"}]
[null,null,"Time Table"]
[null,null,"Subject",null,null,"Date (Day)",null,"Time"]
[null,null,{"$f":"'TIME TABLE'!$F$5","v":"Hindi"},null,null,{"$f":"IF(C416=0,0,'TIME TABLE'!$B$5)","v":"2022-03-31"},{"$f":"IF(C416=0,0,CONCATENATE('TIME TABLE'!$C$5,'TIME TABLE'!$D$5,'TIME TABLE'!$E$5))","v":"(Thursday)"},{"$f":"IF(C416=0,0,'TIME TABLE'!$C$3)","v":"09:00 AM to 11:45 AM"}]
[null,null,{"$f":"'TIME TABLE'!$F$6","v":"English"},null,null,{"$f":"IF(C417=0,0,'TIME TABLE'!$B$6)","v":"2022-04-01"},{"$f":"IF(C417=0,0,CONCATENATE('TIME TABLE'!$C$6,'TIME TABLE'!$D$6,'TIME TABLE'!$E$6))","v":"(Friday)"},{"$f":"IF(C417=0,0,'TIME TABLE'!$C$3)","v":"09:00 AM to 11:45 AM"}]
[null,null,{"$f":"'TIME TABLE'!$F$7","v":"Science"},null,null,{"$f":"IF(C418=0,0,'TIME TABLE'!$B$7)","v":"2022-04-02"},{"$f":"IF(C418=0,0,CONCATENATE('TIME TABLE'!$C$7,'TIME TABLE'!$D$7,'TIME TABLE'!$E$7))","v":"(Saturday)"},{"$f":"IF(C418=0,0,'TIME TABLE'!$C$3)","v":"09:00 AM to 11:45 AM"}]
[null,null,{"$f":"'TIME TABLE'!$F$8","v":"Mathematics"},null,null,{"$f":"IF(C419=0,0,'TIME TABLE'!$B$8)","v":"2022-04-03"},{"$f":"IF(C419=0,0,CONCATENATE('TIME TABLE'!$C$8,'TIME TABLE'!$D$8,'TIME TABLE'!$E$8))","v":"(Sunday)"},{"$f":"IF(C419=0,0,'TIME TABLE'!$C$3)","v":"09:00 AM to 11:45 AM"}]
[null,null,{"$f":"'TIME TABLE'!$F$9","v":"Social Study"},null,null,{"$f":"IF(C420=0,0,'TIME TABLE'!$B$9)","v":"2022-04-04"},{"$f":"IF(C420=0,0,CONCATENATE('TIME TABLE'!$C$9,'TIME TABLE'!$D$9,'TIME TABLE'!$E$9))","v":"(Monday)"},{"$f":"IF(C420=0,0,'TIME TABLE'!$C$3)","v":"09:00 AM to 11:45 AM"}]
[null,null,{"$f":"'TIME TABLE'!$F$10","v":"Sanskrit"},null,null,{"$f":"IF(C421=0,0,'TIME TABLE'!$B$10)","v":"2022-04-05"},{"$f":"IF(C421=0,0,CONCATENATE('TIME TABLE'!$C$10,'TIME TABLE'!$D$10,'TIME TABLE'!$E$10))","v":"(Tuesday)"},{"$f":"IF(C421=0,0,'TIME TABLE'!$C$3)","v":"09:00 AM to 11:45 AM"}]
[null,null,{"$f":"'TIME TABLE'!$F$11","v":0},null,null,{"$f":"IF(C422=0,0,'TIME TABLE'!$B$11)","v":"00:00:00"},{"$f":"IF(C422=0,0,CONCATENATE('TIME TABLE'!$C$11,'TIME TABLE'!$D$11,'TIME TABLE'!$E$11))","v":0},{"$f":"IF(C422=0,0,'TIME TABLE'!$C$3)","v":0}]
[null,null,{"$f":"'TIME TABLE'!$F$12","v":0},null,null,{"$f":"IF(C423=0,0,'TIME TABLE'!$B$12)","v":"00:00:00"},{"$f":"IF(C423=0,0,CONCATENATE('TIME TABLE'!$C$12,'TIME TABLE'!$D$12,'TIME TABLE'!$E$12))","v":0},{"$f":"IF(C423=0,0,'TIME TABLE'!$C$3)","v":0}]
[null,null,{"$f":"'TIME TABLE'!$F$13","v":0},null,null,{"$f":"IF(C424=0,0,'TIME TABLE'!$B$13)","v":"00:00:00"},{"$f":"IF(C424=0,0,CONCATENATE('TIME TABLE'!$C$13,'TIME TABLE'!$D$13,'TIME TABLE'!$E$13))","v":0},{"$f":"IF(C424=0,0,'TIME TABLE'!$C$3)","v":0}]
[null,null,{"$f":"'TIME TABLE'!$F$14","v":0},null,null,{"$f":"IF(C425=0,0,'TIME TABLE'!$B$14)","v":"00:00:00"},{"$f":"IF(C425=0,0,CONCATENATE('TIME TABLE'!$C$14,'TIME TABLE'!$D$14,'TIME TABLE'!$E$14))","v":0},{"$f":"IF(C425=0,0,'TIME TABLE'!$C$3)","v":0}]
[null,null,"Instructions"]
[null,null,1,"Check the exam time table carefully."]
[null,null,2,"Students must bring the 'Admit Card' and show it to the invigilator(s) on duty and should preserve it for future requirements."]
[null,null,3,"Mobile Phone, Calculator, Digital Watch or any Electronic Device is NOT ALLOWED."]
[null,null,4,"Arrive at the School at least 15 minutes before the start examination."]
[null,null,5,"Student is barred from entering the examination hall 15 minutes after the written examination starts."]
[null,null,6,"Ensure that you use the washroom before arriving for your exam as you will not be permitted to leave during the first hour."]
[null,null,7,"Normally, you are required to answer questionsusing blue or black in . Make sure you bring some spare pens with you."]
[null,null,8,"Keep your eyes on your own paper. Remember, copying is cheating!"]
[null,null,9,"You must remain silent until after you have exited the school building."]
[]
[{"$f":"A403+1","v":14}]
[{"$nulls":4},{"$f":"MASTER!$E$11","v":"Govt. Sr. Secondary School Raimalwada"}]
[{"$nulls":4},{"$f":"MASTER!$E$14","v":"P.S.-Bapini (Jodhpur)"}]
[null,{"$f":"CONCATENATE(C441,'TIME TABLE'!$C$5,'ADMIT CARD'!$C442,$F442,'ADMIT CARD'!$G442,'TIME TABLE'!$E$5)","v":"ADMIT CARD(Roll Number●→0)"},{"$f":"CONCATENATE('TIME TABLE'!$B$2,'TIME TABLE'!$F$2)","v":"HALF YEARLY EXAM:2021-22"}]
[null,null,"ADMIT CARD",{"$nulls":6}," "]
[null,null,"Roll Number",null,null,"●→",{"$f":"VLOOKUP(A437,'STUDENT DETAIL'!$C$8:$I$107,3)","v":0},null,"Seal and Signature of Head of Institution"]
[null,null,"Student's Name",null,null,"●→",{"$f":"VLOOKUP(A437,'STUDENT DETAIL'!$C$8:$I$107,4)","v":0}]
[null,null,"Father's Name",null,null,"●→",{"$f":"VLOOKUP(A437,'STUDENT DETAIL'!$C$8:$I$107,5)","v":0}]
[null,null,"Mother's Name ",null,null,"●→",{"$f":"VLOOKUP(A437,'STUDENT DETAIL'!$C$8:$I$107,6)","v":0}]
[null,null,"Class & Section",null,null,"●→",{"$f":"IF(G442=0,0,CONCATENATE('STUDENT DETAIL'!$E$4,'STUDENT DETAIL'!$H$4))","v":0}]
[null,null,"Date Of Birth",null,null,"●→",{"$f":"VLOOKUP(A437,'STUDENT DETAIL'!$C$8:$I$107,7)","v":"00:00:00"}]
[null,null,"Time Table"]
[null,null,"Subject",null,null,"Date (Day)",null,"Time"]
[null,null,{"$f":"'TIME TABLE'!$F$5","v":"Hindi"},null,null,{"$f":"IF(C450=0,0,'TIME TABLE'!$B$5)","v":"2022-03-31"},{"$f":"IF(C450=0,0,CONCATENATE('TIME TABLE'!$C$5,'TIME TABLE'!$D$5,'TIME TABLE'!$E$5))","v":"(Thursday)"},{"$f":"IF(C450=0,0,'TIME TABLE'!$C$3)","v":"09:00 AM to 11:45 AM"}]
[null,null,{"$f":"'TIME TABLE'!$F$6","v":"English"},null,null,{"$f":"IF(C451=0,0,'TIME TABLE'!$B$6)","v":"2022-04-01"},{"$f":"IF(C451=0,0,CONCATENATE('TIME TABLE'!$C$6,'TIME TABLE'!$D$6,'TIME TABLE'!$E$6))","v":"(Friday)"},{"$f":"IF(C451=0,0,'TIME TABLE'!$C$3)","v":"09:00 AM to 11:45 AM"}]
[null,null,{"$f":"'TIME TABLE'!$F$7","v":"Science"},null,null,{"$f":"IF(C452=0,0,'TIME TABLE'!$B$7)","v":"2022-04-02"},{"$f":"IF(C452=0,0,CONCATENATE('TIME TABLE'!$C$7,'TIME TABLE'!$D$7,'TIME TABLE'!$E$7))","v":"(Saturday)"},{"$f":"IF(C452=0,0,'TIME TABLE'!$C$3)","v":"09:00 AM to 11:45 AM"}]
[null,null,{"$f":"'TIME TABLE'!$F$8","v":"Mathematics"},null,null,{"$f":"IF(C453=0,0,'TIME TABLE'!$B$8)","v":"2022-04-03"},{"$f":"IF(C453=0,0,CONCATENATE('TIME TABLE'!$C$8,'TIME TABLE'!$D$8,'TIME TABLE'!$E$8))","v":"(Sunday)"},{"$f":"IF(C453=0,0,'TIME TABLE'!$C$3)","v":"09:00 AM to 11:45 AM"}]
[null,null,{"$f":"'TIME TABLE'!$F$9","v":"Social Study"},null,null,{"$f":"IF(C454=0,0,'TIME TABLE'!$B$9)","v":"2022-04-04"},{"$f":"IF(C454=0,0,CONCATENATE('TIME TABLE'!$C$9,'TIME TABLE'!$D$9,'TIME TABLE'!$E$9))","v":"(Monday)"},{"$f":"IF(C454=0,0,'TIME TABLE'!$C$3)","v":"09:00 AM to 11:45 AM"}]
[null,null,{"$f":"'TIME TABLE'!$F$10","v":"Sanskrit"},null,null,{"$f":"IF(C455=0,0,'TIME TABLE'!$B$10)","v":"2022-04-05"},{"$f":"IF(C455=0,0,CONCATENATE('TIME TABLE'!$C$10,'TIME TABLE'!$D$10,'TIME TABLE'!$E$10))","v":"(Tuesday)"},{"$f":"IF(C455=0,0,'TIME TABLE'!$C$3)","v":"09:00 AM to 11:45 AM"}]
[null,null,{"$f":"'TIME TABLE'!$F$11","v":0},null,null,{"$f":"IF(C456=0,0,'TIME TABLE'!$B$11)","v":"00:00:00"},{"$f":"IF(C456=0,0,CONCATENATE('TIME TABLE'!$C$11,'TIME TABLE'!$D$11,'TIME TABLE'!$E$11))","v":0},{"$f":"IF(C456=0,0,'TIME TABLE'!$C$3)","v":0}]
[null,null,{"$f":"'TIME TABLE'!$F$12","v":0},null,null,{"$f":"IF(C457=0,0,'TIME TABLE'!$B$12)","v":"00:00:00"},{"$f":"IF(C457=0,0,CONCATENATE('TIME TABLE'!$C$12,'TIME TABLE'!$D$12,'TIME TABLE'!$E$12))","v":0},{"$f":"IF(C457=0,0,'TIME TABLE'!$C$3)","v":0}]
[null,null,{"$f":"'TIME TABLE'!$F$13","v":0},null,null,{"$f":"IF(C458=0,0,'TIME TABLE'!$B$13)","v":"00:00:00"},{"$f":"IF(C458=0,0,CONCATENATE('TIME TABLE'!$C$13,'TIME TABLE'!$D$13,'TIME TABLE'!$E$13))","v":0},{"$f":"IF(C458=0,0,'TIME TABLE'!$C$3)","v":0}]
[null,null,{"$f":"'TIME TABLE'!$F$14","v":0},null,null,{"$f":"IF(C459=0,0,'TIME TABLE'!$B$14)","v":"00:00:00"},{"$f":"IF(C459=0,0,CONCATENATE('TIME TABLE'!$C$14,'TIME TABLE'!$D$14,'TIME TABLE'!$E$14))","v":0},{"$f":"IF(C459=0,0,'TIME TABLE'!$C$3)","v":0}]
[null,null,"Instructions"]
[null,null,1,"Check the exam time table carefully."]
[null,null,2,"Students must bring the 'Admit Card' and show it to the invigilator(s) on duty and should preserve it for future requirements."]
[null,null,3,"Mobile Phone, Calculator, Digital Watch or any Electronic Device is NOT ALLOWED."]
[null,null,4,"Arrive at the School at least 15 minutes before the start examination."]
[null,null,5,"Student is barred from entering the examination hall 15 minutes after the written examination starts."]
[null,null,6,"Ensure that you use the washroom before arriving for your exam as you will not be permitted to leave during the first hour."]
[null,null,7,"Normally, you are required to answer questionsusing blue or black in . Make sure you bring some spare pens with you."]
[null,null,8,"Keep your eyes on your own paper. Remember, copying is cheating!"]
[null,null,9,"You must remain silent until after you have exited the school building."]
[{"$f":"A437+1","v":15}]
[{"$nulls":4},{"$f":"MASTER!$E$11","v":"Govt. Sr. Secondary School Raimalwada"}]
[{"$nulls":4},{"$f":"MASTER!$E$14","v":"P.S.-Bapini (Jodhpur)"}]
[null,{"$f":"CONCATENATE(C474,'TIME TABLE'!$C$5,'ADMIT CARD'!$C475,$F475,'ADMIT CARD'!$G475,'TIME TABLE'!$E$5)","v":"ADMIT CARD(Roll Number●→0)"},{"$f":"CONCATENATE('TIME TABLE'!$B$2,'TIME TABLE'!$F$2)","v":"HALF YEARLY EXAM:2021-22"}]
[null,null,"ADMIT CARD",{"$nulls":6}," "]
[null,null,"Roll Number",null,null,"●→",{"$f":"VLOOKUP(A470,'STUDENT DETAIL'!$C$8:$I$107,3)","v":0},null,"Seal and Signature of Head of Institution"]
[null,null,"Student's Name",null,null,"●→",{"$f":"VLOOKUP(A470,'STUDENT DETAIL'!$C$8:$I$107,4)","v":0}]
[null,null,"Father's Name",null,null,"●→",{"$f":"VLOOKUP(A470,'STUDENT DETAIL'!$C$8:$I$107,5)","v":0}]
[null,null,"Mother's Name ",null,null,"●→",{"$f":"VLOOKUP(A470,'STUDENT DETAIL'!$C$8:$I$107,6)","v":0}]
[null,null,"Class & Section",null,null,"●→",{"$f":"IF(G475=0,0,CONCATENATE('STUDENT DETAIL'!$E$4,'STUDENT DETAIL'!$H$4))","v":0}]
[null,null,"Date Of Birth",null,null,"●→",{"$f":"VLOOKUP(A470,'STUDENT DETAIL'!$C$8:$I$107,7)","v":"00:00:00"}]
[null,null,"Time Table"]
[null,null,"Subject",null,null,"Date (Day)",null,"Time"]
[null,null,{"$f":"'TIME TABLE'!$F$5","v":"Hindi"},null,null,{"$f":"IF(C483=0,0,'TIME TABLE'!$B$5)","v":"2022-03-31"},{"$f":"IF(C483=0,0,CONCATENATE('TIME TABLE'!$C$5,'TIME TABLE'!$D$5,'TIME TABLE'!$E$5))","v":"(Thursday)"},{"$f":"IF(C483=0,0,'TIME TABLE'!$C$3)","v":"09:00 AM to 11:45 AM"}]
[null,null,{"$f":"'TIME TABLE'!$F$6","v":"English"},null,null,{"$f":"IF(C484=0,0,'TIME TABLE'!$B$6)","v":"2022-04-01"},{"$f":"IF(C484=0,0,CONCATENATE('TIME TABLE'!$C$6,'TIME TABLE'!$D$6,'TIME TABLE'!$E$6))","v":"(Friday)"},{"$f":"IF(C484=0,0,'TIME TABLE'!$C$3)","v":"09:00 AM to 11:45 AM"}]
[null,null,{"$f":"'TIME TABLE'!$F$7","v":"Science"},null,null,{"$f":"IF(C485=0,0,'TIME TABLE'!$B$7)","v":"2022-04-02"},{"$f":"IF(C485=0,0,CONCATENATE('TIME TABLE'!$C$7,'TIME TABLE'!$D$7,'TIME TABLE'!$E$7))","v":"(Saturday)"},{"$f":"IF(C485=0,0,'TIME TABLE'!$C$3)","v":"09:00 AM to 11:45 AM"}]
[null,null,{"$f":"'TIME TABLE'!$F$8","v":"Mathematics"},null,null,{"$f":"IF(C486=0,0,'TIME TABLE'!$B$8)","v":"2022-04-03"},{"$f":"IF(C486=0,0,CONCATENATE('TIME TABLE'!$C$8,'TIME TABLE'!$D$8,'TIME TABLE'!$E$8))","v":"(Sunday)"},{"$f":"IF(C486=0,0,'TIME TABLE'!$C$3)","v":"09:00 AM to 11:45 AM"}]
[null,null,{"$f":"'TIME TABLE'!$F$9","v":"Social Study"},null,null,{"$f":"IF(C487=0,0,'TIME TABLE'!$B$9)","v":"2022-04-04"},{"$f":"IF(C487=0,0,CONCATENATE('TIME TABLE'!$C$9,'TIME TABLE'!$D$9,'TIME TABLE'!$E$9))","v":"(Monday)"},{"$f":"IF(C487=0,0,'TIME TABLE'!$C$3)","v":"09:00 AM to 11:45 AM"}]
[null,null,{"$f":"'TIME TABLE'!$F$10","v":"Sanskrit"},null,null,{"$f":"IF(C488=0,0,'TIME TABLE'!$B$10)","v":"2022-04-05"},{"$f":"IF(C488=0,0,CONCATENATE('TIME TABLE'!$C$10,'TIME TABLE'!$D$10,'TIME TABLE'!$E$10))","v":"(Tuesday)"},{"$f":"IF(C488=0,0,'TIME TABLE'!$C$3)","v":"09:00 AM to 11:45 AM"}]
[null,null,{"$f":"'TIME TABLE'!$F$11","v":0},null,null,{"$f":"IF(C489=0,0,'TIME TABLE'!$B$11)","v":"00:00:00"},{"$f":"IF(C489=0,0,CONCATENATE('TIME TABLE'!$C$11,'TIME TABLE'!$D$11,'TIME TABLE'!$E$11))","v":0},{"$f":"IF(C489=0,0,'TIME TABLE'!$C$3)","v":0}]
[null,null,{"$f":"'TIME TABLE'!$F$12","v":0},null,null,{"$f":"IF(C490=0,0,'TIME TABLE'!$B$12)","v":"00:00:00"},{"$f":"IF(C490=0,0,CONCATENATE('TIME TABLE'!$C$12,'TIME TABLE'!$D$12,'TIME TABLE'!$E$12))","v":0},{"$f":"IF(C490=0,0,'TIME TABLE'!$C$3)","v":0}]
[null,null,{"$f":"'TIME TABLE'!$F$13","v":0},null,null,{"$f":"IF(C491=0,0,'TIME TABLE'!$B$13)","v":"00:00:00"},{"$f":"IF(C491=0,0,CONCATENATE('TIME TABLE'!$C$13,'TIME TABLE'!$D$13,'TIME TABLE'!$E$13))","v":0},{"$f":"IF(C491=0,0,'TIME TABLE'!$C$3)","v":0}]
[null,null,{"$f":"'TIME TABLE'!$F$14","v":0},null,null,{"$f":"IF(C492=0,0,'TIME TABLE'!$B$14)","v":"00:00:00"},{"$f":"IF(C492=0,0,CONCATENATE('TIME TABLE'!$C$14,'TIME TABLE'!$D$14,'TIME TABLE'!$E$14))","v":0},{"$f":"IF(C492=0,0,'TIME TABLE'!$C$3)","v":0}]
[null,null,"Instructions"]
[null,null,1,"Check the exam time table carefully."]
[null,null,2,"Students must bring the 'Admit Card' and show it to the invigilator(s) on duty and should preserve it for future requirements."]
[null,null,3,"Mobile Phone, Calculator, Digital Watch or any Electronic Device is NOT ALLOWED."]
[null,null,4,"Arrive at the School at least 15 minutes before the start examination."]
[null,null,5,"Student is barred from entering the examination hall 15 minutes after the written examination starts."]
[null,null,6,"Ensure that you use the washroom before arriving for your exam as you will not be permitted to leave during the first hour."]
[null,null,7,"Normally, you are required to answer questionsusing blue or black in . Make sure you bring some spare pens with you."]
[null,null,8,"Keep your eyes on your own paper. Remember, copying is cheating!"]
[null,null,9,"You must remain silent until after you have exited the school building."]
[]
[{"$f":"A470+1","v":16}]
[{"$nulls":4},{"$f":"MASTER!$E$11","v":"Govt. Sr. Secondary School Raimalwada"}]
[{"$nulls":4},{"$f":"MASTER!$E$14","v":"P.S.-Bapini (Jodhpur)"}]
[null,{"$f":"CONCATENATE(C508,'TIME TABLE'!$C$5,'ADMIT CARD'!$C509,$F509,'ADMIT CARD'!$G509,'TIME TABLE'!$E$5)","v":"ADMIT CARD(Roll Number●→0)"},{"$f":"CONCATENATE('TIME TABLE'!$B$2,'TIME TABLE'!$F$2)","v":"HALF YEARLY EXAM:2021-22"}]
[null,null,"ADMIT CARD",{"$nulls":6}," "]
[null,null,"Roll Number",null,null,"●→",{"$f":"VLOOKUP(A504,'STUDENT DETAIL'!$C$8:$I$107,3)","v":0},null,"Seal and Signature of Head of Institution"]
[null,null,"Student's Name",null,null,"●→",{"$f":"VLOOKUP(A504,'STUDENT DETAIL'!$C$8:$I$107,4)","v":0}]
[null,null,"Father's Name",null,null,"●→",{"$f":"VLOOKUP(A504,'STUDENT DETAIL'!$C$8:$I$107,5)","v":0}]
[null,null,"Mother's Name ",null,null,"●→",{"$f":"VLOOKUP(A504,'STUDENT DETAIL'!$C$8:$I$107,6)","v":0}]
[null,null,"Class & Section",null,null,"●→",{"$f":"IF(G509=0,0,CONCATENATE('STUDENT DETAIL'!$E$4,'STUDENT DETAIL'!$H$4))","v":0}]
[null,null,"Date Of Birth",null,null,"●→",{"$f":"VLOOKUP(A504,'STUDENT DETAIL'!$C$8:$I$107,7)","v":"00:00:00"}]
[null,null,"Time Table"]
[null,null,"Subject",null,null,"Date (Day)",null,"Time"]
[null,null,{"$f":"'TIME TABLE'!$F$5","v":"Hindi"},null,null,{"$f":"IF(C517=0,0,'TIME TABLE'!$B$5)","v":"2022-03-31"},{"$f":"IF(C517=0,0,CONCATENATE('TIME TABLE'!$C$5,'TIME TABLE'!$D$5,'TIME TABLE'!$E$5))","v":"(Thursday)"},{"$f":"IF(C517=0,0,'TIME TABLE'!$C$3)","v":"09:00 AM to 11:45 AM"}]
[null,null,{"$f":"'TIME TABLE'!$F$6","v":"English"},null,null,{"$f":"IF(C518=0,0,'TIME TABLE'!$B$6)","v":"2022-04-01"},{"$f":"IF(C518=0,0,CONCATENATE('TIME TABLE'!$C$6,'TIME TABLE'!$D$6,'TIME TABLE'!$E$6))","v":"(Friday)"},{"$f":"IF(C518=0,0,'TIME TABLE'!$C$3)","v":"09:00 AM to 11:45 AM"}]
[null,null,{"$f":"'TIME TABLE'!$F$7","v":"Science"},null,null,{"$f":"IF(C519=0,0,'TIME TABLE'!$B$7)","v":"2022-04-02"},{"$f":"IF(C519=0,0,CONCATENATE('TIME TABLE'!$C$7,'TIME TABLE'!$D$7,'TIME TABLE'!$E$7))","v":"(Saturday)"},{"$f":"IF(C519=0,0,'TIME TABLE'!$C$3)","v":"09:00 AM to 11:45 AM"}]
[null,null,{"$f":"'TIME TABLE'!$F$8","v":"Mathematics"},null,null,{"$f":"IF(C520=0,0,'TIME TABLE'!$B$8)","v":"2022-04-03"},{"$f":"IF(C520=0,0,CONCATENATE('TIME TABLE'!$C$8,'TIME TABLE'!$D$8,'TIME TABLE'!$E$8))","v":"(Sunday)"},{"$f":"IF(C520=0,0,'TIME TABLE'!$C$3)","v":"09:00 AM to 11:45 AM"}]
[null,null,{"$f":"'TIME TABLE'!$F$9","v":"Social Study"},null,null,{"$f":"IF(C521=0,0,'TIME TABLE'!$B$9)","v":"2022-04-04"},{"$f":"IF(C521=0,0,CONCATENATE('TIME TABLE'!$C$9,'TIME TABLE'!$D$9,'TIME TABLE'!$E$9))","v":"(Monday)"},{"$f":"IF(C521=0,0,'TIME TABLE'!$C$3)","v":"09:00 AM to 11:45 AM"}]
[null,null,{"$f":"'TIME TABLE'!$F$10","v":"Sanskrit"},null,null,{"$f":"IF(C522=0,0,'TIME TABLE'!$B$10)","v":"2022-04-05"},{"$f":"IF(C522=0,0,CONCATENATE('TIME TABLE'!$C$10,'TIME TABLE'!$D$10,'TIME TABLE'!$E$10))","v":"(Tuesday)"},{"$f":"IF(C522=0,0,'TIME TABLE'!$C$3)","v":"09:00 AM to 11:45 AM"}]
[null,null,{"$f":"'TIME TABLE'!$F$11","v":0},null,null,{"$f":"IF(C523=0,0,'TIME TABLE'!$B$11)","v":"00:00:00"},{"$f":"IF(C523=0,0,CONCATENATE('TIME TABLE'!$C$11,'TIME TABLE'!$D$11,'TIME TABLE'!$E$11))","v":0},{"$f":"IF(C523=0,0,'TIME TABLE'!$C$3)","v":0}]
[null,null,{"$f":"'TIME TABLE'!$F$12","v":0},null,null,{"$f":"IF(C524=0,0,'TIME TABLE'!$B$12)","v":"00:00:00"},{"$f":"IF(C524=0,0,CONCATENATE('TIME TABLE'!$C$12,'TIME TABLE'!$D$12,'TIME TABLE'!$E$12))","v":0},{"$f":"IF(C524=0,0,'TIME TABLE'!$C$3)","v":0}]
[null,null,{"$f":"'TIME TABLE'!$F$13","v":0},null,null,{"$f":"IF(C525=0,0,'TIME TABLE'!$B$13)","v":"00:00:00"},{"$f":"IF(C525=0,0,CONCATENATE('TIME TABLE'!$C$13,'TIME TABLE'!$D$13,'TIME TABLE'!$E$13))","v":0},{"$f":"IF(C525=0,0,'TIME TABLE'!$C$3)","v":0}]
[null,null,{"$f":"'TIME TABLE'!$F$14","v":0},null,null,{"$f":"IF(C526=0,0,'TIME TABLE'!$B$14)","v":"00:00:00"},{"$f":"IF(C526=0,0,CONCATENATE('TIME TABLE'!$C$14,'TIME TABLE'!$D$14,'TIME TABLE'!$E$14))","v":0},{"$f":"IF(C526=0,0,'TIME TABLE'!$C$3)","v":0}]
[null,null,"Instructions"]
[null,null,1,"Check the exam time table carefully."]
[null,null,2,"Students must bring the 'Admit Card' and show it to the invigilator(s) on duty and should preserve it for future requirements."]
[null,null,3,"Mobile Phone, Calculator, Digital Watch or any Electronic Device is NOT ALLOWED."]
[null,null,4,"Arrive at the School at least 15 minutes before the start examination."]
[null,null,5,"Student is barred from entering the examination hall 15 minutes after the written examination starts."]
[null,null,6,"Ensure that you use the washroom before arriving for your exam as you will not be permitted to leave during the first hour."]
[null,null,7,"Normally, you are required to answer questionsusing blue or black in . Make sure you bring some spare pens with you."]
[null,null,8,"Keep your eyes on your own paper. Remember, copying is cheating!"]
[null,null,9,"You must remain silent until after you have exited the school building."]
[{"$f":"A504+1","v":17}]
[{"$nulls":4},{"$f":"MASTER!$E$11","v":"Govt. Sr. Secondary School Raimalwada"}]
[{"$nulls":4},{"$f":"MASTER!$E$14","v":"P.S.-Bapini (Jodhpur)"}]
[null,{"$f":"CONCATENATE(C541,'TIME TABLE'!$C$5,'ADMIT CARD'!$C542,$F542,'ADMIT CARD'!$G542,'TIME TABLE'!$E$5)","v":"ADMIT CARD(Roll Number●→0)"},{"$f":"CONCATENATE('TIME TABLE'!$B$2,'TIME TABLE'!$F$2)","v":"HALF YEARLY EXAM:2021-22"}]
[null,null,"ADMIT CARD",{"$nulls":6}," "]
[null,null,"Roll Number",null,null,"●→",{"$f":"VLOOKUP(A537,'STUDENT DETAIL'!$C$8:$I$107,3)","v":0},null,"Seal and Signature of Head of Institution"]
[null,null,"Student's Name",null,null,"●→",{"$f":"VLOOKUP(A537,'STUDENT DETAIL'!$C$8:$I$107,4)","v":0}]
[null,null,"Father's Name",null,null,"●→",{"$f":"VLOOKUP(A537,'STUDENT DETAIL'!$C$8:$I$107,5)","v":0}]
[null,null,"Mother's Name ",null,null,"●→",{"$f":"VLOOKUP(A537,'STUDENT DETAIL'!$C$8:$I$107,6)","v":0}]
[null,null,"Class & Section",null,null,"●→",{"$f":"IF(G542=0,0,CONCATENATE('STUDENT DETAIL'!$E$4,'STUDENT DETAIL'!$H$4))","v":0}]
[null,null,"Date Of Birth",null,null,"●→",{"$f":"VLOOKUP(A537,'STUDENT DETAIL'!$C$8:$I$107,7)","v":"00:00:00"}]
[null,null,"Time Table"]
[null,null,"Subject",null,null,"Date (Day)",null,"Time"]
[null,null,{"$f":"'TIME TABLE'!$F$5","v":"Hindi"},null,null,{"$f":"IF(C550=0,0,'TIME TABLE'!$B$5)","v":"2022-03-31"},{"$f":"IF(C550=0,0,CONCATENATE('TIME TABLE'!$C$5,'TIME TABLE'!$D$5,'TIME TABLE'!$E$5))","v":"(Thursday)"},{"$f":"IF(C550=0,0,'TIME TABLE'!$C$3)","v":"09:00 AM to 11:45 AM"}]
[null,null,{"$f":"'TIME TABLE'!$F$6","v":"English"},null,null,{"$f":"IF(C551=0,0,'TIME TABLE'!$B$6)","v":"2022-04-01"},{"$f":"IF(C551=0,0,CONCATENATE('TIME TABLE'!$C$6,'TIME TABLE'!$D$6,'TIME TABLE'!$E$6))","v":"(Friday)"},{"$f":"IF(C551=0,0,'TIME TABLE'!$C$3)","v":"09:00 AM to 11:45 AM"}]
[null,null,{"$f":"'TIME TABLE'!$F$7","v":"Science"},null,null,{"$f":"IF(C552=0,0,'TIME TABLE'!$B$7)","v":"2022-04-02"},{"$f":"IF(C552=0,0,CONCATENATE('TIME TABLE'!$C$7,'TIME TABLE'!$D$7,'TIME TABLE'!$E$7))","v":"(Saturday)"},{"$f":"IF(C552=0,0,'TIME TABLE'!$C$3)","v":"09:00 AM to 11:45 AM"}]
[null,null,{"$f":"'TIME TABLE'!$F$8","v":"Mathematics"},null,null,{"$f":"IF(C553=0,0,'TIME TABLE'!$B$8)","v":"2022-04-03"},{"$f":"IF(C553=0,0,CONCATENATE('TIME TABLE'!$C$8,'TIME TABLE'!$D$8,'TIME TABLE'!$E$8))","v":"(Sunday)"},{"$f":"IF(C553=0,0,'TIME TABLE'!$C$3)","v":"09:00 AM to 11:45 AM"}]
[null,null,{"$f":"'TIME TABLE'!$F$9","v":"Social Study"},null,null,{"$f":"IF(C554=0,0,'TIME TABLE'!$B$9)","v":"2022-04-04"},{"$f":"IF(C554=0,0,CONCATENATE('TIME TABLE'!$C$9,'TIME TABLE'!$D$9,'TIME TABLE'!$E$9))","v":"(Monday)"},{"$f":"IF(C554=0,0,'TIME TABLE'!$C$3)","v":"09:00 AM to 11:45 AM"}]
[null,null,{"$f":"'TIME TABLE'!$F$10","v":"Sanskrit"},null,null,{"$f":"IF(C555=0,0,'TIME TABLE'!$B$10)","v":"2022-04-05"},{"$f":"IF(C555=0,0,CONCATENATE('TIME TABLE'!$C$10,'TIME TABLE'!$D$10,'TIME TABLE'!$E$10))","v":"(Tuesday)"},{"$f":"IF(C555=0,0,'TIME TABLE'!$C$3)","v":"09:00 AM to 11:45 AM"}]
[null,null,{"$f":"'TIME TABLE'!$F$11","v":0},null,null,{"$f":"IF(C556=0,0,'TIME TABLE'!$B$11)","v":"00:00:00"},{"$f":"IF(C556=0,0,CONCATENATE('TIME TABLE'!$C$11,'TIME TABLE'!$D$11,'TIME TABLE'!$E$11))","v":0},{"$f":"IF(C556=0,0,'TIME TABLE'!$C$3)","v":0}]
[null,null,{"$f":"'TIME TABLE'!$F$12","v":0},null,null,{"$f":"IF(C557=0,0,'TIME TABLE'!$B$12)","v":"00:00:00"},{"$f":"IF(C557=0,0,CONCATENATE('TIME TABLE'!$C$12,'TIME TABLE'!$D$12,'TIME TABLE'!$E$12))","v":0},{"$f":"IF(C557=0,0,'TIME TABLE'!$C$3)","v":0}]
[null,null,{"$f":"'TIME TABLE'!$F$13","v":0},null,null,{"$f":"IF(C558=0,0,'TIME TABLE'!$B$13)","v":"00:00:00"},{"$f":"IF(C558=0,0,CONCATENATE('TIME TABLE'!$C$13,'TIME TABLE'!$D$13,'TIME TABLE'!$E$13))","v":0},{"$f":"IF(C558=0,0,'TIME TABLE'!$C$3)","v":0}]
[null,null,{"$f":"'TIME TABLE'!$F$14","v":0},null,null,{"$f":"IF(C559=0,0,'TIME TABLE'!$B$14)","v":"00:00:00"},{"$f":"IF(C559=0,0,CONCATENATE('TIME TABLE'!$C$14,'TIME TABLE'!$D$14,'TIME TABLE'!$E$14))","v":0},{"$f":"IF(C559=0,0,'TIME TABLE'!$C$3)","v":0}]
[null,null,"Instructions"]
[null,null,1,"Check the exam time table carefully."]
[null,null,2,"Students must bring the 'Admit Card' and show it to the invigilator(s) on duty and should preserve it for future requirements."]
[null,null,3,"Mobile Phone, Calculator, Digital Watch or any Electronic Device is NOT ALLOWED."]
[null,null,4,"Arrive at the School at least 15 minutes before the start examination."]
[null,null,5,"Student is barred from entering the examination hall 15 minutes after the written examination starts."]
[null,null,6,"Ensure that you use the washroom before arriving for your exam as you will not be permitted to leave during the first hour."]
[null,null,7,"Normally, you are required to answer questionsusing blue or black in . Make sure you bring some spare pens with you."]
[null,null,8,"Keep your eyes on your own paper. Remember, copying is cheating!"]
[null,null,9,"You must remain silent until after you have exited the school building."]
[]
[{"$f":"A537+1","v":18}]
[{"$nulls":4},{"$f":"MASTER!$E$11","v":"Govt. Sr. Secondary School Raimalwada"}]
[{"$nulls":4},{"$f":"MASTER!$E$14","v":"P.S.-Bapini (Jodhpur)"}]
[null,{"$f":"CONCATENATE(C575,'TIME TABLE'!$C$5,'ADMIT CARD'!$C576,$F576,'ADMIT CARD'!$G576,'TIME TABLE'!$E$5)","v":"ADMIT CARD(Roll Number●→0)"},{"$f":"CONCATENATE('TIME TABLE'!$B$2,'TIME TABLE'!$F$2)","v":"HALF YEARLY EXAM:2021-22"}]
[null,null,"ADMIT CARD",{"$nulls":6}," "]
[null,null,"Roll Number",null,null,"●→",{"$f":"VLOOKUP(A571,'STUDENT DETAIL'!$C$8:$I$107,3)","v":0},null,"Seal and Signature of Head of Institution"]
[null,null,"Student's Name",null,null,"●→",{"$f":"VLOOKUP(A571,'STUDENT DETAIL'!$C$8:$I$107,4)","v":0}]
[null,null,"Father's Name",null,null,"●→",{"$f":"VLOOKUP(A571,'STUDENT DETAIL'!$C$8:$I$107,5)","v":0}]
[null,null,"Mother's Name ",null,null,"●→",{"$f":"VLOOKUP(A571,'STUDENT DETAIL'!$C$8:$I$107,6)","v":0}]
[null,null,"Class & Section",null,null,"●→",{"$f":"IF(G576=0,0,CONCATENATE('STUDENT DETAIL'!$E$4,'STUDENT DETAIL'!$H$4))","v":0}]
[null,null,"Date Of Birth",null,null,"●→",{"$f":"VLOOKUP(A571,'STUDENT DETAIL'!$C$8:$I$107,7)","v":"00:00:00"}]
[null,null,"Time Table"]
[null,null,"Subject",null,null,"Date (Day)",null,"Time"]
[null,null,{"$f":"'TIME TABLE'!$F$5","v":"Hindi"},null,null,{"$f":"IF(C584=0,0,'TIME TABLE'!$B$5)","v":"2022-03-31"},{"$f":"IF(C584=0,0,CONCATENATE('TIME TABLE'!$C$5,'TIME TABLE'!$D$5,'TIME TABLE'!$E$5))","v":"(Thursday)"},{"$f":"IF(C584=0,0,'TIME TABLE'!$C$3)","v":"09:00 AM to 11:45 AM"}]
[null,null,{"$f":"'TIME TABLE'!$F$6","v":"English"},null,null,{"$f":"IF(C585=0,0,'TIME TABLE'!$B$6)","v":"2022-04-01"},{"$f":"IF(C585=0,0,CONCATENATE('TIME TABLE'!$C$6,'TIME TABLE'!$D$6,'TIME TABLE'!$E$6))","v":"(Friday)"},{"$f":"IF(C585=0,0,'TIME TABLE'!$C$3)","v":"09:00 AM to 11:45 AM"}]
[null,null,{"$f":"'TIME TABLE'!$F$7","v":"Science"},null,null,{"$f":"IF(C586=0,0,'TIME TABLE'!$B$7)","v":"2022-04-02"},{"$f":"IF(C586=0,0,CONCATENATE('TIME TABLE'!$C$7,'TIME TABLE'!$D$7,'TIME TABLE'!$E$7))","v":"(Saturday)"},{"$f":"IF(C586=0,0,'TIME TABLE'!$C$3)","v":"09:00 AM to 11:45 AM"}]
[null,null,{"$f":"'TIME TABLE'!$F$8","v":"Mathematics"},null,null,{"$f":"IF(C587=0,0,'TIME TABLE'!$B$8)","v":"2022-04-03"},{"$f":"IF(C587=0,0,CONCATENATE('TIME TABLE'!$C$8,'TIME TABLE'!$D$8,'TIME TABLE'!$E$8))","v":"(Sunday)"},{"$f":"IF(C587=0,0,'TIME TABLE'!$C$3)","v":"09:00 AM to 11:45 AM"}]
[null,null,{"$f":"'TIME TABLE'!$F$9","v":"Social Study"},null,null,{"$f":"IF(C588=0,0,'TIME TABLE'!$B$9)","v":"2022-04-04"},{"$f":"IF(C588=0,0,CONCATENATE('TIME TABLE'!$C$9,'TIME TABLE'!$D$9,'TIME TABLE'!$E$9))","v":"(Monday)"},{"$f":"IF(C588=0,0,'TIME TABLE'!$C$3)","v":"09:00 AM to 11:45 AM"}]
[null,null,{"$f":"'TIME TABLE'!$F$10","v":"Sanskrit"},null,null,{"$f":"IF(C589=0,0,'TIME TABLE'!$B$10)","v":"2022-04-05"},{"$f":"IF(C589=0,0,CONCATENATE('TIME TABLE'!$C$10,'TIME TABLE'!$D$10,'TIME TABLE'!$E$10))","v":"(Tuesday)"},{"$f":"IF(C589=0,0,'TIME TABLE'!$C$3)","v":"09:00 AM to 11:45 AM"}]
[null,null,{"$f":"'TIME TABLE'!$F$11","v":0},null,null,{"$f":"IF(C590=0,0,'TIME TABLE'!$B$11)","v":"00:00:00"},{"$f":"IF(C590=0,0,CONCATENATE('TIME TABLE'!$C$11,'TIME TABLE'!$D$11,'TIME TABLE'!$E$11))","v":0},{"$f":"IF(C590=0,0,'TIME TABLE'!$C$3)","v":0}]
[null,null,{"$f":"'TIME TABLE'!$F$12","v":0},null,null,{"$f":"IF(C591=0,0,'TIME TABLE'!$B$12)","v":"00:00:00"},{"$f":"IF(C591=0,0,CONCATENATE('TIME TABLE'!$C$12,'TIME TABLE'!$D$12,'TIME TABLE'!$E$12))","v":0},{"$f":"IF(C591=0,0,'TIME TABLE'!$C$3)","v":0}]
[null,null,{"$f":"'TIME TABLE'!$F$13","v":0},null,null,{"$f":"IF(C592=0,0,'TIME TABLE'!$B$13)","v":"00:00:00"},{"$f":"IF(C592=0,0,CONCATENATE('TIME TABLE'!$C$13,'TIME TABLE'!$D$13,'TIME TABLE'!$E$13))","v":0},{"$f":"IF(C592=0,0,'TIME TABLE'!$C$3)","v":0}]
[null,null,{"$f":"'TIME TABLE'!$F$14","v":0},null,null,{"$f":"IF(C593=0,0,'TIME TABLE'!$B$14)","v":"00:00:00"},{"$f":"IF(C593=0,0,CONCATENATE('TIME TABLE'!$C$14,'TIME TABLE'!$D$14,'TIME TABLE'!$E$14))","v":0},{"$f":"IF(C593=0,0,'TIME TABLE'!$C$3)","v":0}]
[null,null,"Instructions"]
[null,null,1,"Check the exam time table carefully."]
[null,null,2,"Students must bring the 'Admit Card' and show it to the invigilator(s) on duty and should preserve it for future requirements."]
[null,null,3,"Mobile Phone, Calculator, Digital Watch or any Electronic Device is NOT ALLOWED."]
[null,null,4,"Arrive at the School at least 15 minutes before the start examination."]
[null,null,5,"Student is barred from entering the examination hall 15 minutes after the written examination starts."]
[null,null,6,"Ensure that you use the washroom before arriving for your exam as you will not be permitted to leave during the first hour."]
[null,null,7,"Normally, you are required to answer questionsusing blue or black in . Make sure you bring some spare pens with you."]
[null,null,8,"Keep your eyes on your own paper. Remember, copying is cheating!"]
[null,null,9,"You must remain silent until after you have exited the school building."]
[{"$f":"A571+1","v":19}]
[{"$nulls":4},{"$f":"MASTER!$E$11","v":"Govt. Sr. Secondary School Raimalwada"}]
[{"$nulls":4},{"$f":"MASTER!$E$14","v":"P.S.-Bapini (Jodhpur)"}]
[null,{"$f":"CONCATENATE(C608,'TIME TABLE'!$C$5,'ADMIT CARD'!$C609,$F609,'ADMIT CARD'!$G609,'TIME TABLE'!$E$5)","v":"ADMIT CARD(Roll Number●→0)"},{"$f":"CONCATENATE('TIME TABLE'!$B$2,'TIME TABLE'!$F$2)","v":"HALF YEARLY EXAM:2021-22"}]
[null,null,"ADMIT CARD",{"$nulls":6}," "]
[null,null,"Roll Number",null,null,"●→",{"$f":"VLOOKUP(A604,'STUDENT DETAIL'!$C$8:$I$107,3)","v":0},null,"Seal and Signature of Head of Institution"]
[null,null,"Student's Name",null,null,"●→",{"$f":"VLOOKUP(A604,'STUDENT DETAIL'!$C$8:$I$107,4)","v":0}]
[null,null,"Father's Name",null,null,"●→",{"$f":"VLOOKUP(A604,'STUDENT DETAIL'!$C$8:$I$107,5)","v":0}]
[null,null,"Mother's Name ",null,null,"●→",{"$f":"VLOOKUP(A604,'STUDENT DETAIL'!$C$8:$I$107,6)","v":0}]
[null,null,"Class & Section",null,null,"●→",{"$f":"IF(G609=0,0,CONCATENATE('STUDENT DETAIL'!$E$4,'STUDENT DETAIL'!$H$4))","v":0}]
[null,null,"Date Of Birth",null,null,"●→",{"$f":"VLOOKUP(A604,'STUDENT DETAIL'!$C$8:$I$107,7)","v":"00:00:00"}]
[null,null,"Time Table"]
[null,null,"Subject",null,null,"Date (Day)",null,"Time"]
[null,null,{"$f":"'TIME TABLE'!$F$5","v":"Hindi"},null,null,{"$f":"IF(C617=0,0,'TIME TABLE'!$B$5)","v":"2022-03-31"},{"$f":"IF(C617=0,0,CONCATENATE('TIME TABLE'!$C$5,'TIME TABLE'!$D$5,'TIME TABLE'!$E$5))","v":"(Thursday)"},{"$f":"IF(C617=0,0,'TIME TABLE'!$C$3)","v":"09:00 AM to 11:45 AM"}]
[null,null,{"$f":"'TIME TABLE'!$F$6","v":"English"},null,null,{"$f":"IF(C618=0,0,'TIME TABLE'!$B$6)","v":"2022-04-01"},{"$f":"IF(C618=0,0,CONCATENATE('TIME TABLE'!$C$6,'TIME TABLE'!$D$6,'TIME TABLE'!$E$6))","v":"(Friday)"},{"$f":"IF(C618=0,0,'TIME TABLE'!$C$3)","v":"09:00 AM to 11:45 AM"}]
[null,null,{"$f":"'TIME TABLE'!$F$7","v":"Science"},null,null,{"$f":"IF(C619=0,0,'TIME TABLE'!$B$7)","v":"2022-04-02"},{"$f":"IF(C619=0,0,CONCATENATE('TIME TABLE'!$C$7,'TIME TABLE'!$D$7,'TIME TABLE'!$E$7))","v":"(Saturday)"},{"$f":"IF(C619=0,0,'TIME TABLE'!$C$3)","v":"09:00 AM to 11:45 AM"}]
[null,null,{"$f":"'TIME TABLE'!$F$8","v":"Mathematics"},null,null,{"$f":"IF(C620=0,0,'TIME TABLE'!$B$8)","v":"2022-04-03"},{"$f":"IF(C620=0,0,CONCATENATE('TIME TABLE'!$C$8,'TIME TABLE'!$D$8,'TIME TABLE'!$E$8))","v":"(Sunday)"},{"$f":"IF(C620=0,0,'TIME TABLE'!$C$3)","v":"09:00 AM to 11:45 AM"}]
[null,null,{"$f":"'TIME TABLE'!$F$9","v":"Social Study"},null,null,{"$f":"IF(C621=0,0,'TIME TABLE'!$B$9)","v":"2022-04-04"},{"$f":"IF(C621=0,0,CONCATENATE('TIME TABLE'!$C$9,'TIME TABLE'!$D$9,'TIME TABLE'!$E$9))","v":"(Monday)"},{"$f":"IF(C621=0,0,'TIME TABLE'!$C$3)","v":"09:00 AM to 11:45 AM"}]
[null,null,{"$f":"'TIME TABLE'!$F$10","v":"Sanskrit"},null,null,{"$f":"IF(C622=0,0,'TIME TABLE'!$B$10)","v":"2022-04-05"},{"$f":"IF(C622=0,0,CONCATENATE('TIME TABLE'!$C$10,'TIME TABLE'!$D$10,'TIME TABLE'!$E$10))","v":"(Tuesday)"},{"$f":"IF(C622=0,0,'TIME TABLE'!$C$3)","v":"09:00 AM to 11:45 AM"}]
[null,null,{"$f":"'TIME TABLE'!$F$11","v":0},null,null,{"$f":"IF(C623=0,0,'TIME TABLE'!$B$11)","v":"00:00:00"},{"$f":"IF(C623=0,0,CONCATENATE('TIME TABLE'!$C$11,'TIME TABLE'!$D$11,'TIME TABLE'!$E$11))","v":0},{"$f":"IF(C623=0,0,'TIME TABLE'!$C$3)","v":0}]
[null,null,{"$f":"'TIME TABLE'!$F$12","v":0},null,null,{"$f":"IF(C624=0,0,'TIME TABLE'!$B$12)","v":"00:00:00"},{"$f":"IF(C624=0,0,CONCATENATE('TIME TABLE'!$C$12,'TIME TABLE'!$D$12,'TIME TABLE'!$E$12))","v":0},{"$f":"IF(C624=0,0,'TIME TABLE'!$C$3)","v":0}]
[null,null,{"$f":"'TIME TABLE'!$F$13","v":0},null,null,{"$f":"IF(C625=0,0,'TIME TABLE'!$B$13)","v":"00:00:00"},{"$f":"IF(C625=0,0,CONCATENATE('TIME TABLE'!$C$13,'TIME TABLE'!$D$13,'TIME TABLE'!$E$13))","v":0},{"$f":"IF(C625=0,0,'TIME TABLE'!$C$3)","v":0}]
[null,null,{"$f":"'TIME TABLE'!$F$14","v":0},null,null,{"$f":"IF(C626=0,0,'TIME TABLE'!$B$14)","v":"00:00:00"},{"$f":"IF(C626=0,0,CONCATENATE('TIME TABLE'!$C$14,'TIME TABLE'!$D$14,'TIME TABLE'!$E$14))","v":0},{"$f":"IF(C626=0,0,'TIME TABLE'!$C$3)","v":0}]
[null,null,"Instructions"]
[null,null,1,"Check the exam time table carefully."]
[null,null,2,"Students must bring the 'Admit Card' and show it to the invigilator(s) on duty and should preserve it for future requirements."]
[null,null,3,"Mobile Phone, Calculator, Digital Watch or any Electronic Device is NOT ALLOWED."]
[null,null,4,"Arrive at the School at least 15 minutes before the start examination."]
[null,null,5,"Student is barred from entering the examination hall 15 minutes after the written examination starts."]
[null,null,6,"Ensure that you use the washroom before arriving for your exam as you will not be permitted to leave during the first hour."]
[null,null,7,"Normally, you are required to answer questionsusing blue or black in . Make sure you bring some spare pens with you."]
[null,null,8,"Keep your eyes on your own paper. Remember, copying is cheating!"]
[null,null,9,"You must remain silent until after you have exited the school building."]
[]
[{"$f":"A604+1","v":20}]
[{"$nulls":4},{"$f":"MASTER!$E$11","v":"Govt. Sr. Secondary School Raimalwada"}]
[{"$nulls":4},{"$f":"MASTER!$E$14","v":"P.S.-Bapini (Jodhpur)"}]
[null,{"$f":"CONCATENATE(C642,'TIME TABLE'!$C$5,'ADMIT CARD'!$C643,$F643,'ADMIT CARD'!$G643,'TIME TABLE'!$E$5)","v":"ADMIT CARD(Roll Number●→0)"},{"$f":"CONCATENATE('TIME TABLE'!$B$2,'TIME TABLE'!$F$2)","v":"HALF YEARLY EXAM:2021-22"}]
[null,null,"ADMIT CARD",{"$nulls":6}," "]
[null,null,"Roll Number",null,null,"●→",{"$f":"VLOOKUP(A638,'STUDENT DETAIL'!$C$8:$I$107,3)","v":0},null,"Seal and Signature of Head of Institution"]
[null,null,"Student's Name",null,null,"●→",{"$f":"VLOOKUP(A638,'STUDENT DETAIL'!$C$8:$I$107,4)","v":0}]
[null,null,"Father's Name",null,null,"●→",{"$f":"VLOOKUP(A638,'STUDENT DETAIL'!$C$8:$I$107,5)","v":0}]
[null,null,"Mother's Name ",null,null,"●→",{"$f":"VLOOKUP(A638,'STUDENT DETAIL'!$C$8:$I$107,6)","v":0}]
[null,null,"Class & Section",null,null,"●→",{"$f":"IF(G643=0,0,CONCATENATE('STUDENT DETAIL'!$E$4,'STUDENT DETAIL'!$H$4))","v":0}]
[null,null,"Date Of Birth",null,null,"●→",{"$f":"VLOOKUP(A638,'STUDENT DETAIL'!$C$8:$I$107,7)","v":"00:00:00"}]
[null,null,"Time Table"]
[null,null,"Subject",null,null,"Date (Day)",null,"Time"]
[null,null,{"$f":"'TIME TABLE'!$F$5","v":"Hindi"},null,null,{"$f":"IF(C651=0,0,'TIME TABLE'!$B$5)","v":"2022-03-31"},{"$f":"IF(C651=0,0,CONCATENATE('TIME TABLE'!$C$5,'TIME TABLE'!$D$5,'TIME TABLE'!$E$5))","v":"(Thursday)"},{"$f":"IF(C651=0,0,'TIME TABLE'!$C$3)","v":"09:00 AM to 11:45 AM"}]
[null,null,{"$f":"'TIME TABLE'!$F$6","v":"English"},null,null,{"$f":"IF(C652=0,0,'TIME TABLE'!$B$6)","v":"2022-04-01"},{"$f":"IF(C652=0,0,CONCATENATE('TIME TABLE'!$C$6,'TIME TABLE'!$D$6,'TIME TABLE'!$E$6))","v":"(Friday)"},{"$f":"IF(C652=0,0,'TIME TABLE'!$C$3)","v":"09:00 AM to 11:45 AM"}]
[null,null,{"$f":"'TIME TABLE'!$F$7","v":"Science"},null,null,{"$f":"IF(C653=0,0,'TIME TABLE'!$B$7)","v":"2022-04-02"},{"$f":"IF(C653=0,0,CONCATENATE('TIME TABLE'!$C$7,'TIME TABLE'!$D$7,'TIME TABLE'!$E$7))","v":"(Saturday)"},{"$f":"IF(C653=0,0,'TIME TABLE'!$C$3)","v":"09:00 AM to 11:45 AM"}]
[null,null,{"$f":"'TIME TABLE'!$F$8","v":"Mathematics"},null,null,{"$f":"IF(C654=0,0,'TIME TABLE'!$B$8)","v":"2022-04-03"},{"$f":"IF(C654=0,0,CONCATENATE('TIME TABLE'!$C$8,'TIME TABLE'!$D$8,'TIME TABLE'!$E$8))","v":"(Sunday)"},{"$f":"IF(C654=0,0,'TIME TABLE'!$C$3)","v":"09:00 AM to 11:45 AM"}]
[null,null,{"$f":"'TIME TABLE'!$F$9","v":"Social Study"},null,null,{"$f":"IF(C655=0,0,'TIME TABLE'!$B$9)","v":"2022-04-04"},{"$f":"IF(C655=0,0,CONCATENATE('TIME TABLE'!$C$9,'TIME TABLE'!$D$9,'TIME TABLE'!$E$9))","v":"(Monday)"},{"$f":"IF(C655=0,0,'TIME TABLE'!$C$3)","v":"09:00 AM to 11:45 AM"}]
[null,null,{"$f":"'TIME TABLE'!$F$10","v":"Sanskrit"},null,null,{"$f":"IF(C656=0,0,'TIME TABLE'!$B$10)","v":"2022-04-05"},{"$f":"IF(C656=0,0,CONCATENATE('TIME TABLE'!$C$10,'TIME TABLE'!$D$10,'TIME TABLE'!$E$10))","v":"(Tuesday)"},{"$f":"IF(C656=0,0,'TIME TABLE'!$C$3)","v":"09:00 AM to 11:45 AM"}]
[null,null,{"$f":"'TIME TABLE'!$F$11","v":0},null,null,{"$f":"IF(C657=0,0,'TIME TABLE'!$B$11)","v":"00:00:00"},{"$f":"IF(C657=0,0,CONCATENATE('TIME TABLE'!$C$11,'TIME TABLE'!$D$11,'TIME TABLE'!$E$11))","v":0},{"$f":"IF(C657=0,0,'TIME TABLE'!$C$3)","v":0}]
[null,null,{"$f":"'TIME TABLE'!$F$12","v":0},null,null,{"$f":"IF(C658=0,0,'TIME TABLE'!$B$12)","v":"00:00:00"},{"$f":"IF(C658=0,0,CONCATENATE('TIME TABLE'!$C$12,'TIME TABLE'!$D$12,'TIME TABLE'!$E$12))","v":0},{"$f":"IF(C658=0,0,'TIME TABLE'!$C$3)","v":0}]
[null,null,{"$f":"'TIME TABLE'!$F$13","v":0},null,null,{"$f":"IF(C659=0,0,'TIME TABLE'!$B$13)","v":"00:00:00"},{"$f":"IF(C659=0,0,CONCATENATE('TIME TABLE'!$C$13,'TIME TABLE'!$D$13,'TIME TABLE'!$E$13))","v":0},{"$f":"IF(C659=0,0,'TIME TABLE'!$C$3)","v":0}]
[null,null,{"$f":"'TIME TABLE'!$F$14","v":0},null,null,{"$f":"IF(C660=0,0,'TIME TABLE'!$B$14)","v":"00:00:00"},{"$f":"IF(C660=0,0,CONCATENATE('TIME TABLE'!$C$14,'TIME TABLE'!$D$14,'TIME TABLE'!$E$14))","v":0},{"$f":"IF(C660=0,0,'TIME TABLE'!$C$3)","v":0}]
[null,null,"Instructions"]
[null,null,1,"Check the exam time table carefully."]
[null,null,2,"Students must bring the 'Admit Card' and show it to the invigilator(s) on duty and should preserve it for future requirements."]
[null,null,3,"Mobile Phone, Calculator, Digital Watch or any Electronic Device is NOT ALLOWED."]
[null,null,4,"Arrive at the School at least 15 minutes before the start examination."]
[null,null,5,"Student is barred from entering the examination hall 15 minutes after the written examination starts."]
[null,null,6,"Ensure that you use the washroom before arriving for your exam as you will not be permitted to leave during the first hour."]
[null,null,7,"Normally, you are required to answer questionsusing blue or black in . Make sure you bring some spare pens with you."]
[null,null,8,"Keep your eyes on your own paper. Remember, copying is cheating!"]
[null,null,9,"You must remain silent until after you have exited the school building."]
[{"$f":"A638+1","v":21}]
[{"$nulls":4},{"$f":"MASTER!$E$11","v":"Govt. Sr. Secondary School Raimalwada"}]
[{"$nulls":4},{"$f":"MASTER!$E$14","v":"P.S.-Bapini (Jodhpur)"}]
[null,{"$f":"CONCATENATE(C675,'TIME TABLE'!$C$5,'ADMIT CARD'!$C676,$F676,'ADMIT CARD'!$G676,'TIME TABLE'!$E$5)","v":"ADMIT CARD(Roll Number●→0)"},{"$f":"CONCATENATE('TIME TABLE'!$B$2,'TIME TABLE'!$F$2)","v":"HALF YEARLY EXAM:2021-22"}]
[null,null,"ADMIT CARD",{"$nulls":6}," "]
[null,null,"Roll Number",null,null,"●→",{"$f":"VLOOKUP(A671,'STUDENT DETAIL'!$C$8:$I$107,3)","v":0},null,"Seal and Signature of Head of Institution"]
[null,null,"Student's Name",null,null,"●→",{"$f":"VLOOKUP(A671,'STUDENT DETAIL'!$C$8:$I$107,4)","v":0}]
[null,null,"Father's Name",null,null,"●→",{"$f":"VLOOKUP(A671,'STUDENT DETAIL'!$C$8:$I$107,5)","v":0}]
[null,null,"Mother's Name ",null,null,"●→",{"$f":"VLOOKUP(A671,'STUDENT DETAIL'!$C$8:$I$107,6)","v":0}]
[null,null,"Class & Section",null,null,"●→",{"$f":"IF(G676=0,0,CONCATENATE('STUDENT DETAIL'!$E$4,'STUDENT DETAIL'!$H$4))","v":0}]
[null,null,"Date Of Birth",null,null,"●→",{"$f":"VLOOKUP(A671,'STUDENT DETAIL'!$C$8:$I$107,7)","v":"00:00:00"}]
[null,null,"Time Table"]
[null,null,"Subject",null,null,"Date (Day)",null,"Time"]
[null,null,{"$f":"'TIME TABLE'!$F$5","v":"Hindi"},null,null,{"$f":"IF(C684=0,0,'TIME TABLE'!$B$5)","v":"2022-03-31"},{"$f":"IF(C684=0,0,CONCATENATE('TIME TABLE'!$C$5,'TIME TABLE'!$D$5,'TIME TABLE'!$E$5))","v":"(Thursday)"},{"$f":"IF(C684=0,0,'TIME TABLE'!$C$3)","v":"09:00 AM to 11:45 AM"}]
[null,null,{"$f":"'TIME TABLE'!$F$6","v":"English"},null,null,{"$f":"IF(C685=0,0,'TIME TABLE'!$B$6)","v":"2022-04-01"},{"$f":"IF(C685=0,0,CONCATENATE('TIME TABLE'!$C$6,'TIME TABLE'!$D$6,'TIME TABLE'!$E$6))","v":"(Friday)"},{"$f":"IF(C685=0,0,'TIME TABLE'!$C$3)","v":"09:00 AM to 11:45 AM"}]
[null,null,{"$f":"'TIME TABLE'!$F$7","v":"Science"},null,null,{"$f":"IF(C686=0,0,'TIME TABLE'!$B$7)","v":"2022-04-02"},{"$f":"IF(C686=0,0,CONCATENATE('TIME TABLE'!$C$7,'TIME TABLE'!$D$7,'TIME TABLE'!$E$7))","v":"(Saturday)"},{"$f":"IF(C686=0,0,'TIME TABLE'!$C$3)","v":"09:00 AM to 11:45 AM"}]
[null,null,{"$f":"'TIME TABLE'!$F$8","v":"Mathematics"},null,null,{"$f":"IF(C687=0,0,'TIME TABLE'!$B$8)","v":"2022-04-03"},{"$f":"IF(C687=0,0,CONCATENATE('TIME TABLE'!$C$8,'TIME TABLE'!$D$8,'TIME TABLE'!$E$8))","v":"(Sunday)"},{"$f":"IF(C687=0,0,'TIME TABLE'!$C$3)","v":"09:00 AM to 11:45 AM"}]
[null,null,{"$f":"'TIME TABLE'!$F$9","v":"Social Study"},null,null,{"$f":"IF(C688=0,0,'TIME TABLE'!$B$9)","v":"2022-04-04"},{"$f":"IF(C688=0,0,CONCATENATE('TIME TABLE'!$C$9,'TIME TABLE'!$D$9,'TIME TABLE'!$E$9))","v":"(Monday)"},{"$f":"IF(C688=0,0,'TIME TABLE'!$C$3)","v":"09:00 AM to 11:45 AM"}]
[null,null,{"$f":"'TIME TABLE'!$F$10","v":"Sanskrit"},null,null,{"$f":"IF(C689=0,0,'TIME TABLE'!$B$10)","v":"2022-04-05"},{"$f":"IF(C689=0,0,CONCATENATE('TIME TABLE'!$C$10,'TIME TABLE'!$D$10,'TIME TABLE'!$E$10))","v":"(Tuesday)"},{"$f":"IF(C689=0,0,'TIME TABLE'!$C$3)","v":"09:00 AM to 11:45 AM"}]
[null,null,{"$f":"'TIME TABLE'!$F$11","v":0},null,null,{"$f":"IF(C690=0,0,'TIME TABLE'!$B$11)","v":"00:00:00"},{"$f":"IF(C690=0,0,CONCATENATE('TIME TABLE'!$C$11,'TIME TABLE'!$D$11,'TIME TABLE'!$E$11))","v":0},{"$f":"IF(C690=0,0,'TIME TABLE'!$C$3)","v":0}]
[null,null,{"$f":"'TIME TABLE'!$F$12","v":0},null,null,{"$f":"IF(C691=0,0,'TIME TABLE'!$B$12)","v":"00:00:00"},{"$f":"IF(C691=0,0,CONCATENATE('TIME TABLE'!$C$12,'TIME TABLE'!$D$12,'TIME TABLE'!$E$12))","v":0},{"$f":"IF(C691=0,0,'TIME TABLE'!$C$3)","v":0}]
[null,null,{"$f":"'TIME TABLE'!$F$13","v":0},null,null,{"$f":"IF(C692=0,0,'TIME TABLE'!$B$13)","v":"00:00:00"},{"$f":"IF(C692=0,0,CONCATENATE('TIME TABLE'!$C$13,'TIME TABLE'!$D$13,'TIME TABLE'!$E$13))","v":0},{"$f":"IF(C692=0,0,'TIME TABLE'!$C$3)","v":0}]
[null,null,{"$f":"'TIME TABLE'!$F$14","v":0},null,null,{"$f":"IF(C693=0,0,'TIME TABLE'!$B$14)","v":"00:00:00"},{"$f":"IF(C693=0,0,CONCATENATE('TIME TABLE'!$C$14,'TIME TABLE'!$D$14,'TIME TABLE'!$E$14))","v":0},{"$f":"IF(C693=0,0,'TIME TABLE'!$C$3)","v":0}]
[null,null,"Instructions"]
[null,null,1,"Check the exam time table carefully."]
[null,null,2,"Students must bring the 'Admit Card' and show it to the invigilator(s) on duty and should preserve it for future requirements."]
[null,null,3,"Mobile Phone, Calculator, Digital Watch or any Electronic Device is NOT ALLOWED."]
[null,null,4,"Arrive at the School at least 15 minutes before the start examination."]
[null,null,5,"Student is barred from entering the examination hall 15 minutes after the written examination starts."]
[null,null,6,"Ensure that you use the washroom before arriving for your exam as you will not be permitted to leave during the first hour."]
[null,null,7,"Normally, you are required to answer questionsusing blue or black in . Make sure you bring some spare pens with you."]
[null,null,8,"Keep your eyes on your own paper. Remember, copying is cheating!"]
[null,null,9,"You must remain silent until after you have exited the school building."]
[]
[{"$f":"A671+1","v":22}]
[{"$nulls":4},{"$f":"MASTER!$E$11","v":"Govt. Sr. Secondary School Raimalwada"}]
[{"$nulls":4},{"$f":"MASTER!$E$14","v":"P.S.-Bapini (Jodhpur)"}]
[null,{"$f":"CONCATENATE(C709,'TIME TABLE'!$C$5,'ADMIT CARD'!$C710,$F710,'ADMIT CARD'!$G710,'TIME TABLE'!$E$5)","v":"ADMIT CARD(Roll Number●→0)"},{"$f":"CONCATENATE('TIME TABLE'!$B$2,'TIME TABLE'!$F$2)","v":"HALF YEARLY EXAM:2021-22"}]
[null,null,"ADMIT CARD",{"$nulls":6}," "]
[null,null,"Roll Number",null,null,"●→",{"$f":"VLOOKUP(A705,'STUDENT DETAIL'!$C$8:$I$107,3)","v":0},null,"Seal and Signature of Head of Institution"]
[null,null,"Student's Name",null,null,"●→",{"$f":"VLOOKUP(A705,'STUDENT DETAIL'!$C$8:$I$107,4)","v":0}]
[null,null,"Father's Name",null,null,"●→",{"$f":"VLOOKUP(A705,'STUDENT DETAIL'!$C$8:$I$107,5)","v":0}]
[null,null,"Mother's Name ",null,null,"●→",{"$f":"VLOOKUP(A705,'STUDENT DETAIL'!$C$8:$I$107,6)","v":0}]
[null,null,"Class & Section",null,null,"●→",{"$f":"IF(G710=0,0,CONCATENATE('STUDENT DETAIL'!$E$4,'STUDENT DETAIL'!$H$4))","v":0}]
[null,null,"Date Of Birth",null,null,"●→",{"$f":"VLOOKUP(A705,'STUDENT DETAIL'!$C$8:$I$107,7)","v":"00:00:00"}]
[null,null,"Time Table"]
[null,null,"Subject",null,null,"Date (Day)",null,"Time"]
[null,null,{"$f":"'TIME TABLE'!$F$5","v":"Hindi"},null,null,{"$f":"IF(C718=0,0,'TIME TABLE'!$B$5)","v":"2022-03-31"},{"$f":"IF(C718=0,0,CONCATENATE('TIME TABLE'!$C$5,'TIME TABLE'!$D$5,'TIME TABLE'!$E$5))","v":"(Thursday)"},{"$f":"IF(C718=0,0,'TIME TABLE'!$C$3)","v":"09:00 AM to 11:45 AM"}]
[null,null,{"$f":"'TIME TABLE'!$F$6","v":"English"},null,null,{"$f":"IF(C719=0,0,'TIME TABLE'!$B$6)","v":"2022-04-01"},{"$f":"IF(C719=0,0,CONCATENATE('TIME TABLE'!$C$6,'TIME TABLE'!$D$6,'TIME TABLE'!$E$6))","v":"(Friday)"},{"$f":"IF(C719=0,0,'TIME TABLE'!$C$3)","v":"09:00 AM to 11:45 AM"}]
[null,null,{"$f":"'TIME TABLE'!$F$7","v":"Science"},null,null,{"$f":"IF(C720=0,0,'TIME TABLE'!$B$7)","v":"2022-04-02"},{"$f":"IF(C720=0,0,CONCATENATE('TIME TABLE'!$C$7,'TIME TABLE'!$D$7,'TIME TABLE'!$E$7))","v":"(Saturday)"},{"$f":"IF(C720=0,0,'TIME TABLE'!$C$3)","v":"09:00 AM to 11:45 AM"}]
[null,null,{"$f":"'TIME TABLE'!$F$8","v":"Mathematics"},null,null,{"$f":"IF(C721=0,0,'TIME TABLE'!$B$8)","v":"2022-04-03"},{"$f":"IF(C721=0,0,CONCATENATE('TIME TABLE'!$C$8,'TIME TABLE'!$D$8,'TIME TABLE'!$E$8))","v":"(Sunday)"},{"$f":"IF(C721=0,0,'TIME TABLE'!$C$3)","v":"09:00 AM to 11:45 AM"}]
[null,null,{"$f":"'TIME TABLE'!$F$9","v":"Social Study"},null,null,{"$f":"IF(C722=0,0,'TIME TABLE'!$B$9)","v":"2022-04-04"},{"$f":"IF(C722=0,0,CONCATENATE('TIME TABLE'!$C$9,'TIME TABLE'!$D$9,'TIME TABLE'!$E$9))","v":"(Monday)"},{"$f":"IF(C722=0,0,'TIME TABLE'!$C$3)","v":"09:00 AM to 11:45 AM"}]
[null,null,{"$f":"'TIME TABLE'!$F$10","v":"Sanskrit"},null,null,{"$f":"IF(C723=0,0,'TIME TABLE'!$B$10)","v":"2022-04-05"},{"$f":"IF(C723=0,0,CONCATENATE('TIME TABLE'!$C$10,'TIME TABLE'!$D$10,'TIME TABLE'!$E$10))","v":"(Tuesday)"},{"$f":"IF(C723=0,0,'TIME TABLE'!$C$3)","v":"09:00 AM to 11:45 AM"}]
[null,null,{"$f":"'TIME TABLE'!$F$11","v":0},null,null,{"$f":"IF(C724=0,0,'TIME TABLE'!$B$11)","v":"00:00:00"},{"$f":"IF(C724=0,0,CONCATENATE('TIME TABLE'!$C$11,'TIME TABLE'!$D$11,'TIME TABLE'!$E$11))","v":0},{"$f":"IF(C724=0,0,'TIME TABLE'!$C$3)","v":0}]
[null,null,{"$f":"'TIME TABLE'!$F$12","v":0},null,null,{"$f":"IF(C725=0,0,'TIME TABLE'!$B$12)","v":"00:00:00"},{"$f":"IF(C725=0,0,CONCATENATE('TIME TABLE'!$C$12,'TIME TABLE'!$D$12,'TIME TABLE'!$E$12))","v":0},{"$f":"IF(C725=0,0,'TIME TABLE'!$C$3)","v":0}]
[null,null,{"$f":"'TIME TABLE'!$F$13","v":0},null,null,{"$f":"IF(C726=0,0,'TIME TABLE'!$B$13)","v":"00:00:00"},{"$f":"IF(C726=0,0,CONCATENATE('TIME TABLE'!$C$13,'TIME TABLE'!$D$13,'TIME TABLE'!$E$13))","v":0},{"$f":"IF(C726=0,0,'TIME TABLE'!$C$3)","v":0}]
[null,null,{"$f":"'TIME TABLE'!$F$14","v":0},null,null,{"$f":"IF(C727=0,0,'TIME TABLE'!$B$14)","v":"00:00:00"},{"$f":"IF(C727=0,0,CONCATENATE('TIME TABLE'!$C$14,'TIME TABLE'!$D$14,'TIME TABLE'!$E$14))","v":0},{"$f":"IF(C727=0,0,'TIME TABLE'!$C$3)","v":0}]
[null,null,"Instructions"]
[null,null,1,"Check the exam time table carefully."]
[null,null,2,"Students must bring the 'Admit Card' and show it to the invigilator(s) on duty and should preserve it for future requirements."]
[null,null,3,"Mobile Phone, Calculator, Digital Watch or any Electronic Device is NOT ALLOWED."]
[null,null,4,"Arrive at the School at least 15 minutes before the start examination."]
[null,null,5,"Student is barred from entering the examination hall 15 minutes after the written examination starts."]
[null,null,6,"Ensure that you use the washroom before arriving for your exam as you will not be permitted to leave during the first hour."]
[null,null,7,"Normally, you are required to answer questionsusing blue or black in . Make sure you bring some spare pens with you."]
[null,null,8,"Keep your eyes on your own paper. Remember, copying is cheating!"]
[null,null,9,"You must remain silent until after you have exited the school building."]
[{"$f":"A705+1","v":23}]
[{"$nulls":4},{"$f":"MASTER!$E$11","v":"Govt. Sr. Secondary School Raimalwada"}]
[{"$nulls":4},{"$f":"MASTER!$E$14","v":"P.S.-Bapini (Jodhpur)"}]
[null,{"$f":"CONCATENATE(C742,'TIME TABLE'!$C$5,'ADMIT CARD'!$C743,$F743,'ADMIT CARD'!$G743,'TIME TABLE'!$E$5)","v":"ADMIT CARD(Roll Number●→0)"},{"$f":"CONCATENATE('TIME TABLE'!$B$2,'TIME TABLE'!$F$2)","v":"HALF YEARLY EXAM:2021-22"}]
[null,null,"ADMIT CARD",{"$nulls":6}," "]
[null,null,"Roll Number",null,null,"●→",{"$f":"VLOOKUP(A738,'STUDENT DETAIL'!$C$8:$I$107,3)","v":0},null,"Seal and Signature of Head of Institution"]
[null,null,"Student's Name",null,null,"●→",{"$f":"VLOOKUP(A738,'STUDENT DETAIL'!$C$8:$I$107,4)","v":0}]
[null,null,"Father's Name",null,null,"●→",{"$f":"VLOOKUP(A738,'STUDENT DETAIL'!$C$8:$I$107,5)","v":0}]
[null,null,"Mother's Name ",null,null,"●→",{"$f":"VLOOKUP(A738,'STUDENT DETAIL'!$C$8:$I$107,6)","v":0}]
[null,null,"Class & Section",null,null,"●→",{"$f":"IF(G743=0,0,CONCATENATE('STUDENT DETAIL'!$E$4,'STUDENT DETAIL'!$H$4))","v":0}]
[null,null,"Date Of Birth",null,null,"●→",{"$f":"VLOOKUP(A738,'STUDENT DETAIL'!$C$8:$I$107,7)","v":"00:00:00"}]
[null,null,"Time Table"]
[null,null,"Subject",null,null,"Date (Day)",null,"Time"]
[null,null,{"$f":"'TIME TABLE'!$F$5","v":"Hindi"},null,null,{"$f":"IF(C751=0,0,'TIME TABLE'!$B$5)","v":"2022-03-31"},{"$f":"IF(C751=0,0,CONCATENATE('TIME TABLE'!$C$5,'TIME TABLE'!$D$5,'TIME TABLE'!$E$5))","v":"(Thursday)"},{"$f":"IF(C751=0,0,'TIME TABLE'!$C$3)","v":"09:00 AM to 11:45 AM"}]
[null,null,{"$f":"'TIME TABLE'!$F$6","v":"English"},null,null,{"$f":"IF(C752=0,0,'TIME TABLE'!$B$6)","v":"2022-04-01"},{"$f":"IF(C752=0,0,CONCATENATE('TIME TABLE'!$C$6,'TIME TABLE'!$D$6,'TIME TABLE'!$E$6))","v":"(Friday)"},{"$f":"IF(C752=0,0,'TIME TABLE'!$C$3)","v":"09:00 AM to 11:45 AM"}]
[null,null,{"$f":"'TIME TABLE'!$F$7","v":"Science"},null,null,{"$f":"IF(C753=0,0,'TIME TABLE'!$B$7)","v":"2022-04-02"},{"$f":"IF(C753=0,0,CONCATENATE('TIME TABLE'!$C$7,'TIME TABLE'!$D$7,'TIME TABLE'!$E$7))","v":"(Saturday)"},{"$f":"IF(C753=0,0,'TIME TABLE'!$C$3)","v":"09:00 AM to 11:45 AM"}]
[null,null,{"$f":"'TIME TABLE'!$F$8","v":"Mathematics"},null,null,{"$f":"IF(C754=0,0,'TIME TABLE'!$B$8)","v":"2022-04-03"},{"$f":"IF(C754=0,0,CONCATENATE('TIME TABLE'!$C$8,'TIME TABLE'!$D$8,'TIME TABLE'!$E$8))","v":"(Sunday)"},{"$f":"IF(C754=0,0,'TIME TABLE'!$C$3)","v":"09:00 AM to 11:45 AM"}]
[null,null,{"$f":"'TIME TABLE'!$F$9","v":"Social Study"},null,null,{"$f":"IF(C755=0,0,'TIME TABLE'!$B$9)","v":"2022-04-04"},{"$f":"IF(C755=0,0,CONCATENATE('TIME TABLE'!$C$9,'TIME TABLE'!$D$9,'TIME TABLE'!$E$9))","v":"(Monday)"},{"$f":"IF(C755=0,0,'TIME TABLE'!$C$3)","v":"09:00 AM to 11:45 AM"}]
[null,null,{"$f":"'TIME TABLE'!$F$10","v":"Sanskrit"},null,null,{"$f":"IF(C756=0,0,'TIME TABLE'!$B$10)","v":"2022-04-05"},{"$f":"IF(C756=0,0,CONCATENATE('TIME TABLE'!$C$10,'TIME TABLE'!$D$10,'TIME TABLE'!$E$10))","v":"(Tuesday)"},{"$f":"IF(C756=0,0,'TIME TABLE'!$C$3)","v":"09:00 AM to 11:45 AM"}]
[null,null,{"$f":"'TIME TABLE'!$F$11","v":0},null,null,{"$f":"IF(C757=0,0,'TIME TABLE'!$B$11)","v":"00:00:00"},{"$f":"IF(C757=0,0,CONCATENATE('TIME TABLE'!$C$11,'TIME TABLE'!$D$11,'TIME TABLE'!$E$11))","v":0},{"$f":"IF(C757=0,0,'TIME TABLE'!$C$3)","v":0}]
[null,null,{"$f":"'TIME TABLE'!$F$12","v":0},null,null,{"$f":"IF(C758=0,0,'TIME TABLE'!$B$12)","v":"00:00:00"},{"$f":"IF(C758=0,0,CONCATENATE('TIME TABLE'!$C$12,'TIME TABLE'!$D$12,'TIME TABLE'!$E$12))","v":0},{"$f":"IF(C758=0,0,'TIME TABLE'!$C$3)","v":0}]
[null,null,{"$f":"'TIME TABLE'!$F$13","v":0},null,null,{"$f":"IF(C759=0,0,'TIME TABLE'!$B$13)","v":"00:00:00"},{"$f":"IF(C759=0,0,CONCATENATE('TIME TABLE'!$C$13,'TIME TABLE'!$D$13,'TIME TABLE'!$E$13))","v":0},{"$f":"IF(C759=0,0,'TIME TABLE'!$C$3)","v":0}]
[null,null,{"$f":"'TIME TABLE'!$F$14","v":0},null,null,{"$f":"IF(C760=0,0,'TIME TABLE'!$B$14)","v":"00:00:00"},{"$f":"IF(C760=0,0,CONCATENATE('TIME TABLE'!$C$14,'TIME TABLE'!$D$14,'TIME TABLE'!$E$14))","v":0},{"$f":"IF(C760=0,0,'TIME TABLE'!$C$3)","v":0}]
[null,null,"Instructions"]
[null,null,1,"Check the exam time table carefully."]
[null,null,2,"Students must bring the 'Admit Card' and show it to the invigilator(s) on duty and should preserve it for future requirements."]
[null,null,3,"Mobile Phone, Calculator, Digital Watch or any Electronic Device is NOT ALLOWED."]
[null,null,4,"Arrive at the School at least 15 minutes before the start examination."]
[null,null,5,"Student is barred from entering the examination hall 15 minutes after the written examination starts."]
[null,null,6,"Ensure that you use the washroom before arriving for your exam as you will not be permitted to leave during the first hour."]
[null,null,7,"Normally, you are required to answer questionsusing blue or black in . Make sure you bring some spare pens with you."]
[null,null,8,"Keep your eyes on your own paper. Remember, copying is cheating!"]
[null,null,9,"You must remain silent until after you have exited the school building."]
[]
[{"$f":"A738+1","v":24}]
[{"$nulls":4},{"$f":"MASTER!$E$11","v":"Govt. Sr. Secondary School Raimalwada"}]
[{"$nulls":4},{"$f":"MASTER!$E$14","v":"P.S.-Bapini (Jodhpur)"}]
[null,{"$f":"CONCATENATE(C776,'TIME TABLE'!$C$5,'ADMIT CARD'!$C777,$F777,'ADMIT CARD'!$G777,'TIME TABLE'!$E$5)","v":"ADMIT CARD(Roll Number●→0)"},{"$f":"CONCATENATE('TIME TABLE'!$B$2,'TIME TABLE'!$F$2)","v":"HALF YEARLY EXAM:2021-22"}]
[null,null,"ADMIT CARD",{"$nulls":6}," "]
[null,null,"Roll Number",null,null,"●→",{"$f":"VLOOKUP(A772,'STUDENT DETAIL'!$C$8:$I$107,3)","v":0},null,"Seal and Signature of Head of Institution"]
[null,null,"Student's Name",null,null,"●→",{"$f":"VLOOKUP(A772,'STUDENT DETAIL'!$C$8:$I$107,4)","v":0}]
[null,null,"Father's Name",null,null,"●→",{"$f":"VLOOKUP(A772,'STUDENT DETAIL'!$C$8:$I$107,5)","v":0}]
[null,null,"Mother's Name ",null,null,"●→",{"$f":"VLOOKUP(A772,'STUDENT DETAIL'!$C$8:$I$107,6)","v":0}]
[null,null,"Class & Section",null,null,"●→",{"$f":"IF(G777=0,0,CONCATENATE('STUDENT DETAIL'!$E$4,'STUDENT DETAIL'!$H$4))","v":0}]
[null,null,"Date Of Birth",null,null,"●→",{"$f":"VLOOKUP(A772,'STUDENT DETAIL'!$C$8:$I$107,7)","v":"00:00:00"}]
[null,null,"Time Table"]
[null,null,"Subject",null,null,"Date (Day)",null,"Time"]
[null,null,{"$f":"'TIME TABLE'!$F$5","v":"Hindi"},null,null,{"$f":"IF(C785=0,0,'TIME TABLE'!$B$5)","v":"2022-03-31"},{"$f":"IF(C785=0,0,CONCATENATE('TIME TABLE'!$C$5,'TIME TABLE'!$D$5,'TIME TABLE'!$E$5))","v":"(Thursday)"},{"$f":"IF(C785=0,0,'TIME TABLE'!$C$3)","v":"09:00 AM to 11:45 AM"}]
[null,null,{"$f":"'TIME TABLE'!$F$6","v":"English"},null,null,{"$f":"IF(C786=0,0,'TIME TABLE'!$B$6)","v":"2022-04-01"},{"$f":"IF(C786=0,0,CONCATENATE('TIME TABLE'!$C$6,'TIME TABLE'!$D$6,'TIME TABLE'!$E$6))","v":"(Friday)"},{"$f":"IF(C786=0,0,'TIME TABLE'!$C$3)","v":"09:00 AM to 11:45 AM"}]
[null,null,{"$f":"'TIME TABLE'!$F$7","v":"Science"},null,null,{"$f":"IF(C787=0,0,'TIME TABLE'!$B$7)","v":"2022-04-02"},{"$f":"IF(C787=0,0,CONCATENATE('TIME TABLE'!$C$7,'TIME TABLE'!$D$7,'TIME TABLE'!$E$7))","v":"(Saturday)"},{"$f":"IF(C787=0,0,'TIME TABLE'!$C$3)","v":"09:00 AM to 11:45 AM"}]
[null,null,{"$f":"'TIME TABLE'!$F$8","v":"Mathematics"},null,null,{"$f":"IF(C788=0,0,'TIME TABLE'!$B$8)","v":"2022-04-03"},{"$f":"IF(C788=0,0,CONCATENATE('TIME TABLE'!$C$8,'TIME TABLE'!$D$8,'TIME TABLE'!$E$8))","v":"(Sunday)"},{"$f":"IF(C788=0,0,'TIME TABLE'!$C$3)","v":"09:00 AM to 11:45 AM"}]
[null,null,{"$f":"'TIME TABLE'!$F$9","v":"Social Study"},null,null,{"$f":"IF(C789=0,0,'TIME TABLE'!$B$9)","v":"2022-04-04"},{"$f":"IF(C789=0,0,CONCATENATE('TIME TABLE'!$C$9,'TIME TABLE'!$D$9,'TIME TABLE'!$E$9))","v":"(Monday)"},{"$f":"IF(C789=0,0,'TIME TABLE'!$C$3)","v":"09:00 AM to 11:45 AM"}]
[null,null,{"$f":"'TIME TABLE'!$F$10","v":"Sanskrit"},null,null,{"$f":"IF(C790=0,0,'TIME TABLE'!$B$10)","v":"2022-04-05"},{"$f":"IF(C790=0,0,CONCATENATE('TIME TABLE'!$C$10,'TIME TABLE'!$D$10,'TIME TABLE'!$E$10))","v":"(Tuesday)"},{"$f":"IF(C790=0,0,'TIME TABLE'!$C$3)","v":"09:00 AM to 11:45 AM"}]
[null,null,{"$f":"'TIME TABLE'!$F$11","v":0},null,null,{"$f":"IF(C791=0,0,'TIME TABLE'!$B$11)","v":"00:00:00"},{"$f":"IF(C791=0,0,CONCATENATE('TIME TABLE'!$C$11,'TIME TABLE'!$D$11,'TIME TABLE'!$E$11))","v":0},{"$f":"IF(C791=0,0,'TIME TABLE'!$C$3)","v":0}]
[null,null,{"$f":"'TIME TABLE'!$F$12","v":0},null,null,{"$f":"IF(C792=0,0,'TIME TABLE'!$B$12)","v":"00:00:00"},{"$f":"IF(C792=0,0,CONCATENATE('TIME TABLE'!$C$12,'TIME TABLE'!$D$12,'TIME TABLE'!$E$12))","v":0},{"$f":"IF(C792=0,0,'TIME TABLE'!$C$3)","v":0}]
[null,null,{"$f":"'TIME TABLE'!$F$13","v":0},null,null,{"$f":"IF(C793=0,0,'TIME TABLE'!$B$13)","v":"00:00:00"},{"$f":"IF(C793=0,0,CONCATENATE('TIME TABLE'!$C$13,'TIME TABLE'!$D$13,'TIME TABLE'!$E$13))","v":0},{"$f":"IF(C793=0,0,'TIME TABLE'!$C$3)","v":0}]
[null,null,{"$f":"'TIME TABLE'!$F$14","v":0},null,null,{"$f":"IF(C794=0,0,'TIME TABLE'!$B$14)","v":"00:00:00"},{"$f":"IF(C794=0,0,CONCATENATE('TIME TABLE'!$C$14,'TIME TABLE'!$D$14,'TIME TABLE'!$E$14))","v":0},{"$f":"IF(C794=0,0,'TIME TABLE'!$C$3)","v":0}]
[null,null,"Instructions"]
[null,null,1,"Check the exam time table carefully."]
[null,null,2,"Students must bring the 'Admit Card' and show it to the invigilator(s) on duty and should preserve it for future requirements."]
[null,null,3,"Mobile Phone, Calculator, Digital Watch or any Electronic Device is NOT ALLOWED."]
[null,null,4,"Arrive at the School at least 15 minutes before the start examination."]
[null,null,5,"Student is barred from entering the examination hall 15 minutes after the written examination starts."]
[null,null,6,"Ensure that you use the washroom before arriving for your exam as you will not be permitted to leave during the first hour."]
[null,null,7,"Normally, you are required to answer questionsusing blue or black in . Make sure you bring some spare pens with you."]
[null,null,8,"Keep your eyes on your own paper. Remember, copying is cheating!"]
[null,null,9,"You must remain silent until after you have exited the school building."]
[{"$f":"A772+1","v":25}]
[{"$nulls":4},{"$f":"MASTER!$E$11","v":"Govt. Sr. Secondary School Raimalwada"}]
[{"$nulls":4},{"$f":"MASTER!$E$14","v":"P.S.-Bapini (Jodhpur)"}]
[null,{"$f":"CONCATENATE(C809,'TIME TABLE'!$C$5,'ADMIT CARD'!$C810,$F810,'ADMIT CARD'!$G810,'TIME TABLE'!$E$5)","v":"ADMIT CARD(Roll Number●→0)"},{"$f":"CONCATENATE('TIME TABLE'!$B$2,'TIME TABLE'!$F$2)","v":"HALF YEARLY EXAM:2021-22"}]
[null,null,"ADMIT CARD",{"$nulls":6}," "]
[null,null,"Roll Number",null,null,"●→",{"$f":"VLOOKUP(A805,'STUDENT DETAIL'!$C$8:$I$107,3)","v":0},null,"Seal and Signature of Head of Institution"]
[null,null,"Student's Name",null,null,"●→",{"$f":"VLOOKUP(A805,'STUDENT DETAIL'!$C$8:$I$107,4)","v":0}]
[null,null,"Father's Name",null,null,"●→",{"$f":"VLOOKUP(A805,'STUDENT DETAIL'!$C$8:$I$107,5)","v":0}]
[null,null,"Mother's Name ",null,null,"●→",{"$f":"VLOOKUP(A805,'STUDENT DETAIL'!$C$8:$I$107,6)","v":0}]
[null,null,"Class & Section",null,null,"●→",{"$f":"IF(G810=0,0,CONCATENATE('STUDENT DETAIL'!$E$4,'STUDENT DETAIL'!$H$4))","v":0}]
[null,null,"Date Of Birth",null,null,"●→",{"$f":"VLOOKUP(A805,'STUDENT DETAIL'!$C$8:$I$107,7)","v":"00:00:00"}]
[null,null,"Time Table"]
[null,null,"Subject",null,null,"Date (Day)",null,"Time"]
[null,null,{"$f":"'TIME TABLE'!$F$5","v":"Hindi"},null,null,{"$f":"IF(C818=0,0,'TIME TABLE'!$B$5)","v":"2022-03-31"},{"$f":"IF(C818=0,0,CONCATENATE('TIME TABLE'!$C$5,'TIME TABLE'!$D$5,'TIME TABLE'!$E$5))","v":"(Thursday)"},{"$f":"IF(C818=0,0,'TIME TABLE'!$C$3)","v":"09:00 AM to 11:45 AM"}]
[null,null,{"$f":"'TIME TABLE'!$F$6","v":"English"},null,null,{"$f":"IF(C819=0,0,'TIME TABLE'!$B$6)","v":"2022-04-01"},{"$f":"IF(C819=0,0,CONCATENATE('TIME TABLE'!$C$6,'TIME TABLE'!$D$6,'TIME TABLE'!$E$6))","v":"(Friday)"},{"$f":"IF(C819=0,0,'TIME TABLE'!$C$3)","v":"09:00 AM to 11:45 AM"}]
[null,null,{"$f":"'TIME TABLE'!$F$7","v":"Science"},null,null,{"$f":"IF(C820=0,0,'TIME TABLE'!$B$7)","v":"2022-04-02"},{"$f":"IF(C820=0,0,CONCATENATE('TIME TABLE'!$C$7,'TIME TABLE'!$D$7,'TIME TABLE'!$E$7))","v":"(Saturday)"},{"$f":"IF(C820=0,0,'TIME TABLE'!$C$3)","v":"09:00 AM to 11:45 AM"}]
[null,null,{"$f":"'TIME TABLE'!$F$8","v":"Mathematics"},null,null,{"$f":"IF(C821=0,0,'TIME TABLE'!$B$8)","v":"2022-04-03"},{"$f":"IF(C821=0,0,CONCATENATE('TIME TABLE'!$C$8,'TIME TABLE'!$D$8,'TIME TABLE'!$E$8))","v":"(Sunday)"},{"$f":"IF(C821=0,0,'TIME TABLE'!$C$3)","v":"09:00 AM to 11:45 AM"}]
[null,null,{"$f":"'TIME TABLE'!$F$9","v":"Social Study"},null,null,{"$f":"IF(C822=0,0,'TIME TABLE'!$B$9)","v":"2022-04-04"},{"$f":"IF(C822=0,0,CONCATENATE('TIME TABLE'!$C$9,'TIME TABLE'!$D$9,'TIME TABLE'!$E$9))","v":"(Monday)"},{"$f":"IF(C822=0,0,'TIME TABLE'!$C$3)","v":"09:00 AM to 11:45 AM"}]
[null,null,{"$f":"'TIME TABLE'!$F$10","v":"Sanskrit"},null,null,{"$f":"IF(C823=0,0,'TIME TABLE'!$B$10)","v":"2022-04-05"},{"$f":"IF(C823=0,0,CONCATENATE('TIME TABLE'!$C$10,'TIME TABLE'!$D$10,'TIME TABLE'!$E$10))","v":"(Tuesday)"},{"$f":"IF(C823=0,0,'TIME TABLE'!$C$3)","v":"09:00 AM to 11:45 AM"}]
[null,null,{"$f":"'TIME TABLE'!$F$11","v":0},null,null,{"$f":"IF(C824=0,0,'TIME TABLE'!$B$11)","v":"00:00:00"},{"$f":"IF(C824=0,0,CONCATENATE('TIME TABLE'!$C$11,'TIME TABLE'!$D$11,'TIME TABLE'!$E$11))","v":0},{"$f":"IF(C824=0,0,'TIME TABLE'!$C$3)","v":0}]
[null,null,{"$f":"'TIME TABLE'!$F$12","v":0},null,null,{"$f":"IF(C825=0,0,'TIME TABLE'!$B$12)","v":"00:00:00"},{"$f":"IF(C825=0,0,CONCATENATE('TIME TABLE'!$C$12,'TIME TABLE'!$D$12,'TIME TABLE'!$E$12))","v":0},{"$f":"IF(C825=0,0,'TIME TABLE'!$C$3)","v":0}]
[null,null,{"$f":"'TIME TABLE'!$F$13","v":0},null,null,{"$f":"IF(C826=0,0,'TIME TABLE'!$B$13)","v":"00:00:00"},{"$f":"IF(C826=0,0,CONCATENATE('TIME TABLE'!$C$13,'TIME TABLE'!$D$13,'TIME TABLE'!$E$13))","v":0},{"$f":"IF(C826=0,0,'TIME TABLE'!$C$3)","v":0}]
[null,null,{"$f":"'TIME TABLE'!$F$14","v":0},null,null,{"$f":"IF(C827=0,0,'TIME TABLE'!$B$14)","v":"00:00:00"},{"$f":"IF(C827=0,0,CONCATENATE('TIME TABLE'!$C$14,'TIME TABLE'!$D$14,'TIME TABLE'!$E$14))","v":0},{"$f":"IF(C827=0,0,'TIME TABLE'!$C$3)","v":0}]
[null,null,"Instructions"]
[null,null,1,"Check the exam time table carefully."]
[null,null,2,"Students must bring the 'Admit Card' and show it to the invigilator(s) on duty and should preserve it for future requirements."]
[null,null,3,"Mobile Phone, Calculator, Digital Watch or any Electronic Device is NOT ALLOWED."]
[null,null,4,"Arrive at the School at least 15 minutes before the start examination."]
[null,null,5,"Student is barred from entering the examination hall 15 minutes after the written examination starts."]
[null,null,6,"Ensure that you use the washroom before arriving for your exam as you will not be permitted to leave during the first hour."]
[null,null,7,"Normally, you are required to answer questionsusing blue or black in . Make sure you bring some spare pens with you."]
[null,null,8,"Keep your eyes on your own paper. Remember, copying is cheating!"]
[null,null,9,"You must remain silent until after you have exited the school building."]
[]
[{"$f":"A805+1","v":26}]
[{"$nulls":4},{"$f":"MASTER!$E$11","v":"Govt. Sr. Secondary School Raimalwada"}]
[{"$nulls":4},{"$f":"MASTER!$E$14","v":"P.S.-Bapini (Jodhpur)"}]
[null,{"$f":"CONCATENATE(C843,'TIME TABLE'!$C$5,'ADMIT CARD'!$C844,$F844,'ADMIT CARD'!$G844,'TIME TABLE'!$E$5)","v":"ADMIT CARD(Roll Number●→0)"},{"$f":"CONCATENATE('TIME TABLE'!$B$2,'TIME TABLE'!$F$2)","v":"HALF YEARLY EXAM:2021-22"}]
[null,null,"ADMIT CARD",{"$nulls":6}," "]
[null,null,"Roll Number",null,null,"●→",{"$f":"VLOOKUP(A839,'STUDENT DETAIL'!$C$8:$I$107,3)","v":0},null,"Seal and Signature of Head of Institution"]
[null,null,"Student's Name",null,null,"●→",{"$f":"VLOOKUP(A839,'STUDENT DETAIL'!$C$8:$I$107,4)","v":0}]
[null,null,"Father's Name",null,null,"●→",{"$f":"VLOOKUP(A839,'STUDENT DETAIL'!$C$8:$I$107,5)","v":0}]
[null,null,"Mother's Name ",null,null,"●→",{"$f":"VLOOKUP(A839,'STUDENT DETAIL'!$C$8:$I$107,6)","v":0}]
[null,null,"Class & Section",null,null,"●→",{"$f":"IF(G844=0,0,CONCATENATE('STUDENT DETAIL'!$E$4,'STUDENT DETAIL'!$H$4))","v":0}]
[null,null,"Date Of Birth",null,null,"●→",{"$f":"VLOOKUP(A839,'STUDENT DETAIL'!$C$8:$I$107,7)","v":"00:00:00"}]
[null,null,"Time Table"]
[null,null,"Subject",null,null,"Date (Day)",null,"Time"]
[null,null,{"$f":"'TIME TABLE'!$F$5","v":"Hindi"},null,null,{"$f":"IF(C852=0,0,'TIME TABLE'!$B$5)","v":"2022-03-31"},{"$f":"IF(C852=0,0,CONCATENATE('TIME TABLE'!$C$5,'TIME TABLE'!$D$5,'TIME TABLE'!$E$5))","v":"(Thursday)"},{"$f":"IF(C852=0,0,'TIME TABLE'!$C$3)","v":"09:00 AM to 11:45 AM"}]
[null,null,{"$f":"'TIME TABLE'!$F$6","v":"English"},null,null,{"$f":"IF(C853=0,0,'TIME TABLE'!$B$6)","v":"2022-04-01"},{"$f":"IF(C853=0,0,CONCATENATE('TIME TABLE'!$C$6,'TIME TABLE'!$D$6,'TIME TABLE'!$E$6))","v":"(Friday)"},{"$f":"IF(C853=0,0,'TIME TABLE'!$C$3)","v":"09:00 AM to 11:45 AM"}]
[null,null,{"$f":"'TIME TABLE'!$F$7","v":"Science"},null,null,{"$f":"IF(C854=0,0,'TIME TABLE'!$B$7)","v":"2022-04-02"},{"$f":"IF(C854=0,0,CONCATENATE('TIME TABLE'!$C$7,'TIME TABLE'!$D$7,'TIME TABLE'!$E$7))","v":"(Saturday)"},{"$f":"IF(C854=0,0,'TIME TABLE'!$C$3)","v":"09:00 AM to 11:45 AM"}]
[null,null,{"$f":"'TIME TABLE'!$F$8","v":"Mathematics"},null,null,{"$f":"IF(C855=0,0,'TIME TABLE'!$B$8)","v":"2022-04-03"},{"$f":"IF(C855=0,0,CONCATENATE('TIME TABLE'!$C$8,'TIME TABLE'!$D$8,'TIME TABLE'!$E$8))","v":"(Sunday)"},{"$f":"IF(C855=0,0,'TIME TABLE'!$C$3)","v":"09:00 AM to 11:45 AM"}]
[null,null,{"$f":"'TIME TABLE'!$F$9","v":"Social Study"},null,null,{"$f":"IF(C856=0,0,'TIME TABLE'!$B$9)","v":"2022-04-04"},{"$f":"IF(C856=0,0,CONCATENATE('TIME TABLE'!$C$9,'TIME TABLE'!$D$9,'TIME TABLE'!$E$9))","v":"(Monday)"},{"$f":"IF(C856=0,0,'TIME TABLE'!$C$3)","v":"09:00 AM to 11:45 AM"}]
[null,null,{"$f":"'TIME TABLE'!$F$10","v":"Sanskrit"},null,null,{"$f":"IF(C857=0,0,'TIME TABLE'!$B$10)","v":"2022-04-05"},{"$f":"IF(C857=0,0,CONCATENATE('TIME TABLE'!$C$10,'TIME TABLE'!$D$10,'TIME TABLE'!$E$10))","v":"(Tuesday)"},{"$f":"IF(C857=0,0,'TIME TABLE'!$C$3)","v":"09:00 AM to 11:45 AM"}]
[null,null,{"$f":"'TIME TABLE'!$F$11","v":0},null,null,{"$f":"IF(C858=0,0,'TIME TABLE'!$B$11)","v":"00:00:00"},{"$f":"IF(C858=0,0,CONCATENATE('TIME TABLE'!$C$11,'TIME TABLE'!$D$11,'TIME TABLE'!$E$11))","v":0},{"$f":"IF(C858=0,0,'TIME TABLE'!$C$3)","v":0}]
[null,null,{"$f":"'TIME TABLE'!$F$12","v":0},null,null,{"$f":"IF(C859=0,0,'TIME TABLE'!$B$12)","v":"00:00:00"},{"$f":"IF(C859=0,0,CONCATENATE('TIME TABLE'!$C$12,'TIME TABLE'!$D$12,'TIME TABLE'!$E$12))","v":0},{"$f":"IF(C859=0,0,'TIME TABLE'!$C$3)","v":0}]
[null,null,{"$f":"'TIME TABLE'!$F$13","v":0},null,null,{"$f":"IF(C860=0,0,'TIME TABLE'!$B$13)","v":"00:00:00"},{"$f":"IF(C860=0,0,CONCATENATE('TIME TABLE'!$C$13,'TIME TABLE'!$D$13,'TIME TABLE'!$E$13))","v":0},{"$f":"IF(C860=0,0,'TIME TABLE'!$C$3)","v":0}]
[null,null,{"$f":"'TIME TABLE'!$F$14","v":0},null,null,{"$f":"IF(C861=0,0,'TIME TABLE'!$B$14)","v":"00:00:00"},{"$f":"IF(C861=0,0,CONCATENATE('TIME TABLE'!$C$14,'TIME TABLE'!$D$14,'TIME TABLE'!$E$14))","v":0},{"$f":"IF(C861=0,0,'TIME TABLE'!$C$3)","v":0}]
[null,null,"Instructions"]
[null,null,1,"Check the exam time table carefully."]
[null,null,2,"Students must bring the 'Admit Card' and show it to the invigilator(s) on duty and should preserve it for future requirements."]
[null,null,3,"Mobile Phone, Calculator, Digital Watch or any Electronic Device is NOT ALLOWED."]
[null,null,4,"Arrive at the School at least 15 minutes before the start examination."]
[null,null,5,"Student is barred from entering the examination hall 15 minutes after the written examination starts."]
[null,null,6,"Ensure that you use the washroom before arriving for your exam as you will not be permitted to leave during the first hour."]
[null,null,7,"Normally, you are required to answer questionsusing blue or black in . Make sure you bring some spare pens with you."]
[null,null,8,"Keep your eyes on your own paper. Remember, copying is cheating!"]
[null,null,9,"You must remain silent until after you have exited the school building."]
[{"$f":"A839+1","v":27}]
[{"$nulls":4},{"$f":"MASTER!$E$11","v":"Govt. Sr. Secondary School Raimalwada"}]
[{"$nulls":4},{"$f":"MASTER!$E$14","v":"P.S.-Bapini (Jodhpur)"}]
[null,{"$f":"CONCATENATE(C876,'TIME TABLE'!$C$5,'ADMIT CARD'!$C877,$F877,'ADMIT CARD'!$G877,'TIME TABLE'!$E$5)","v":"ADMIT CARD(Roll Number●→0)"},{"$f":"CONCATENATE('TIME TABLE'!$B$2,'TIME TABLE'!$F$2)","v":"HALF YEARLY EXAM:2021-22"}]
[null,null,"ADMIT CARD",{"$nulls":6}," "]
[null,null,"Roll Number",null,null,"●→",{"$f":"VLOOKUP(A872,'STUDENT DETAIL'!$C$8:$I$107,3)","v":0},null,"Seal and Signature of Head of Institution"]
[null,null,"Student's Name",null,null,"●→",{"$f":"VLOOKUP(A872,'STUDENT DETAIL'!$C$8:$I$107,4)","v":0}]
[null,null,"Father's Name",null,null,"●→",{"$f":"VLOOKUP(A872,'STUDENT DETAIL'!$C$8:$I$107,5)","v":0}]
[null,null,"Mother's Name ",null,null,"●→",{"$f":"VLOOKUP(A872,'STUDENT DETAIL'!$C$8:$I$107,6)","v":0}]
[null,null,"Class & Section",null,null,"●→",{"$f":"IF(G877=0,0,CONCATENATE('STUDENT DETAIL'!$E$4,'STUDENT DETAIL'!$H$4))","v":0}]
[null,null,"Date Of Birth",null,null,"●→",{"$f":"VLOOKUP(A872,'STUDENT DETAIL'!$C$8:$I$107,7)","v":"00:00:00"}]
[null,null,"Time Table"]
[null,null,"Subject",null,null,"Date (Day)",null,"Time"]
[null,null,{"$f":"'TIME TABLE'!$F$5","v":"Hindi"},null,null,{"$f":"IF(C885=0,0,'TIME TABLE'!$B$5)","v":"2022-03-31"},{"$f":"IF(C885=0,0,CONCATENATE('TIME TABLE'!$C$5,'TIME TABLE'!$D$5,'TIME TABLE'!$E$5))","v":"(Thursday)"},{"$f":"IF(C885=0,0,'TIME TABLE'!$C$3)","v":"09:00 AM to 11:45 AM"}]
[null,null,{"$f":"'TIME TABLE'!$F$6","v":"English"},null,null,{"$f":"IF(C886=0,0,'TIME TABLE'!$B$6)","v":"2022-04-01"},{"$f":"IF(C886=0,0,CONCATENATE('TIME TABLE'!$C$6,'TIME TABLE'!$D$6,'TIME TABLE'!$E$6))","v":"(Friday)"},{"$f":"IF(C886=0,0,'TIME TABLE'!$C$3)","v":"09:00 AM to 11:45 AM"}]
[null,null,{"$f":"'TIME TABLE'!$F$7","v":"Science"},null,null,{"$f":"IF(C887=0,0,'TIME TABLE'!$B$7)","v":"2022-04-02"},{"$f":"IF(C887=0,0,CONCATENATE('TIME TABLE'!$C$7,'TIME TABLE'!$D$7,'TIME TABLE'!$E$7))","v":"(Saturday)"},{"$f":"IF(C887=0,0,'TIME TABLE'!$C$3)","v":"09:00 AM to 11:45 AM"}]
[null,null,{"$f":"'TIME TABLE'!$F$8","v":"Mathematics"},null,null,{"$f":"IF(C888=0,0,'TIME TABLE'!$B$8)","v":"2022-04-03"},{"$f":"IF(C888=0,0,CONCATENATE('TIME TABLE'!$C$8,'TIME TABLE'!$D$8,'TIME TABLE'!$E$8))","v":"(Sunday)"},{"$f":"IF(C888=0,0,'TIME TABLE'!$C$3)","v":"09:00 AM to 11:45 AM"}]
[null,null,{"$f":"'TIME TABLE'!$F$9","v":"Social Study"},null,null,{"$f":"IF(C889=0,0,'TIME TABLE'!$B$9)","v":"2022-04-04"},{"$f":"IF(C889=0,0,CONCATENATE('TIME TABLE'!$C$9,'TIME TABLE'!$D$9,'TIME TABLE'!$E$9))","v":"(Monday)"},{"$f":"IF(C889=0,0,'TIME TABLE'!$C$3)","v":"09:00 AM to 11:45 AM"}]
[null,null,{"$f":"'TIME TABLE'!$F$10","v":"Sanskrit"},null,null,{"$f":"IF(C890=0,0,'TIME TABLE'!$B$10)","v":"2022-04-05"},{"$f":"IF(C890=0,0,CONCATENATE('TIME TABLE'!$C$10,'TIME TABLE'!$D$10,'TIME TABLE'!$E$10))","v":"(Tuesday)"},{"$f":"IF(C890=0,0,'TIME TABLE'!$C$3)","v":"09:00 AM to 11:45 AM"}]
[null,null,{"$f":"'TIME TABLE'!$F$11","v":0},null,null,{"$f":"IF(C891=0,0,'TIME TABLE'!$B$11)","v":"00:00:00"},{"$f":"IF(C891=0,0,CONCATENATE('TIME TABLE'!$C$11,'TIME TABLE'!$D$11,'TIME TABLE'!$E$11))","v":0},{"$f":"IF(C891=0,0,'TIME TABLE'!$C$3)","v":0}]
[null,null,{"$f":"'TIME TABLE'!$F$12","v":0},null,null,{"$f":"IF(C892=0,0,'TIME TABLE'!$B$12)","v":"00:00:00"},{"$f":"IF(C892=0,0,CONCATENATE('TIME TABLE'!$C$12,'TIME TABLE'!$D$12,'TIME TABLE'!$E$12))","v":0},{"$f":"IF(C892=0,0,'TIME TABLE'!$C$3)","v":0}]
[null,null,{"$f":"'TIME TABLE'!$F$13","v":0},null,null,{"$f":"IF(C893=0,0,'TIME TABLE'!$B$13)","v":"00:00:00"},{"$f":"IF(C893=0,0,CONCATENATE('TIME TABLE'!$C$13,'TIME TABLE'!$D$13,'TIME TABLE'!$E$13))","v":0},{"$f":"IF(C893=0,0,'TIME TABLE'!$C$3)","v":0}]
[null,null,{"$f":"'TIME TABLE'!$F$14","v":0},null,null,{"$f":"IF(C894=0,0,'TIME TABLE'!$B$14)","v":"00:00:00"},{"$f":"IF(C894=0,0,CONCATENATE('TIME TABLE'!$C$14,'TIME TABLE'!$D$14,'TIME TABLE'!$E$14))","v":0},{"$f":"IF(C894=0,0,'TIME TABLE'!$C$3)","v":0}]
[null,null,"Instructions"]
[null,null,1,"Check the exam time table carefully."]
[null,null,2,"Students must bring the 'Admit Card' and show it to the invigilator(s) on duty and should preserve it for future requirements."]
[null,null,3,"Mobile Phone, Calculator, Digital Watch or any Electronic Device is NOT ALLOWED."]
[null,null,4,"Arrive at the School at least 15 minutes before the start examination."]
[null,null,5,"Student is barred from entering the examination hall 15 minutes after the written examination starts."]
[null,null,6,"Ensure that you use the washroom before arriving for your exam as you will not be permitted to leave during the first hour."]
[null,null,7,"Normally, you are required to answer questionsusing blue or black in . Make sure you bring some spare pens with you."]
[null,null,8,"Keep your eyes on your own paper. Remember, copying is cheating!"]
[null,null,9,"You must remain silent until after you have exited the school building."]
[]
[{"$f":"A872+1","v":28}]
[{"$nulls":4},{"$f":"MASTER!$E$11","v":"Govt. Sr. Secondary School Raimalwada"}]
[{"$nulls":4},{"$f":"MASTER!$E$14","v":"P.S.-Bapini (Jodhpur)"}]
[null,{"$f":"CONCATENATE(C910,'TIME TABLE'!$C$5,'ADMIT CARD'!$C911,$F911,'ADMIT CARD'!$G911,'TIME TABLE'!$E$5)","v":"ADMIT CARD(Roll Number●→0)"},{"$f":"CONCATENATE('TIME TABLE'!$B$2,'TIME TABLE'!$F$2)","v":"HALF YEARLY EXAM:2021-22"}]
[null,null,"ADMIT CARD",{"$nulls":6}," "]
[null,null,"Roll Number",null,null,"●→",{"$f":"VLOOKUP(A906,'STUDENT DETAIL'!$C$8:$I$107,3)","v":0},null,"Seal and Signature of Head of Institution"]
[null,null,"Student's Name",null,null,"●→",{"$f":"VLOOKUP(A906,'STUDENT DETAIL'!$C$8:$I$107,4)","v":0}]
[null,null,"Father's Name",null,null,"●→",{"$f":"VLOOKUP(A906,'STUDENT DETAIL'!$C$8:$I$107,5)","v":0}]
[null,null,"Mother's Name ",null,null,"●→",{"$f":"VLOOKUP(A906,'STUDENT DETAIL'!$C$8:$I$107,6)","v":0}]
[null,null,"Class & Section",null,null,"●→",{"$f":"IF(G911=0,0,CONCATENATE('STUDENT DETAIL'!$E$4,'STUDENT DETAIL'!$H$4))","v":0}]
[null,null,"Date Of Birth",null,null,"●→",{"$f":"VLOOKUP(A906,'STUDENT DETAIL'!$C$8:$I$107,7)","v":"00:00:00"}]
[null,null,"Time Table"]
[null,null,"Subject",null,null,"Date (Day)",null,"Time"]
[null,null,{"$f":"'TIME TABLE'!$F$5","v":"Hindi"},null,null,{"$f":"IF(C919=0,0,'TIME TABLE'!$B$5)","v":"2022-03-31"},{"$f":"IF(C919=0,0,CONCATENATE('TIME TABLE'!$C$5,'TIME TABLE'!$D$5,'TIME TABLE'!$E$5))","v":"(Thursday)"},{"$f":"IF(C919=0,0,'TIME TABLE'!$C$3)","v":"09:00 AM to 11:45 AM"}]
[null,null,{"$f":"'TIME TABLE'!$F$6","v":"English"},null,null,{"$f":"IF(C920=0,0,'TIME TABLE'!$B$6)","v":"2022-04-01"},{"$f":"IF(C920=0,0,CONCATENATE('TIME TABLE'!$C$6,'TIME TABLE'!$D$6,'TIME TABLE'!$E$6))","v":"(Friday)"},{"$f":"IF(C920=0,0,'TIME TABLE'!$C$3)","v":"09:00 AM to 11:45 AM"}]
[null,null,{"$f":"'TIME TABLE'!$F$7","v":"Science"},null,null,{"$f":"IF(C921=0,0,'TIME TABLE'!$B$7)","v":"2022-04-02"},{"$f":"IF(C921=0,0,CONCATENATE('TIME TABLE'!$C$7,'TIME TABLE'!$D$7,'TIME TABLE'!$E$7))","v":"(Saturday)"},{"$f":"IF(C921=0,0,'TIME TABLE'!$C$3)","v":"09:00 AM to 11:45 AM"}]
[null,null,{"$f":"'TIME TABLE'!$F$8","v":"Mathematics"},null,null,{"$f":"IF(C922=0,0,'TIME TABLE'!$B$8)","v":"2022-04-03"},{"$f":"IF(C922=0,0,CONCATENATE('TIME TABLE'!$C$8,'TIME TABLE'!$D$8,'TIME TABLE'!$E$8))","v":"(Sunday)"},{"$f":"IF(C922=0,0,'TIME TABLE'!$C$3)","v":"09:00 AM to 11:45 AM"}]
[null,null,{"$f":"'TIME TABLE'!$F$9","v":"Social Study"},null,null,{"$f":"IF(C923=0,0,'TIME TABLE'!$B$9)","v":"2022-04-04"},{"$f":"IF(C923=0,0,CONCATENATE('TIME TABLE'!$C$9,'TIME TABLE'!$D$9,'TIME TABLE'!$E$9))","v":"(Monday)"},{"$f":"IF(C923=0,0,'TIME TABLE'!$C$3)","v":"09:00 AM to 11:45 AM"}]
[null,null,{"$f":"'TIME TABLE'!$F$10","v":"Sanskrit"},null,null,{"$f":"IF(C924=0,0,'TIME TABLE'!$B$10)","v":"2022-04-05"},{"$f":"IF(C924=0,0,CONCATENATE('TIME TABLE'!$C$10,'TIME TABLE'!$D$10,'TIME TABLE'!$E$10))","v":"(Tuesday)"},{"$f":"IF(C924=0,0,'TIME TABLE'!$C$3)","v":"09:00 AM to 11:45 AM"}]
[null,null,{"$f":"'TIME TABLE'!$F$11","v":0},null,null,{"$f":"IF(C925=0,0,'TIME TABLE'!$B$11)","v":"00:00:00"},{"$f":"IF(C925=0,0,CONCATENATE('TIME TABLE'!$C$11,'TIME TABLE'!$D$11,'TIME TABLE'!$E$11))","v":0},{"$f":"IF(C925=0,0,'TIME TABLE'!$C$3)","v":0}]
[null,null,{"$f":"'TIME TABLE'!$F$12","v":0},null,null,{"$f":"IF(C926=0,0,'TIME TABLE'!$B$12)","v":"00:00:00"},{"$f":"IF(C926=0,0,CONCATENATE('TIME TABLE'!$C$12,'TIME TABLE'!$D$12,'TIME TABLE'!$E$12))","v":0},{"$f":"IF(C926=0,0,'TIME TABLE'!$C$3)","v":0}]
[null,null,{"$f":"'TIME TABLE'!$F$13","v":0},null,null,{"$f":"IF(C927=0,0,'TIME TABLE'!$B$13)","v":"00:00:00"},{"$f":"IF(C927=0,0,CONCATENATE('TIME TABLE'!$C$13,'TIME TABLE'!$D$13,'TIME TABLE'!$E$13))","v":0},{"$f":"IF(C927=0,0,'TIME TABLE'!$C$3)","v":0}]
[null,null,{"$f":"'TIME TABLE'!$F$14","v":0},null,null,{"$f":"IF(C928=0,0,'TIME TABLE'!$B$14)","v":"00:00:00"},{"$f":"IF(C928=0,0,CONCATENATE('TIME TABLE'!$C$14,'TIME TABLE'!$D$14,'TIME TABLE'!$E$14))","v":0},{"$f":"IF(C928=0,0,'TIME TABLE'!$C$3)","v":0}]
[null,null,"Instructions"]
[null,null,1,"Check the exam time table carefully."]
[null,null,2,"Students must bring the 'Admit Card' and show it to the invigilator(s) on duty and should preserve it for future requirements."]
[null,null,3,"Mobile Phone, Calculator, Digital Watch or any Electronic Device is NOT ALLOWED."]
[null,null,4,"Arrive at the School at least 15 minutes before the start examination."]
[null,null,5,"Student is barred from entering the examination hall 15 minutes after the written examination starts."]
[null,null,6,"Ensure that you use the washroom before arriving for your exam as you will not be permitted to leave during the first hour."]
[null,null,7,"Normally, you are required to answer questionsusing blue or black in . Make sure you bring some spare pens with you."]
[null,null,8,"Keep your eyes on your own paper. Remember, copying is cheating!"]
[null,null,9,"You must remain silent until after you have exited the school building."]
[{"$f":"A906+1","v":29}]
[{"$nulls":4},{"$f":"MASTER!$E$11","v":"Govt. Sr. Secondary School Raimalwada"}]
[{"$nulls":4},{"$f":"MASTER!$E$14","v":"P.S.-Bapini (Jodhpur)"}]
[null,{"$f":"CONCATENATE(C943,'TIME TABLE'!$C$5,'ADMIT CARD'!$C944,$F944,'ADMIT CARD'!$G944,'TIME TABLE'!$E$5)","v":"ADMIT CARD(Roll Number●→0)"},{"$f":"CONCATENATE('TIME TABLE'!$B$2,'TIME TABLE'!$F$2)","v":"HALF YEARLY EXAM:2021-22"}]
[null,null,"ADMIT CARD",{"$nulls":6}," "]
[null,null,"Roll Number",null,null,"●→",{"$f":"VLOOKUP(A939,'STUDENT DETAIL'!$C$8:$I$107,3)","v":0},null,"Seal and Signature of Head of Institution"]
[null,null,"Student's Name",null,null,"●→",{"$f":"VLOOKUP(A939,'STUDENT DETAIL'!$C$8:$I$107,4)","v":0}]
[null,null,"Father's Name",null,null,"●→",{"$f":"VLOOKUP(A939,'STUDENT DETAIL'!$C$8:$I$107,5)","v":0}]
[null,null,"Mother's Name ",null,null,"●→",{"$f":"VLOOKUP(A939,'STUDENT DETAIL'!$C$8:$I$107,6)","v":0}]
[null,null,"Class & Section",null,null,"●→",{"$f":"IF(G944=0,0,CONCATENATE('STUDENT DETAIL'!$E$4,'STUDENT DETAIL'!$H$4))","v":0}]
[null,null,"Date Of Birth",null,null,"●→",{"$f":"VLOOKUP(A939,'STUDENT DETAIL'!$C$8:$I$107,7)","v":"00:00:00"}]
[null,null,"Time Table"]
[null,null,"Subject",null,null,"Date (Day)",null,"Time"]
[null,null,{"$f":"'TIME TABLE'!$F$5","v":"Hindi"},null,null,{"$f":"IF(C952=0,0,'TIME TABLE'!$B$5)","v":"2022-03-31"},{"$f":"IF(C952=0,0,CONCATENATE('TIME TABLE'!$C$5,'TIME TABLE'!$D$5,'TIME TABLE'!$E$5))","v":"(Thursday)"},{"$f":"IF(C952=0,0,'TIME TABLE'!$C$3)","v":"09:00 AM to 11:45 AM"}]
[null,null,{"$f":"'TIME TABLE'!$F$6","v":"English"},null,null,{"$f":"IF(C953=0,0,'TIME TABLE'!$B$6)","v":"2022-04-01"},{"$f":"IF(C953=0,0,CONCATENATE('TIME TABLE'!$C$6,'TIME TABLE'!$D$6,'TIME TABLE'!$E$6))","v":"(Friday)"},{"$f":"IF(C953=0,0,'TIME TABLE'!$C$3)","v":"09:00 AM to 11:45 AM"}]
[null,null,{"$f":"'TIME TABLE'!$F$7","v":"Science"},null,null,{"$f":"IF(C954=0,0,'TIME TABLE'!$B$7)","v":"2022-04-02"},{"$f":"IF(C954=0,0,CONCATENATE('TIME TABLE'!$C$7,'TIME TABLE'!$D$7,'TIME TABLE'!$E$7))","v":"(Saturday)"},{"$f":"IF(C954=0,0,'TIME TABLE'!$C$3)","v":"09:00 AM to 11:45 AM"}]
[null,null,{"$f":"'TIME TABLE'!$F$8","v":"Mathematics"},null,null,{"$f":"IF(C955=0,0,'TIME TABLE'!$B$8)","v":"2022-04-03"},{"$f":"IF(C955=0,0,CONCATENATE('TIME TABLE'!$C$8,'TIME TABLE'!$D$8,'TIME TABLE'!$E$8))","v":"(Sunday)"},{"$f":"IF(C955=0,0,'TIME TABLE'!$C$3)","v":"09:00 AM to 11:45 AM"}]
[null,null,{"$f":"'TIME TABLE'!$F$9","v":"Social Study"},null,null,{"$f":"IF(C956=0,0,'TIME TABLE'!$B$9)","v":"2022-04-04"},{"$f":"IF(C956=0,0,CONCATENATE('TIME TABLE'!$C$9,'TIME TABLE'!$D$9,'TIME TABLE'!$E$9))","v":"(Monday)"},{"$f":"IF(C956=0,0,'TIME TABLE'!$C$3)","v":"09:00 AM to 11:45 AM"}]
[null,null,{"$f":"'TIME TABLE'!$F$10","v":"Sanskrit"},null,null,{"$f":"IF(C957=0,0,'TIME TABLE'!$B$10)","v":"2022-04-05"},{"$f":"IF(C957=0,0,CONCATENATE('TIME TABLE'!$C$10,'TIME TABLE'!$D$10,'TIME TABLE'!$E$10))","v":"(Tuesday)"},{"$f":"IF(C957=0,0,'TIME TABLE'!$C$3)","v":"09:00 AM to 11:45 AM"}]
[null,null,{"$f":"'TIME TABLE'!$F$11","v":0},null,null,{"$f":"IF(C958=0,0,'TIME TABLE'!$B$11)","v":"00:00:00"},{"$f":"IF(C958=0,0,CONCATENATE('TIME TABLE'!$C$11,'TIME TABLE'!$D$11,'TIME TABLE'!$E$11))","v":0},{"$f":"IF(C958=0,0,'TIME TABLE'!$C$3)","v":0}]
[null,null,{"$f":"'TIME TABLE'!$F$12","v":0},null,null,{"$f":"IF(C959=0,0,'TIME TABLE'!$B$12)","v":"00:00:00"},{"$f":"IF(C959=0,0,CONCATENATE('TIME TABLE'!$C$12,'TIME TABLE'!$D$12,'TIME TABLE'!$E$12))","v":0},{"$f":"IF(C959=0,0,'TIME TABLE'!$C$3)","v":0}]
[null,null,{"$f":"'TIME TABLE'!$F$13","v":0},null,null,{"$f":"IF(C960=0,0,'TIME TABLE'!$B$13)","v":"00:00:00"},{"$f":"IF(C960=0,0,CONCATENATE('TIME TABLE'!$C$13,'TIME TABLE'!$D$13,'TIME TABLE'!$E$13))","v":0},{"$f":"IF(C960=0,0,'TIME TABLE'!$C$3)","v":0}]
[null,null,{"$f":"'TIME TABLE'!$F$14","v":0},null,null,{"$f":"IF(C961=0,0,'TIME TABLE'!$B$14)","v":"00:00:00"},{"$f":"IF(C961=0,0,CONCATENATE('TIME TABLE'!$C$14,'TIME TABLE'!$D$14,'TIME TABLE'!$E$14))","v":0},{"$f":"IF(C961=0,0,'TIME TABLE'!$C$3)","v":0}]
[null,null,"Instructions"]
[null,null,1,"Check the exam time table carefully."]
[null,null,2,"Students must bring the 'Admit Card' and show it to the invigilator(s) on duty and should preserve it for future requirements."]
[null,null,3,"Mobile Phone, Calculator, Digital Watch or any Electronic Device is NOT ALLOWED."]
[null,null,4,"Arrive at the School at least 15 minutes before the start examination."]
[null,null,5,"Student is barred from entering the examination hall 15 minutes after the written examination starts."]
[null,null,6,"Ensure that you use the washroom before arriving for your exam as you will not be permitted to leave during the first hour."]
[null,null,7,"Normally, you are required to answer questionsusing blue or black in . Make sure you bring some spare pens with you."]
[null,null,8,"Keep your eyes on your own paper. Remember, copying is cheating!"]
[null,null,9,"You must remain silent until after you have exited the school building."]
[]
[{"$f":"A939+1","v":30}]
[{"$nulls":4},{"$f":"MASTER!$E$11","v":"Govt. Sr. Secondary School Raimalwada"}]
[{"$nulls":4},{"$f":"MASTER!$E$14","v":"P.S.-Bapini (Jodhpur)"}]
[null,{"$f":"CONCATENATE(C977,'TIME TABLE'!$C$5,'ADMIT CARD'!$C978,$F978,'ADMIT CARD'!$G978,'TIME TABLE'!$E$5)","v":"ADMIT CARD(Roll Number●→0)"},{"$f":"CONCATENATE('TIME TABLE'!$B$2,'TIME TABLE'!$F$2)","v":"HALF YEARLY EXAM:2021-22"}]
[null,null,"ADMIT CARD",{"$nulls":6}," "]
[null,null,"Roll Number",null,null,"●→",{"$f":"VLOOKUP(A973,'STUDENT DETAIL'!$C$8:$I$107,3)","v":0},null,"Seal and Signature of Head of Institution"]
[null,null,"Student's Name",null,null,"●→",{"$f":"VLOOKUP(A973,'STUDENT DETAIL'!$C$8:$I$107,4)","v":0}]
[null,null,"Father's Name",null,null,"●→",{"$f":"VLOOKUP(A973,'STUDENT DETAIL'!$C$8:$I$107,5)","v":0}]
[null,null,"Mother's Name ",null,null,"●→",{"$f":"VLOOKUP(A973,'STUDENT DETAIL'!$C$8:$I$107,6)","v":0}]
[null,null,"Class & Section",null,null,"●→",{"$f":"IF(G978=0,0,CONCATENATE('STUDENT DETAIL'!$E$4,'STUDENT DETAIL'!$H$4))","v":0}]
[null,null,"Date Of Birth",null,null,"●→",{"$f":"VLOOKUP(A973,'STUDENT DETAIL'!$C$8:$I$107,7)","v":"00:00:00"}]
[null,null,"Time Table"]
[null,null,"Subject",null,null,"Date (Day)",null,"Time"]
[null,null,{"$f":"'TIME TABLE'!$F$5","v":"Hindi"},null,null,{"$f":"IF(C986=0,0,'TIME TABLE'!$B$5)","v":"2022-03-31"},{"$f":"IF(C986=0,0,CONCATENATE('TIME TABLE'!$C$5,'TIME TABLE'!$D$5,'TIME TABLE'!$E$5))","v":"(Thursday)"},{"$f":"IF(C986=0,0,'TIME TABLE'!$C$3)","v":"09:00 AM to 11:45 AM"}]
[null,null,{"$f":"'TIME TABLE'!$F$6","v":"English"},null,null,{"$f":"IF(C987=0,0,'TIME TABLE'!$B$6)","v":"2022-04-01"},{"$f":"IF(C987=0,0,CONCATENATE('TIME TABLE'!$C$6,'TIME TABLE'!$D$6,'TIME TABLE'!$E$6))","v":"(Friday)"},{"$f":"IF(C987=0,0,'TIME TABLE'!$C$3)","v":"09:00 AM to 11:45 AM"}]
[null,null,{"$f":"'TIME TABLE'!$F$7","v":"Science"},null,null,{"$f":"IF(C988=0,0,'TIME TABLE'!$B$7)","v":"2022-04-02"},{"$f":"IF(C988=0,0,CONCATENATE('TIME TABLE'!$C$7,'TIME TABLE'!$D$7,'TIME TABLE'!$E$7))","v":"(Saturday)"},{"$f":"IF(C988=0,0,'TIME TABLE'!$C$3)","v":"09:00 AM to 11:45 AM"}]
[null,null,{"$f":"'TIME TABLE'!$F$8","v":"Mathematics"},null,null,{"$f":"IF(C989=0,0,'TIME TABLE'!$B$8)","v":"2022-04-03"},{"$f":"IF(C989=0,0,CONCATENATE('TIME TABLE'!$C$8,'TIME TABLE'!$D$8,'TIME TABLE'!$E$8))","v":"(Sunday)"},{"$f":"IF(C989=0,0,'TIME TABLE'!$C$3)","v":"09:00 AM to 11:45 AM"}]
[null,null,{"$f":"'TIME TABLE'!$F$9","v":"Social Study"},null,null,{"$f":"IF(C990=0,0,'TIME TABLE'!$B$9)","v":"2022-04-04"},{"$f":"IF(C990=0,0,CONCATENATE('TIME TABLE'!$C$9,'TIME TABLE'!$D$9,'TIME TABLE'!$E$9))","v":"(Monday)"},{"$f":"IF(C990=0,0,'TIME TABLE'!$C$3)","v":"09:00 AM to 11:45 AM"}]
[null,null,{"$f":"'TIME TABLE'!$F$10","v":"Sanskrit"},null,null,{"$f":"IF(C991=0,0,'TIME TABLE'!$B$10)","v":"2022-04-05"},{"$f":"IF(C991=0,0,CONCATENATE('TIME TABLE'!$C$10,'TIME TABLE'!$D$10,'TIME TABLE'!$E$10))","v":"(Tuesday)"},{"$f":"IF(C991=0,0,'TIME TABLE'!$C$3)","v":"09:00 AM to 11:45 AM"}]
[null,null,{"$f":"'TIME TABLE'!$F$11","v":0},null,null,{"$f":"IF(C992=0,0,'TIME TABLE'!$B$11)","v":"00:00:00"},{"$f":"IF(C992=0,0,CONCATENATE('TIME TABLE'!$C$11,'TIME TABLE'!$D$11,'TIME TABLE'!$E$11))","v":0},{"$f":"IF(C992=0,0,'TIME TABLE'!$C$3)","v":0}]
[null,null,{"$f":"'TIME TABLE'!$F$12","v":0},null,null,{"$f":"IF(C993=0,0,'TIME TABLE'!$B$12)","v":"00:00:00"},{"$f":"IF(C993=0,0,CONCATENATE('TIME TABLE'!$C$12,'TIME TABLE'!$D$12,'TIME TABLE'!$E$12))","v":0},{"$f":"IF(C993=0,0,'TIME TABLE'!$C$3)","v":0}]
[null,null,{"$f":"'TIME TABLE'!$F$13","v":0},null,null,{"$f":"IF(C994=0,0,'TIME TABLE'!$B$13)","v":"00:00:00"},{"$f":"IF(C994=0,0,CONCATENATE('TIME TABLE'!$C$13,'TIME TABLE'!$D$13,'TIME TABLE'!$E$13))","v":0},{"$f":"IF(C994=0,0,'TIME TABLE'!$C$3)","v":0}]
[null,null,{"$f":"'TIME TABLE'!$F$14","v":0},null,null,{"$f":"IF(C995=0,0,'TIME TABLE'!$B$14)","v":"00:00:00"},{"$f":"IF(C995=0,0,CONCATENATE('TIME TABLE'!$C$14,'TIME TABLE'!$D$14,'TIME TABLE'!$E$14))","v":0},{"$f":"IF(C995=0,0,'TIME TABLE'!$C$3)","v":0}]
[null,null,"Instructions"]
[null,null,1,"Check the exam time table carefully."]
[null,null,2,"Students must bring the 'Admit Card' and show it to the invigilator(s) on duty and should preserve it for future requirements."]
[null,null,3,"Mobile Phone, Calculator, Digital Watch or any Electronic Device is NOT ALLOWED."]
[null,null,4,"Arrive at the School at least 15 minutes before the start examination."]
[null,null,5,"Student is barred from entering the examination hall 15 minutes after the written examination starts."]
[null,null,6,"Ensure that you use the washroom before arriving for your exam as you will not be permitted to leave during the first hour."]
[null,null,7,"Normally, you are required to answer questionsusing blue or black in . Make sure you bring some spare pens with you."]
[null,null,8,"Keep your eyes on your own paper. Remember, copying is cheating!"]
[null,null,9,"You must remain silent until after you have exited the school building."]
[{"$f":"A973+1","v":31}]
[{"$nulls":4},{"$f":"MASTER!$E$11","v":"Govt. Sr. Secondary School Raimalwada"}]
[{"$nulls":4},{"$f":"MASTER!$E$14","v":"P.S.-Bapini (Jodhpur)"}]
[null,{"$f":"CONCATENATE(C1010,'TIME TABLE'!$C$5,'ADMIT CARD'!$C1011,$F1011,'ADMIT CARD'!$G1011,'TIME TABLE'!$E$5)","v":"ADMIT CARD(Roll Number●→0)"},{"$f":"CONCATENATE('TIME TABLE'!$B$2,'TIME TABLE'!$F$2)","v":"HALF YEARLY EXAM:2021-22"}]
[null,null,"ADMIT CARD",{"$nulls":6}," "]
[null,null,"Roll Number",null,null,"●→",{"$f":"VLOOKUP(A1006,'STUDENT DETAIL'!$C$8:$I$107,3)","v":0},null,"Seal and Signature of Head of Institution"]
[null,null,"Student's Name",null,null,"●→",{"$f":"VLOOKUP(A1006,'STUDENT DETAIL'!$C$8:$I$107,4)","v":0}]
[null,null,"Father's Name",null,null,"●→",{"$f":"VLOOKUP(A1006,'STUDENT DETAIL'!$C$8:$I$107,5)","v":0}]
[null,null,"Mother's Name ",null,null,"●→",{"$f":"VLOOKUP(A1006,'STUDENT DETAIL'!$C$8:$I$107,6)","v":0}]
[null,null,"Class & Section",null,null,"●→",{"$f":"IF(G1011=0,0,CONCATENATE('STUDENT DETAIL'!$E$4,'STUDENT DETAIL'!$H$4))","v":0}]
[null,null,"Date Of Birth",null,null,"●→",{"$f":"VLOOKUP(A1006,'STUDENT DETAIL'!$C$8:$I$107,7)","v":"00:00:00"}]
[null,null,"Time Table"]
[null,null,"Subject",null,null,"Date (Day)",null,"Time"]
[null,null,{"$f":"'TIME TABLE'!$F$5","v":"Hindi"},null,null,{"$f":"IF(C1019=0,0,'TIME TABLE'!$B$5)","v":"2022-03-31"},{"$f":"IF(C1019=0,0,CONCATENATE('TIME TABLE'!$C$5,'TIME TABLE'!$D$5,'TIME TABLE'!$E$5))","v":"(Thursday)"},{"$f":"IF(C1019=0,0,'TIME TABLE'!$C$3)","v":"09:00 AM to 11:45 AM"}]
[null,null,{"$f":"'TIME TABLE'!$F$6","v":"English"},null,null,{"$f":"IF(C1020=0,0,'TIME TABLE'!$B$6)","v":"2022-04-01"},{"$f":"IF(C1020=0,0,CONCATENATE('TIME TABLE'!$C$6,'TIME TABLE'!$D$6,'TIME TABLE'!$E$6))","v":"(Friday)"},{"$f":"IF(C1020=0,0,'TIME TABLE'!$C$3)","v":"09:00 AM to 11:45 AM"}]
[null,null,{"$f":"'TIME TABLE'!$F$7","v":"Science"},null,null,{"$f":"IF(C1021=0,0,'TIME TABLE'!$B$7)","v":"2022-04-02"},{"$f":"IF(C1021=0,0,CONCATENATE('TIME TABLE'!$C$7,'TIME TABLE'!$D$7,'TIME TABLE'!$E$7))","v":"(Saturday)"},{"$f":"IF(C1021=0,0,'TIME TABLE'!$C$3)","v":"09:00 AM to 11:45 AM"}]
[null,null,{"$f":"'TIME TABLE'!$F$8","v":"Mathematics"},null,null,{"$f":"IF(C1022=0,0,'TIME TABLE'!$B$8)","v":"2022-04-03"},{"$f":"IF(C1022=0,0,CONCATENATE('TIME TABLE'!$C$8,'TIME TABLE'!$D$8,'TIME TABLE'!$E$8))","v":"(Sunday)"},{"$f":"IF(C1022=0,0,'TIME TABLE'!$C$3)","v":"09:00 AM to 11:45 AM"}]
[null,null,{"$f":"'TIME TABLE'!$F$9","v":"Social Study"},null,null,{"$f":"IF(C1023=0,0,'TIME TABLE'!$B$9)","v":"2022-04-04"},{"$f":"IF(C1023=0,0,CONCATENATE('TIME TABLE'!$C$9,'TIME TABLE'!$D$9,'TIME TABLE'!$E$9))","v":"(Monday)"},{"$f":"IF(C1023=0,0,'TIME TABLE'!$C$3)","v":"09:00 AM to 11:45 AM"}]
[null,null,{"$f":"'TIME TABLE'!$F$10","v":"Sanskrit"},null,null,{"$f":"IF(C1024=0,0,'TIME TABLE'!$B$10)","v":"2022-04-05"},{"$f":"IF(C1024=0,0,CONCATENATE('TIME TABLE'!$C$10,'TIME TABLE'!$D$10,'TIME TABLE'!$E$10))","v":"(Tuesday)"},{"$f":"IF(C1024=0,0,'TIME TABLE'!$C$3)","v":"09:00 AM to 11:45 AM"}]
[null,null,{"$f":"'TIME TABLE'!$F$11","v":0},null,null,{"$f":"IF(C1025=0,0,'TIME TABLE'!$B$11)","v":"00:00:00"},{"$f":"IF(C1025=0,0,CONCATENATE('TIME TABLE'!$C$11,'TIME TABLE'!$D$11,'TIME TABLE'!$E$11))","v":0},{"$f":"IF(C1025=0,0,'TIME TABLE'!$C$3)","v":0}]
[null,null,{"$f":"'TIME TABLE'!$F$12","v":0},null,null,{"$f":"IF(C1026=0,0,'TIME TABLE'!$B$12)","v":"00:00:00"},{"$f":"IF(C1026=0,0,CONCATENATE('TIME TABLE'!$C$12,'TIME TABLE'!$D$12,'TIME TABLE'!$E$12))","v":0},{"$f":"IF(C1026=0,0,'TIME TABLE'!$C$3)","v":0}]
[null,null,{"$f":"'TIME TABLE'!$F$13","v":0},null,null,{"$f":"IF(C1027=0,0,'TIME TABLE'!$B$13)","v":"00:00:00"},{"$f":"IF(C1027=0,0,CONCATENATE('TIME TABLE'!$C$13,'TIME TABLE'!$D$13,'TIME TABLE'!$E$13))","v":0},{"$f":"IF(C1027=0,0,'TIME TABLE'!$C$3)","v":0}]
[null,null,{"$f":"'TIME TABLE'!$F$14","v":0},null,null,{"$f":"IF(C1028=0,0,'TIME TABLE'!$B$14)","v":"00:00:00"},{"$f":"IF(C1028=0,0,CONCATENATE('TIME TABLE'!$C$14,'TIME TABLE'!$D$14,'TIME TABLE'!$E$14))","v":0},{"$f":"IF(C1028=0,0,'TIME TABLE'!$C$3)","v":0}]
[null,null,"Instructions"]
[null,null,1,"Check the exam time table carefully."]
[null,null,2,"Students must bring the 'Admit Card' and show it to the invigilator(s) on duty and should preserve it for future requirements."]
[null,null,3,"Mobile Phone, Calculator, Digital Watch or any Electronic Device is NOT ALLOWED."]
[null,null,4,"Arrive at the School at least 15 minutes before the start examination."]
[null,null,5,"Student is barred from entering the examination hall 15 minutes after the written examination starts."]
[null,null,6,"Ensure that you use the washroom before arriving for your exam as you will not be permitted to leave during the first hour."]
[null,null,7,"Normally, you are required to answer questionsusing blue or black in . Make sure you bring some spare pens with you."]
[null,null,8,"Keep your eyes on your own paper. Remember, copying is cheating!"]
[null,null,9,"You must remain silent until after you have exited the school building."]
[]
[{"$f":"A1006+1","v":32}]
[{"$nulls":4},{"$f":"MASTER!$E$11","v":"Govt. Sr. Secondary School Raimalwada"}]
[{"$nulls":4},{"$f":"MASTER!$E$14","v":"P.S.-Bapini (Jodhpur)"}]
[null,{"$f":"CONCATENATE(C1044,'TIME TABLE'!$C$5,'ADMIT CARD'!$C1045,$F1045,'ADMIT CARD'!$G1045,'TIME TABLE'!$E$5)","v":"ADMIT CARD(Roll Number●→0)"},{"$f":"CONCATENATE('TIME TABLE'!$B$2,'TIME TABLE'!$F$2)","v":"HALF YEARLY EXAM:2021-22"}]
[null,null,"ADMIT CARD",{"$nulls":6}," "]
[null,null,"Roll Number",null,null,"●→",{"$f":"VLOOKUP(A1040,'STUDENT DETAIL'!$C$8:$I$107,3)","v":0},null,"Seal and Signature of Head of Institution"]
[null,null,"Student's Name",null,null,"●→",{"$f":"VLOOKUP(A1040,'STUDENT DETAIL'!$C$8:$I$107,4)","v":0}]
[null,null,"Father's Name",null,null,"●→",{"$f":"VLOOKUP(A1040,'STUDENT DETAIL'!$C$8:$I$107,5)","v":0}]
[null,null,"Mother's Name ",null,null,"●→",{"$f":"VLOOKUP(A1040,'STUDENT DETAIL'!$C$8:$I$107,6)","v":0}]
[null,null,"Class & Section",null,null,"●→",{"$f":"IF(G1045=0,0,CONCATENATE('STUDENT DETAIL'!$E$4,'STUDENT DETAIL'!$H$4))","v":0}]
[null,null,"Date Of Birth",null,null,"●→",{"$f":"VLOOKUP(A1040,'STUDENT DETAIL'!$C$8:$I$107,7)","v":"00:00:00"}]
[null,null,"Time Table"]
[null,null,"Subject",null,null,"Date (Day)",null,"Time"]
[null,null,{"$f":"'TIME TABLE'!$F$5","v":"Hindi"},null,null,{"$f":"IF(C1053=0,0,'TIME TABLE'!$B$5)","v":"2022-03-31"},{"$f":"IF(C1053=0,0,CONCATENATE('TIME TABLE'!$C$5,'TIME TABLE'!$D$5,'TIME TABLE'!$E$5))","v":"(Thursday)"},{"$f":"IF(C1053=0,0,'TIME TABLE'!$C$3)","v":"09:00 AM to 11:45 AM"}]
[null,null,{"$f":"'TIME TABLE'!$F$6","v":"English"},null,null,{"$f":"IF(C1054=0,0,'TIME TABLE'!$B$6)","v":"2022-04-01"},{"$f":"IF(C1054=0,0,CONCATENATE('TIME TABLE'!$C$6,'TIME TABLE'!$D$6,'TIME TABLE'!$E$6))","v":"(Friday)"},{"$f":"IF(C1054=0,0,'TIME TABLE'!$C$3)","v":"09:00 AM to 11:45 AM"}]
[null,null,{"$f":"'TIME TABLE'!$F$7","v":"Science"},null,null,{"$f":"IF(C1055=0,0,'TIME TABLE'!$B$7)","v":"2022-04-02"},{"$f":"IF(C1055=0,0,CONCATENATE('TIME TABLE'!$C$7,'TIME TABLE'!$D$7,'TIME TABLE'!$E$7))","v":"(Saturday)"},{"$f":"IF(C1055=0,0,'TIME TABLE'!$C$3)","v":"09:00 AM to 11:45 AM"}]
[null,null,{"$f":"'TIME TABLE'!$F$8","v":"Mathematics"},null,null,{"$f":"IF(C1056=0,0,'TIME TABLE'!$B$8)","v":"2022-04-03"},{"$f":"IF(C1056=0,0,CONCATENATE('TIME TABLE'!$C$8,'TIME TABLE'!$D$8,'TIME TABLE'!$E$8))","v":"(Sunday)"},{"$f":"IF(C1056=0,0,'TIME TABLE'!$C$3)","v":"09:00 AM to 11:45 AM"}]
[null,null,{"$f":"'TIME TABLE'!$F$9","v":"Social Study"},null,null,{"$f":"IF(C1057=0,0,'TIME TABLE'!$B$9)","v":"2022-04-04"},{"$f":"IF(C1057=0,0,CONCATENATE('TIME TABLE'!$C$9,'TIME TABLE'!$D$9,'TIME TABLE'!$E$9))","v":"(Monday)"},{"$f":"IF(C1057=0,0,'TIME TABLE'!$C$3)","v":"09:00 AM to 11:45 AM"}]
[null,null,{"$f":"'TIME TABLE'!$F$10","v":"Sanskrit"},null,null,{"$f":"IF(C1058=0,0,'TIME TABLE'!$B$10)","v":"2022-04-05"},{"$f":"IF(C1058=0,0,CONCATENATE('TIME TABLE'!$C$10,'TIME TABLE'!$D$10,'TIME TABLE'!$E$10))","v":"(Tuesday)"},{"$f":"IF(C1058=0,0,'TIME TABLE'!$C$3)","v":"09:00 AM to 11:45 AM"}]
[null,null,{"$f":"'TIME TABLE'!$F$11","v":0},null,null,{"$f":"IF(C1059=0,0,'TIME TABLE'!$B$11)","v":"00:00:00"},{"$f":"IF(C1059=0,0,CONCATENATE('TIME TABLE'!$C$11,'TIME TABLE'!$D$11,'TIME TABLE'!$E$11))","v":0},{"$f":"IF(C1059=0,0,'TIME TABLE'!$C$3)","v":0}]
[null,null,{"$f":"'TIME TABLE'!$F$12","v":0},null,null,{"$f":"IF(C1060=0,0,'TIME TABLE'!$B$12)","v":"00:00:00"},{"$f":"IF(C1060=0,0,CONCATENATE('TIME TABLE'!$C$12,'TIME TABLE'!$D$12,'TIME TABLE'!$E$12))","v":0},{"$f":"IF(C1060=0,0,'TIME TABLE'!$C$3)","v":0}]
[null,null,{"$f":"'TIME TABLE'!$F$13","v":0},null,null,{"$f":"IF(C1061=0,0,'TIME TABLE'!$B$13)","v":"00:00:00"},{"$f":"IF(C1061=0,0,CONCATENATE('TIME TABLE'!$C$13,'TIME TABLE'!$D$13,'TIME TABLE'!$E$13))","v":0},{"$f":"IF(C1061=0,0,'TIME TABLE'!$C$3)","v":0}]
[null,null,{"$f":"'TIME TABLE'!$F$14","v":0},null,null,{"$f":"IF(C1062=0,0,'TIME TABLE'!$B$14)","v":"00:00:00"},{"$f":"IF(C1062=0,0,CONCATENATE('TIME TABLE'!$C$14,'TIME TABLE'!$D$14,'TIME TABLE'!$E$14))","v":0},{"$f":"IF(C1062=0,0,'TIME TABLE'!$C$3)","v":0}]
[null,null,"Instructions"]
[null,null,1,"Check the exam time table carefully."]
[null,null,2,"Students must bring the 'Admit Card' and show it to the invigilator(s) on duty and should preserve it for future requirements."]
[null,null,3,"Mobile Phone, Calculator, Digital Watch or any Electronic Device is NOT ALLOWED."]
[null,null,4,"Arrive at the School at least 15 minutes before the start examination."]
[null,null,5,"Student is barred from entering the examination hall 15 minutes after the written examination starts."]
[null,null,6,"Ensure that you use the washroom before arriving for your exam as you will not be permitted to leave during the first hour."]
[null,null,7,"Normally, you are required to answer questionsusing blue or black in . Make sure you bring some spare pens with you."]
[null,null,8,"Keep your eyes on your own paper. Remember, copying is cheating!"]
[null,null,9,"You must remain silent until after you have exited the school building."]
[{"$f":"A1040+1","v":33}]
[{"$nulls":4},{"$f":"MASTER!$E$11","v":"Govt. Sr. Secondary School Raimalwada"}]
[{"$nulls":4},{"$f":"MASTER!$E$14","v":"P.S.-Bapini (Jodhpur)"}]
[null,{"$f":"CONCATENATE(C1077,'TIME TABLE'!$C$5,'ADMIT CARD'!$C1078,$F1078,'ADMIT CARD'!$G1078,'TIME TABLE'!$E$5)","v":"ADMIT CARD(Roll Number●→0)"},{"$f":"CONCATENATE('TIME TABLE'!$B$2,'TIME TABLE'!$F$2)","v":"HALF YEARLY EXAM:2021-22"}]
[null,null,"ADMIT CARD",{"$nulls":6}," "]
[null,null,"Roll Number",null,null,"●→",{"$f":"VLOOKUP(A1073,'STUDENT DETAIL'!$C$8:$I$107,3)","v":0},null,"Seal and Signature of Head of Institution"]
[null,null,"Student's Name",null,null,"●→",{"$f":"VLOOKUP(A1073,'STUDENT DETAIL'!$C$8:$I$107,4)","v":0}]
[null,null,"Father's Name",null,null,"●→",{"$f":"VLOOKUP(A1073,'STUDENT DETAIL'!$C$8:$I$107,5)","v":0}]
[null,null,"Mother's Name ",null,null,"●→",{"$f":"VLOOKUP(A1073,'STUDENT DETAIL'!$C$8:$I$107,6)","v":0}]
[null,null,"Class & Section",null,null,"●→",{"$f":"IF(G1078=0,0,CONCATENATE('STUDENT DETAIL'!$E$4,'STUDENT DETAIL'!$H$4))","v":0}]
[null,null,"Date Of Birth",null,null,"●→",{"$f":"VLOOKUP(A1073,'STUDENT DETAIL'!$C$8:$I$107,7)","v":"00:00:00"}]
[null,null,"Time Table"]
[null,null,"Subject",null,null,"Date (Day)",null,"Time"]
[null,null,{"$f":"'TIME TABLE'!$F$5","v":"Hindi"},null,null,{"$f":"IF(C1086=0,0,'TIME TABLE'!$B$5)","v":"2022-03-31"},{"$f":"IF(C1086=0,0,CONCATENATE('TIME TABLE'!$C$5,'TIME TABLE'!$D$5,'TIME TABLE'!$E$5))","v":"(Thursday)"},{"$f":"IF(C1086=0,0,'TIME TABLE'!$C$3)","v":"09:00 AM to 11:45 AM"}]
[null,null,{"$f":"'TIME TABLE'!$F$6","v":"English"},null,null,{"$f":"IF(C1087=0,0,'TIME TABLE'!$B$6)","v":"2022-04-01"},{"$f":"IF(C1087=0,0,CONCATENATE('TIME TABLE'!$C$6,'TIME TABLE'!$D$6,'TIME TABLE'!$E$6))","v":"(Friday)"},{"$f":"IF(C1087=0,0,'TIME TABLE'!$C$3)","v":"09:00 AM to 11:45 AM"}]
[null,null,{"$f":"'TIME TABLE'!$F$7","v":"Science"},null,null,{"$f":"IF(C1088=0,0,'TIME TABLE'!$B$7)","v":"2022-04-02"},{"$f":"IF(C1088=0,0,CONCATENATE('TIME TABLE'!$C$7,'TIME TABLE'!$D$7,'TIME TABLE'!$E$7))","v":"(Saturday)"},{"$f":"IF(C1088=0,0,'TIME TABLE'!$C$3)","v":"09:00 AM to 11:45 AM"}]
[null,null,{"$f":"'TIME TABLE'!$F$8","v":"Mathematics"},null,null,{"$f":"IF(C1089=0,0,'TIME TABLE'!$B$8)","v":"2022-04-03"},{"$f":"IF(C1089=0,0,CONCATENATE('TIME TABLE'!$C$8,'TIME TABLE'!$D$8,'TIME TABLE'!$E$8))","v":"(Sunday)"},{"$f":"IF(C1089=0,0,'TIME TABLE'!$C$3)","v":"09:00 AM to 11:45 AM"}]
[null,null,{"$f":"'TIME TABLE'!$F$9","v":"Social Study"},null,null,{"$f":"IF(C1090=0,0,'TIME TABLE'!$B$9)","v":"2022-04-04"},{"$f":"IF(C1090=0,0,CONCATENATE('TIME TABLE'!$C$9,'TIME TABLE'!$D$9,'TIME TABLE'!$E$9))","v":"(Monday)"},{"$f":"IF(C1090=0,0,'TIME TABLE'!$C$3)","v":"09:00 AM to 11:45 AM"}]
[null,null,{"$f":"'TIME TABLE'!$F$10","v":"Sanskrit"},null,null,{"$f":"IF(C1091=0,0,'TIME TABLE'!$B$10)","v":"2022-04-05"},{"$f":"IF(C1091=0,0,CONCATENATE('TIME TABLE'!$C$10,'TIME TABLE'!$D$10,'TIME TABLE'!$E$10))","v":"(Tuesday)"},{"$f":"IF(C1091=0,0,'TIME TABLE'!$C$3)","v":"09:00 AM to 11:45 AM"}]
[null,null,{"$f":"'TIME TABLE'!$F$11","v":0},null,null,{"$f":"IF(C1092=0,0,'TIME TABLE'!$B$11)","v":"00:00:00"},{"$f":"IF(C1092=0,0,CONCATENATE('TIME TABLE'!$C$11,'TIME TABLE'!$D$11,'TIME TABLE'!$E$11))","v":0},{"$f":"IF(C1092=0,0,'TIME TABLE'!$C$3)","v":0}]
[null,null,{"$f":"'TIME TABLE'!$F$12","v":0},null,null,{"$f":"IF(C1093=0,0,'TIME TABLE'!$B$12)","v":"00:00:00"},{"$f":"IF(C1093=0,0,CONCATENATE('TIME TABLE'!$C$12,'TIME TABLE'!$D$12,'TIME TABLE'!$E$12))","v":0},{"$f":"IF(C1093=0,0,'TIME TABLE'!$C$3)","v":0}]
[null,null,{"$f":"'TIME TABLE'!$F$13","v":0},null,null,{"$f":"IF(C1094=0,0,'TIME TABLE'!$B$13)","v":"00:00:00"},{"$f":"IF(C1094=0,0,CONCATENATE('TIME TABLE'!$C$13,'TIME TABLE'!$D$13,'TIME TABLE'!$E$13))","v":0},{"$f":"IF(C1094=0,0,'TIME TABLE'!$C$3)","v":0}]
[null,null,{"$f":"'TIME TABLE'!$F$14","v":0},null,null,{"$f":"IF(C1095=0,0,'TIME TABLE'!$B$14)","v":"00:00:00"},{"$f":"IF(C1095=0,0,CONCATENATE('TIME TABLE'!$C$14,'TIME TABLE'!$D$14,'TIME TABLE'!$E$14))","v":0},{"$f":"IF(C1095=0,0,'TIME TABLE'!$C$3)","v":0}]
[null,null,"Instructions"]
[null,null,1,"Check the exam time table carefully."]
[null,null,2,"Students must bring the 'Admit Card' and show it to the invigilator(s) on duty and should preserve it for future requirements."]
[null,null,3,"Mobile Phone, Calculator, Digital Watch or any Electronic Device is NOT ALLOWED."]
[null,null,4,"Arrive at the School at least 15 minutes before the start examination."]
[null,null,5,"Student is barred from entering the examination hall 15 minutes after the written examination starts."]
[null,null,6,"Ensure that you use the washroom before arriving for your exam as you will not be permitted to leave during the first hour."]
[null,null,7,"Normally, you are required to answer questionsusing blue or black in . Make sure you bring some spare pens with you."]
[null,null,8,"Keep your eyes on your own paper. Remember, copying is cheating!"]
[null,null,9,"You must remain silent until after you have exited the school building."]
[]
[{"$f":"A1073+1","v":34}]
[{"$nulls":4},{"$f":"MASTER!$E$11","v":"Govt. Sr. Secondary School Raimalwada"}]
[{"$nulls":4},{"$f":"MASTER!$E$14","v":"P.S.-Bapini (Jodhpur)"}]
[null,{"$f":"CONCATENATE(C1111,'TIME TABLE'!$C$5,'ADMIT CARD'!$C1112,$F1112,'ADMIT CARD'!$G1112,'TIME TABLE'!$E$5)","v":"ADMIT CARD(Roll Number●→0)"},{"$f":"CONCATENATE('TIME TABLE'!$B$2,'TIME TABLE'!$F$2)","v":"HALF YEARLY EXAM:2021-22"}]
[null,null,"ADMIT CARD",{"$nulls":6}," "]
[null,null,"Roll Number",null,null,"●→",{"$f":"VLOOKUP(A1107,'STUDENT DETAIL'!$C$8:$I$107,3)","v":0},null,"Seal and Signature of Head of Institution"]
[null,null,"Student's Name",null,null,"●→",{"$f":"VLOOKUP(A1107,'STUDENT DETAIL'!$C$8:$I$107,4)","v":0}]
[null,null,"Father's Name",null,null,"●→",{"$f":"VLOOKUP(A1107,'STUDENT DETAIL'!$C$8:$I$107,5)","v":0}]
[null,null,"Mother's Name ",null,null,"●→",{"$f":"VLOOKUP(A1107,'STUDENT DETAIL'!$C$8:$I$107,6)","v":0}]
[null,null,"Class & Section",null,null,"●→",{"$f":"IF(G1112=0,0,CONCATENATE('STUDENT DETAIL'!$E$4,'STUDENT DETAIL'!$H$4))","v":0}]
[null,null,"Date Of Birth",null,null,"●→",{"$f":"VLOOKUP(A1107,'STUDENT DETAIL'!$C$8:$I$107,7)","v":"00:00:00"}]
[null,null,"Time Table"]
[null,null,"Subject",null,null,"Date (Day)",null,"Time"]
[null,null,{"$f":"'TIME TABLE'!$F$5","v":"Hindi"},null,null,{"$f":"IF(C1120=0,0,'TIME TABLE'!$B$5)","v":"2022-03-31"},{"$f":"IF(C1120=0,0,CONCATENATE('TIME TABLE'!$C$5,'TIME TABLE'!$D$5,'TIME TABLE'!$E$5))","v":"(Thursday)"},{"$f":"IF(C1120=0,0,'TIME TABLE'!$C$3)","v":"09:00 AM to 11:45 AM"}]
[null,null,{"$f":"'TIME TABLE'!$F$6","v":"English"},null,null,{"$f":"IF(C1121=0,0,'TIME TABLE'!$B$6)","v":"2022-04-01"},{"$f":"IF(C1121=0,0,CONCATENATE('TIME TABLE'!$C$6,'TIME TABLE'!$D$6,'TIME TABLE'!$E$6))","v":"(Friday)"},{"$f":"IF(C1121=0,0,'TIME TABLE'!$C$3)","v":"09:00 AM to 11:45 AM"}]
[null,null,{"$f":"'TIME TABLE'!$F$7","v":"Science"},null,null,{"$f":"IF(C1122=0,0,'TIME TABLE'!$B$7)","v":"2022-04-02"},{"$f":"IF(C1122=0,0,CONCATENATE('TIME TABLE'!$C$7,'TIME TABLE'!$D$7,'TIME TABLE'!$E$7))","v":"(Saturday)"},{"$f":"IF(C1122=0,0,'TIME TABLE'!$C$3)","v":"09:00 AM to 11:45 AM"}]
[null,null,{"$f":"'TIME TABLE'!$F$8","v":"Mathematics"},null,null,{"$f":"IF(C1123=0,0,'TIME TABLE'!$B$8)","v":"2022-04-03"},{"$f":"IF(C1123=0,0,CONCATENATE('TIME TABLE'!$C$8,'TIME TABLE'!$D$8,'TIME TABLE'!$E$8))","v":"(Sunday)"},{"$f":"IF(C1123=0,0,'TIME TABLE'!$C$3)","v":"09:00 AM to 11:45 AM"}]
[null,null,{"$f":"'TIME TABLE'!$F$9","v":"Social Study"},null,null,{"$f":"IF(C1124=0,0,'TIME TABLE'!$B$9)","v":"2022-04-04"},{"$f":"IF(C1124=0,0,CONCATENATE('TIME TABLE'!$C$9,'TIME TABLE'!$D$9,'TIME TABLE'!$E$9))","v":"(Monday)"},{"$f":"IF(C1124=0,0,'TIME TABLE'!$C$3)","v":"09:00 AM to 11:45 AM"}]
[null,null,{"$f":"'TIME TABLE'!$F$10","v":"Sanskrit"},null,null,{"$f":"IF(C1125=0,0,'TIME TABLE'!$B$10)","v":"2022-04-05"},{"$f":"IF(C1125=0,0,CONCATENATE('TIME TABLE'!$C$10,'TIME TABLE'!$D$10,'TIME TABLE'!$E$10))","v":"(Tuesday)"},{"$f":"IF(C1125=0,0,'TIME TABLE'!$C$3)","v":"09:00 AM to 11:45 AM"}]
[null,null,{"$f":"'TIME TABLE'!$F$11","v":0},null,null,{"$f":"IF(C1126=0,0,'TIME TABLE'!$B$11)","v":"00:00:00"},{"$f":"IF(C1126=0,0,CONCATENATE('TIME TABLE'!$C$11,'TIME TABLE'!$D$11,'TIME TABLE'!$E$11))","v":0},{"$f":"IF(C1126=0,0,'TIME TABLE'!$C$3)","v":0}]
[null,null,{"$f":"'TIME TABLE'!$F$12","v":0},null,null,{"$f":"IF(C1127=0,0,'TIME TABLE'!$B$12)","v":"00:00:00"},{"$f":"IF(C1127=0,0,CONCATENATE('TIME TABLE'!$C$12,'TIME TABLE'!$D$12,'TIME TABLE'!$E$12))","v":0},{"$f":"IF(C1127=0,0,'TIME TABLE'!$C$3)","v":0}]
[null,null,{"$f":"'TIME TABLE'!$F$13","v":0},null,null,{"$f":"IF(C1128=0,0,'TIME TABLE'!$B$13)","v":"00:00:00"},{"$f":"IF(C1128=0,0,CONCATENATE('TIME TABLE'!$C$13,'TIME TABLE'!$D$13,'TIME TABLE'!$E$13))","v":0},{"$f":"IF(C1128=0,0,'TIME TABLE'!$C$3)","v":0}]
[null,null,{"$f":"'TIME TABLE'!$F$14","v":0},null,null,{"$f":"IF(C1129=0,0,'TIME TABLE'!$B$14)","v":"00:00:00"},{"$f":"IF(C1129=0,0,CONCATENATE('TIME TABLE'!$C$14,'TIME TABLE'!$D$14,'TIME TABLE'!$E$14))","v":0},{"$f":"IF(C1129=0,0,'TIME TABLE'!$C$3)","v":0}]
[null,null,"Instructions"]
[null,null,1,"Check the exam time table carefully."]
[null,null,2,"Students must bring the 'Admit Card' and show it to the invigilator(s) on duty and should preserve it for future requirements."]
[null,null,3,"Mobile Phone, Calculator, Digital Watch or any Electronic Device is NOT ALLOWED."]
[null,null,4,"Arrive at the School at least 15 minutes before the start examination."]
[null,null,5,"Student is barred from entering the examination hall 15 minutes after the written examination starts."]
[null,null,6,"Ensure that you use the washroom before arriving for your exam as you will not be permitted to leave during the first hour."]
[null,null,7,"Normally, you are required to answer questionsusing blue or black in . Make sure you bring some spare pens with you."]
[null,null,8,"Keep your eyes on your own paper. Remember, copying is cheating!"]
[null,null,9,"You must remain silent until after you have exited the school building."]
[{"$f":"A1107+1","v":35}]
[{"$nulls":4},{"$f":"MASTER!$E$11","v":"Govt. Sr. Secondary School Raimalwada"}]
[{"$nulls":4},{"$f":"MASTER!$E$14","v":"P.S.-Bapini (Jodhpur)"}]
[null,{"$f":"CONCATENATE(C1144,'TIME TABLE'!$C$5,'ADMIT CARD'!$C1145,$F1145,'ADMIT CARD'!$G1145,'TIME TABLE'!$E$5)","v":"ADMIT CARD(Roll Number●→0)"},{"$f":"CONCATENATE('TIME TABLE'!$B$2,'TIME TABLE'!$F$2)","v":"HALF YEARLY EXAM:2021-22"}]
[null,null,"ADMIT CARD",{"$nulls":6}," "]
[null,null,"Roll Number",null,null,"●→",{"$f":"VLOOKUP(A1140,'STUDENT DETAIL'!$C$8:$I$107,3)","v":0},null,"Seal and Signature of Head of Institution"]
[null,null,"Student's Name",null,null,"●→",{"$f":"VLOOKUP(A1140,'STUDENT DETAIL'!$C$8:$I$107,4)","v":0}]
[null,null,"Father's Name",null,null,"●→",{"$f":"VLOOKUP(A1140,'STUDENT DETAIL'!$C$8:$I$107,5)","v":0}]
[null,null,"Mother's Name ",null,null,"●→",{"$f":"VLOOKUP(A1140,'STUDENT DETAIL'!$C$8:$I$107,6)","v":0}]
[null,null,"Class & Section",null,null,"●→",{"$f":"IF(G1145=0,0,CONCATENATE('STUDENT DETAIL'!$E$4,'STUDENT DETAIL'!$H$4))","v":0}]
[null,null,"Date Of Birth",null,null,"●→",{"$f":"VLOOKUP(A1140,'STUDENT DETAIL'!$C$8:$I$107,7)","v":"00:00:00"}]
[null,null,"Time Table"]
[null,null,"Subject",null,null,"Date (Day)",null,"Time"]
[null,null,{"$f":"'TIME TABLE'!$F$5","v":"Hindi"},null,null,{"$f":"IF(C1153=0,0,'TIME TABLE'!$B$5)","v":"2022-03-31"},{"$f":"IF(C1153=0,0,CONCATENATE('TIME TABLE'!$C$5,'TIME TABLE'!$D$5,'TIME TABLE'!$E$5))","v":"(Thursday)"},{"$f":"IF(C1153=0,0,'TIME TABLE'!$C$3)","v":"09:00 AM to 11:45 AM"}]
[null,null,{"$f":"'TIME TABLE'!$F$6","v":"English"},null,null,{"$f":"IF(C1154=0,0,'TIME TABLE'!$B$6)","v":"2022-04-01"},{"$f":"IF(C1154=0,0,CONCATENATE('TIME TABLE'!$C$6,'TIME TABLE'!$D$6,'TIME TABLE'!$E$6))","v":"(Friday)"},{"$f":"IF(C1154=0,0,'TIME TABLE'!$C$3)","v":"09:00 AM to 11:45 AM"}]
[null,null,{"$f":"'TIME TABLE'!$F$7","v":"Science"},null,null,{"$f":"IF(C1155=0,0,'TIME TABLE'!$B$7)","v":"2022-04-02"},{"$f":"IF(C1155=0,0,CONCATENATE('TIME TABLE'!$C$7,'TIME TABLE'!$D$7,'TIME TABLE'!$E$7))","v":"(Saturday)"},{"$f":"IF(C1155=0,0,'TIME TABLE'!$C$3)","v":"09:00 AM to 11:45 AM"}]
[null,null,{"$f":"'TIME TABLE'!$F$8","v":"Mathematics"},null,null,{"$f":"IF(C1156=0,0,'TIME TABLE'!$B$8)","v":"2022-04-03"},{"$f":"IF(C1156=0,0,CONCATENATE('TIME TABLE'!$C$8,'TIME TABLE'!$D$8,'TIME TABLE'!$E$8))","v":"(Sunday)"},{"$f":"IF(C1156=0,0,'TIME TABLE'!$C$3)","v":"09:00 AM to 11:45 AM"}]
[null,null,{"$f":"'TIME TABLE'!$F$9","v":"Social Study"},null,null,{"$f":"IF(C1157=0,0,'TIME TABLE'!$B$9)","v":"2022-04-04"},{"$f":"IF(C1157=0,0,CONCATENATE('TIME TABLE'!$C$9,'TIME TABLE'!$D$9,'TIME TABLE'!$E$9))","v":"(Monday)"},{"$f":"IF(C1157=0,0,'TIME TABLE'!$C$3)","v":"09:00 AM to 11:45 AM"}]
[null,null,{"$f":"'TIME TABLE'!$F$10","v":"Sanskrit"},null,null,{"$f":"IF(C1158=0,0,'TIME TABLE'!$B$10)","v":"2022-04-05"},{"$f":"IF(C1158=0,0,CONCATENATE('TIME TABLE'!$C$10,'TIME TABLE'!$D$10,'TIME TABLE'!$E$10))","v":"(Tuesday)"},{"$f":"IF(C1158=0,0,'TIME TABLE'!$C$3)","v":"09:00 AM to 11:45 AM"}]
[null,null,{"$f":"'TIME TABLE'!$F$11","v":0},null,null,{"$f":"IF(C1159=0,0,'TIME TABLE'!$B$11)","v":"00:00:00"},{"$f":"IF(C1159=0,0,CONCATENATE('TIME TABLE'!$C$11,'TIME TABLE'!$D$11,'TIME TABLE'!$E$11))","v":0},{"$f":"IF(C1159=0,0,'TIME TABLE'!$C$3)","v":0}]
[null,null,{"$f":"'TIME TABLE'!$F$12","v":0},null,null,{"$f":"IF(C1160=0,0,'TIME TABLE'!$B$12)","v":"00:00:00"},{"$f":"IF(C1160=0,0,CONCATENATE('TIME TABLE'!$C$12,'TIME TABLE'!$D$12,'TIME TABLE'!$E$12))","v":0},{"$f":"IF(C1160=0,0,'TIME TABLE'!$C$3)","v":0}]
[null,null,{"$f":"'TIME TABLE'!$F$13","v":0},null,null,{"$f":"IF(C1161=0,0,'TIME TABLE'!$B$13)","v":"00:00:00"},{"$f":"IF(C1161=0,0,CONCATENATE('TIME TABLE'!$C$13,'TIME TABLE'!$D$13,'TIME TABLE'!$E$13))","v":0},{"$f":"IF(C1161=0,0,'TIME TABLE'!$C$3)","v":0}]
[null,null,{"$f":"'TIME TABLE'!$F$14","v":0},null,null,{"$f":"IF(C1162=0,0,'TIME TABLE'!$B$14)","v":"00:00:00"},{"$f":"IF(C1162=0,0,CONCATENATE('TIME TABLE'!$C$14,'TIME TABLE'!$D$14,'TIME TABLE'!$E$14))","v":0},{"$f":"IF(C1162=0,0,'TIME TABLE'!$C$3)","v":0}]
[null,null,"Instructions"]
[null,null,1,"Check the exam time table carefully."]
[null,null,2,"Students must bring the 'Admit Card' and show it to the invigilator(s) on duty and should preserve it for future requirements."]
[null,null,3,"Mobile Phone, Calculator, Digital Watch or any Electronic Device is NOT ALLOWED."]
[null,null,4,"Arrive at the School at least 15 minutes before the start examination."]
[null,null,5,"Student is barred from entering the examination hall 15 minutes after the written examination starts."]
[null,null,6,"Ensure that you use the washroom before arriving for your exam as you will not be permitted to leave during the first hour."]
[null,null,7,"Normally, you are required to answer questionsusing blue or black in . Make sure you bring some spare pens with you."]
[null,null,8,"Keep your eyes on your own paper. Remember, copying is cheating!"]
[null,null,9,"You must remain silent until after you have exited the school building."]
[]
[{"$f":"A1140+1","v":36}]
[{"$nulls":4},{"$f":"MASTER!$E$11","v":"Govt. Sr. Secondary School Raimalwada"}]
[{"$nulls":4},{"$f":"MASTER!$E$14","v":"P.S.-Bapini (Jodhpur)"}]
[null,{"$f":"CONCATENATE(C1178,'TIME TABLE'!$C$5,'ADMIT CARD'!$C1179,$F1179,'ADMIT CARD'!$G1179,'TIME TABLE'!$E$5)","v":"ADMIT CARD(Roll Number●→0)"},{"$f":"CONCATENATE('TIME TABLE'!$B$2,'TIME TABLE'!$F$2)","v":"HALF YEARLY EXAM:2021-22"}]
[null,null,"ADMIT CARD",{"$nulls":6}," "]
[null,null,"Roll Number",null,null,"●→",{"$f":"VLOOKUP(A1174,'STUDENT DETAIL'!$C$8:$I$107,3)","v":0},null,"Seal and Signature of Head of Institution"]
[null,null,"Student's Name",null,null,"●→",{"$f":"VLOOKUP(A1174,'STUDENT DETAIL'!$C$8:$I$107,4)","v":0}]
[null,null,"Father's Name",null,null,"●→",{"$f":"VLOOKUP(A1174,'STUDENT DETAIL'!$C$8:$I$107,5)","v":0}]
[null,null,"Mother's Name ",null,null,"●→",{"$f":"VLOOKUP(A1174,'STUDENT DETAIL'!$C$8:$I$107,6)","v":0}]
[null,null,"Class & Section",null,null,"●→",{"$f":"IF(G1179=0,0,CONCATENATE('STUDENT DETAIL'!$E$4,'STUDENT DETAIL'!$H$4))","v":0}]
[null,null,"Date Of Birth",null,null,"●→",{"$f":"VLOOKUP(A1174,'STUDENT DETAIL'!$C$8:$I$107,7)","v":"00:00:00"}]
[null,null,"Time Table"]
[null,null,"Subject",null,null,"Date (Day)",null,"Time"]
[null,null,{"$f":"'TIME TABLE'!$F$5","v":"Hindi"},null,null,{"$f":"IF(C1187=0,0,'TIME TABLE'!$B$5)","v":"2022-03-31"},{"$f":"IF(C1187=0,0,CONCATENATE('TIME TABLE'!$C$5,'TIME TABLE'!$D$5,'TIME TABLE'!$E$5))","v":"(Thursday)"},{"$f":"IF(C1187=0,0,'TIME TABLE'!$C$3)","v":"09:00 AM to 11:45 AM"}]
[null,null,{"$f":"'TIME TABLE'!$F$6","v":"English"},null,null,{"$f":"IF(C1188=0,0,'TIME TABLE'!$B$6)","v":"2022-04-01"},{"$f":"IF(C1188=0,0,CONCATENATE('TIME TABLE'!$C$6,'TIME TABLE'!$D$6,'TIME TABLE'!$E$6))","v":"(Friday)"},{"$f":"IF(C1188=0,0,'TIME TABLE'!$C$3)","v":"09:00 AM to 11:45 AM"}]
[null,null,{"$f":"'TIME TABLE'!$F$7","v":"Science"},null,null,{"$f":"IF(C1189=0,0,'TIME TABLE'!$B$7)","v":"2022-04-02"},{"$f":"IF(C1189=0,0,CONCATENATE('TIME TABLE'!$C$7,'TIME TABLE'!$D$7,'TIME TABLE'!$E$7))","v":"(Saturday)"},{"$f":"IF(C1189=0,0,'TIME TABLE'!$C$3)","v":"09:00 AM to 11:45 AM"}]
[null,null,{"$f":"'TIME TABLE'!$F$8","v":"Mathematics"},null,null,{"$f":"IF(C1190=0,0,'TIME TABLE'!$B$8)","v":"2022-04-03"},{"$f":"IF(C1190=0,0,CONCATENATE('TIME TABLE'!$C$8,'TIME TABLE'!$D$8,'TIME TABLE'!$E$8))","v":"(Sunday)"},{"$f":"IF(C1190=0,0,'TIME TABLE'!$C$3)","v":"09:00 AM to 11:45 AM"}]
[null,null,{"$f":"'TIME TABLE'!$F$9","v":"Social Study"},null,null,{"$f":"IF(C1191=0,0,'TIME TABLE'!$B$9)","v":"2022-04-04"},{"$f":"IF(C1191=0,0,CONCATENATE('TIME TABLE'!$C$9,'TIME TABLE'!$D$9,'TIME TABLE'!$E$9))","v":"(Monday)"},{"$f":"IF(C1191=0,0,'TIME TABLE'!$C$3)","v":"09:00 AM to 11:45 AM"}]
[null,null,{"$f":"'TIME TABLE'!$F$10","v":"Sanskrit"},null,null,{"$f":"IF(C1192=0,0,'TIME TABLE'!$B$10)","v":"2022-04-05"},{"$f":"IF(C1192=0,0,CONCATENATE('TIME TABLE'!$C$10,'TIME TABLE'!$D$10,'TIME TABLE'!$E$10))","v":"(Tuesday)"},{"$f":"IF(C1192=0,0,'TIME TABLE'!$C$3)","v":"09:00 AM to 11:45 AM"}]
[null,null,{"$f":"'TIME TABLE'!$F$11","v":0},null,null,{"$f":"IF(C1193=0,0,'TIME TABLE'!$B$11)","v":"00:00:00"},{"$f":"IF(C1193=0,0,CONCATENATE('TIME TABLE'!$C$11,'TIME TABLE'!$D$11,'TIME TABLE'!$E$11))","v":0},{"$f":"IF(C1193=0,0,'TIME TABLE'!$C$3)","v":0}]
[null,null,{"$f":"'TIME TABLE'!$F$12","v":0},null,null,{"$f":"IF(C1194=0,0,'TIME TABLE'!$B$12)","v":"00:00:00"},{"$f":"IF(C1194=0,0,CONCATENATE('TIME TABLE'!$C$12,'TIME TABLE'!$D$12,'TIME TABLE'!$E$12))","v":0},{"$f":"IF(C1194=0,0,'TIME TABLE'!$C$3)","v":0}]
[null,null,{"$f":"'TIME TABLE'!$F$13","v":0},null,null,{"$f":"IF(C1195=0,0,'TIME TABLE'!$B$13)","v":"00:00:00"},{"$f":"IF(C1195=0,0,CONCATENATE('TIME TABLE'!$C$13,'TIME TABLE'!$D$13,'TIME TABLE'!$E$13))","v":0},{"$f":"IF(C1195=0,0,'TIME TABLE'!$C$3)","v":0}]
[null,null,{"$f":"'TIME TABLE'!$F$14","v":0},null,null,{"$f":"IF(C1196=0,0,'TIME TABLE'!$B$14)","v":"00:00:00"},{"$f":"IF(C1196=0,0,CONCATENATE('TIME TABLE'!$C$14,'TIME TABLE'!$D$14,'TIME TABLE'!$E$14))","v":0},{"$f":"IF(C1196=0,0,'TIME TABLE'!$C$3)","v":0}]
[null,null,"Instructions"]
[null,null,1,"Check the exam time table carefully."]
[null,null,2,"Students must bring the 'Admit Card' and show it to the invigilator(s) on duty and should preserve it for future requirements."]
[null,null,3,"Mobile Phone, Calculator, Digital Watch or any Electronic Device is NOT ALLOWED."]
[null,null,4,"Arrive at the School at least 15 minutes before the start examination."]
[null,null,5,"Student is barred from entering the examination hall 15 minutes after the written examination starts."]
[null,null,6,"Ensure that you use the washroom before arriving for your exam as you will not be permitted to leave during the first hour."]
[null,null,7,"Normally, you are required to answer questionsusing blue or black in . Make sure you bring some spare pens with you."]
[null,null,8,"Keep your eyes on your own paper. Remember, copying is cheating!"]
[null,null,9,"You must remain silent until after you have exited the school building."]
[{"$f":"A1174+1","v":37}]
[{"$nulls":4},{"$f":"MASTER!$E$11","v":"Govt. Sr. Secondary School Raimalwada"}]
[{"$nulls":4},{"$f":"MASTER!$E$14","v":"P.S.-Bapini (Jodhpur)"}]
[null,{"$f":"CONCATENATE(C1211,'TIME TABLE'!$C$5,'ADMIT CARD'!$C1212,$F1212,'ADMIT CARD'!$G1212,'TIME TABLE'!$E$5)","v":"ADMIT CARD(Roll Number●→0)"},{"$f":"CONCATENATE('TIME TABLE'!$B$2,'TIME TABLE'!$F$2)","v":"HALF YEARLY EXAM:2021-22"}]
[null,null,"ADMIT CARD",{"$nulls":6}," "]
[null,null,"Roll Number",null,null,"●→",{"$f":"VLOOKUP(A1207,'STUDENT DETAIL'!$C$8:$I$107,3)","v":0},null,"Seal and Signature of Head of Institution"]
[null,null,"Student's Name",null,null,"●→",{"$f":"VLOOKUP(A1207,'STUDENT DETAIL'!$C$8:$I$107,4)","v":0}]
[null,null,"Father's Name",null,null,"●→",{"$f":"VLOOKUP(A1207,'STUDENT DETAIL'!$C$8:$I$107,5)","v":0}]
[null,null,"Mother's Name ",null,null,"●→",{"$f":"VLOOKUP(A1207,'STUDENT DETAIL'!$C$8:$I$107,6)","v":0}]
[null,null,"Class & Section",null,null,"●→",{"$f":"IF(G1212=0,0,CONCATENATE('STUDENT DETAIL'!$E$4,'STUDENT DETAIL'!$H$4))","v":0}]
[null,null,"Date Of Birth",null,null,"●→",{"$f":"VLOOKUP(A1207,'STUDENT DETAIL'!$C$8:$I$107,7)","v":"00:00:00"}]
[null,null,"Time Table"]
[null,null,"Subject",null,null,"Date (Day)",null,"Time"]
[null,null,{"$f":"'TIME TABLE'!$F$5","v":"Hindi"},null,null,{"$f":"IF(C1220=0,0,'TIME TABLE'!$B$5)","v":"2022-03-31"},{"$f":"IF(C1220=0,0,CONCATENATE('TIME TABLE'!$C$5,'TIME TABLE'!$D$5,'TIME TABLE'!$E$5))","v":"(Thursday)"},{"$f":"IF(C1220=0,0,'TIME TABLE'!$C$3)","v":"09:00 AM to 11:45 AM"}]
[null,null,{"$f":"'TIME TABLE'!$F$6","v":"English"},null,null,{"$f":"IF(C1221=0,0,'TIME TABLE'!$B$6)","v":"2022-04-01"},{"$f":"IF(C1221=0,0,CONCATENATE('TIME TABLE'!$C$6,'TIME TABLE'!$D$6,'TIME TABLE'!$E$6))","v":"(Friday)"},{"$f":"IF(C1221=0,0,'TIME TABLE'!$C$3)","v":"09:00 AM to 11:45 AM"}]
[null,null,{"$f":"'TIME TABLE'!$F$7","v":"Science"},null,null,{"$f":"IF(C1222=0,0,'TIME TABLE'!$B$7)","v":"2022-04-02"},{"$f":"IF(C1222=0,0,CONCATENATE('TIME TABLE'!$C$7,'TIME TABLE'!$D$7,'TIME TABLE'!$E$7))","v":"(Saturday)"},{"$f":"IF(C1222=0,0,'TIME TABLE'!$C$3)","v":"09:00 AM to 11:45 AM"}]
[null,null,{"$f":"'TIME TABLE'!$F$8","v":"Mathematics"},null,null,{"$f":"IF(C1223=0,0,'TIME TABLE'!$B$8)","v":"2022-04-03"},{"$f":"IF(C1223=0,0,CONCATENATE('TIME TABLE'!$C$8,'TIME TABLE'!$D$8,'TIME TABLE'!$E$8))","v":"(Sunday)"},{"$f":"IF(C1223=0,0,'TIME TABLE'!$C$3)","v":"09:00 AM to 11:45 AM"}]
[null,null,{"$f":"'TIME TABLE'!$F$9","v":"Social Study"},null,null,{"$f":"IF(C1224=0,0,'TIME TABLE'!$B$9)","v":"2022-04-04"},{"$f":"IF(C1224=0,0,CONCATENATE('TIME TABLE'!$C$9,'TIME TABLE'!$D$9,'TIME TABLE'!$E$9))","v":"(Monday)"},{"$f":"IF(C1224=0,0,'TIME TABLE'!$C$3)","v":"09:00 AM to 11:45 AM"}]
[null,null,{"$f":"'TIME TABLE'!$F$10","v":"Sanskrit"},null,null,{"$f":"IF(C1225=0,0,'TIME TABLE'!$B$10)","v":"2022-04-05"},{"$f":"IF(C1225=0,0,CONCATENATE('TIME TABLE'!$C$10,'TIME TABLE'!$D$10,'TIME TABLE'!$E$10))","v":"(Tuesday)"},{"$f":"IF(C1225=0,0,'TIME TABLE'!$C$3)","v":"09:00 AM to 11:45 AM"}]
[null,null,{"$f":"'TIME TABLE'!$F$11","v":0},null,null,{"$f":"IF(C1226=0,0,'TIME TABLE'!$B$11)","v":"00:00:00"},{"$f":"IF(C1226=0,0,CONCATENATE('TIME TABLE'!$C$11,'TIME TABLE'!$D$11,'TIME TABLE'!$E$11))","v":0},{"$f":"IF(C1226=0,0,'TIME TABLE'!$C$3)","v":0}]
[null,null,{"$f":"'TIME TABLE'!$F$12","v":0},null,null,{"$f":"IF(C1227=0,0,'TIME TABLE'!$B$12)","v":"00:00:00"},{"$f":"IF(C1227=0,0,CONCATENATE('TIME TABLE'!$C$12,'TIME TABLE'!$D$12,'TIME TABLE'!$E$12))","v":0},{"$f":"IF(C1227=0,0,'TIME TABLE'!$C$3)","v":0}]
[null,null,{"$f":"'TIME TABLE'!$F$13","v":0},null,null,{"$f":"IF(C1228=0,0,'TIME TABLE'!$B$13)","v":"00:00:00"},{"$f":"IF(C1228=0,0,CONCATENATE('TIME TABLE'!$C$13,'TIME TABLE'!$D$13,'TIME TABLE'!$E$13))","v":0},{"$f":"IF(C1228=0,0,'TIME TABLE'!$C$3)","v":0}]
[null,null,{"$f":"'TIME TABLE'!$F$14","v":0},null,null,{"$f":"IF(C1229=0,0,'TIME TABLE'!$B$14)","v":"00:00:00"},{"$f":"IF(C1229=0,0,CONCATENATE('TIME TABLE'!$C$14,'TIME TABLE'!$D$14,'TIME TABLE'!$E$14))","v":0},{"$f":"IF(C1229=0,0,'TIME TABLE'!$C$3)","v":0}]
[null,null,"Instructions"]
[null,null,1,"Check the exam time table carefully."]
[null,null,2,"Students must bring the 'Admit Card' and show it to the invigilator(s) on duty and should preserve it for future requirements."]
[null,null,3,"Mobile Phone, Calculator, Digital Watch or any Electronic Device is NOT ALLOWED."]
[null,null,4,"Arrive at the School at least 15 minutes before the start examination."]
[null,null,5,"Student is barred from entering the examination hall 15 minutes after the written examination starts."]
[null,null,6,"Ensure that you use the washroom before arriving for your exam as you will not be permitted to leave during the first hour."]
[null,null,7,"Normally, you are required to answer questionsusing blue or black in . Make sure you bring some spare pens with you."]
[null,null,8,"Keep your eyes on your own paper. Remember, copying is cheating!"]
[null,null,9,"You must remain silent until after you have exited the school building."]
[]
[{"$f":"A1207+1","v":38}]
[{"$nulls":4},{"$f":"MASTER!$E$11","v":"Govt. Sr. Secondary School Raimalwada"}]
[{"$nulls":4},{"$f":"MASTER!$E$14","v":"P.S.-Bapini (Jodhpur)"}]
[null,{"$f":"CONCATENATE(C1245,'TIME TABLE'!$C$5,'ADMIT CARD'!$C1246,$F1246,'ADMIT CARD'!$G1246,'TIME TABLE'!$E$5)","v":"ADMIT CARD(Roll Number●→0)"},{"$f":"CONCATENATE('TIME TABLE'!$B$2,'TIME TABLE'!$F$2)","v":"HALF YEARLY EXAM:2021-22"}]
[null,null,"ADMIT CARD",{"$nulls":6}," "]
[null,null,"Roll Number",null,null,"●→",{"$f":"VLOOKUP(A1241,'STUDENT DETAIL'!$C$8:$I$107,3)","v":0},null,"Seal and Signature of Head of Institution"]
[null,null,"Student's Name",null,null,"●→",{"$f":"VLOOKUP(A1241,'STUDENT DETAIL'!$C$8:$I$107,4)","v":0}]
[null,null,"Father's Name",null,null,"●→",{"$f":"VLOOKUP(A1241,'STUDENT DETAIL'!$C$8:$I$107,5)","v":0}]
[null,null,"Mother's Name ",null,null,"●→",{"$f":"VLOOKUP(A1241,'STUDENT DETAIL'!$C$8:$I$107,6)","v":0}]
[null,null,"Class & Section",null,null,"●→",{"$f":"IF(G1246=0,0,CONCATENATE('STUDENT DETAIL'!$E$4,'STUDENT DETAIL'!$H$4))","v":0}]
[null,null,"Date Of Birth",null,null,"●→",{"$f":"VLOOKUP(A1241,'STUDENT DETAIL'!$C$8:$I$107,7)","v":"00:00:00"}]
[null,null,"Time Table"]
[null,null,"Subject",null,null,"Date (Day)",null,"Time"]
[null,null,{"$f":"'TIME TABLE'!$F$5","v":"Hindi"},null,null,{"$f":"IF(C1254=0,0,'TIME TABLE'!$B$5)","v":"2022-03-31"},{"$f":"IF(C1254=0,0,CONCATENATE('TIME TABLE'!$C$5,'TIME TABLE'!$D$5,'TIME TABLE'!$E$5))","v":"(Thursday)"},{"$f":"IF(C1254=0,0,'TIME TABLE'!$C$3)","v":"09:00 AM to 11:45 AM"}]
[null,null,{"$f":"'TIME TABLE'!$F$6","v":"English"},null,null,{"$f":"IF(C1255=0,0,'TIME TABLE'!$B$6)","v":"2022-04-01"},{"$f":"IF(C1255=0,0,CONCATENATE('TIME TABLE'!$C$6,'TIME TABLE'!$D$6,'TIME TABLE'!$E$6))","v":"(Friday)"},{"$f":"IF(C1255=0,0,'TIME TABLE'!$C$3)","v":"09:00 AM to 11:45 AM"}]
[null,null,{"$f":"'TIME TABLE'!$F$7","v":"Science"},null,null,{"$f":"IF(C1256=0,0,'TIME TABLE'!$B$7)","v":"2022-04-02"},{"$f":"IF(C1256=0,0,CONCATENATE('TIME TABLE'!$C$7,'TIME TABLE'!$D$7,'TIME TABLE'!$E$7))","v":"(Saturday)"},{"$f":"IF(C1256=0,0,'TIME TABLE'!$C$3)","v":"09:00 AM to 11:45 AM"}]
[null,null,{"$f":"'TIME TABLE'!$F$8","v":"Mathematics"},null,null,{"$f":"IF(C1257=0,0,'TIME TABLE'!$B$8)","v":"2022-04-03"},{"$f":"IF(C1257=0,0,CONCATENATE('TIME TABLE'!$C$8,'TIME TABLE'!$D$8,'TIME TABLE'!$E$8))","v":"(Sunday)"},{"$f":"IF(C1257=0,0,'TIME TABLE'!$C$3)","v":"09:00 AM to 11:45 AM"}]
[null,null,{"$f":"'TIME TABLE'!$F$9","v":"Social Study"},null,null,{"$f":"IF(C1258=0,0,'TIME TABLE'!$B$9)","v":"2022-04-04"},{"$f":"IF(C1258=0,0,CONCATENATE('TIME TABLE'!$C$9,'TIME TABLE'!$D$9,'TIME TABLE'!$E$9))","v":"(Monday)"},{"$f":"IF(C1258=0,0,'TIME TABLE'!$C$3)","v":"09:00 AM to 11:45 AM"}]
[null,null,{"$f":"'TIME TABLE'!$F$10","v":"Sanskrit"},null,null,{"$f":"IF(C1259=0,0,'TIME TABLE'!$B$10)","v":"2022-04-05"},{"$f":"IF(C1259=0,0,CONCATENATE('TIME TABLE'!$C$10,'TIME TABLE'!$D$10,'TIME TABLE'!$E$10))","v":"(Tuesday)"},{"$f":"IF(C1259=0,0,'TIME TABLE'!$C$3)","v":"09:00 AM to 11:45 AM"}]
[null,null,{"$f":"'TIME TABLE'!$F$11","v":0},null,null,{"$f":"IF(C1260=0,0,'TIME TABLE'!$B$11)","v":"00:00:00"},{"$f":"IF(C1260=0,0,CONCATENATE('TIME TABLE'!$C$11,'TIME TABLE'!$D$11,'TIME TABLE'!$E$11))","v":0},{"$f":"IF(C1260=0,0,'TIME TABLE'!$C$3)","v":0}]
[null,null,{"$f":"'TIME TABLE'!$F$12","v":0},null,null,{"$f":"IF(C1261=0,0,'TIME TABLE'!$B$12)","v":"00:00:00"},{"$f":"IF(C1261=0,0,CONCATENATE('TIME TABLE'!$C$12,'TIME TABLE'!$D$12,'TIME TABLE'!$E$12))","v":0},{"$f":"IF(C1261=0,0,'TIME TABLE'!$C$3)","v":0}]
[null,null,{"$f":"'TIME TABLE'!$F$13","v":0},null,null,{"$f":"IF(C1262=0,0,'TIME TABLE'!$B$13)","v":"00:00:00"},{"$f":"IF(C1262=0,0,CONCATENATE('TIME TABLE'!$C$13,'TIME TABLE'!$D$13,'TIME TABLE'!$E$13))","v":0},{"$f":"IF(C1262=0,0,'TIME TABLE'!$C$3)","v":0}]
[null,null,{"$f":"'TIME TABLE'!$F$14","v":0},null,null,{"$f":"IF(C1263=0,0,'TIME TABLE'!$B$14)","v":"00:00:00"},{"$f":"IF(C1263=0,0,CONCATENATE('TIME TABLE'!$C$14,'TIME TABLE'!$D$14,'TIME TABLE'!$E$14))","v":0},{"$f":"IF(C1263=0,0,'TIME TABLE'!$C$3)","v":0}]
[null,null,"Instructions"]
[null,null,1,"Check the exam time table carefully."]
[null,null,2,"Students must bring the 'Admit Card' and show it to the invigilator(s) on duty and should preserve it for future requirements."]
[null,null,3,"Mobile Phone, Calculator, Digital Watch or any Electronic Device is NOT ALLOWED."]
[null,null,4,"Arrive at the School at least 15 minutes before the start examination."]
[null,null,5,"Student is barred from entering the examination hall 15 minutes after the written examination starts."]
[null,null,6,"Ensure that you use the washroom before arriving for your exam as you will not be permitted to leave during the first hour."]
[null,null,7,"Normally, you are required to answer questionsusing blue or black in . Make sure you bring some spare pens with you."]
[null,null,8,"Keep your eyes on your own paper. Remember, copying is cheating!"]
[null,null,9,"You must remain silent until after you have exited the school building."]
[{"$f":"A1241+1","v":39}]
[{"$nulls":4},{"$f":"MASTER!$E$11","v":"Govt. Sr. Secondary School Raimalwada"}]
[{"$nulls":4},{"$f":"MASTER!$E$14","v":"P.S.-Bapini (Jodhpur)"}]
[null,{"$f":"CONCATENATE(C1278,'TIME TABLE'!$C$5,'ADMIT CARD'!$C1279,$F1279,'ADMIT CARD'!$G1279,'TIME TABLE'!$E$5)","v":"ADMIT CARD(Roll Number●→0)"},{"$f":"CONCATENATE('TIME TABLE'!$B$2,'TIME TABLE'!$F$2)","v":"HALF YEARLY EXAM:2021-22"}]
[null,null,"ADMIT CARD",{"$nulls":6}," "]
[null,null,"Roll Number",null,null,"●→",{"$f":"VLOOKUP(A1274,'STUDENT DETAIL'!$C$8:$I$107,3)","v":0},null,"Seal and Signature of Head of Institution"]
[null,null,"Student's Name",null,null,"●→",{"$f":"VLOOKUP(A1274,'STUDENT DETAIL'!$C$8:$I$107,4)","v":0}]
[null,null,"Father's Name",null,null,"●→",{"$f":"VLOOKUP(A1274,'STUDENT DETAIL'!$C$8:$I$107,5)","v":0}]
[null,null,"Mother's Name ",null,null,"●→",{"$f":"VLOOKUP(A1274,'STUDENT DETAIL'!$C$8:$I$107,6)","v":0}]
[null,null,"Class & Section",null,null,"●→",{"$f":"IF(G1279=0,0,CONCATENATE('STUDENT DETAIL'!$E$4,'STUDENT DETAIL'!$H$4))","v":0}]
[null,null,"Date Of Birth",null,null,"●→",{"$f":"VLOOKUP(A1274,'STUDENT DETAIL'!$C$8:$I$107,7)","v":"00:00:00"}]
[null,null,"Time Table"]
[null,null,"Subject",null,null,"Date (Day)",null,"Time"]
[null,null,{"$f":"'TIME TABLE'!$F$5","v":"Hindi"},null,null,{"$f":"IF(C1287=0,0,'TIME TABLE'!$B$5)","v":"2022-03-31"},{"$f":"IF(C1287=0,0,CONCATENATE('TIME TABLE'!$C$5,'TIME TABLE'!$D$5,'TIME TABLE'!$E$5))","v":"(Thursday)"},{"$f":"IF(C1287=0,0,'TIME TABLE'!$C$3)","v":"09:00 AM to 11:45 AM"}]
[null,null,{"$f":"'TIME TABLE'!$F$6","v":"English"},null,null,{"$f":"IF(C1288=0,0,'TIME TABLE'!$B$6)","v":"2022-04-01"},{"$f":"IF(C1288=0,0,CONCATENATE('TIME TABLE'!$C$6,'TIME TABLE'!$D$6,'TIME TABLE'!$E$6))","v":"(Friday)"},{"$f":"IF(C1288=0,0,'TIME TABLE'!$C$3)","v":"09:00 AM to 11:45 AM"}]
[null,null,{"$f":"'TIME TABLE'!$F$7","v":"Science"},null,null,{"$f":"IF(C1289=0,0,'TIME TABLE'!$B$7)","v":"2022-04-02"},{"$f":"IF(C1289=0,0,CONCATENATE('TIME TABLE'!$C$7,'TIME TABLE'!$D$7,'TIME TABLE'!$E$7))","v":"(Saturday)"},{"$f":"IF(C1289=0,0,'TIME TABLE'!$C$3)","v":"09:00 AM to 11:45 AM"}]
[null,null,{"$f":"'TIME TABLE'!$F$8","v":"Mathematics"},null,null,{"$f":"IF(C1290=0,0,'TIME TABLE'!$B$8)","v":"2022-04-03"},{"$f":"IF(C1290=0,0,CONCATENATE('TIME TABLE'!$C$8,'TIME TABLE'!$D$8,'TIME TABLE'!$E$8))","v":"(Sunday)"},{"$f":"IF(C1290=0,0,'TIME TABLE'!$C$3)","v":"09:00 AM to 11:45 AM"}]
[null,null,{"$f":"'TIME TABLE'!$F$9","v":"Social Study"},null,null,{"$f":"IF(C1291=0,0,'TIME TABLE'!$B$9)","v":"2022-04-04"},{"$f":"IF(C1291=0,0,CONCATENATE('TIME TABLE'!$C$9,'TIME TABLE'!$D$9,'TIME TABLE'!$E$9))","v":"(Monday)"},{"$f":"IF(C1291=0,0,'TIME TABLE'!$C$3)","v":"09:00 AM to 11:45 AM"}]
[null,null,{"$f":"'TIME TABLE'!$F$10","v":"Sanskrit"},null,null,{"$f":"IF(C1292=0,0,'TIME TABLE'!$B$10)","v":"2022-04-05"},{"$f":"IF(C1292=0,0,CONCATENATE('TIME TABLE'!$C$10,'TIME TABLE'!$D$10,'TIME TABLE'!$E$10))","v":"(Tuesday)"},{"$f":"IF(C1292=0,0,'TIME TABLE'!$C$3)","v":"09:00 AM to 11:45 AM"}]
[null,null,{"$f":"'TIME TABLE'!$F$11","v":0},null,null,{"$f":"IF(C1293=0,0,'TIME TABLE'!$B$11)","v":"00:00:00"},{"$f":"IF(C1293=0,0,CONCATENATE('TIME TABLE'!$C$11,'TIME TABLE'!$D$11,'TIME TABLE'!$E$11))","v":0},{"$f":"IF(C1293=0,0,'TIME TABLE'!$C$3)","v":0}]
[null,null,{"$f":"'TIME TABLE'!$F$12","v":0},null,null,{"$f":"IF(C1294=0,0,'TIME TABLE'!$B$12)","v":"00:00:00"},{"$f":"IF(C1294=0,0,CONCATENATE('TIME TABLE'!$C$12,'TIME TABLE'!$D$12,'TIME TABLE'!$E$12))","v":0},{"$f":"IF(C1294=0,0,'TIME TABLE'!$C$3)","v":0}]
[null,null,{"$f":"'TIME TABLE'!$F$13","v":0},null,null,{"$f":"IF(C1295=0,0,'TIME TABLE'!$B$13)","v":"00:00:00"},{"$f":"IF(C1295=0,0,CONCATENATE('TIME TABLE'!$C$13,'TIME TABLE'!$D$13,'TIME TABLE'!$E$13))","v":0},{"$f":"IF(C1295=0,0,'TIME TABLE'!$C$3)","v":0}]
[null,null,{"$f":"'TIME TABLE'!$F$14","v":0},null,null,{"$f":"IF(C1296=0,0,'TIME TABLE'!$B$14)","v":"00:00:00"},{"$f":"IF(C1296=0,0,CONCATENATE('TIME TABLE'!$C$14,'TIME TABLE'!$D$14,'TIME TABLE'!$E$14))","v":0},{"$f":"IF(C1296=0,0,'TIME TABLE'!$C$3)","v":0}]
[null,null,"Instructions"]
[null,null,1,"Check the exam time table carefully."]
[null,null,2,"Students must bring the 'Admit Card' and show it to the invigilator(s) on duty and should preserve it for future requirements."]
[null,null,3,"Mobile Phone, Calculator, Digital Watch or any Electronic Device is NOT ALLOWED."]
[null,null,4,"Arrive at the School at least 15 minutes before the start examination."]
[null,null,5,"Student is barred from entering the examination hall 15 minutes after the written examination starts."]
[null,null,6,"Ensure that you use the washroom before arriving for your exam as you will not be permitted to leave during the first hour."]
[null,null,7,"Normally, you are required to answer questionsusing blue or black in . Make sure you bring some spare pens with you."]
[null,null,8,"Keep your eyes on your own paper. Remember, copying is cheating!"]
[null,null,9,"You must remain silent until after you have exited the school building."]
[]
[{"$f":"A1274+1","v":40}]
[{"$nulls":4},{"$f":"MASTER!$E$11","v":"Govt. Sr. Secondary School Raimalwada"}]
[{"$nulls":4},{"$f":"MASTER!$E$14","v":"P.S.-Bapini (Jodhpur)"}]
[null,{"$f":"CONCATENATE(C1312,'TIME TABLE'!$C$5,'ADMIT CARD'!$C1313,$F1313,'ADMIT CARD'!$G1313,'TIME TABLE'!$E$5)","v":"ADMIT CARD(Roll Number●→0)"},{"$f":"CONCATENATE('TIME TABLE'!$B$2,'TIME TABLE'!$F$2)","v":"HALF YEARLY EXAM:2021-22"}]
[null,null,"ADMIT CARD",{"$nulls":6}," "]
[null,null,"Roll Number",null,null,"●→",{"$f":"VLOOKUP(A1308,'STUDENT DETAIL'!$C$8:$I$107,3)","v":0},null,"Seal and Signature of Head of Institution"]
[null,null,"Student's Name",null,null,"●→",{"$f":"VLOOKUP(A1308,'STUDENT DETAIL'!$C$8:$I$107,4)","v":0}]
[null,null,"Father's Name",null,null,"●→",{"$f":"VLOOKUP(A1308,'STUDENT DETAIL'!$C$8:$I$107,5)","v":0}]
[null,null,"Mother's Name ",null,null,"●→",{"$f":"VLOOKUP(A1308,'STUDENT DETAIL'!$C$8:$I$107,6)","v":0}]
[null,null,"Class & Section",null,null,"●→",{"$f":"IF(G1313=0,0,CONCATENATE('STUDENT DETAIL'!$E$4,'STUDENT DETAIL'!$H$4))","v":0}]
[null,null,"Date Of Birth",null,null,"●→",{"$f":"VLOOKUP(A1308,'STUDENT DETAIL'!$C$8:$I$107,7)","v":"00:00:00"}]
[null,null,"Time Table"]
[null,null,"Subject",null,null,"Date (Day)",null,"Time"]
[null,null,{"$f":"'TIME TABLE'!$F$5","v":"Hindi"},null,null,{"$f":"IF(C1321=0,0,'TIME TABLE'!$B$5)","v":"2022-03-31"},{"$f":"IF(C1321=0,0,CONCATENATE('TIME TABLE'!$C$5,'TIME TABLE'!$D$5,'TIME TABLE'!$E$5))","v":"(Thursday)"},{"$f":"IF(C1321=0,0,'TIME TABLE'!$C$3)","v":"09:00 AM to 11:45 AM"}]
[null,null,{"$f":"'TIME TABLE'!$F$6","v":"English"},null,null,{"$f":"IF(C1322=0,0,'TIME TABLE'!$B$6)","v":"2022-04-01"},{"$f":"IF(C1322=0,0,CONCATENATE('TIME TABLE'!$C$6,'TIME TABLE'!$D$6,'TIME TABLE'!$E$6))","v":"(Friday)"},{"$f":"IF(C1322=0,0,'TIME TABLE'!$C$3)","v":"09:00 AM to 11:45 AM"}]
[null,null,{"$f":"'TIME TABLE'!$F$7","v":"Science"},null,null,{"$f":"IF(C1323=0,0,'TIME TABLE'!$B$7)","v":"2022-04-02"},{"$f":"IF(C1323=0,0,CONCATENATE('TIME TABLE'!$C$7,'TIME TABLE'!$D$7,'TIME TABLE'!$E$7))","v":"(Saturday)"},{"$f":"IF(C1323=0,0,'TIME TABLE'!$C$3)","v":"09:00 AM to 11:45 AM"}]
[null,null,{"$f":"'TIME TABLE'!$F$8","v":"Mathematics"},null,null,{"$f":"IF(C1324=0,0,'TIME TABLE'!$B$8)","v":"2022-04-03"},{"$f":"IF(C1324=0,0,CONCATENATE('TIME TABLE'!$C$8,'TIME TABLE'!$D$8,'TIME TABLE'!$E$8))","v":"(Sunday)"},{"$f":"IF(C1324=0,0,'TIME TABLE'!$C$3)","v":"09:00 AM to 11:45 AM"}]
[null,null,{"$f":"'TIME TABLE'!$F$9","v":"Social Study"},null,null,{"$f":"IF(C1325=0,0,'TIME TABLE'!$B$9)","v":"2022-04-04"},{"$f":"IF(C1325=0,0,CONCATENATE('TIME TABLE'!$C$9,'TIME TABLE'!$D$9,'TIME TABLE'!$E$9))","v":"(Monday)"},{"$f":"IF(C1325=0,0,'TIME TABLE'!$C$3)","v":"09:00 AM to 11:45 AM"}]
[null,null,{"$f":"'TIME TABLE'!$F$10","v":"Sanskrit"},null,null,{"$f":"IF(C1326=0,0,'TIME TABLE'!$B$10)","v":"2022-04-05"},{"$f":"IF(C1326=0,0,CONCATENATE('TIME TABLE'!$C$10,'TIME TABLE'!$D$10,'TIME TABLE'!$E$10))","v":"(Tuesday)"},{"$f":"IF(C1326=0,0,'TIME TABLE'!$C$3)","v":"09:00 AM to 11:45 AM"}]
[null,null,{"$f":"'TIME TABLE'!$F$11","v":0},null,null,{"$f":"IF(C1327=0,0,'TIME TABLE'!$B$11)","v":"00:00:00"},{"$f":"IF(C1327=0,0,CONCATENATE('TIME TABLE'!$C$11,'TIME TABLE'!$D$11,'TIME TABLE'!$E$11))","v":0},{"$f":"IF(C1327=0,0,'TIME TABLE'!$C$3)","v":0}]
[null,null,{"$f":"'TIME TABLE'!$F$12","v":0},null,null,{"$f":"IF(C1328=0,0,'TIME TABLE'!$B$12)","v":"00:00:00"},{"$f":"IF(C1328=0,0,CONCATENATE('TIME TABLE'!$C$12,'TIME TABLE'!$D$12,'TIME TABLE'!$E$12))","v":0},{"$f":"IF(C1328=0,0,'TIME TABLE'!$C$3)","v":0}]
[null,null,{"$f":"'TIME TABLE'!$F$13","v":0},null,null,{"$f":"IF(C1329=0,0,'TIME TABLE'!$B$13)","v":"00:00:00"},{"$f":"IF(C1329=0,0,CONCATENATE('TIME TABLE'!$C$13,'TIME TABLE'!$D$13,'TIME TABLE'!$E$13))","v":0},{"$f":"IF(C1329=0,0,'TIME TABLE'!$C$3)","v":0}]
[null,null,{"$f":"'TIME TABLE'!$F$14","v":0},null,null,{"$f":"IF(C1330=0,0,'TIME TABLE'!$B$14)","v":"00:00:00"},{"$f":"IF(C1330=0,0,CONCATENATE('TIME TABLE'!$C$14,'TIME TABLE'!$D$14,'TIME TABLE'!$E$14))","v":0},{"$f":"IF(C1330=0,0,'TIME TABLE'!$C$3)","v":0}]
[null,null,"Instructions"]
[null,null,1,"Check the exam time table carefully."]
[null,null,2,"Students must bring the 'Admit Card' and show it to the invigilator(s) on duty and should preserve it for future requirements."]
[null,null,3,"Mobile Phone, Calculator, Digital Watch or any Electronic Device is NOT ALLOWED."]
[null,null,4,"Arrive at the School at least 15 minutes before the start examination."]
[null,null,5,"Student is barred from entering the examination hall 15 minutes after the written examination starts."]
[null,null,6,"Ensure that you use the washroom before arriving for your exam as you will not be permitted to leave during the first hour."]
[null,null,7,"Normally, you are required to answer questionsusing blue or black in . Make sure you bring some spare pens with you."]
[null,null,8,"Keep your eyes on your own paper. Remember, copying is cheating!"]
[null,null,9,"You must remain silent until after you have exited the school building."]
[{"$f":"A1308+1","v":41}]
[{"$nulls":4},{"$f":"MASTER!$E$11","v":"Govt. Sr. Secondary School Raimalwada"}]
[{"$nulls":4},{"$f":"MASTER!$E$14","v":"P.S.-Bapini (Jodhpur)"}]
[null,{"$f":"CONCATENATE(C1345,'TIME TABLE'!$C$5,'ADMIT CARD'!$C1346,$F1346,'ADMIT CARD'!$G1346,'TIME TABLE'!$E$5)","v":"ADMIT CARD(Roll Number●→0)"},{"$f":"CONCATENATE('TIME TABLE'!$B$2,'TIME TABLE'!$F$2)","v":"HALF YEARLY EXAM:2021-22"}]
[null,null,"ADMIT CARD",{"$nulls":6}," "]
[null,null,"Roll Number",null,null,"●→",{"$f":"VLOOKUP(A1341,'STUDENT DETAIL'!$C$8:$I$107,3)","v":0},null,"Seal and Signature of Head of Institution"]
[null,null,"Student's Name",null,null,"●→",{"$f":"VLOOKUP(A1341,'STUDENT DETAIL'!$C$8:$I$107,4)","v":0}]
[null,null,"Father's Name",null,null,"●→",{"$f":"VLOOKUP(A1341,'STUDENT DETAIL'!$C$8:$I$107,5)","v":0}]
[null,null,"Mother's Name ",null,null,"●→",{"$f":"VLOOKUP(A1341,'STUDENT DETAIL'!$C$8:$I$107,6)","v":0}]
[null,null,"Class & Section",null,null,"●→",{"$f":"IF(G1346=0,0,CONCATENATE('STUDENT DETAIL'!$E$4,'STUDENT DETAIL'!$H$4))","v":0}]
[null,null,"Date Of Birth",null,null,"●→",{"$f":"VLOOKUP(A1341,'STUDENT DETAIL'!$C$8:$I$107,7)","v":"00:00:00"}]
[null,null,"Time Table"]
[null,null,"Subject",null,null,"Date (Day)",null,"Time"]
[null,null,{"$f":"'TIME TABLE'!$F$5","v":"Hindi"},null,null,{"$f":"IF(C1354=0,0,'TIME TABLE'!$B$5)","v":"2022-03-31"},{"$f":"IF(C1354=0,0,CONCATENATE('TIME TABLE'!$C$5,'TIME TABLE'!$D$5,'TIME TABLE'!$E$5))","v":"(Thursday)"},{"$f":"IF(C1354=0,0,'TIME TABLE'!$C$3)","v":"09:00 AM to 11:45 AM"}]
[null,null,{"$f":"'TIME TABLE'!$F$6","v":"English"},null,null,{"$f":"IF(C1355=0,0,'TIME TABLE'!$B$6)","v":"2022-04-01"},{"$f":"IF(C1355=0,0,CONCATENATE('TIME TABLE'!$C$6,'TIME TABLE'!$D$6,'TIME TABLE'!$E$6))","v":"(Friday)"},{"$f":"IF(C1355=0,0,'TIME TABLE'!$C$3)","v":"09:00 AM to 11:45 AM"}]
[null,null,{"$f":"'TIME TABLE'!$F$7","v":"Science"},null,null,{"$f":"IF(C1356=0,0,'TIME TABLE'!$B$7)","v":"2022-04-02"},{"$f":"IF(C1356=0,0,CONCATENATE('TIME TABLE'!$C$7,'TIME TABLE'!$D$7,'TIME TABLE'!$E$7))","v":"(Saturday)"},{"$f":"IF(C1356=0,0,'TIME TABLE'!$C$3)","v":"09:00 AM to 11:45 AM"}]
[null,null,{"$f":"'TIME TABLE'!$F$8","v":"Mathematics"},null,null,{"$f":"IF(C1357=0,0,'TIME TABLE'!$B$8)","v":"2022-04-03"},{"$f":"IF(C1357=0,0,CONCATENATE('TIME TABLE'!$C$8,'TIME TABLE'!$D$8,'TIME TABLE'!$E$8))","v":"(Sunday)"},{"$f":"IF(C1357=0,0,'TIME TABLE'!$C$3)","v":"09:00 AM to 11:45 AM"}]
[null,null,{"$f":"'TIME TABLE'!$F$9","v":"Social Study"},null,null,{"$f":"IF(C1358=0,0,'TIME TABLE'!$B$9)","v":"2022-04-04"},{"$f":"IF(C1358=0,0,CONCATENATE('TIME TABLE'!$C$9,'TIME TABLE'!$D$9,'TIME TABLE'!$E$9))","v":"(Monday)"},{"$f":"IF(C1358=0,0,'TIME TABLE'!$C$3)","v":"09:00 AM to 11:45 AM"}]
[null,null,{"$f":"'TIME TABLE'!$F$10","v":"Sanskrit"},null,null,{"$f":"IF(C1359=0,0,'TIME TABLE'!$B$10)","v":"2022-04-05"},{"$f":"IF(C1359=0,0,CONCATENATE('TIME TABLE'!$C$10,'TIME TABLE'!$D$10,'TIME TABLE'!$E$10))","v":"(Tuesday)"},{"$f":"IF(C1359=0,0,'TIME TABLE'!$C$3)","v":"09:00 AM to 11:45 AM"}]
[null,null,{"$f":"'TIME TABLE'!$F$11","v":0},null,null,{"$f":"IF(C1360=0,0,'TIME TABLE'!$B$11)","v":"00:00:00"},{"$f":"IF(C1360=0,0,CONCATENATE('TIME TABLE'!$C$11,'TIME TABLE'!$D$11,'TIME TABLE'!$E$11))","v":0},{"$f":"IF(C1360=0,0,'TIME TABLE'!$C$3)","v":0}]
[null,null,{"$f":"'TIME TABLE'!$F$12","v":0},null,null,{"$f":"IF(C1361=0,0,'TIME TABLE'!$B$12)","v":"00:00:00"},{"$f":"IF(C1361=0,0,CONCATENATE('TIME TABLE'!$C$12,'TIME TABLE'!$D$12,'TIME TABLE'!$E$12))","v":0},{"$f":"IF(C1361=0,0,'TIME TABLE'!$C$3)","v":0}]
[null,null,{"$f":"'TIME TABLE'!$F$13","v":0},null,null,{"$f":"IF(C1362=0,0,'TIME TABLE'!$B$13)","v":"00:00:00"},{"$f":"IF(C1362=0,0,CONCATENATE('TIME TABLE'!$C$13,'TIME TABLE'!$D$13,'TIME TABLE'!$E$13))","v":0},{"$f":"IF(C1362=0,0,'TIME TABLE'!$C$3)","v":0}]
[null,null,{"$f":"'TIME TABLE'!$F$14","v":0},null,null,{"$f":"IF(C1363=0,0,'TIME TABLE'!$B$14)","v":"00:00:00"},{"$f":"IF(C1363=0,0,CONCATENATE('TIME TABLE'!$C$14,'TIME TABLE'!$D$14,'TIME TABLE'!$E$14))","v":0},{"$f":"IF(C1363=0,0,'TIME TABLE'!$C$3)","v":0}]
[null,null,"Instructions"]
[null,null,1,"Check the exam time table carefully."]
[null,null,2,"Students must bring the 'Admit Card' and show it to the invigilator(s) on duty and should preserve it for future requirements."]
[null,null,3,"Mobile Phone, Calculator, Digital Watch or any Electronic Device is NOT ALLOWED."]
[null,null,4,"Arrive at the School at least 15 minutes before the start examination."]
[null,null,5,"Student is barred from entering the examination hall 15 minutes after the written examination starts."]
[null,null,6,"Ensure that you use the washroom before arriving for your exam as you will not be permitted to leave during the first hour."]
[null,null,7,"Normally, you are required to answer questionsusing blue or black in . Make sure you bring some spare pens with you."]
[null,null,8,"Keep your eyes on your own paper. Remember, copying is cheating!"]
[null,null,9,"You must remain silent until after you have exited the school building."]
[]
[{"$f":"A1341+1","v":42}]
[{"$nulls":4},{"$f":"MASTER!$E$11","v":"Govt. Sr. Secondary School Raimalwada"}]
[{"$nulls":4},{"$f":"MASTER!$E$14","v":"P.S.-Bapini (Jodhpur)"}]
[null,{"$f":"CONCATENATE(C1379,'TIME TABLE'!$C$5,'ADMIT CARD'!$C1380,$F1380,'ADMIT CARD'!$G1380,'TIME TABLE'!$E$5)","v":"ADMIT CARD(Roll Number●→0)"},{"$f":"CONCATENATE('TIME TABLE'!$B$2,'TIME TABLE'!$F$2)","v":"HALF YEARLY EXAM:2021-22"}]
[null,null,"ADMIT CARD",{"$nulls":6}," "]
[null,null,"Roll Number",null,null,"●→",{"$f":"VLOOKUP(A1375,'STUDENT DETAIL'!$C$8:$I$107,3)","v":0},null,"Seal and Signature of Head of Institution"]
[null,null,"Student's Name",null,null,"●→",{"$f":"VLOOKUP(A1375,'STUDENT DETAIL'!$C$8:$I$107,4)","v":0}]
[null,null,"Father's Name",null,null,"●→",{"$f":"VLOOKUP(A1375,'STUDENT DETAIL'!$C$8:$I$107,5)","v":0}]
[null,null,"Mother's Name ",null,null,"●→",{"$f":"VLOOKUP(A1375,'STUDENT DETAIL'!$C$8:$I$107,6)","v":0}]
[null,null,"Class & Section",null,null,"●→",{"$f":"IF(G1380=0,0,CONCATENATE('STUDENT DETAIL'!$E$4,'STUDENT DETAIL'!$H$4))","v":0}]
[null,null,"Date Of Birth",null,null,"●→",{"$f":"VLOOKUP(A1375,'STUDENT DETAIL'!$C$8:$I$107,7)","v":"00:00:00"}]
[null,null,"Time Table"]
[null,null,"Subject",null,null,"Date (Day)",null,"Time"]
[null,null,{"$f":"'TIME TABLE'!$F$5","v":"Hindi"},null,null,{"$f":"IF(C1388=0,0,'TIME TABLE'!$B$5)","v":"2022-03-31"},{"$f":"IF(C1388=0,0,CONCATENATE('TIME TABLE'!$C$5,'TIME TABLE'!$D$5,'TIME TABLE'!$E$5))","v":"(Thursday)"},{"$f":"IF(C1388=0,0,'TIME TABLE'!$C$3)","v":"09:00 AM to 11:45 AM"}]
[null,null,{"$f":"'TIME TABLE'!$F$6","v":"English"},null,null,{"$f":"IF(C1389=0,0,'TIME TABLE'!$B$6)","v":"2022-04-01"},{"$f":"IF(C1389=0,0,CONCATENATE('TIME TABLE'!$C$6,'TIME TABLE'!$D$6,'TIME TABLE'!$E$6))","v":"(Friday)"},{"$f":"IF(C1389=0,0,'TIME TABLE'!$C$3)","v":"09:00 AM to 11:45 AM"}]
[null,null,{"$f":"'TIME TABLE'!$F$7","v":"Science"},null,null,{"$f":"IF(C1390=0,0,'TIME TABLE'!$B$7)","v":"2022-04-02"},{"$f":"IF(C1390=0,0,CONCATENATE('TIME TABLE'!$C$7,'TIME TABLE'!$D$7,'TIME TABLE'!$E$7))","v":"(Saturday)"},{"$f":"IF(C1390=0,0,'TIME TABLE'!$C$3)","v":"09:00 AM to 11:45 AM"}]
[null,null,{"$f":"'TIME TABLE'!$F$8","v":"Mathematics"},null,null,{"$f":"IF(C1391=0,0,'TIME TABLE'!$B$8)","v":"2022-04-03"},{"$f":"IF(C1391=0,0,CONCATENATE('TIME TABLE'!$C$8,'TIME TABLE'!$D$8,'TIME TABLE'!$E$8))","v":"(Sunday)"},{"$f":"IF(C1391=0,0,'TIME TABLE'!$C$3)","v":"09:00 AM to 11:45 AM"}]
[null,null,{"$f":"'TIME TABLE'!$F$9","v":"Social Study"},null,null,{"$f":"IF(C1392=0,0,'TIME TABLE'!$B$9)","v":"2022-04-04"},{"$f":"IF(C1392=0,0,CONCATENATE('TIME TABLE'!$C$9,'TIME TABLE'!$D$9,'TIME TABLE'!$E$9))","v":"(Monday)"},{"$f":"IF(C1392=0,0,'TIME TABLE'!$C$3)","v":"09:00 AM to 11:45 AM"}]
[null,null,{"$f":"'TIME TABLE'!$F$10","v":"Sanskrit"},null,null,{"$f":"IF(C1393=0,0,'TIME TABLE'!$B$10)","v":"2022-04-05"},{"$f":"IF(C1393=0,0,CONCATENATE('TIME TABLE'!$C$10,'TIME TABLE'!$D$10,'TIME TABLE'!$E$10))","v":"(Tuesday)"},{"$f":"IF(C1393=0,0,'TIME TABLE'!$C$3)","v":"09:00 AM to 11:45 AM"}]
[null,null,{"$f":"'TIME TABLE'!$F$11","v":0},null,null,{"$f":"IF(C1394=0,0,'TIME TABLE'!$B$11)","v":"00:00:00"},{"$f":"IF(C1394=0,0,CONCATENATE('TIME TABLE'!$C$11,'TIME TABLE'!$D$11,'TIME TABLE'!$E$11))","v":0},{"$f":"IF(C1394=0,0,'TIME TABLE'!$C$3)","v":0}]
[null,null,{"$f":"'TIME TABLE'!$F$12","v":0},null,null,{"$f":"IF(C1395=0,0,'TIME TABLE'!$B$12)","v":"00:00:00"},{"$f":"IF(C1395=0,0,CONCATENATE('TIME TABLE'!$C$12,'TIME TABLE'!$D$12,'TIME TABLE'!$E$12))","v":0},{"$f":"IF(C1395=0,0,'TIME TABLE'!$C$3)","v":0}]
[null,null,{"$f":"'TIME TABLE'!$F$13","v":0},null,null,{"$f":"IF(C1396=0,0,'TIME TABLE'!$B$13)","v":"00:00:00"},{"$f":"IF(C1396=0,0,CONCATENATE('TIME TABLE'!$C$13,'TIME TABLE'!$D$13,'TIME TABLE'!$E$13))","v":0},{"$f":"IF(C1396=0,0,'TIME TABLE'!$C$3)","v":0}]
[null,null,{"$f":"'TIME TABLE'!$F$14","v":0},null,null,{"$f":"IF(C1397=0,0,'TIME TABLE'!$B$14)","v":"00:00:00"},{"$f":"IF(C1397=0,0,CONCATENATE('TIME TABLE'!$C$14,'TIME TABLE'!$D$14,'TIME TABLE'!$E$14))","v":0},{"$f":"IF(C1397=0,0,'TIME TABLE'!$C$3)","v":0}]
[null,null,"Instructions"]
[null,null,1,"Check the exam time table carefully."]
[null,null,2,"Students must bring the 'Admit Card' and show it to the invigilator(s) on duty and should preserve it for future requirements."]
[null,null,3,"Mobile Phone, Calculator, Digital Watch or any Electronic Device is NOT ALLOWED."]
[null,null,4,"Arrive at the School at least 15 minutes before the start examination."]
[null,null,5,"Student is barred from entering the examination hall 15 minutes after the written examination starts."]
[null,null,6,"Ensure that you use the washroom before arriving for your exam as you will not be permitted to leave during the first hour."]
[null,null,7,"Normally, you are required to answer questionsusing blue or black in . Make sure you bring some spare pens with you."]
[null,null,8,"Keep your eyes on your own paper. Remember, copying is cheating!"]
[null,null,9,"You must remain silent until after you have exited the school building."]
[{"$f":"A1375+1","v":43}]
[{"$nulls":4},{"$f":"MASTER!$E$11","v":"Govt. Sr. Secondary School Raimalwada"}]
[{"$nulls":4},{"$f":"MASTER!$E$14","v":"P.S.-Bapini (Jodhpur)"}]
[null,{"$f":"CONCATENATE(C1412,'TIME TABLE'!$C$5,'ADMIT CARD'!$C1413,$F1413,'ADMIT CARD'!$G1413,'TIME TABLE'!$E$5)","v":"ADMIT CARD(Roll Number●→0)"},{"$f":"CONCATENATE('TIME TABLE'!$B$2,'TIME TABLE'!$F$2)","v":"HALF YEARLY EXAM:2021-22"}]
[null,null,"ADMIT CARD",{"$nulls":6}," "]
[null,null,"Roll Number",null,null,"●→",{"$f":"VLOOKUP(A1408,'STUDENT DETAIL'!$C$8:$I$107,3)","v":0},null,"Seal and Signature of Head of Institution"]
[null,null,"Student's Name",null,null,"●→",{"$f":"VLOOKUP(A1408,'STUDENT DETAIL'!$C$8:$I$107,4)","v":0}]
[null,null,"Father's Name",null,null,"●→",{"$f":"VLOOKUP(A1408,'STUDENT DETAIL'!$C$8:$I$107,5)","v":0}]
[null,null,"Mother's Name ",null,null,"●→",{"$f":"VLOOKUP(A1408,'STUDENT DETAIL'!$C$8:$I$107,6)","v":0}]
[null,null,"Class & Section",null,null,"●→",{"$f":"IF(G1413=0,0,CONCATENATE('STUDENT DETAIL'!$E$4,'STUDENT DETAIL'!$H$4))","v":0}]
[null,null,"Date Of Birth",null,null,"●→",{"$f":"VLOOKUP(A1408,'STUDENT DETAIL'!$C$8:$I$107,7)","v":"00:00:00"}]
[null,null,"Time Table"]
[null,null,"Subject",null,null,"Date (Day)",null,"Time"]
[null,null,{"$f":"'TIME TABLE'!$F$5","v":"Hindi"},null,null,{"$f":"IF(C1421=0,0,'TIME TABLE'!$B$5)","v":"2022-03-31"},{"$f":"IF(C1421=0,0,CONCATENATE('TIME TABLE'!$C$5,'TIME TABLE'!$D$5,'TIME TABLE'!$E$5))","v":"(Thursday)"},{"$f":"IF(C1421=0,0,'TIME TABLE'!$C$3)","v":"09:00 AM to 11:45 AM"}]
[null,null,{"$f":"'TIME TABLE'!$F$6","v":"English"},null,null,{"$f":"IF(C1422=0,0,'TIME TABLE'!$B$6)","v":"2022-04-01"},{"$f":"IF(C1422=0,0,CONCATENATE('TIME TABLE'!$C$6,'TIME TABLE'!$D$6,'TIME TABLE'!$E$6))","v":"(Friday)"},{"$f":"IF(C1422=0,0,'TIME TABLE'!$C$3)","v":"09:00 AM to 11:45 AM"}]
[null,null,{"$f":"'TIME TABLE'!$F$7","v":"Science"},null,null,{"$f":"IF(C1423=0,0,'TIME TABLE'!$B$7)","v":"2022-04-02"},{"$f":"IF(C1423=0,0,CONCATENATE('TIME TABLE'!$C$7,'TIME TABLE'!$D$7,'TIME TABLE'!$E$7))","v":"(Saturday)"},{"$f":"IF(C1423=0,0,'TIME TABLE'!$C$3)","v":"09:00 AM to 11:45 AM"}]
[null,null,{"$f":"'TIME TABLE'!$F$8","v":"Mathematics"},null,null,{"$f":"IF(C1424=0,0,'TIME TABLE'!$B$8)","v":"2022-04-03"},{"$f":"IF(C1424=0,0,CONCATENATE('TIME TABLE'!$C$8,'TIME TABLE'!$D$8,'TIME TABLE'!$E$8))","v":"(Sunday)"},{"$f":"IF(C1424=0,0,'TIME TABLE'!$C$3)","v":"09:00 AM to 11:45 AM"}]
[null,null,{"$f":"'TIME TABLE'!$F$9","v":"Social Study"},null,null,{"$f":"IF(C1425=0,0,'TIME TABLE'!$B$9)","v":"2022-04-04"},{"$f":"IF(C1425=0,0,CONCATENATE('TIME TABLE'!$C$9,'TIME TABLE'!$D$9,'TIME TABLE'!$E$9))","v":"(Monday)"},{"$f":"IF(C1425=0,0,'TIME TABLE'!$C$3)","v":"09:00 AM to 11:45 AM"}]
[null,null,{"$f":"'TIME TABLE'!$F$10","v":"Sanskrit"},null,null,{"$f":"IF(C1426=0,0,'TIME TABLE'!$B$10)","v":"2022-04-05"},{"$f":"IF(C1426=0,0,CONCATENATE('TIME TABLE'!$C$10,'TIME TABLE'!$D$10,'TIME TABLE'!$E$10))","v":"(Tuesday)"},{"$f":"IF(C1426=0,0,'TIME TABLE'!$C$3)","v":"09:00 AM to 11:45 AM"}]
[null,null,{"$f":"'TIME TABLE'!$F$11","v":0},null,null,{"$f":"IF(C1427=0,0,'TIME TABLE'!$B$11)","v":"00:00:00"},{"$f":"IF(C1427=0,0,CONCATENATE('TIME TABLE'!$C$11,'TIME TABLE'!$D$11,'TIME TABLE'!$E$11))","v":0},{"$f":"IF(C1427=0,0,'TIME TABLE'!$C$3)","v":0}]
[null,null,{"$f":"'TIME TABLE'!$F$12","v":0},null,null,{"$f":"IF(C1428=0,0,'TIME TABLE'!$B$12)","v":"00:00:00"},{"$f":"IF(C1428=0,0,CONCATENATE('TIME TABLE'!$C$12,'TIME TABLE'!$D$12,'TIME TABLE'!$E$12))","v":0},{"$f":"IF(C1428=0,0,'TIME TABLE'!$C$3)","v":0}]
[null,null,{"$f":"'TIME TABLE'!$F$13","v":0},null,null,{"$f":"IF(C1429=0,0,'TIME TABLE'!$B$13)","v":"00:00:00"},{"$f":"IF(C1429=0,0,CONCATENATE('TIME TABLE'!$C$13,'TIME TABLE'!$D$13,'TIME TABLE'!$E$13))","v":0},{"$f":"IF(C1429=0,0,'TIME TABLE'!$C$3)","v":0}]
[null,null,{"$f":"'TIME TABLE'!$F$14","v":0},null,null,{"$f":"IF(C1430=0,0,'TIME TABLE'!$B$14)","v":"00:00:00"},{"$f":"IF(C1430=0,0,CONCATENATE('TIME TABLE'!$C$14,'TIME TABLE'!$D$14,'TIME TABLE'!$E$14))","v":0},{"$f":"IF(C1430=0,0,'TIME TABLE'!$C$3)","v":0}]
[null,null,"Instructions"]
[null,null,1,"Check the exam time table carefully."]
[null,null,2,"Students must bring the 'Admit Card' and show it to the invigilator(s) on duty and should preserve it for future requirements."]
[null,null,3,"Mobile Phone, Calculator, Digital Watch or any Electronic Device is NOT ALLOWED."]
[null,null,4,"Arrive at the School at least 15 minutes before the start examination."]
[null,null,5,"Student is barred from entering the examination hall 15 minutes after the written examination starts."]
[null,null,6,"Ensure that you use the washroom before arriving for your exam as you will not be permitted to leave during the first hour."]
[null,null,7,"Normally, you are required to answer questionsusing blue or black in . Make sure you bring some spare pens with you."]
[null,null,8,"Keep your eyes on your own paper. Remember, copying is cheating!"]
[null,null,9,"You must remain silent until after you have exited the school building."]
[]
[{"$f":"A1408+1","v":44}]
[{"$nulls":4},{"$f":"MASTER!$E$11","v":"Govt. Sr. Secondary School Raimalwada"}]
[{"$nulls":4},{"$f":"MASTER!$E$14","v":"P.S.-Bapini (Jodhpur)"}]
[null,{"$f":"CONCATENATE(C1446,'TIME TABLE'!$C$5,'ADMIT CARD'!$C1447,$F1447,'ADMIT CARD'!$G1447,'TIME TABLE'!$E$5)","v":"ADMIT CARD(Roll Number●→0)"},{"$f":"CONCATENATE('TIME TABLE'!$B$2,'TIME TABLE'!$F$2)","v":"HALF YEARLY EXAM:2021-22"}]
[null,null,"ADMIT CARD",{"$nulls":6}," "]
[null,null,"Roll Number",null,null,"●→",{"$f":"VLOOKUP(A1442,'STUDENT DETAIL'!$C$8:$I$107,3)","v":0},null,"Seal and Signature of Head of Institution"]
[null,null,"Student's Name",null,null,"●→",{"$f":"VLOOKUP(A1442,'STUDENT DETAIL'!$C$8:$I$107,4)","v":0}]
[null,null,"Father's Name",null,null,"●→",{"$f":"VLOOKUP(A1442,'STUDENT DETAIL'!$C$8:$I$107,5)","v":0}]
[null,null,"Mother's Name ",null,null,"●→",{"$f":"VLOOKUP(A1442,'STUDENT DETAIL'!$C$8:$I$107,6)","v":0}]
[null,null,"Class & Section",null,null,"●→",{"$f":"IF(G1447=0,0,CONCATENATE('STUDENT DETAIL'!$E$4,'STUDENT DETAIL'!$H$4))","v":0}]
[null,null,"Date Of Birth",null,null,"●→",{"$f":"VLOOKUP(A1442,'STUDENT DETAIL'!$C$8:$I$107,7)","v":"00:00:00"}]
[null,null,"Time Table"]
[null,null,"Subject",null,null,"Date (Day)",null,"Time"]
[null,null,{"$f":"'TIME TABLE'!$F$5","v":"Hindi"},null,null,{"$f":"IF(C1455=0,0,'TIME TABLE'!$B$5)","v":"2022-03-31"},{"$f":"IF(C1455=0,0,CONCATENATE('TIME TABLE'!$C$5,'TIME TABLE'!$D$5,'TIME TABLE'!$E$5))","v":"(Thursday)"},{"$f":"IF(C1455=0,0,'TIME TABLE'!$C$3)","v":"09:00 AM to 11:45 AM"}]
[null,null,{"$f":"'TIME TABLE'!$F$6","v":"English"},null,null,{"$f":"IF(C1456=0,0,'TIME TABLE'!$B$6)","v":"2022-04-01"},{"$f":"IF(C1456=0,0,CONCATENATE('TIME TABLE'!$C$6,'TIME TABLE'!$D$6,'TIME TABLE'!$E$6))","v":"(Friday)"},{"$f":"IF(C1456=0,0,'TIME TABLE'!$C$3)","v":"09:00 AM to 11:45 AM"}]
[null,null,{"$f":"'TIME TABLE'!$F$7","v":"Science"},null,null,{"$f":"IF(C1457=0,0,'TIME TABLE'!$B$7)","v":"2022-04-02"},{"$f":"IF(C1457=0,0,CONCATENATE('TIME TABLE'!$C$7,'TIME TABLE'!$D$7,'TIME TABLE'!$E$7))","v":"(Saturday)"},{"$f":"IF(C1457=0,0,'TIME TABLE'!$C$3)","v":"09:00 AM to 11:45 AM"}]
[null,null,{"$f":"'TIME TABLE'!$F$8","v":"Mathematics"},null,null,{"$f":"IF(C1458=0,0,'TIME TABLE'!$B$8)","v":"2022-04-03"},{"$f":"IF(C1458=0,0,CONCATENATE('TIME TABLE'!$C$8,'TIME TABLE'!$D$8,'TIME TABLE'!$E$8))","v":"(Sunday)"},{"$f":"IF(C1458=0,0,'TIME TABLE'!$C$3)","v":"09:00 AM to 11:45 AM"}]
[null,null,{"$f":"'TIME TABLE'!$F$9","v":"Social Study"},null,null,{"$f":"IF(C1459=0,0,'TIME TABLE'!$B$9)","v":"2022-04-04"},{"$f":"IF(C1459=0,0,CONCATENATE('TIME TABLE'!$C$9,'TIME TABLE'!$D$9,'TIME TABLE'!$E$9))","v":"(Monday)"},{"$f":"IF(C1459=0,0,'TIME TABLE'!$C$3)","v":"09:00 AM to 11:45 AM"}]
[null,null,{"$f":"'TIME TABLE'!$F$10","v":"Sanskrit"},null,null,{"$f":"IF(C1460=0,0,'TIME TABLE'!$B$10)","v":"2022-04-05"},{"$f":"IF(C1460=0,0,CONCATENATE('TIME TABLE'!$C$10,'TIME TABLE'!$D$10,'TIME TABLE'!$E$10))","v":"(Tuesday)"},{"$f":"IF(C1460=0,0,'TIME TABLE'!$C$3)","v":"09:00 AM to 11:45 AM"}]
[null,null,{"$f":"'TIME TABLE'!$F$11","v":0},null,null,{"$f":"IF(C1461=0,0,'TIME TABLE'!$B$11)","v":"00:00:00"},{"$f":"IF(C1461=0,0,CONCATENATE('TIME TABLE'!$C$11,'TIME TABLE'!$D$11,'TIME TABLE'!$E$11))","v":0},{"$f":"IF(C1461=0,0,'TIME TABLE'!$C$3)","v":0}]
[null,null,{"$f":"'TIME TABLE'!$F$12","v":0},null,null,{"$f":"IF(C1462=0,0,'TIME TABLE'!$B$12)","v":"00:00:00"},{"$f":"IF(C1462=0,0,CONCATENATE('TIME TABLE'!$C$12,'TIME TABLE'!$D$12,'TIME TABLE'!$E$12))","v":0},{"$f":"IF(C1462=0,0,'TIME TABLE'!$C$3)","v":0}]
[null,null,{"$f":"'TIME TABLE'!$F$13","v":0},null,null,{"$f":"IF(C1463=0,0,'TIME TABLE'!$B$13)","v":"00:00:00"},{"$f":"IF(C1463=0,0,CONCATENATE('TIME TABLE'!$C$13,'TIME TABLE'!$D$13,'TIME TABLE'!$E$13))","v":0},{"$f":"IF(C1463=0,0,'TIME TABLE'!$C$3)","v":0}]
[null,null,{"$f":"'TIME TABLE'!$F$14","v":0},null,null,{"$f":"IF(C1464=0,0,'TIME TABLE'!$B$14)","v":"00:00:00"},{"$f":"IF(C1464=0,0,CONCATENATE('TIME TABLE'!$C$14,'TIME TABLE'!$D$14,'TIME TABLE'!$E$14))","v":0},{"$f":"IF(C1464=0,0,'TIME TABLE'!$C$3)","v":0}]
[null,null,"Instructions"]
[null,null,1,"Check the exam time table carefully."]
[null,null,2,"Students must bring the 'Admit Card' and show it to the invigilator(s) on duty and should preserve it for future requirements."]
[null,null,3,"Mobile Phone, Calculator, Digital Watch or any Electronic Device is NOT ALLOWED."]
[null,null,4,"Arrive at the School at least 15 minutes before the start examination."]
[null,null,5,"Student is barred from entering the examination hall 15 minutes after the written examination starts."]
[null,null,6,"Ensure that you use the washroom before arriving for your exam as you will not be permitted to leave during the first hour."]
[null,null,7,"Normally, you are required to answer questionsusing blue or black in . Make sure you bring some spare pens with you."]
[null,null,8,"Keep your eyes on your own paper. Remember, copying is cheating!"]
[null,null,9,"You must remain silent until after you have exited the school building."]
[{"$f":"A1442+1","v":45}]
[{"$nulls":4},{"$f":"MASTER!$E$11","v":"Govt. Sr. Secondary School Raimalwada"}]
[{"$nulls":4},{"$f":"MASTER!$E$14","v":"P.S.-Bapini (Jodhpur)"}]
[null,{"$f":"CONCATENATE(C1479,'TIME TABLE'!$C$5,'ADMIT CARD'!$C1480,$F1480,'ADMIT CARD'!$G1480,'TIME TABLE'!$E$5)","v":"ADMIT CARD(Roll Number●→0)"},{"$f":"CONCATENATE('TIME TABLE'!$B$2,'TIME TABLE'!$F$2)","v":"HALF YEARLY EXAM:2021-22"}]
[null,null,"ADMIT CARD",{"$nulls":6}," "]
[null,null,"Roll Number",null,null,"●→",{"$f":"VLOOKUP(A1475,'STUDENT DETAIL'!$C$8:$I$107,3)","v":0},null,"Seal and Signature of Head of Institution"]
[null,null,"Student's Name",null,null,"●→",{"$f":"VLOOKUP(A1475,'STUDENT DETAIL'!$C$8:$I$107,4)","v":0}]
[null,null,"Father's Name",null,null,"●→",{"$f":"VLOOKUP(A1475,'STUDENT DETAIL'!$C$8:$I$107,5)","v":0}]
[null,null,"Mother's Name ",null,null,"●→",{"$f":"VLOOKUP(A1475,'STUDENT DETAIL'!$C$8:$I$107,6)","v":0}]
[null,null,"Class & Section",null,null,"●→",{"$f":"IF(G1480=0,0,CONCATENATE('STUDENT DETAIL'!$E$4,'STUDENT DETAIL'!$H$4))","v":0}]
[null,null,"Date Of Birth",null,null,"●→",{"$f":"VLOOKUP(A1475,'STUDENT DETAIL'!$C$8:$I$107,7)","v":"00:00:00"}]
[null,null,"Time Table"]
[null,null,"Subject",null,null,"Date (Day)",null,"Time"]
[null,null,{"$f":"'TIME TABLE'!$F$5","v":"Hindi"},null,null,{"$f":"IF(C1488=0,0,'TIME TABLE'!$B$5)","v":"2022-03-31"},{"$f":"IF(C1488=0,0,CONCATENATE('TIME TABLE'!$C$5,'TIME TABLE'!$D$5,'TIME TABLE'!$E$5))","v":"(Thursday)"},{"$f":"IF(C1488=0,0,'TIME TABLE'!$C$3)","v":"09:00 AM to 11:45 AM"}]
[null,null,{"$f":"'TIME TABLE'!$F$6","v":"English"},null,null,{"$f":"IF(C1489=0,0,'TIME TABLE'!$B$6)","v":"2022-04-01"},{"$f":"IF(C1489=0,0,CONCATENATE('TIME TABLE'!$C$6,'TIME TABLE'!$D$6,'TIME TABLE'!$E$6))","v":"(Friday)"},{"$f":"IF(C1489=0,0,'TIME TABLE'!$C$3)","v":"09:00 AM to 11:45 AM"}]
[null,null,{"$f":"'TIME TABLE'!$F$7","v":"Science"},null,null,{"$f":"IF(C1490=0,0,'TIME TABLE'!$B$7)","v":"2022-04-02"},{"$f":"IF(C1490=0,0,CONCATENATE('TIME TABLE'!$C$7,'TIME TABLE'!$D$7,'TIME TABLE'!$E$7))","v":"(Saturday)"},{"$f":"IF(C1490=0,0,'TIME TABLE'!$C$3)","v":"09:00 AM to 11:45 AM"}]
[null,null,{"$f":"'TIME TABLE'!$F$8","v":"Mathematics"},null,null,{"$f":"IF(C1491=0,0,'TIME TABLE'!$B$8)","v":"2022-04-03"},{"$f":"IF(C1491=0,0,CONCATENATE('TIME TABLE'!$C$8,'TIME TABLE'!$D$8,'TIME TABLE'!$E$8))","v":"(Sunday)"},{"$f":"IF(C1491=0,0,'TIME TABLE'!$C$3)","v":"09:00 AM to 11:45 AM"}]
[null,null,{"$f":"'TIME TABLE'!$F$9","v":"Social Study"},null,null,{"$f":"IF(C1492=0,0,'TIME TABLE'!$B$9)","v":"2022-04-04"},{"$f":"IF(C1492=0,0,CONCATENATE('TIME TABLE'!$C$9,'TIME TABLE'!$D$9,'TIME TABLE'!$E$9))","v":"(Monday)"},{"$f":"IF(C1492=0,0,'TIME TABLE'!$C$3)","v":"09:00 AM to 11:45 AM"}]
[null,null,{"$f":"'TIME TABLE'!$F$10","v":"Sanskrit"},null,null,{"$f":"IF(C1493=0,0,'TIME TABLE'!$B$10)","v":"2022-04-05"},{"$f":"IF(C1493=0,0,CONCATENATE('TIME TABLE'!$C$10,'TIME TABLE'!$D$10,'TIME TABLE'!$E$10))","v":"(Tuesday)"},{"$f":"IF(C1493=0,0,'TIME TABLE'!$C$3)","v":"09:00 AM to 11:45 AM"}]
[null,null,{"$f":"'TIME TABLE'!$F$11","v":0},null,null,{"$f":"IF(C1494=0,0,'TIME TABLE'!$B$11)","v":"00:00:00"},{"$f":"IF(C1494=0,0,CONCATENATE('TIME TABLE'!$C$11,'TIME TABLE'!$D$11,'TIME TABLE'!$E$11))","v":0},{"$f":"IF(C1494=0,0,'TIME TABLE'!$C$3)","v":0}]
[null,null,{"$f":"'TIME TABLE'!$F$12","v":0},null,null,{"$f":"IF(C1495=0,0,'TIME TABLE'!$B$12)","v":"00:00:00"},{"$f":"IF(C1495=0,0,CONCATENATE('TIME TABLE'!$C$12,'TIME TABLE'!$D$12,'TIME TABLE'!$E$12))","v":0},{"$f":"IF(C1495=0,0,'TIME TABLE'!$C$3)","v":0}]
[null,null,{"$f":"'TIME TABLE'!$F$13","v":0},null,null,{"$f":"IF(C1496=0,0,'TIME TABLE'!$B$13)","v":"00:00:00"},{"$f":"IF(C1496=0,0,CONCATENATE('TIME TABLE'!$C$13,'TIME TABLE'!$D$13,'TIME TABLE'!$E$13))","v":0},{"$f":"IF(C1496=0,0,'TIME TABLE'!$C$3)","v":0}]
[null,null,{"$f":"'TIME TABLE'!$F$14","v":0},null,null,{"$f":"IF(C1497=0,0,'TIME TABLE'!$B$14)","v":"00:00:00"},{"$f":"IF(C1497=0,0,CONCATENATE('TIME TABLE'!$C$14,'TIME TABLE'!$D$14,'TIME TABLE'!$E$14))","v":0},{"$f":"IF(C1497=0,0,'TIME TABLE'!$C$3)","v":0}]
[null,null,"Instructions"]
[null,null,1,"Check the exam time table carefully."]
[null,null,2,"Students must bring the 'Admit Card' and show it to the invigilator(s) on duty and should preserve it for future requirements."]
[null,null,3,"Mobile Phone, Calculator, Digital Watch or any Electronic Device is NOT ALLOWED."]
[null,null,4,"Arrive at the School at least 15 minutes before the start examination."]
[null,null,5,"Student is barred from entering the examination hall 15 minutes after the written examination starts."]
[null,null,6,"Ensure that you use the washroom before arriving for your exam as you will not be permitted to leave during the first hour."]
[null,null,7,"Normally, you are required to answer questionsusing blue or black in . Make sure you bring some spare pens with you."]
[null,null,8,"Keep your eyes on your own paper. Remember, copying is cheating!"]
[null,null,9,"You must remain silent until after you have exited the school building."]
[]
[{"$f":"A1475+1","v":46}]
[{"$nulls":4},{"$f":"MASTER!$E$11","v":"Govt. Sr. Secondary School Raimalwada"}]
[{"$nulls":4},{"$f":"MASTER!$E$14","v":"P.S.-Bapini (Jodhpur)"}]
[null,{"$f":"CONCATENATE(C1513,'TIME TABLE'!$C$5,'ADMIT CARD'!$C1514,$F1514,'ADMIT CARD'!$G1514,'TIME TABLE'!$E$5)","v":"ADMIT CARD(Roll Number●→0)"},{"$f":"CONCATENATE('TIME TABLE'!$B$2,'TIME TABLE'!$F$2)","v":"HALF YEARLY EXAM:2021-22"}]
[null,null,"ADMIT CARD",{"$nulls":6}," "]
[null,null,"Roll Number",null,null,"●→",{"$f":"VLOOKUP(A1509,'STUDENT DETAIL'!$C$8:$I$107,3)","v":0},null,"Seal and Signature of Head of Institution"]
[null,null,"Student's Name",null,null,"●→",{"$f":"VLOOKUP(A1509,'STUDENT DETAIL'!$C$8:$I$107,4)","v":0}]
[null,null,"Father's Name",null,null,"●→",{"$f":"VLOOKUP(A1509,'STUDENT DETAIL'!$C$8:$I$107,5)","v":0}]
[null,null,"Mother's Name ",null,null,"●→",{"$f":"VLOOKUP(A1509,'STUDENT DETAIL'!$C$8:$I$107,6)","v":0}]
[null,null,"Class & Section",null,null,"●→",{"$f":"IF(G1514=0,0,CONCATENATE('STUDENT DETAIL'!$E$4,'STUDENT DETAIL'!$H$4))","v":0}]
[null,null,"Date Of Birth",null,null,"●→",{"$f":"VLOOKUP(A1509,'STUDENT DETAIL'!$C$8:$I$107,7)","v":"00:00:00"}]
[null,null,"Time Table"]
[null,null,"Subject",null,null,"Date (Day)",null,"Time"]
[null,null,{"$f":"'TIME TABLE'!$F$5","v":"Hindi"},null,null,{"$f":"IF(C1522=0,0,'TIME TABLE'!$B$5)","v":"2022-03-31"},{"$f":"IF(C1522=0,0,CONCATENATE('TIME TABLE'!$C$5,'TIME TABLE'!$D$5,'TIME TABLE'!$E$5))","v":"(Thursday)"},{"$f":"IF(C1522=0,0,'TIME TABLE'!$C$3)","v":"09:00 AM to 11:45 AM"}]
[null,null,{"$f":"'TIME TABLE'!$F$6","v":"English"},null,null,{"$f":"IF(C1523=0,0,'TIME TABLE'!$B$6)","v":"2022-04-01"},{"$f":"IF(C1523=0,0,CONCATENATE('TIME TABLE'!$C$6,'TIME TABLE'!$D$6,'TIME TABLE'!$E$6))","v":"(Friday)"},{"$f":"IF(C1523=0,0,'TIME TABLE'!$C$3)","v":"09:00 AM to 11:45 AM"}]
[null,null,{"$f":"'TIME TABLE'!$F$7","v":"Science"},null,null,{"$f":"IF(C1524=0,0,'TIME TABLE'!$B$7)","v":"2022-04-02"},{"$f":"IF(C1524=0,0,CONCATENATE('TIME TABLE'!$C$7,'TIME TABLE'!$D$7,'TIME TABLE'!$E$7))","v":"(Saturday)"},{"$f":"IF(C1524=0,0,'TIME TABLE'!$C$3)","v":"09:00 AM to 11:45 AM"}]
[null,null,{"$f":"'TIME TABLE'!$F$8","v":"Mathematics"},null,null,{"$f":"IF(C1525=0,0,'TIME TABLE'!$B$8)","v":"2022-04-03"},{"$f":"IF(C1525=0,0,CONCATENATE('TIME TABLE'!$C$8,'TIME TABLE'!$D$8,'TIME TABLE'!$E$8))","v":"(Sunday)"},{"$f":"IF(C1525=0,0,'TIME TABLE'!$C$3)","v":"09:00 AM to 11:45 AM"}]
[null,null,{"$f":"'TIME TABLE'!$F$9","v":"Social Study"},null,null,{"$f":"IF(C1526=0,0,'TIME TABLE'!$B$9)","v":"2022-04-04"},{"$f":"IF(C1526=0,0,CONCATENATE('TIME TABLE'!$C$9,'TIME TABLE'!$D$9,'TIME TABLE'!$E$9))","v":"(Monday)"},{"$f":"IF(C1526=0,0,'TIME TABLE'!$C$3)","v":"09:00 AM to 11:45 AM"}]
[null,null,{"$f":"'TIME TABLE'!$F$10","v":"Sanskrit"},null,null,{"$f":"IF(C1527=0,0,'TIME TABLE'!$B$10)","v":"2022-04-05"},{"$f":"IF(C1527=0,0,CONCATENATE('TIME TABLE'!$C$10,'TIME TABLE'!$D$10,'TIME TABLE'!$E$10))","v":"(Tuesday)"},{"$f":"IF(C1527=0,0,'TIME TABLE'!$C$3)","v":"09:00 AM to 11:45 AM"}]
[null,null,{"$f":"'TIME TABLE'!$F$11","v":0},null,null,{"$f":"IF(C1528=0,0,'TIME TABLE'!$B$11)","v":"00:00:00"},{"$f":"IF(C1528=0,0,CONCATENATE('TIME TABLE'!$C$11,'TIME TABLE'!$D$11,'TIME TABLE'!$E$11))","v":0},{"$f":"IF(C1528=0,0,'TIME TABLE'!$C$3)","v":0}]
[null,null,{"$f":"'TIME TABLE'!$F$12","v":0},null,null,{"$f":"IF(C1529=0,0,'TIME TABLE'!$B$12)","v":"00:00:00"},{"$f":"IF(C1529=0,0,CONCATENATE('TIME TABLE'!$C$12,'TIME TABLE'!$D$12,'TIME TABLE'!$E$12))","v":0},{"$f":"IF(C1529=0,0,'TIME TABLE'!$C$3)","v":0}]
[null,null,{"$f":"'TIME TABLE'!$F$13","v":0},null,null,{"$f":"IF(C1530=0,0,'TIME TABLE'!$B$13)","v":"00:00:00"},{"$f":"IF(C1530=0,0,CONCATENATE('TIME TABLE'!$C$13,'TIME TABLE'!$D$13,'TIME TABLE'!$E$13))","v":0},{"$f":"IF(C1530=0,0,'TIME TABLE'!$C$3)","v":0}]
[null,null,{"$f":"'TIME TABLE'!$F$14","v":0},null,null,{"$f":"IF(C1531=0,0,'TIME TABLE'!$B$14)","v":"00:00:00"},{"$f":"IF(C1531=0,0,CONCATENATE('TIME TABLE'!$C$14,'TIME TABLE'!$D$14,'TIME TABLE'!$E$14))","v":0},{"$f":"IF(C1531=0,0,'TIME TABLE'!$C$3)","v":0}]
[null,null,"Instructions"]
[null,null,1,"Check the exam time table carefully."]
[null,null,2,"Students must bring the 'Admit Card' and show it to the invigilator(s) on duty and should preserve it for future requirements."]
[null,null,3,"Mobile Phone, Calculator, Digital Watch or any Electronic Device is NOT ALLOWED."]
[null,null,4,"Arrive at the School at least 15 minutes before the start examination."]
[null,null,5,"Student is barred from entering the examination hall 15 minutes after the written examination starts."]
[null,null,6,"Ensure that you use the washroom before arriving for your exam as you will not be permitted to leave during the first hour."]
[null,null,7,"Normally, you are required to answer questionsusing blue or black in . Make sure you bring some spare pens with you."]
[null,null,8,"Keep your eyes on your own paper. Remember, copying is cheating!"]
[null,null,9,"You must remain silent until after you have exited the school building."]
[{"$f":"A1509+1","v":47}]
[{"$nulls":4},{"$f":"MASTER!$E$11","v":"Govt. Sr. Secondary School Raimalwada"}]
[{"$nulls":4},{"$f":"MASTER!$E$14","v":"P.S.-Bapini (Jodhpur)"}]
[null,{"$f":"CONCATENATE(C1546,'TIME TABLE'!$C$5,'ADMIT CARD'!$C1547,$F1547,'ADMIT CARD'!$G1547,'TIME TABLE'!$E$5)","v":"ADMIT CARD(Roll Number●→0)"},{"$f":"CONCATENATE('TIME TABLE'!$B$2,'TIME TABLE'!$F$2)","v":"HALF YEARLY EXAM:2021-22"}]
[null,null,"ADMIT CARD",{"$nulls":6}," "]
[null,null,"Roll Number",null,null,"●→",{"$f":"VLOOKUP(A1542,'STUDENT DETAIL'!$C$8:$I$107,3)","v":0},null,"Seal and Signature of Head of Institution"]
[null,null,"Student's Name",null,null,"●→",{"$f":"VLOOKUP(A1542,'STUDENT DETAIL'!$C$8:$I$107,4)","v":0}]
[null,null,"Father's Name",null,null,"●→",{"$f":"VLOOKUP(A1542,'STUDENT DETAIL'!$C$8:$I$107,5)","v":0}]
[null,null,"Mother's Name ",null,null,"●→",{"$f":"VLOOKUP(A1542,'STUDENT DETAIL'!$C$8:$I$107,6)","v":0}]
[null,null,"Class & Section",null,null,"●→",{"$f":"IF(G1547=0,0,CONCATENATE('STUDENT DETAIL'!$E$4,'STUDENT DETAIL'!$H$4))","v":0}]
[null,null,"Date Of Birth",null,null,"●→",{"$f":"VLOOKUP(A1542,'STUDENT DETAIL'!$C$8:$I$107,7)","v":"00:00:00"}]
[null,null,"Time Table"]
[null,null,"Subject",null,null,"Date (Day)",null,"Time"]
[null,null,{"$f":"'TIME TABLE'!$F$5","v":"Hindi"},null,null,{"$f":"IF(C1555=0,0,'TIME TABLE'!$B$5)","v":"2022-03-31"},{"$f":"IF(C1555=0,0,CONCATENATE('TIME TABLE'!$C$5,'TIME TABLE'!$D$5,'TIME TABLE'!$E$5))","v":"(Thursday)"},{"$f":"IF(C1555=0,0,'TIME TABLE'!$C$3)","v":"09:00 AM to 11:45 AM"}]
[null,null,{"$f":"'TIME TABLE'!$F$6","v":"English"},null,null,{"$f":"IF(C1556=0,0,'TIME TABLE'!$B$6)","v":"2022-04-01"},{"$f":"IF(C1556=0,0,CONCATENATE('TIME TABLE'!$C$6,'TIME TABLE'!$D$6,'TIME TABLE'!$E$6))","v":"(Friday)"},{"$f":"IF(C1556=0,0,'TIME TABLE'!$C$3)","v":"09:00 AM to 11:45 AM"}]
[null,null,{"$f":"'TIME TABLE'!$F$7","v":"Science"},null,null,{"$f":"IF(C1557=0,0,'TIME TABLE'!$B$7)","v":"2022-04-02"},{"$f":"IF(C1557=0,0,CONCATENATE('TIME TABLE'!$C$7,'TIME TABLE'!$D$7,'TIME TABLE'!$E$7))","v":"(Saturday)"},{"$f":"IF(C1557=0,0,'TIME TABLE'!$C$3)","v":"09:00 AM to 11:45 AM"}]
[null,null,{"$f":"'TIME TABLE'!$F$8","v":"Mathematics"},null,null,{"$f":"IF(C1558=0,0,'TIME TABLE'!$B$8)","v":"2022-04-03"},{"$f":"IF(C1558=0,0,CONCATENATE('TIME TABLE'!$C$8,'TIME TABLE'!$D$8,'TIME TABLE'!$E$8))","v":"(Sunday)"},{"$f":"IF(C1558=0,0,'TIME TABLE'!$C$3)","v":"09:00 AM to 11:45 AM"}]
[null,null,{"$f":"'TIME TABLE'!$F$9","v":"Social Study"},null,null,{"$f":"IF(C1559=0,0,'TIME TABLE'!$B$9)","v":"2022-04-04"},{"$f":"IF(C1559=0,0,CONCATENATE('TIME TABLE'!$C$9,'TIME TABLE'!$D$9,'TIME TABLE'!$E$9))","v":"(Monday)"},{"$f":"IF(C1559=0,0,'TIME TABLE'!$C$3)","v":"09:00 AM to 11:45 AM"}]
[null,null,{"$f":"'TIME TABLE'!$F$10","v":"Sanskrit"},null,null,{"$f":"IF(C1560=0,0,'TIME TABLE'!$B$10)","v":"2022-04-05"},{"$f":"IF(C1560=0,0,CONCATENATE('TIME TABLE'!$C$10,'TIME TABLE'!$D$10,'TIME TABLE'!$E$10))","v":"(Tuesday)"},{"$f":"IF(C1560=0,0,'TIME TABLE'!$C$3)","v":"09:00 AM to 11:45 AM"}]
[null,null,{"$f":"'TIME TABLE'!$F$11","v":0},null,null,{"$f":"IF(C1561=0,0,'TIME TABLE'!$B$11)","v":"00:00:00"},{"$f":"IF(C1561=0,0,CONCATENATE('TIME TABLE'!$C$11,'TIME TABLE'!$D$11,'TIME TABLE'!$E$11))","v":0},{"$f":"IF(C1561=0,0,'TIME TABLE'!$C$3)","v":0}]
[null,null,{"$f":"'TIME TABLE'!$F$12","v":0},null,null,{"$f":"IF(C1562=0,0,'TIME TABLE'!$B$12)","v":"00:00:00"},{"$f":"IF(C1562=0,0,CONCATENATE('TIME TABLE'!$C$12,'TIME TABLE'!$D$12,'TIME TABLE'!$E$12))","v":0},{"$f":"IF(C1562=0,0,'TIME TABLE'!$C$3)","v":0}]
[null,null,{"$f":"'TIME TABLE'!$F$13","v":0},null,null,{"$f":"IF(C1563=0,0,'TIME TABLE'!$B$13)","v":"00:00:00"},{"$f":"IF(C1563=0,0,CONCATENATE('TIME TABLE'!$C$13,'TIME TABLE'!$D$13,'TIME TABLE'!$E$13))","v":0},{"$f":"IF(C1563=0,0,'TIME TABLE'!$C$3)","v":0}]
[null,null,{"$f":"'TIME TABLE'!$F$14","v":0},null,null,{"$f":"IF(C1564=0,0,'TIME TABLE'!$B$14)","v":"00:00:00"},{"$f":"IF(C1564=0,0,CONCATENATE('TIME TABLE'!$C$14,'TIME TABLE'!$D$14,'TIME TABLE'!$E$14))","v":0},{"$f":"IF(C1564=0,0,'TIME TABLE'!$C$3)","v":0}]
[null,null,"Instructions"]
[null,null,1,"Check the exam time table carefully."]
[null,null,2,"Students must bring the 'Admit Card' and show it to the invigilator(s) on duty and should preserve it for future requirements."]
[null,null,3,"Mobile Phone, Calculator, Digital Watch or any Electronic Device is NOT ALLOWED."]
[null,null,4,"Arrive at the School at least 15 minutes before the start examination."]
[null,null,5,"Student is barred from entering the examination hall 15 minutes after the written examination starts."]
[null,null,6,"Ensure that you use the washroom before arriving for your exam as you will not be permitted to leave during the first hour."]
[null,null,7,"Normally, you are required to answer questionsusing blue or black in . Make sure you bring some spare pens with you."]
[null,null,8,"Keep your eyes on your own paper. Remember, copying is cheating!"]
[null,null,9,"You must remain silent until after you have exited the school building."]
[]
[{"$f":"A1542+1","v":48}]
[{"$nulls":4},{"$f":"MASTER!$E$11","v":"Govt. Sr. Secondary School Raimalwada"}]
[{"$nulls":4},{"$f":"MASTER!$E$14","v":"P.S.-Bapini (Jodhpur)"}]
[null,{"$f":"CONCATENATE(C1580,'TIME TABLE'!$C$5,'ADMIT CARD'!$C1581,$F1581,'ADMIT CARD'!$G1581,'TIME TABLE'!$E$5)","v":"ADMIT CARD(Roll Number●→0)"},{"$f":"CONCATENATE('TIME TABLE'!$B$2,'TIME TABLE'!$F$2)","v":"HALF YEARLY EXAM:2021-22"}]
[null,null,"ADMIT CARD",{"$nulls":6}," "]
[null,null,"Roll Number",null,null,"●→",{"$f":"VLOOKUP(A1576,'STUDENT DETAIL'!$C$8:$I$107,3)","v":0},null,"Seal and Signature of Head of Institution"]
[null,null,"Student's Name",null,null,"●→",{"$f":"VLOOKUP(A1576,'STUDENT DETAIL'!$C$8:$I$107,4)","v":0}]
[null,null,"Father's Name",null,null,"●→",{"$f":"VLOOKUP(A1576,'STUDENT DETAIL'!$C$8:$I$107,5)","v":0}]
[null,null,"Mother's Name ",null,null,"●→",{"$f":"VLOOKUP(A1576,'STUDENT DETAIL'!$C$8:$I$107,6)","v":0}]
[null,null,"Class & Section",null,null,"●→",{"$f":"IF(G1581=0,0,CONCATENATE('STUDENT DETAIL'!$E$4,'STUDENT DETAIL'!$H$4))","v":0}]
[null,null,"Date Of Birth",null,null,"●→",{"$f":"VLOOKUP(A1576,'STUDENT DETAIL'!$C$8:$I$107,7)","v":"00:00:00"}]
[null,null,"Time Table"]
[null,null,"Subject",null,null,"Date (Day)",null,"Time"]
[null,null,{"$f":"'TIME TABLE'!$F$5","v":"Hindi"},null,null,{"$f":"IF(C1589=0,0,'TIME TABLE'!$B$5)","v":"2022-03-31"},{"$f":"IF(C1589=0,0,CONCATENATE('TIME TABLE'!$C$5,'TIME TABLE'!$D$5,'TIME TABLE'!$E$5))","v":"(Thursday)"},{"$f":"IF(C1589=0,0,'TIME TABLE'!$C$3)","v":"09:00 AM to 11:45 AM"}]
[null,null,{"$f":"'TIME TABLE'!$F$6","v":"English"},null,null,{"$f":"IF(C1590=0,0,'TIME TABLE'!$B$6)","v":"2022-04-01"},{"$f":"IF(C1590=0,0,CONCATENATE('TIME TABLE'!$C$6,'TIME TABLE'!$D$6,'TIME TABLE'!$E$6))","v":"(Friday)"},{"$f":"IF(C1590=0,0,'TIME TABLE'!$C$3)","v":"09:00 AM to 11:45 AM"}]
[null,null,{"$f":"'TIME TABLE'!$F$7","v":"Science"},null,null,{"$f":"IF(C1591=0,0,'TIME TABLE'!$B$7)","v":"2022-04-02"},{"$f":"IF(C1591=0,0,CONCATENATE('TIME TABLE'!$C$7,'TIME TABLE'!$D$7,'TIME TABLE'!$E$7))","v":"(Saturday)"},{"$f":"IF(C1591=0,0,'TIME TABLE'!$C$3)","v":"09:00 AM to 11:45 AM"}]
[null,null,{"$f":"'TIME TABLE'!$F$8","v":"Mathematics"},null,null,{"$f":"IF(C1592=0,0,'TIME TABLE'!$B$8)","v":"2022-04-03"},{"$f":"IF(C1592=0,0,CONCATENATE('TIME TABLE'!$C$8,'TIME TABLE'!$D$8,'TIME TABLE'!$E$8))","v":"(Sunday)"},{"$f":"IF(C1592=0,0,'TIME TABLE'!$C$3)","v":"09:00 AM to 11:45 AM"}]
[null,null,{"$f":"'TIME TABLE'!$F$9","v":"Social Study"},null,null,{"$f":"IF(C1593=0,0,'TIME TABLE'!$B$9)","v":"2022-04-04"},{"$f":"IF(C1593=0,0,CONCATENATE('TIME TABLE'!$C$9,'TIME TABLE'!$D$9,'TIME TABLE'!$E$9))","v":"(Monday)"},{"$f":"IF(C1593=0,0,'TIME TABLE'!$C$3)","v":"09:00 AM to 11:45 AM"}]
[null,null,{"$f":"'TIME TABLE'!$F$10","v":"Sanskrit"},null,null,{"$f":"IF(C1594=0,0,'TIME TABLE'!$B$10)","v":"2022-04-05"},{"$f":"IF(C1594=0,0,CONCATENATE('TIME TABLE'!$C$10,'TIME TABLE'!$D$10,'TIME TABLE'!$E$10))","v":"(Tuesday)"},{"$f":"IF(C1594=0,0,'TIME TABLE'!$C$3)","v":"09:00 AM to 11:45 AM"}]
[null,null,{"$f":"'TIME TABLE'!$F$11","v":0},null,null,{"$f":"IF(C1595=0,0,'TIME TABLE'!$B$11)","v":"00:00:00"},{"$f":"IF(C1595=0,0,CONCATENATE('TIME TABLE'!$C$11,'TIME TABLE'!$D$11,'TIME TABLE'!$E$11))","v":0},{"$f":"IF(C1595=0,0,'TIME TABLE'!$C$3)","v":0}]
[null,null,{"$f":"'TIME TABLE'!$F$12","v":0},null,null,{"$f":"IF(C1596=0,0,'TIME TABLE'!$B$12)","v":"00:00:00"},{"$f":"IF(C1596=0,0,CONCATENATE('TIME TABLE'!$C$12,'TIME TABLE'!$D$12,'TIME TABLE'!$E$12))","v":0},{"$f":"IF(C1596=0,0,'TIME TABLE'!$C$3)","v":0}]
[null,null,{"$f":"'TIME TABLE'!$F$13","v":0},null,null,{"$f":"IF(C1597=0,0,'TIME TABLE'!$B$13)","v":"00:00:00"},{"$f":"IF(C1597=0,0,CONCATENATE('TIME TABLE'!$C$13,'TIME TABLE'!$D$13,'TIME TABLE'!$E$13))","v":0},{"$f":"IF(C1597=0,0,'TIME TABLE'!$C$3)","v":0}]
[null,null,{"$f":"'TIME TABLE'!$F$14","v":0},null,null,{"$f":"IF(C1598=0,0,'TIME TABLE'!$B$14)","v":"00:00:00"},{"$f":"IF(C1598=0,0,CONCATENATE('TIME TABLE'!$C$14,'TIME TABLE'!$D$14,'TIME TABLE'!$E$14))","v":0},{"$f":"IF(C1598=0,0,'TIME TABLE'!$C$3)","v":0}]
[null,null,"Instructions"]
[null,null,1,"Check the exam time table carefully."]
[null,null,2,"Students must bring the 'Admit Card' and show it to the invigilator(s) on duty and should preserve it for future requirements."]
[null,null,3,"Mobile Phone, Calculator, Digital Watch or any Electronic Device is NOT ALLOWED."]
[null,null,4,"Arrive at the School at least 15 minutes before the start examination."]
[null,null,5,"Student is barred from entering the examination hall 15 minutes after the written examination starts."]
[null,null,6,"Ensure that you use the washroom before arriving for your exam as you will not be permitted to leave during the first hour."]
[null,null,7,"Normally, you are required to answer questionsusing blue or black in . Make sure you bring some spare pens with you."]
[null,null,8,"Keep your eyes on your own paper. Remember, copying is cheating!"]
[null,null,9,"You must remain silent until after you have exited the school building."]
[{"$f":"A1576+1","v":49}]
[{"$nulls":4},{"$f":"MASTER!$E$11","v":"Govt. Sr. Secondary School Raimalwada"}]
[{"$nulls":4},{"$f":"MASTER!$E$14","v":"P.S.-Bapini (Jodhpur)"}]
[null,{"$f":"CONCATENATE(C1613,'TIME TABLE'!$C$5,'ADMIT CARD'!$C1614,$F1614,'ADMIT CARD'!$G1614,'TIME TABLE'!$E$5)","v":"ADMIT CARD(Roll Number●→0)"},{"$f":"CONCATENATE('TIME TABLE'!$B$2,'TIME TABLE'!$F$2)","v":"HALF YEARLY EXAM:2021-22"}]
[null,null,"ADMIT CARD",{"$nulls":6}," "]
[null,null,"Roll Number",null,null,"●→",{"$f":"VLOOKUP(A1609,'STUDENT DETAIL'!$C$8:$I$107,3)","v":0},null,"Seal and Signature of Head of Institution"]
[null,null,"Student's Name",null,null,"●→",{"$f":"VLOOKUP(A1609,'STUDENT DETAIL'!$C$8:$I$107,4)","v":0}]
[null,null,"Father's Name",null,null,"●→",{"$f":"VLOOKUP(A1609,'STUDENT DETAIL'!$C$8:$I$107,5)","v":0}]
[null,null,"Mother's Name ",null,null,"●→",{"$f":"VLOOKUP(A1609,'STUDENT DETAIL'!$C$8:$I$107,6)","v":0}]
[null,null,"Class & Section",null,null,"●→",{"$f":"IF(G1614=0,0,CONCATENATE('STUDENT DETAIL'!$E$4,'STUDENT DETAIL'!$H$4))","v":0}]
[null,null,"Date Of Birth",null,null,"●→",{"$f":"VLOOKUP(A1609,'STUDENT DETAIL'!$C$8:$I$107,7)","v":"00:00:00"}]
[null,null,"Time Table"]
[null,null,"Subject",null,null,"Date (Day)",null,"Time"]
[null,null,{"$f":"'TIME TABLE'!$F$5","v":"Hindi"},null,null,{"$f":"IF(C1622=0,0,'TIME TABLE'!$B$5)","v":"2022-03-31"},{"$f":"IF(C1622=0,0,CONCATENATE('TIME TABLE'!$C$5,'TIME TABLE'!$D$5,'TIME TABLE'!$E$5))","v":"(Thursday)"},{"$f":"IF(C1622=0,0,'TIME TABLE'!$C$3)","v":"09:00 AM to 11:45 AM"}]
[null,null,{"$f":"'TIME TABLE'!$F$6","v":"English"},null,null,{"$f":"IF(C1623=0,0,'TIME TABLE'!$B$6)","v":"2022-04-01"},{"$f":"IF(C1623=0,0,CONCATENATE('TIME TABLE'!$C$6,'TIME TABLE'!$D$6,'TIME TABLE'!$E$6))","v":"(Friday)"},{"$f":"IF(C1623=0,0,'TIME TABLE'!$C$3)","v":"09:00 AM to 11:45 AM"}]
[null,null,{"$f":"'TIME TABLE'!$F$7","v":"Science"},null,null,{"$f":"IF(C1624=0,0,'TIME TABLE'!$B$7)","v":"2022-04-02"},{"$f":"IF(C1624=0,0,CONCATENATE('TIME TABLE'!$C$7,'TIME TABLE'!$D$7,'TIME TABLE'!$E$7))","v":"(Saturday)"},{"$f":"IF(C1624=0,0,'TIME TABLE'!$C$3)","v":"09:00 AM to 11:45 AM"}]
[null,null,{"$f":"'TIME TABLE'!$F$8","v":"Mathematics"},null,null,{"$f":"IF(C1625=0,0,'TIME TABLE'!$B$8)","v":"2022-04-03"},{"$f":"IF(C1625=0,0,CONCATENATE('TIME TABLE'!$C$8,'TIME TABLE'!$D$8,'TIME TABLE'!$E$8))","v":"(Sunday)"},{"$f":"IF(C1625=0,0,'TIME TABLE'!$C$3)","v":"09:00 AM to 11:45 AM"}]
[null,null,{"$f":"'TIME TABLE'!$F$9","v":"Social Study"},null,null,{"$f":"IF(C1626=0,0,'TIME TABLE'!$B$9)","v":"2022-04-04"},{"$f":"IF(C1626=0,0,CONCATENATE('TIME TABLE'!$C$9,'TIME TABLE'!$D$9,'TIME TABLE'!$E$9))","v":"(Monday)"},{"$f":"IF(C1626=0,0,'TIME TABLE'!$C$3)","v":"09:00 AM to 11:45 AM"}]
[null,null,{"$f":"'TIME TABLE'!$F$10","v":"Sanskrit"},null,null,{"$f":"IF(C1627=0,0,'TIME TABLE'!$B$10)","v":"2022-04-05"},{"$f":"IF(C1627=0,0,CONCATENATE('TIME TABLE'!$C$10,'TIME TABLE'!$D$10,'TIME TABLE'!$E$10))","v":"(Tuesday)"},{"$f":"IF(C1627=0,0,'TIME TABLE'!$C$3)","v":"09:00 AM to 11:45 AM"}]
[null,null,{"$f":"'TIME TABLE'!$F$11","v":0},null,null,{"$f":"IF(C1628=0,0,'TIME TABLE'!$B$11)","v":"00:00:00"},{"$f":"IF(C1628=0,0,CONCATENATE('TIME TABLE'!$C$11,'TIME TABLE'!$D$11,'TIME TABLE'!$E$11))","v":0},{"$f":"IF(C1628=0,0,'TIME TABLE'!$C$3)","v":0}]
[null,null,{"$f":"'TIME TABLE'!$F$12","v":0},null,null,{"$f":"IF(C1629=0,0,'TIME TABLE'!$B$12)","v":"00:00:00"},{"$f":"IF(C1629=0,0,CONCATENATE('TIME TABLE'!$C$12,'TIME TABLE'!$D$12,'TIME TABLE'!$E$12))","v":0},{"$f":"IF(C1629=0,0,'TIME TABLE'!$C$3)","v":0}]
[null,null,{"$f":"'TIME TABLE'!$F$13","v":0},null,null,{"$f":"IF(C1630=0,0,'TIME TABLE'!$B$13)","v":"00:00:00"},{"$f":"IF(C1630=0,0,CONCATENATE('TIME TABLE'!$C$13,'TIME TABLE'!$D$13,'TIME TABLE'!$E$13))","v":0},{"$f":"IF(C1630=0,0,'TIME TABLE'!$C$3)","v":0}]
[null,null,{"$f":"'TIME TABLE'!$F$14","v":0},null,null,{"$f":"IF(C1631=0,0,'TIME TABLE'!$B$14)","v":"00:00:00"},{"$f":"IF(C1631=0,0,CONCATENATE('TIME TABLE'!$C$14,'TIME TABLE'!$D$14,'TIME TABLE'!$E$14))","v":0},{"$f":"IF(C1631=0,0,'TIME TABLE'!$C$3)","v":0}]
[null,null,"Instructions"]
[null,null,1,"Check the exam time table carefully."]
[null,null,2,"Students must bring the 'Admit Card' and show it to the invigilator(s) on duty and should preserve it for future requirements."]
[null,null,3,"Mobile Phone, Calculator, Digital Watch or any Electronic Device is NOT ALLOWED."]
[null,null,4,"Arrive at the School at least 15 minutes before the start examination."]
[null,null,5,"Student is barred from entering the examination hall 15 minutes after the written examination starts."]
[null,null,6,"Ensure that you use the washroom before arriving for your exam as you will not be permitted to leave during the first hour."]
[null,null,7,"Normally, you are required to answer questionsusing blue or black in . Make sure you bring some spare pens with you."]
[null,null,8,"Keep your eyes on your own paper. Remember, copying is cheating!"]
[null,null,9,"You must remain silent until after you have exited the school building."]
[]
[{"$f":"A1609+1","v":50}]
[{"$nulls":4},{"$f":"MASTER!$E$11","v":"Govt. Sr. Secondary School Raimalwada"}]
[{"$nulls":4},{"$f":"MASTER!$E$14","v":"P.S.-Bapini (Jodhpur)"}]
[null,{"$f":"CONCATENATE(C1647,'TIME TABLE'!$C$5,'ADMIT CARD'!$C1648,$F1648,'ADMIT CARD'!$G1648,'TIME TABLE'!$E$5)","v":"ADMIT CARD(Roll Number●→0)"},{"$f":"CONCATENATE('TIME TABLE'!$B$2,'TIME TABLE'!$F$2)","v":"HALF YEARLY EXAM:2021-22"}]
[null,null,"ADMIT CARD",{"$nulls":6}," "]
[null,null,"Roll Number",null,null,"●→",{"$f":"VLOOKUP(A1643,'STUDENT DETAIL'!$C$8:$I$107,3)","v":0},null,"Seal and Signature of Head of Institution"]
[null,null,"Student's Name",null,null,"●→",{"$f":"VLOOKUP(A1643,'STUDENT DETAIL'!$C$8:$I$107,4)","v":0}]
[null,null,"Father's Name",null,null,"●→",{"$f":"VLOOKUP(A1643,'STUDENT DETAIL'!$C$8:$I$107,5)","v":0}]
[null,null,"Mother's Name ",null,null,"●→",{"$f":"VLOOKUP(A1643,'STUDENT DETAIL'!$C$8:$I$107,6)","v":0}]
[null,null,"Class & Section",null,null,"●→",{"$f":"IF(G1648=0,0,CONCATENATE('STUDENT DETAIL'!$E$4,'STUDENT DETAIL'!$H$4))","v":0}]
[null,null,"Date Of Birth",null,null,"●→",{"$f":"VLOOKUP(A1643,'STUDENT DETAIL'!$C$8:$I$107,7)","v":"00:00:00"}]
[null,null,"Time Table"]
[null,null,"Subject",null,null,"Date (Day)",null,"Time"]
[null,null,{"$f":"'TIME TABLE'!$F$5","v":"Hindi"},null,null,{"$f":"IF(C1656=0,0,'TIME TABLE'!$B$5)","v":"2022-03-31"},{"$f":"IF(C1656=0,0,CONCATENATE('TIME TABLE'!$C$5,'TIME TABLE'!$D$5,'TIME TABLE'!$E$5))","v":"(Thursday)"},{"$f":"IF(C1656=0,0,'TIME TABLE'!$C$3)","v":"09:00 AM to 11:45 AM"}]
[null,null,{"$f":"'TIME TABLE'!$F$6","v":"English"},null,null,{"$f":"IF(C1657=0,0,'TIME TABLE'!$B$6)","v":"2022-04-01"},{"$f":"IF(C1657=0,0,CONCATENATE('TIME TABLE'!$C$6,'TIME TABLE'!$D$6,'TIME TABLE'!$E$6))","v":"(Friday)"},{"$f":"IF(C1657=0,0,'TIME TABLE'!$C$3)","v":"09:00 AM to 11:45 AM"}]
[null,null,{"$f":"'TIME TABLE'!$F$7","v":"Science"},null,null,{"$f":"IF(C1658=0,0,'TIME TABLE'!$B$7)","v":"2022-04-02"},{"$f":"IF(C1658=0,0,CONCATENATE('TIME TABLE'!$C$7,'TIME TABLE'!$D$7,'TIME TABLE'!$E$7))","v":"(Saturday)"},{"$f":"IF(C1658=0,0,'TIME TABLE'!$C$3)","v":"09:00 AM to 11:45 AM"}]
[null,null,{"$f":"'TIME TABLE'!$F$8","v":"Mathematics"},null,null,{"$f":"IF(C1659=0,0,'TIME TABLE'!$B$8)","v":"2022-04-03"},{"$f":"IF(C1659=0,0,CONCATENATE('TIME TABLE'!$C$8,'TIME TABLE'!$D$8,'TIME TABLE'!$E$8))","v":"(Sunday)"},{"$f":"IF(C1659=0,0,'TIME TABLE'!$C$3)","v":"09:00 AM to 11:45 AM"}]
[null,null,{"$f":"'TIME TABLE'!$F$9","v":"Social Study"},null,null,{"$f":"IF(C1660=0,0,'TIME TABLE'!$B$9)","v":"2022-04-04"},{"$f":"IF(C1660=0,0,CONCATENATE('TIME TABLE'!$C$9,'TIME TABLE'!$D$9,'TIME TABLE'!$E$9))","v":"(Monday)"},{"$f":"IF(C1660=0,0,'TIME TABLE'!$C$3)","v":"09:00 AM to 11:45 AM"}]
[null,null,{"$f":"'TIME TABLE'!$F$10","v":"Sanskrit"},null,null,{"$f":"IF(C1661=0,0,'TIME TABLE'!$B$10)","v":"2022-04-05"},{"$f":"IF(C1661=0,0,CONCATENATE('TIME TABLE'!$C$10,'TIME TABLE'!$D$10,'TIME TABLE'!$E$10))","v":"(Tuesday)"},{"$f":"IF(C1661=0,0,'TIME TABLE'!$C$3)","v":"09:00 AM to 11:45 AM"}]
[null,null,{"$f":"'TIME TABLE'!$F$11","v":0},null,null,{"$f":"IF(C1662=0,0,'TIME TABLE'!$B$11)","v":"00:00:00"},{"$f":"IF(C1662=0,0,CONCATENATE('TIME TABLE'!$C$11,'TIME TABLE'!$D$11,'TIME TABLE'!$E$11))","v":0},{"$f":"IF(C1662=0,0,'TIME TABLE'!$C$3)","v":0}]
[null,null,{"$f":"'TIME TABLE'!$F$12","v":0},null,null,{"$f":"IF(C1663=0,0,'TIME TABLE'!$B$12)","v":"00:00:00"},{"$f":"IF(C1663=0,0,CONCATENATE('TIME TABLE'!$C$12,'TIME TABLE'!$D$12,'TIME TABLE'!$E$12))","v":0},{"$f":"IF(C1663=0,0,'TIME TABLE'!$C$3)","v":0}]
[null,null,{"$f":"'TIME TABLE'!$F$13","v":0},null,null,{"$f":"IF(C1664=0,0,'TIME TABLE'!$B$13)","v":"00:00:00"},{"$f":"IF(C1664=0,0,CONCATENATE('TIME TABLE'!$C$13,'TIME TABLE'!$D$13,'TIME TABLE'!$E$13))","v":0},{"$f":"IF(C1664=0,0,'TIME TABLE'!$C$3)","v":0}]
[null,null,{"$f":"'TIME TABLE'!$F$14","v":0},null,null,{"$f":"IF(C1665=0,0,'TIME TABLE'!$B$14)","v":"00:00:00"},{"$f":"IF(C1665=0,0,CONCATENATE('TIME TABLE'!$C$14,'TIME TABLE'!$D$14,'TIME TABLE'!$E$14))","v":0},{"$f":"IF(C1665=0,0,'TIME TABLE'!$C$3)","v":0}]
[null,null,"Instructions"]
[null,null,1,"Check the exam time table carefully."]
[null,null,2,"Students must bring the 'Admit Card' and show it to the invigilator(s) on duty and should preserve it for future requirements."]
[null,null,3,"Mobile Phone, Calculator, Digital Watch or any Electronic Device is NOT ALLOWED."]
[null,null,4,"Arrive at the School at least 15 minutes before the start examination."]
[null,null,5,"Student is barred from entering the examination hall 15 minutes after the written examination starts."]
[null,null,6,"Ensure that you use the washroom before arriving for your exam as you will not be permitted to leave during the first hour."]
[null,null,7,"Normally, you are required to answer questionsusing blue or black in . Make sure you bring some spare pens with you."]
[null,null,8,"Keep your eyes on your own paper. Remember, copying is cheating!"]
[null,null,9,"You must remain silent until after you have exited the school building."]
[{"$f":"A1643+1","v":51}]
[{"$nulls":4},{"$f":"MASTER!$E$11","v":"Govt. Sr. Secondary School Raimalwada"}]
[{"$nulls":4},{"$f":"MASTER!$E$14","v":"P.S.-Bapini (Jodhpur)"}]
[null,{"$f":"CONCATENATE(C1680,'TIME TABLE'!$C$5,'ADMIT CARD'!$C1681,$F1681,'ADMIT CARD'!$G1681,'TIME TABLE'!$E$5)","v":"ADMIT CARD(Roll Number●→0)"},{"$f":"CONCATENATE('TIME TABLE'!$B$2,'TIME TABLE'!$F$2)","v":"HALF YEARLY EXAM:2021-22"}]
[null,null,"ADMIT CARD",{"$nulls":6}," "]
[null,null,"Roll Number",null,null,"●→",{"$f":"VLOOKUP(A1676,'STUDENT DETAIL'!$C$8:$I$107,3)","v":0},null,"Seal and Signature of Head of Institution"]
[null,null,"Student's Name",null,null,"●→",{"$f":"VLOOKUP(A1676,'STUDENT DETAIL'!$C$8:$I$107,4)","v":0}]
[null,null,"Father's Name",null,null,"●→",{"$f":"VLOOKUP(A1676,'STUDENT DETAIL'!$C$8:$I$107,5)","v":0}]
[null,null,"Mother's Name ",null,null,"●→",{"$f":"VLOOKUP(A1676,'STUDENT DETAIL'!$C$8:$I$107,6)","v":0}]
[null,null,"Class & Section",null,null,"●→",{"$f":"IF(G1681=0,0,CONCATENATE('STUDENT DETAIL'!$E$4,'STUDENT DETAIL'!$H$4))","v":0}]
[null,null,"Date Of Birth",null,null,"●→",{"$f":"VLOOKUP(A1676,'STUDENT DETAIL'!$C$8:$I$107,7)","v":"00:00:00"}]
[null,null,"Time Table"]
[null,null,"Subject",null,null,"Date (Day)",null,"Time"]
[null,null,{"$f":"'TIME TABLE'!$F$5","v":"Hindi"},null,null,{"$f":"IF(C1689=0,0,'TIME TABLE'!$B$5)","v":"2022-03-31"},{"$f":"IF(C1689=0,0,CONCATENATE('TIME TABLE'!$C$5,'TIME TABLE'!$D$5,'TIME TABLE'!$E$5))","v":"(Thursday)"},{"$f":"IF(C1689=0,0,'TIME TABLE'!$C$3)","v":"09:00 AM to 11:45 AM"}]
[null,null,{"$f":"'TIME TABLE'!$F$6","v":"English"},null,null,{"$f":"IF(C1690=0,0,'TIME TABLE'!$B$6)","v":"2022-04-01"},{"$f":"IF(C1690=0,0,CONCATENATE('TIME TABLE'!$C$6,'TIME TABLE'!$D$6,'TIME TABLE'!$E$6))","v":"(Friday)"},{"$f":"IF(C1690=0,0,'TIME TABLE'!$C$3)","v":"09:00 AM to 11:45 AM"}]
[null,null,{"$f":"'TIME TABLE'!$F$7","v":"Science"},null,null,{"$f":"IF(C1691=0,0,'TIME TABLE'!$B$7)","v":"2022-04-02"},{"$f":"IF(C1691=0,0,CONCATENATE('TIME TABLE'!$C$7,'TIME TABLE'!$D$7,'TIME TABLE'!$E$7))","v":"(Saturday)"},{"$f":"IF(C1691=0,0,'TIME TABLE'!$C$3)","v":"09:00 AM to 11:45 AM"}]
[null,null,{"$f":"'TIME TABLE'!$F$8","v":"Mathematics"},null,null,{"$f":"IF(C1692=0,0,'TIME TABLE'!$B$8)","v":"2022-04-03"},{"$f":"IF(C1692=0,0,CONCATENATE('TIME TABLE'!$C$8,'TIME TABLE'!$D$8,'TIME TABLE'!$E$8))","v":"(Sunday)"},{"$f":"IF(C1692=0,0,'TIME TABLE'!$C$3)","v":"09:00 AM to 11:45 AM"}]
[null,null,{"$f":"'TIME TABLE'!$F$9","v":"Social Study"},null,null,{"$f":"IF(C1693=0,0,'TIME TABLE'!$B$9)","v":"2022-04-04"},{"$f":"IF(C1693=0,0,CONCATENATE('TIME TABLE'!$C$9,'TIME TABLE'!$D$9,'TIME TABLE'!$E$9))","v":"(Monday)"},{"$f":"IF(C1693=0,0,'TIME TABLE'!$C$3)","v":"09:00 AM to 11:45 AM"}]
[null,null,{"$f":"'TIME TABLE'!$F$10","v":"Sanskrit"},null,null,{"$f":"IF(C1694=0,0,'TIME TABLE'!$B$10)","v":"2022-04-05"},{"$f":"IF(C1694=0,0,CONCATENATE('TIME TABLE'!$C$10,'TIME TABLE'!$D$10,'TIME TABLE'!$E$10))","v":"(Tuesday)"},{"$f":"IF(C1694=0,0,'TIME TABLE'!$C$3)","v":"09:00 AM to 11:45 AM"}]
[null,null,{"$f":"'TIME TABLE'!$F$11","v":0},null,null,{"$f":"IF(C1695=0,0,'TIME TABLE'!$B$11)","v":"00:00:00"},{"$f":"IF(C1695=0,0,CONCATENATE('TIME TABLE'!$C$11,'TIME TABLE'!$D$11,'TIME TABLE'!$E$11))","v":0},{"$f":"IF(C1695=0,0,'TIME TABLE'!$C$3)","v":0}]
[null,null,{"$f":"'TIME TABLE'!$F$12","v":0},null,null,{"$f":"IF(C1696=0,0,'TIME TABLE'!$B$12)","v":"00:00:00"},{"$f":"IF(C1696=0,0,CONCATENATE('TIME TABLE'!$C$12,'TIME TABLE'!$D$12,'TIME TABLE'!$E$12))","v":0},{"$f":"IF(C1696=0,0,'TIME TABLE'!$C$3)","v":0}]
[null,null,{"$f":"'TIME TABLE'!$F$13","v":0},null,null,{"$f":"IF(C1697=0,0,'TIME TABLE'!$B$13)","v":"00:00:00"},{"$f":"IF(C1697=0,0,CONCATENATE('TIME TABLE'!$C$13,'TIME TABLE'!$D$13,'TIME TABLE'!$E$13))","v":0},{"$f":"IF(C1697=0,0,'TIME TABLE'!$C$3)","v":0}]
[null,null,{"$f":"'TIME TABLE'!$F$14","v":0},null,null,{"$f":"IF(C1698=0,0,'TIME TABLE'!$B$14)","v":"00:00:00"},{"$f":"IF(C1698=0,0,CONCATENATE('TIME TABLE'!$C$14,'TIME TABLE'!$D$14,'TIME TABLE'!$E$14))","v":0},{"$f":"IF(C1698=0,0,'TIME TABLE'!$C$3)","v":0}]
[null,null,"Instructions"]
[null,null,1,"Check the exam time table carefully."]
[null,null,2,"Students must bring the 'Admit Card' and show it to the invigilator(s) on duty and should preserve it for future requirements."]
[null,null,3,"Mobile Phone, Calculator, Digital Watch or any Electronic Device is NOT ALLOWED."]
[null,null,4,"Arrive at the School at least 15 minutes before the start examination."]
[null,null,5,"Student is barred from entering the examination hall 15 minutes after the written examination starts."]
[null,null,6,"Ensure that you use the washroom before arriving for your exam as you will not be permitted to leave during the first hour."]
[null,null,7,"Normally, you are required to answer questionsusing blue or black in . Make sure you bring some spare pens with you."]
[null,null,8,"Keep your eyes on your own paper. Remember, copying is cheating!"]
[null,null,9,"You must remain silent until after you have exited the school building."]
[]
[{"$f":"A1676+1","v":52}]
[{"$nulls":4},{"$f":"MASTER!$E$11","v":"Govt. Sr. Secondary School Raimalwada"}]
[{"$nulls":4},{"$f":"MASTER!$E$14","v":"P.S.-Bapini (Jodhpur)"}]
[null,{"$f":"CONCATENATE(C1714,'TIME TABLE'!$C$5,'ADMIT CARD'!$C1715,$F1715,'ADMIT CARD'!$G1715,'TIME TABLE'!$E$5)","v":"ADMIT CARD(Roll Number●→0)"},{"$f":"CONCATENATE('TIME TABLE'!$B$2,'TIME TABLE'!$F$2)","v":"HALF YEARLY EXAM:2021-22"}]
[null,null,"ADMIT CARD",{"$nulls":6}," "]
[null,null,"Roll Number",null,null,"●→",{"$f":"VLOOKUP(A1710,'STUDENT DETAIL'!$C$8:$I$107,3)","v":0},null,"Seal and Signature of Head of Institution"]
[null,null,"Student's Name",null,null,"●→",{"$f":"VLOOKUP(A1710,'STUDENT DETAIL'!$C$8:$I$107,4)","v":0}]
[null,null,"Father's Name",null,null,"●→",{"$f":"VLOOKUP(A1710,'STUDENT DETAIL'!$C$8:$I$107,5)","v":0}]
[null,null,"Mother's Name ",null,null,"●→",{"$f":"VLOOKUP(A1710,'STUDENT DETAIL'!$C$8:$I$107,6)","v":0}]
[null,null,"Class & Section",null,null,"●→",{"$f":"IF(G1715=0,0,CONCATENATE('STUDENT DETAIL'!$E$4,'STUDENT DETAIL'!$H$4))","v":0}]
[null,null,"Date Of Birth",null,null,"●→",{"$f":"VLOOKUP(A1710,'STUDENT DETAIL'!$C$8:$I$107,7)","v":"00:00:00"}]
[null,null,"Time Table"]
[null,null,"Subject",null,null,"Date (Day)",null,"Time"]
[null,null,{"$f":"'TIME TABLE'!$F$5","v":"Hindi"},null,null,{"$f":"IF(C1723=0,0,'TIME TABLE'!$B$5)","v":"2022-03-31"},{"$f":"IF(C1723=0,0,CONCATENATE('TIME TABLE'!$C$5,'TIME TABLE'!$D$5,'TIME TABLE'!$E$5))","v":"(Thursday)"},{"$f":"IF(C1723=0,0,'TIME TABLE'!$C$3)","v":"09:00 AM to 11:45 AM"}]
[null,null,{"$f":"'TIME TABLE'!$F$6","v":"English"},null,null,{"$f":"IF(C1724=0,0,'TIME TABLE'!$B$6)","v":"2022-04-01"},{"$f":"IF(C1724=0,0,CONCATENATE('TIME TABLE'!$C$6,'TIME TABLE'!$D$6,'TIME TABLE'!$E$6))","v":"(Friday)"},{"$f":"IF(C1724=0,0,'TIME TABLE'!$C$3)","v":"09:00 AM to 11:45 AM"}]
[null,null,{"$f":"'TIME TABLE'!$F$7","v":"Science"},null,null,{"$f":"IF(C1725=0,0,'TIME TABLE'!$B$7)","v":"2022-04-02"},{"$f":"IF(C1725=0,0,CONCATENATE('TIME TABLE'!$C$7,'TIME TABLE'!$D$7,'TIME TABLE'!$E$7))","v":"(Saturday)"},{"$f":"IF(C1725=0,0,'TIME TABLE'!$C$3)","v":"09:00 AM to 11:45 AM"}]
[null,null,{"$f":"'TIME TABLE'!$F$8","v":"Mathematics"},null,null,{"$f":"IF(C1726=0,0,'TIME TABLE'!$B$8)","v":"2022-04-03"},{"$f":"IF(C1726=0,0,CONCATENATE('TIME TABLE'!$C$8,'TIME TABLE'!$D$8,'TIME TABLE'!$E$8))","v":"(Sunday)"},{"$f":"IF(C1726=0,0,'TIME TABLE'!$C$3)","v":"09:00 AM to 11:45 AM"}]
[null,null,{"$f":"'TIME TABLE'!$F$9","v":"Social Study"},null,null,{"$f":"IF(C1727=0,0,'TIME TABLE'!$B$9)","v":"2022-04-04"},{"$f":"IF(C1727=0,0,CONCATENATE('TIME TABLE'!$C$9,'TIME TABLE'!$D$9,'TIME TABLE'!$E$9))","v":"(Monday)"},{"$f":"IF(C1727=0,0,'TIME TABLE'!$C$3)","v":"09:00 AM to 11:45 AM"}]
[null,null,{"$f":"'TIME TABLE'!$F$10","v":"Sanskrit"},null,null,{"$f":"IF(C1728=0,0,'TIME TABLE'!$B$10)","v":"2022-04-05"},{"$f":"IF(C1728=0,0,CONCATENATE('TIME TABLE'!$C$10,'TIME TABLE'!$D$10,'TIME TABLE'!$E$10))","v":"(Tuesday)"},{"$f":"IF(C1728=0,0,'TIME TABLE'!$C$3)","v":"09:00 AM to 11:45 AM"}]
[null,null,{"$f":"'TIME TABLE'!$F$11","v":0},null,null,{"$f":"IF(C1729=0,0,'TIME TABLE'!$B$11)","v":"00:00:00"},{"$f":"IF(C1729=0,0,CONCATENATE('TIME TABLE'!$C$11,'TIME TABLE'!$D$11,'TIME TABLE'!$E$11))","v":0},{"$f":"IF(C1729=0,0,'TIME TABLE'!$C$3)","v":0}]
[null,null,{"$f":"'TIME TABLE'!$F$12","v":0},null,null,{"$f":"IF(C1730=0,0,'TIME TABLE'!$B$12)","v":"00:00:00"},{"$f":"IF(C1730=0,0,CONCATENATE('TIME TABLE'!$C$12,'TIME TABLE'!$D$12,'TIME TABLE'!$E$12))","v":0},{"$f":"IF(C1730=0,0,'TIME TABLE'!$C$3)","v":0}]
[null,null,{"$f":"'TIME TABLE'!$F$13","v":0},null,null,{"$f":"IF(C1731=0,0,'TIME TABLE'!$B$13)","v":"00:00:00"},{"$f":"IF(C1731=0,0,CONCATENATE('TIME TABLE'!$C$13,'TIME TABLE'!$D$13,'TIME TABLE'!$E$13))","v":0},{"$f":"IF(C1731=0,0,'TIME TABLE'!$C$3)","v":0}]
[null,null,{"$f":"'TIME TABLE'!$F$14","v":0},null,null,{"$f":"IF(C1732=0,0,'TIME TABLE'!$B$14)","v":"00:00:00"},{"$f":"IF(C1732=0,0,CONCATENATE('TIME TABLE'!$C$14,'TIME TABLE'!$D$14,'TIME TABLE'!$E$14))","v":0},{"$f":"IF(C1732=0,0,'TIME TABLE'!$C$3)","v":0}]
[null,null,"Instructions"]
[null,null,1,"Check the exam time table carefully."]
[null,null,2,"Students must bring the 'Admit Card' and show it to the invigilator(s) on duty and should preserve it for future requirements."]
[null,null,3,"Mobile Phone, Calculator, Digital Watch or any Electronic Device is NOT ALLOWED."]
[null,null,4,"Arrive at the School at least 15 minutes before the start examination."]
[null,null,5,"Student is barred from entering the examination hall 15 minutes after the written examination starts."]
[null,null,6,"Ensure that you use the washroom before arriving for your exam as you will not be permitted to leave during the first hour."]
[null,null,7,"Normally, you are required to answer questionsusing blue or black in . Make sure you bring some spare pens with you."]
[null,null,8,"Keep your eyes on your own paper. Remember, copying is cheating!"]
[null,null,9,"You must remain silent until after you have exited the school building."]
[{"$f":"A1710+1","v":53}]
[{"$nulls":4},{"$f":"MASTER!$E$11","v":"Govt. Sr. Secondary School Raimalwada"}]
[{"$nulls":4},{"$f":"MASTER!$E$14","v":"P.S.-Bapini (Jodhpur)"}]
[null,{"$f":"CONCATENATE(C1747,'TIME TABLE'!$C$5,'ADMIT CARD'!$C1748,$F1748,'ADMIT CARD'!$G1748,'TIME TABLE'!$E$5)","v":"ADMIT CARD(Roll Number●→0)"},{"$f":"CONCATENATE('TIME TABLE'!$B$2,'TIME TABLE'!$F$2)","v":"HALF YEARLY EXAM:2021-22"}]
[null,null,"ADMIT CARD",{"$nulls":6}," "]
[null,null,"Roll Number",null,null,"●→",{"$f":"VLOOKUP(A1743,'STUDENT DETAIL'!$C$8:$I$107,3)","v":0},null,"Seal and Signature of Head of Institution"]
[null,null,"Student's Name",null,null,"●→",{"$f":"VLOOKUP(A1743,'STUDENT DETAIL'!$C$8:$I$107,4)","v":0}]
[null,null,"Father's Name",null,null,"●→",{"$f":"VLOOKUP(A1743,'STUDENT DETAIL'!$C$8:$I$107,5)","v":0}]
[null,null,"Mother's Name ",null,null,"●→",{"$f":"VLOOKUP(A1743,'STUDENT DETAIL'!$C$8:$I$107,6)","v":0}]
[null,null,"Class & Section",null,null,"●→",{"$f":"IF(G1748=0,0,CONCATENATE('STUDENT DETAIL'!$E$4,'STUDENT DETAIL'!$H$4))","v":0}]
[null,null,"Date Of Birth",null,null,"●→",{"$f":"VLOOKUP(A1743,'STUDENT DETAIL'!$C$8:$I$107,7)","v":"00:00:00"}]
[null,null,"Time Table"]
[null,null,"Subject",null,null,"Date (Day)",null,"Time"]
[null,null,{"$f":"'TIME TABLE'!$F$5","v":"Hindi"},null,null,{"$f":"IF(C1756=0,0,'TIME TABLE'!$B$5)","v":"2022-03-31"},{"$f":"IF(C1756=0,0,CONCATENATE('TIME TABLE'!$C$5,'TIME TABLE'!$D$5,'TIME TABLE'!$E$5))","v":"(Thursday)"},{"$f":"IF(C1756=0,0,'TIME TABLE'!$C$3)","v":"09:00 AM to 11:45 AM"}]
[null,null,{"$f":"'TIME TABLE'!$F$6","v":"English"},null,null,{"$f":"IF(C1757=0,0,'TIME TABLE'!$B$6)","v":"2022-04-01"},{"$f":"IF(C1757=0,0,CONCATENATE('TIME TABLE'!$C$6,'TIME TABLE'!$D$6,'TIME TABLE'!$E$6))","v":"(Friday)"},{"$f":"IF(C1757=0,0,'TIME TABLE'!$C$3)","v":"09:00 AM to 11:45 AM"}]
[null,null,{"$f":"'TIME TABLE'!$F$7","v":"Science"},null,null,{"$f":"IF(C1758=0,0,'TIME TABLE'!$B$7)","v":"2022-04-02"},{"$f":"IF(C1758=0,0,CONCATENATE('TIME TABLE'!$C$7,'TIME TABLE'!$D$7,'TIME TABLE'!$E$7))","v":"(Saturday)"},{"$f":"IF(C1758=0,0,'TIME TABLE'!$C$3)","v":"09:00 AM to 11:45 AM"}]
[null,null,{"$f":"'TIME TABLE'!$F$8","v":"Mathematics"},null,null,{"$f":"IF(C1759=0,0,'TIME TABLE'!$B$8)","v":"2022-04-03"},{"$f":"IF(C1759=0,0,CONCATENATE('TIME TABLE'!$C$8,'TIME TABLE'!$D$8,'TIME TABLE'!$E$8))","v":"(Sunday)"},{"$f":"IF(C1759=0,0,'TIME TABLE'!$C$3)","v":"09:00 AM to 11:45 AM"}]
[null,null,{"$f":"'TIME TABLE'!$F$9","v":"Social Study"},null,null,{"$f":"IF(C1760=0,0,'TIME TABLE'!$B$9)","v":"2022-04-04"},{"$f":"IF(C1760=0,0,CONCATENATE('TIME TABLE'!$C$9,'TIME TABLE'!$D$9,'TIME TABLE'!$E$9))","v":"(Monday)"},{"$f":"IF(C1760=0,0,'TIME TABLE'!$C$3)","v":"09:00 AM to 11:45 AM"}]
[null,null,{"$f":"'TIME TABLE'!$F$10","v":"Sanskrit"},null,null,{"$f":"IF(C1761=0,0,'TIME TABLE'!$B$10)","v":"2022-04-05"},{"$f":"IF(C1761=0,0,CONCATENATE('TIME TABLE'!$C$10,'TIME TABLE'!$D$10,'TIME TABLE'!$E$10))","v":"(Tuesday)"},{"$f":"IF(C1761=0,0,'TIME TABLE'!$C$3)","v":"09:00 AM to 11:45 AM"}]
[null,null,{"$f":"'TIME TABLE'!$F$11","v":0},null,null,{"$f":"IF(C1762=0,0,'TIME TABLE'!$B$11)","v":"00:00:00"},{"$f":"IF(C1762=0,0,CONCATENATE('TIME TABLE'!$C$11,'TIME TABLE'!$D$11,'TIME TABLE'!$E$11))","v":0},{"$f":"IF(C1762=0,0,'TIME TABLE'!$C$3)","v":0}]
[null,null,{"$f":"'TIME TABLE'!$F$12","v":0},null,null,{"$f":"IF(C1763=0,0,'TIME TABLE'!$B$12)","v":"00:00:00"},{"$f":"IF(C1763=0,0,CONCATENATE('TIME TABLE'!$C$12,'TIME TABLE'!$D$12,'TIME TABLE'!$E$12))","v":0},{"$f":"IF(C1763=0,0,'TIME TABLE'!$C$3)","v":0}]
[null,null,{"$f":"'TIME TABLE'!$F$13","v":0},null,null,{"$f":"IF(C1764=0,0,'TIME TABLE'!$B$13)","v":"00:00:00"},{"$f":"IF(C1764=0,0,CONCATENATE('TIME TABLE'!$C$13,'TIME TABLE'!$D$13,'TIME TABLE'!$E$13))","v":0},{"$f":"IF(C1764=0,0,'TIME TABLE'!$C$3)","v":0}]
[null,null,{"$f":"'TIME TABLE'!$F$14","v":0},null,null,{"$f":"IF(C1765=0,0,'TIME TABLE'!$B$14)","v":"00:00:00"},{"$f":"IF(C1765=0,0,CONCATENATE('TIME TABLE'!$C$14,'TIME TABLE'!$D$14,'TIME TABLE'!$E$14))","v":0},{"$f":"IF(C1765=0,0,'TIME TABLE'!$C$3)","v":0}]
[null,null,"Instructions"]
[null,null,1,"Check the exam time table carefully."]
[null,null,2,"Students must bring the 'Admit Card' and show it to the invigilator(s) on duty and should preserve it for future requirements."]
[null,null,3,"Mobile Phone, Calculator, Digital Watch or any Electronic Device is NOT ALLOWED."]
[null,null,4,"Arrive at the School at least 15 minutes before the start examination."]
[null,null,5,"Student is barred from entering the examination hall 15 minutes after the written examination starts."]
[null,null,6,"Ensure that you use the washroom before arriving for your exam as you will not be permitted to leave during the first hour."]
[null,null,7,"Normally, you are required to answer questionsusing blue or black in . Make sure you bring some spare pens with you."]
[null,null,8,"Keep your eyes on your own paper. Remember, copying is cheating!"]
[null,null,9,"You must remain silent until after you have exited the school building."]
[]
[{"$f":"A1743+1","v":54}]
[{"$nulls":4},{"$f":"MASTER!$E$11","v":"Govt. Sr. Secondary School Raimalwada"}]
[{"$nulls":4},{"$f":"MASTER!$E$14","v":"P.S.-Bapini (Jodhpur)"}]
[null,{"$f":"CONCATENATE(C1781,'TIME TABLE'!$C$5,'ADMIT CARD'!$C1782,$F1782,'ADMIT CARD'!$G1782,'TIME TABLE'!$E$5)","v":"ADMIT CARD(Roll Number●→0)"},{"$f":"CONCATENATE('TIME TABLE'!$B$2,'TIME TABLE'!$F$2)","v":"HALF YEARLY EXAM:2021-22"}]
[null,null,"ADMIT CARD",{"$nulls":6}," "]
[null,null,"Roll Number",null,null,"●→",{"$f":"VLOOKUP(A1777,'STUDENT DETAIL'!$C$8:$I$107,3)","v":0},null,"Seal and Signature of Head of Institution"]
[null,null,"Student's Name",null,null,"●→",{"$f":"VLOOKUP(A1777,'STUDENT DETAIL'!$C$8:$I$107,4)","v":0}]
[null,null,"Father's Name",null,null,"●→",{"$f":"VLOOKUP(A1777,'STUDENT DETAIL'!$C$8:$I$107,5)","v":0}]
[null,null,"Mother's Name ",null,null,"●→",{"$f":"VLOOKUP(A1777,'STUDENT DETAIL'!$C$8:$I$107,6)","v":0}]
[null,null,"Class & Section",null,null,"●→",{"$f":"IF(G1782=0,0,CONCATENATE('STUDENT DETAIL'!$E$4,'STUDENT DETAIL'!$H$4))","v":0}]
[null,null,"Date Of Birth",null,null,"●→",{"$f":"VLOOKUP(A1777,'STUDENT DETAIL'!$C$8:$I$107,7)","v":"00:00:00"}]
[null,null,"Time Table"]
[null,null,"Subject",null,null,"Date (Day)",null,"Time"]
[null,null,{"$f":"'TIME TABLE'!$F$5","v":"Hindi"},null,null,{"$f":"IF(C1790=0,0,'TIME TABLE'!$B$5)","v":"2022-03-31"},{"$f":"IF(C1790=0,0,CONCATENATE('TIME TABLE'!$C$5,'TIME TABLE'!$D$5,'TIME TABLE'!$E$5))","v":"(Thursday)"},{"$f":"IF(C1790=0,0,'TIME TABLE'!$C$3)","v":"09:00 AM to 11:45 AM"}]
[null,null,{"$f":"'TIME TABLE'!$F$6","v":"English"},null,null,{"$f":"IF(C1791=0,0,'TIME TABLE'!$B$6)","v":"2022-04-01"},{"$f":"IF(C1791=0,0,CONCATENATE('TIME TABLE'!$C$6,'TIME TABLE'!$D$6,'TIME TABLE'!$E$6))","v":"(Friday)"},{"$f":"IF(C1791=0,0,'TIME TABLE'!$C$3)","v":"09:00 AM to 11:45 AM"}]
[null,null,{"$f":"'TIME TABLE'!$F$7","v":"Science"},null,null,{"$f":"IF(C1792=0,0,'TIME TABLE'!$B$7)","v":"2022-04-02"},{"$f":"IF(C1792=0,0,CONCATENATE('TIME TABLE'!$C$7,'TIME TABLE'!$D$7,'TIME TABLE'!$E$7))","v":"(Saturday)"},{"$f":"IF(C1792=0,0,'TIME TABLE'!$C$3)","v":"09:00 AM to 11:45 AM"}]
[null,null,{"$f":"'TIME TABLE'!$F$8","v":"Mathematics"},null,null,{"$f":"IF(C1793=0,0,'TIME TABLE'!$B$8)","v":"2022-04-03"},{"$f":"IF(C1793=0,0,CONCATENATE('TIME TABLE'!$C$8,'TIME TABLE'!$D$8,'TIME TABLE'!$E$8))","v":"(Sunday)"},{"$f":"IF(C1793=0,0,'TIME TABLE'!$C$3)","v":"09:00 AM to 11:45 AM"}]
[null,null,{"$f":"'TIME TABLE'!$F$9","v":"Social Study"},null,null,{"$f":"IF(C1794=0,0,'TIME TABLE'!$B$9)","v":"2022-04-04"},{"$f":"IF(C1794=0,0,CONCATENATE('TIME TABLE'!$C$9,'TIME TABLE'!$D$9,'TIME TABLE'!$E$9))","v":"(Monday)"},{"$f":"IF(C1794=0,0,'TIME TABLE'!$C$3)","v":"09:00 AM to 11:45 AM"}]
[null,null,{"$f":"'TIME TABLE'!$F$10","v":"Sanskrit"},null,null,{"$f":"IF(C1795=0,0,'TIME TABLE'!$B$10)","v":"2022-04-05"},{"$f":"IF(C1795=0,0,CONCATENATE('TIME TABLE'!$C$10,'TIME TABLE'!$D$10,'TIME TABLE'!$E$10))","v":"(Tuesday)"},{"$f":"IF(C1795=0,0,'TIME TABLE'!$C$3)","v":"09:00 AM to 11:45 AM"}]
[null,null,{"$f":"'TIME TABLE'!$F$11","v":0},null,null,{"$f":"IF(C1796=0,0,'TIME TABLE'!$B$11)","v":"00:00:00"},{"$f":"IF(C1796=0,0,CONCATENATE('TIME TABLE'!$C$11,'TIME TABLE'!$D$11,'TIME TABLE'!$E$11))","v":0},{"$f":"IF(C1796=0,0,'TIME TABLE'!$C$3)","v":0}]
[null,null,{"$f":"'TIME TABLE'!$F$12","v":0},null,null,{"$f":"IF(C1797=0,0,'TIME TABLE'!$B$12)","v":"00:00:00"},{"$f":"IF(C1797=0,0,CONCATENATE('TIME TABLE'!$C$12,'TIME TABLE'!$D$12,'TIME TABLE'!$E$12))","v":0},{"$f":"IF(C1797=0,0,'TIME TABLE'!$C$3)","v":0}]
[null,null,{"$f":"'TIME TABLE'!$F$13","v":0},null,null,{"$f":"IF(C1798=0,0,'TIME TABLE'!$B$13)","v":"00:00:00"},{"$f":"IF(C1798=0,0,CONCATENATE('TIME TABLE'!$C$13,'TIME TABLE'!$D$13,'TIME TABLE'!$E$13))","v":0},{"$f":"IF(C1798=0,0,'TIME TABLE'!$C$3)","v":0}]
[null,null,{"$f":"'TIME TABLE'!$F$14","v":0},null,null,{"$f":"IF(C1799=0,0,'TIME TABLE'!$B$14)","v":"00:00:00"},{"$f":"IF(C1799=0,0,CONCATENATE('TIME TABLE'!$C$14,'TIME TABLE'!$D$14,'TIME TABLE'!$E$14))","v":0},{"$f":"IF(C1799=0,0,'TIME TABLE'!$C$3)","v":0}]
[null,null,"Instructions"]
[null,null,1,"Check the exam time table carefully."]
[null,null,2,"Students must bring the 'Admit Card' and show it to the invigilator(s) on duty and should preserve it for future requirements."]
[null,null,3,"Mobile Phone, Calculator, Digital Watch or any Electronic Device is NOT ALLOWED."]
[null,null,4,"Arrive at the School at least 15 minutes before the start examination."]
[null,null,5,"Student is barred from entering the examination hall 15 minutes after the written examination starts."]
[null,null,6,"Ensure that you use the washroom before arriving for your exam as you will not be permitted to leave during the first hour."]
[null,null,7,"Normally, you are required to answer questionsusing blue or black in . Make sure you bring some spare pens with you."]
[null,null,8,"Keep your eyes on your own paper. Remember, copying is cheating!"]
[null,null,9,"You must remain silent until after you have exited the school building."]
[{"$f":"A1777+1","v":55}]
[{"$nulls":4},{"$f":"MASTER!$E$11","v":"Govt. Sr. Secondary School Raimalwada"}]
[{"$nulls":4},{"$f":"MASTER!$E$14","v":"P.S.-Bapini (Jodhpur)"}]
[null,{"$f":"CONCATENATE(C1814,'TIME TABLE'!$C$5,'ADMIT CARD'!$C1815,$F1815,'ADMIT CARD'!$G1815,'TIME TABLE'!$E$5)","v":"ADMIT CARD(Roll Number●→0)"},{"$f":"CONCATENATE('TIME TABLE'!$B$2,'TIME TABLE'!$F$2)","v":"HALF YEARLY EXAM:2021-22"}]
[null,null,"ADMIT CARD",{"$nulls":6}," "]
[null,null,"Roll Number",null,null,"●→",{"$f":"VLOOKUP(A1810,'STUDENT DETAIL'!$C$8:$I$107,3)","v":0},null,"Seal and Signature of Head of Institution"]
[null,null,"Student's Name",null,null,"●→",{"$f":"VLOOKUP(A1810,'STUDENT DETAIL'!$C$8:$I$107,4)","v":0}]
[null,null,"Father's Name",null,null,"●→",{"$f":"VLOOKUP(A1810,'STUDENT DETAIL'!$C$8:$I$107,5)","v":0}]
[null,null,"Mother's Name ",null,null,"●→",{"$f":"VLOOKUP(A1810,'STUDENT DETAIL'!$C$8:$I$107,6)","v":0}]
[null,null,"Class & Section",null,null,"●→",{"$f":"IF(G1815=0,0,CONCATENATE('STUDENT DETAIL'!$E$4,'STUDENT DETAIL'!$H$4))","v":0}]
[null,null,"Date Of Birth",null,null,"●→",{"$f":"VLOOKUP(A1810,'STUDENT DETAIL'!$C$8:$I$107,7)","v":"00:00:00"}]
[null,null,"Time Table"]
[null,null,"Subject",null,null,"Date (Day)",null,"Time"]
[null,null,{"$f":"'TIME TABLE'!$F$5","v":"Hindi"},null,null,{"$f":"IF(C1823=0,0,'TIME TABLE'!$B$5)","v":"2022-03-31"},{"$f":"IF(C1823=0,0,CONCATENATE('TIME TABLE'!$C$5,'TIME TABLE'!$D$5,'TIME TABLE'!$E$5))","v":"(Thursday)"},{"$f":"IF(C1823=0,0,'TIME TABLE'!$C$3)","v":"09:00 AM to 11:45 AM"}]
[null,null,{"$f":"'TIME TABLE'!$F$6","v":"English"},null,null,{"$f":"IF(C1824=0,0,'TIME TABLE'!$B$6)","v":"2022-04-01"},{"$f":"IF(C1824=0,0,CONCATENATE('TIME TABLE'!$C$6,'TIME TABLE'!$D$6,'TIME TABLE'!$E$6))","v":"(Friday)"},{"$f":"IF(C1824=0,0,'TIME TABLE'!$C$3)","v":"09:00 AM to 11:45 AM"}]
[null,null,{"$f":"'TIME TABLE'!$F$7","v":"Science"},null,null,{"$f":"IF(C1825=0,0,'TIME TABLE'!$B$7)","v":"2022-04-02"},{"$f":"IF(C1825=0,0,CONCATENATE('TIME TABLE'!$C$7,'TIME TABLE'!$D$7,'TIME TABLE'!$E$7))","v":"(Saturday)"},{"$f":"IF(C1825=0,0,'TIME TABLE'!$C$3)","v":"09:00 AM to 11:45 AM"}]
[null,null,{"$f":"'TIME TABLE'!$F$8","v":"Mathematics"},null,null,{"$f":"IF(C1826=0,0,'TIME TABLE'!$B$8)","v":"2022-04-03"},{"$f":"IF(C1826=0,0,CONCATENATE('TIME TABLE'!$C$8,'TIME TABLE'!$D$8,'TIME TABLE'!$E$8))","v":"(Sunday)"},{"$f":"IF(C1826=0,0,'TIME TABLE'!$C$3)","v":"09:00 AM to 11:45 AM"}]
[null,null,{"$f":"'TIME TABLE'!$F$9","v":"Social Study"},null,null,{"$f":"IF(C1827=0,0,'TIME TABLE'!$B$9)","v":"2022-04-04"},{"$f":"IF(C1827=0,0,CONCATENATE('TIME TABLE'!$C$9,'TIME TABLE'!$D$9,'TIME TABLE'!$E$9))","v":"(Monday)"},{"$f":"IF(C1827=0,0,'TIME TABLE'!$C$3)","v":"09:00 AM to 11:45 AM"}]
[null,null,{"$f":"'TIME TABLE'!$F$10","v":"Sanskrit"},null,null,{"$f":"IF(C1828=0,0,'TIME TABLE'!$B$10)","v":"2022-04-05"},{"$f":"IF(C1828=0,0,CONCATENATE('TIME TABLE'!$C$10,'TIME TABLE'!$D$10,'TIME TABLE'!$E$10))","v":"(Tuesday)"},{"$f":"IF(C1828=0,0,'TIME TABLE'!$C$3)","v":"09:00 AM to 11:45 AM"}]
[null,null,{"$f":"'TIME TABLE'!$F$11","v":0},null,null,{"$f":"IF(C1829=0,0,'TIME TABLE'!$B$11)","v":"00:00:00"},{"$f":"IF(C1829=0,0,CONCATENATE('TIME TABLE'!$C$11,'TIME TABLE'!$D$11,'TIME TABLE'!$E$11))","v":0},{"$f":"IF(C1829=0,0,'TIME TABLE'!$C$3)","v":0}]
[null,null,{"$f":"'TIME TABLE'!$F$12","v":0},null,null,{"$f":"IF(C1830=0,0,'TIME TABLE'!$B$12)","v":"00:00:00"},{"$f":"IF(C1830=0,0,CONCATENATE('TIME TABLE'!$C$12,'TIME TABLE'!$D$12,'TIME TABLE'!$E$12))","v":0},{"$f":"IF(C1830=0,0,'TIME TABLE'!$C$3)","v":0}]
[null,null,{"$f":"'TIME TABLE'!$F$13","v":0},null,null,{"$f":"IF(C1831=0,0,'TIME TABLE'!$B$13)","v":"00:00:00"},{"$f":"IF(C1831=0,0,CONCATENATE('TIME TABLE'!$C$13,'TIME TABLE'!$D$13,'TIME TABLE'!$E$13))","v":0},{"$f":"IF(C1831=0,0,'TIME TABLE'!$C$3)","v":0}]
[null,null,{"$f":"'TIME TABLE'!$F$14","v":0},null,null,{"$f":"IF(C1832=0,0,'TIME TABLE'!$B$14)","v":"00:00:00"},{"$f":"IF(C1832=0,0,CONCATENATE('TIME TABLE'!$C$14,'TIME TABLE'!$D$14,'TIME TABLE'!$E$14))","v":0},{"$f":"IF(C1832=0,0,'TIME TABLE'!$C$3)","v":0}]
[null,null,"Instructions"]
[null,null,1,"Check the exam time table carefully."]
[null,null,2,"Students must bring the 'Admit Card' and show it to the invigilator(s) on duty and should preserve it for future requirements."]
[null,null,3,"Mobile Phone, Calculator, Digital Watch or any Electronic Device is NOT ALLOWED."]
[null,null,4,"Arrive at the School at least 15 minutes before the start examination."]
[null,null,5,"Student is barred from entering the examination hall 15 minutes after the written examination starts."]
[null,null,6,"Ensure that you use the washroom before arriving for your exam as you will not be permitted to leave during the first hour."]
[null,null,7,"Normally, you are required to answer questionsusing blue or black in . Make sure you bring some spare pens with you."]
[null,null,8,"Keep your eyes on your own paper. Remember, copying is cheating!"]
[null,null,9,"You must remain silent until after you have exited the school building."]
[]
[{"$f":"A1810+1","v":56}]
[{"$nulls":4},{"$f":"MASTER!$E$11","v":"Govt. Sr. Secondary School Raimalwada"}]
[{"$nulls":4},{"$f":"MASTER!$E$14","v":"P.S.-Bapini (Jodhpur)"}]
[null,{"$f":"CONCATENATE(C1848,'TIME TABLE'!$C$5,'ADMIT CARD'!$C1849,$F1849,'ADMIT CARD'!$G1849,'TIME TABLE'!$E$5)","v":"ADMIT CARD(Roll Number●→0)"},{"$f":"CONCATENATE('TIME TABLE'!$B$2,'TIME TABLE'!$F$2)","v":"HALF YEARLY EXAM:2021-22"}]
[null,null,"ADMIT CARD",{"$nulls":6}," "]
[null,null,"Roll Number",null,null,"●→",{"$f":"VLOOKUP(A1844,'STUDENT DETAIL'!$C$8:$I$107,3)","v":0},null,"Seal and Signature of Head of Institution"]
[null,null,"Student's Name",null,null,"●→",{"$f":"VLOOKUP(A1844,'STUDENT DETAIL'!$C$8:$I$107,4)","v":0}]
[null,null,"Father's Name",null,null,"●→",{"$f":"VLOOKUP(A1844,'STUDENT DETAIL'!$C$8:$I$107,5)","v":0}]
[null,null,"Mother's Name ",null,null,"●→",{"$f":"VLOOKUP(A1844,'STUDENT DETAIL'!$C$8:$I$107,6)","v":0}]
[null,null,"Class & Section",null,null,"●→",{"$f":"IF(G1849=0,0,CONCATENATE('STUDENT DETAIL'!$E$4,'STUDENT DETAIL'!$H$4))","v":0}]
[null,null,"Date Of Birth",null,null,"●→",{"$f":"VLOOKUP(A1844,'STUDENT DETAIL'!$C$8:$I$107,7)","v":"00:00:00"}]
[null,null,"Time Table"]
[null,null,"Subject",null,null,"Date (Day)",null,"Time"]
[null,null,{"$f":"'TIME TABLE'!$F$5","v":"Hindi"},null,null,{"$f":"IF(C1857=0,0,'TIME TABLE'!$B$5)","v":"2022-03-31"},{"$f":"IF(C1857=0,0,CONCATENATE('TIME TABLE'!$C$5,'TIME TABLE'!$D$5,'TIME TABLE'!$E$5))","v":"(Thursday)"},{"$f":"IF(C1857=0,0,'TIME TABLE'!$C$3)","v":"09:00 AM to 11:45 AM"}]
[null,null,{"$f":"'TIME TABLE'!$F$6","v":"English"},null,null,{"$f":"IF(C1858=0,0,'TIME TABLE'!$B$6)","v":"2022-04-01"},{"$f":"IF(C1858=0,0,CONCATENATE('TIME TABLE'!$C$6,'TIME TABLE'!$D$6,'TIME TABLE'!$E$6))","v":"(Friday)"},{"$f":"IF(C1858=0,0,'TIME TABLE'!$C$3)","v":"09:00 AM to 11:45 AM"}]
[null,null,{"$f":"'TIME TABLE'!$F$7","v":"Science"},null,null,{"$f":"IF(C1859=0,0,'TIME TABLE'!$B$7)","v":"2022-04-02"},{"$f":"IF(C1859=0,0,CONCATENATE('TIME TABLE'!$C$7,'TIME TABLE'!$D$7,'TIME TABLE'!$E$7))","v":"(Saturday)"},{"$f":"IF(C1859=0,0,'TIME TABLE'!$C$3)","v":"09:00 AM to 11:45 AM"}]
[null,null,{"$f":"'TIME TABLE'!$F$8","v":"Mathematics"},null,null,{"$f":"IF(C1860=0,0,'TIME TABLE'!$B$8)","v":"2022-04-03"},{"$f":"IF(C1860=0,0,CONCATENATE('TIME TABLE'!$C$8,'TIME TABLE'!$D$8,'TIME TABLE'!$E$8))","v":"(Sunday)"},{"$f":"IF(C1860=0,0,'TIME TABLE'!$C$3)","v":"09:00 AM to 11:45 AM"}]
[null,null,{"$f":"'TIME TABLE'!$F$9","v":"Social Study"},null,null,{"$f":"IF(C1861=0,0,'TIME TABLE'!$B$9)","v":"2022-04-04"},{"$f":"IF(C1861=0,0,CONCATENATE('TIME TABLE'!$C$9,'TIME TABLE'!$D$9,'TIME TABLE'!$E$9))","v":"(Monday)"},{"$f":"IF(C1861=0,0,'TIME TABLE'!$C$3)","v":"09:00 AM to 11:45 AM"}]
[null,null,{"$f":"'TIME TABLE'!$F$10","v":"Sanskrit"},null,null,{"$f":"IF(C1862=0,0,'TIME TABLE'!$B$10)","v":"2022-04-05"},{"$f":"IF(C1862=0,0,CONCATENATE('TIME TABLE'!$C$10,'TIME TABLE'!$D$10,'TIME TABLE'!$E$10))","v":"(Tuesday)"},{"$f":"IF(C1862=0,0,'TIME TABLE'!$C$3)","v":"09:00 AM to 11:45 AM"}]
[null,null,{"$f":"'TIME TABLE'!$F$11","v":0},null,null,{"$f":"IF(C1863=0,0,'TIME TABLE'!$B$11)","v":"00:00:00"},{"$f":"IF(C1863=0,0,CONCATENATE('TIME TABLE'!$C$11,'TIME TABLE'!$D$11,'TIME TABLE'!$E$11))","v":0},{"$f":"IF(C1863=0,0,'TIME TABLE'!$C$3)","v":0}]
[null,null,{"$f":"'TIME TABLE'!$F$12","v":0},null,null,{"$f":"IF(C1864=0,0,'TIME TABLE'!$B$12)","v":"00:00:00"},{"$f":"IF(C1864=0,0,CONCATENATE('TIME TABLE'!$C$12,'TIME TABLE'!$D$12,'TIME TABLE'!$E$12))","v":0},{"$f":"IF(C1864=0,0,'TIME TABLE'!$C$3)","v":0}]
[null,null,{"$f":"'TIME TABLE'!$F$13","v":0},null,null,{"$f":"IF(C1865=0,0,'TIME TABLE'!$B$13)","v":"00:00:00"},{"$f":"IF(C1865=0,0,CONCATENATE('TIME TABLE'!$C$13,'TIME TABLE'!$D$13,'TIME TABLE'!$E$13))","v":0},{"$f":"IF(C1865=0,0,'TIME TABLE'!$C$3)","v":0}]
[null,null,{"$f":"'TIME TABLE'!$F$14","v":0},null,null,{"$f":"IF(C1866=0,0,'TIME TABLE'!$B$14)","v":"00:00:00"},{"$f":"IF(C1866=0,0,CONCATENATE('TIME TABLE'!$C$14,'TIME TABLE'!$D$14,'TIME TABLE'!$E$14))","v":0},{"$f":"IF(C1866=0,0,'TIME TABLE'!$C$3)","v":0}]
[null,null,"Instructions"]
[null,null,1,"Check the exam time table carefully."]
[null,null,2,"Students must bring the 'Admit Card' and show it to the invigilator(s) on duty and should preserve it for future requirements."]
[null,null,3,"Mobile Phone, Calculator, Digital Watch or any Electronic Device is NOT ALLOWED."]
[null,null,4,"Arrive at the School at least 15 minutes before the start examination."]
[null,null,5,"Student is barred from entering the examination hall 15 minutes after the written examination starts."]
[null,null,6,"Ensure that you use the washroom before arriving for your exam as you will not be permitted to leave during the first hour."]
[null,null,7,"Normally, you are required to answer questionsusing blue or black in . Make sure you bring some spare pens with you."]
[null,null,8,"Keep your eyes on your own paper. Remember, copying is cheating!"]
[null,null,9,"You must remain silent until after you have exited the school building."]
[{"$f":"A1844+1","v":57}]
[{"$nulls":4},{"$f":"MASTER!$E$11","v":"Govt. Sr. Secondary School Raimalwada"}]
[{"$nulls":4},{"$f":"MASTER!$E$14","v":"P.S.-Bapini (Jodhpur)"}]
[null,{"$f":"CONCATENATE(C1881,'TIME TABLE'!$C$5,'ADMIT CARD'!$C1882,$F1882,'ADMIT CARD'!$G1882,'TIME TABLE'!$E$5)","v":"ADMIT CARD(Roll Number●→0)"},{"$f":"CONCATENATE('TIME TABLE'!$B$2,'TIME TABLE'!$F$2)","v":"HALF YEARLY EXAM:2021-22"}]
[null,null,"ADMIT CARD",{"$nulls":6}," "]
[null,null,"Roll Number",null,null,"●→",{"$f":"VLOOKUP(A1877,'STUDENT DETAIL'!$C$8:$I$107,3)","v":0},null,"Seal and Signature of Head of Institution"]
[null,null,"Student's Name",null,null,"●→",{"$f":"VLOOKUP(A1877,'STUDENT DETAIL'!$C$8:$I$107,4)","v":0}]
[null,null,"Father's Name",null,null,"●→",{"$f":"VLOOKUP(A1877,'STUDENT DETAIL'!$C$8:$I$107,5)","v":0}]
[null,null,"Mother's Name ",null,null,"●→",{"$f":"VLOOKUP(A1877,'STUDENT DETAIL'!$C$8:$I$107,6)","v":0}]
[null,null,"Class & Section",null,null,"●→",{"$f":"IF(G1882=0,0,CONCATENATE('STUDENT DETAIL'!$E$4,'STUDENT DETAIL'!$H$4))","v":0}]
[null,null,"Date Of Birth",null,null,"●→",{"$f":"VLOOKUP(A1877,'STUDENT DETAIL'!$C$8:$I$107,7)","v":"00:00:00"}]
[null,null,"Time Table"]
[null,null,"Subject",null,null,"Date (Day)",null,"Time"]
[null,null,{"$f":"'TIME TABLE'!$F$5","v":"Hindi"},null,null,{"$f":"IF(C1890=0,0,'TIME TABLE'!$B$5)","v":"2022-03-31"},{"$f":"IF(C1890=0,0,CONCATENATE('TIME TABLE'!$C$5,'TIME TABLE'!$D$5,'TIME TABLE'!$E$5))","v":"(Thursday)"},{"$f":"IF(C1890=0,0,'TIME TABLE'!$C$3)","v":"09:00 AM to 11:45 AM"}]
[null,null,{"$f":"'TIME TABLE'!$F$6","v":"English"},null,null,{"$f":"IF(C1891=0,0,'TIME TABLE'!$B$6)","v":"2022-04-01"},{"$f":"IF(C1891=0,0,CONCATENATE('TIME TABLE'!$C$6,'TIME TABLE'!$D$6,'TIME TABLE'!$E$6))","v":"(Friday)"},{"$f":"IF(C1891=0,0,'TIME TABLE'!$C$3)","v":"09:00 AM to 11:45 AM"}]
[null,null,{"$f":"'TIME TABLE'!$F$7","v":"Science"},null,null,{"$f":"IF(C1892=0,0,'TIME TABLE'!$B$7)","v":"2022-04-02"},{"$f":"IF(C1892=0,0,CONCATENATE('TIME TABLE'!$C$7,'TIME TABLE'!$D$7,'TIME TABLE'!$E$7))","v":"(Saturday)"},{"$f":"IF(C1892=0,0,'TIME TABLE'!$C$3)","v":"09:00 AM to 11:45 AM"}]
[null,null,{"$f":"'TIME TABLE'!$F$8","v":"Mathematics"},null,null,{"$f":"IF(C1893=0,0,'TIME TABLE'!$B$8)","v":"2022-04-03"},{"$f":"IF(C1893=0,0,CONCATENATE('TIME TABLE'!$C$8,'TIME TABLE'!$D$8,'TIME TABLE'!$E$8))","v":"(Sunday)"},{"$f":"IF(C1893=0,0,'TIME TABLE'!$C$3)","v":"09:00 AM to 11:45 AM"}]
[null,null,{"$f":"'TIME TABLE'!$F$9","v":"Social Study"},null,null,{"$f":"IF(C1894=0,0,'TIME TABLE'!$B$9)","v":"2022-04-04"},{"$f":"IF(C1894=0,0,CONCATENATE('TIME TABLE'!$C$9,'TIME TABLE'!$D$9,'TIME TABLE'!$E$9))","v":"(Monday)"},{"$f":"IF(C1894=0,0,'TIME TABLE'!$C$3)","v":"09:00 AM to 11:45 AM"}]
[null,null,{"$f":"'TIME TABLE'!$F$10","v":"Sanskrit"},null,null,{"$f":"IF(C1895=0,0,'TIME TABLE'!$B$10)","v":"2022-04-05"},{"$f":"IF(C1895=0,0,CONCATENATE('TIME TABLE'!$C$10,'TIME TABLE'!$D$10,'TIME TABLE'!$E$10))","v":"(Tuesday)"},{"$f":"IF(C1895=0,0,'TIME TABLE'!$C$3)","v":"09:00 AM to 11:45 AM"}]
[null,null,{"$f":"'TIME TABLE'!$F$11","v":0},null,null,{"$f":"IF(C1896=0,0,'TIME TABLE'!$B$11)","v":"00:00:00"},{"$f":"IF(C1896=0,0,CONCATENATE('TIME TABLE'!$C$11,'TIME TABLE'!$D$11,'TIME TABLE'!$E$11))","v":0},{"$f":"IF(C1896=0,0,'TIME TABLE'!$C$3)","v":0}]
[null,null,{"$f":"'TIME TABLE'!$F$12","v":0},null,null,{"$f":"IF(C1897=0,0,'TIME TABLE'!$B$12)","v":"00:00:00"},{"$f":"IF(C1897=0,0,CONCATENATE('TIME TABLE'!$C$12,'TIME TABLE'!$D$12,'TIME TABLE'!$E$12))","v":0},{"$f":"IF(C1897=0,0,'TIME TABLE'!$C$3)","v":0}]
[null,null,{"$f":"'TIME TABLE'!$F$13","v":0},null,null,{"$f":"IF(C1898=0,0,'TIME TABLE'!$B$13)","v":"00:00:00"},{"$f":"IF(C1898=0,0,CONCATENATE('TIME TABLE'!$C$13,'TIME TABLE'!$D$13,'TIME TABLE'!$E$13))","v":0},{"$f":"IF(C1898=0,0,'TIME TABLE'!$C$3)","v":0}]
[null,null,{"$f":"'TIME TABLE'!$F$14","v":0},null,null,{"$f":"IF(C1899=0,0,'TIME TABLE'!$B$14)","v":"00:00:00"},{"$f":"IF(C1899=0,0,CONCATENATE('TIME TABLE'!$C$14,'TIME TABLE'!$D$14,'TIME TABLE'!$E$14))","v":0},{"$f":"IF(C1899=0,0,'TIME TABLE'!$C$3)","v":0}]
[null,null,"Instructions"]
[null,null,1,"Check the exam time table carefully."]
[null,null,2,"Students must bring the 'Admit Card' and show it to the invigilator(s) on duty and should preserve it for future requirements."]
[null,null,3,"Mobile Phone, Calculator, Digital Watch or any Electronic Device is NOT ALLOWED."]
[null,null,4,"Arrive at the School at least 15 minutes before the start examination."]
[null,null,5,"Student is barred from entering the examination hall 15 minutes after the written examination starts."]
[null,null,6,"Ensure that you use the washroom before arriving for your exam as you will not be permitted to leave during the first hour."]
[null,null,7,"Normally, you are required to answer questionsusing blue or black in . Make sure you bring some spare pens with you."]
[null,null,8,"Keep your eyes on your own paper. Remember, copying is cheating!"]
[null,null,9,"You must remain silent until after you have exited the school building."]
[]
[{"$f":"A1877+1","v":58}]
[{"$nulls":4},{"$f":"MASTER!$E$11","v":"Govt. Sr. Secondary School Raimalwada"}]
[{"$nulls":4},{"$f":"MASTER!$E$14","v":"P.S.-Bapini (Jodhpur)"}]
[null,{"$f":"CONCATENATE(C1915,'TIME TABLE'!$C$5,'ADMIT CARD'!$C1916,$F1916,'ADMIT CARD'!$G1916,'TIME TABLE'!$E$5)","v":"ADMIT CARD(Roll Number●→0)"},{"$f":"CONCATENATE('TIME TABLE'!$B$2,'TIME TABLE'!$F$2)","v":"HALF YEARLY EXAM:2021-22"}]
[null,null,"ADMIT CARD",{"$nulls":6}," "]
[null,null,"Roll Number",null,null,"●→",{"$f":"VLOOKUP(A1911,'STUDENT DETAIL'!$C$8:$I$107,3)","v":0},null,"Seal and Signature of Head of Institution"]
[null,null,"Student's Name",null,null,"●→",{"$f":"VLOOKUP(A1911,'STUDENT DETAIL'!$C$8:$I$107,4)","v":0}]
[null,null,"Father's Name",null,null,"●→",{"$f":"VLOOKUP(A1911,'STUDENT DETAIL'!$C$8:$I$107,5)","v":0}]
[null,null,"Mother's Name ",null,null,"●→",{"$f":"VLOOKUP(A1911,'STUDENT DETAIL'!$C$8:$I$107,6)","v":0}]
[null,null,"Class & Section",null,null,"●→",{"$f":"IF(G1916=0,0,CONCATENATE('STUDENT DETAIL'!$E$4,'STUDENT DETAIL'!$H$4))","v":0}]
[null,null,"Date Of Birth",null,null,"●→",{"$f":"VLOOKUP(A1911,'STUDENT DETAIL'!$C$8:$I$107,7)","v":"00:00:00"}]
[null,null,"Time Table"]
[null,null,"Subject",null,null,"Date (Day)",null,"Time"]
[null,null,{"$f":"'TIME TABLE'!$F$5","v":"Hindi"},null,null,{"$f":"IF(C1924=0,0,'TIME TABLE'!$B$5)","v":"2022-03-31"},{"$f":"IF(C1924=0,0,CONCATENATE('TIME TABLE'!$C$5,'TIME TABLE'!$D$5,'TIME TABLE'!$E$5))","v":"(Thursday)"},{"$f":"IF(C1924=0,0,'TIME TABLE'!$C$3)","v":"09:00 AM to 11:45 AM"}]
[null,null,{"$f":"'TIME TABLE'!$F$6","v":"English"},null,null,{"$f":"IF(C1925=0,0,'TIME TABLE'!$B$6)","v":"2022-04-01"},{"$f":"IF(C1925=0,0,CONCATENATE('TIME TABLE'!$C$6,'TIME TABLE'!$D$6,'TIME TABLE'!$E$6))","v":"(Friday)"},{"$f":"IF(C1925=0,0,'TIME TABLE'!$C$3)","v":"09:00 AM to 11:45 AM"}]
[null,null,{"$f":"'TIME TABLE'!$F$7","v":"Science"},null,null,{"$f":"IF(C1926=0,0,'TIME TABLE'!$B$7)","v":"2022-04-02"},{"$f":"IF(C1926=0,0,CONCATENATE('TIME TABLE'!$C$7,'TIME TABLE'!$D$7,'TIME TABLE'!$E$7))","v":"(Saturday)"},{"$f":"IF(C1926=0,0,'TIME TABLE'!$C$3)","v":"09:00 AM to 11:45 AM"}]
[null,null,{"$f":"'TIME TABLE'!$F$8","v":"Mathematics"},null,null,{"$f":"IF(C1927=0,0,'TIME TABLE'!$B$8)","v":"2022-04-03"},{"$f":"IF(C1927=0,0,CONCATENATE('TIME TABLE'!$C$8,'TIME TABLE'!$D$8,'TIME TABLE'!$E$8))","v":"(Sunday)"},{"$f":"IF(C1927=0,0,'TIME TABLE'!$C$3)","v":"09:00 AM to 11:45 AM"}]
[null,null,{"$f":"'TIME TABLE'!$F$9","v":"Social Study"},null,null,{"$f":"IF(C1928=0,0,'TIME TABLE'!$B$9)","v":"2022-04-04"},{"$f":"IF(C1928=0,0,CONCATENATE('TIME TABLE'!$C$9,'TIME TABLE'!$D$9,'TIME TABLE'!$E$9))","v":"(Monday)"},{"$f":"IF(C1928=0,0,'TIME TABLE'!$C$3)","v":"09:00 AM to 11:45 AM"}]
[null,null,{"$f":"'TIME TABLE'!$F$10","v":"Sanskrit"},null,null,{"$f":"IF(C1929=0,0,'TIME TABLE'!$B$10)","v":"2022-04-05"},{"$f":"IF(C1929=0,0,CONCATENATE('TIME TABLE'!$C$10,'TIME TABLE'!$D$10,'TIME TABLE'!$E$10))","v":"(Tuesday)"},{"$f":"IF(C1929=0,0,'TIME TABLE'!$C$3)","v":"09:00 AM to 11:45 AM"}]
[null,null,{"$f":"'TIME TABLE'!$F$11","v":0},null,null,{"$f":"IF(C1930=0,0,'TIME TABLE'!$B$11)","v":"00:00:00"},{"$f":"IF(C1930=0,0,CONCATENATE('TIME TABLE'!$C$11,'TIME TABLE'!$D$11,'TIME TABLE'!$E$11))","v":0},{"$f":"IF(C1930=0,0,'TIME TABLE'!$C$3)","v":0}]
[null,null,{"$f":"'TIME TABLE'!$F$12","v":0},null,null,{"$f":"IF(C1931=0,0,'TIME TABLE'!$B$12)","v":"00:00:00"},{"$f":"IF(C1931=0,0,CONCATENATE('TIME TABLE'!$C$12,'TIME TABLE'!$D$12,'TIME TABLE'!$E$12))","v":0},{"$f":"IF(C1931=0,0,'TIME TABLE'!$C$3)","v":0}]
[null,null,{"$f":"'TIME TABLE'!$F$13","v":0},null,null,{"$f":"IF(C1932=0,0,'TIME TABLE'!$B$13)","v":"00:00:00"},{"$f":"IF(C1932=0,0,CONCATENATE('TIME TABLE'!$C$13,'TIME TABLE'!$D$13,'TIME TABLE'!$E$13))","v":0},{"$f":"IF(C1932=0,0,'TIME TABLE'!$C$3)","v":0}]
[null,null,{"$f":"'TIME TABLE'!$F$14","v":0},null,null,{"$f":"IF(C1933=0,0,'TIME TABLE'!$B$14)","v":"00:00:00"},{"$f":"IF(C1933=0,0,CONCATENATE('TIME TABLE'!$C$14,'TIME TABLE'!$D$14,'TIME TABLE'!$E$14))","v":0},{"$f":"IF(C1933=0,0,'TIME TABLE'!$C$3)","v":0}]
[null,null,"Instructions"]
[null,null,1,"Check the exam time table carefully."]
[null,null,2,"Students must bring the 'Admit Card' and show it to the invigilator(s) on duty and should preserve it for future requirements."]
[null,null,3,"Mobile Phone, Calculator, Digital Watch or any Electronic Device is NOT ALLOWED."]
[null,null,4,"Arrive at the School at least 15 minutes before the start examination."]
[null,null,5,"Student is barred from entering the examination hall 15 minutes after the written examination starts."]
[null,null,6,"Ensure that you use the washroom before arriving for your exam as you will not be permitted to leave during the first hour."]
[null,null,7,"Normally, you are required to answer questionsusing blue or black in . Make sure you bring some spare pens with you."]
[null,null,8,"Keep your eyes on your own paper. Remember, copying is cheating!"]
[null,null,9,"You must remain silent until after you have exited the school building."]
[{"$f":"A1911+1","v":59}]
[{"$nulls":4},{"$f":"MASTER!$E$11","v":"Govt. Sr. Secondary School Raimalwada"}]
[{"$nulls":4},{"$f":"MASTER!$E$14","v":"P.S.-Bapini (Jodhpur)"}]
[null,{"$f":"CONCATENATE(C1948,'TIME TABLE'!$C$5,'ADMIT CARD'!$C1949,$F1949,'ADMIT CARD'!$G1949,'TIME TABLE'!$E$5)","v":"ADMIT CARD(Roll Number●→0)"},{"$f":"CONCATENATE('TIME TABLE'!$B$2,'TIME TABLE'!$F$2)","v":"HALF YEARLY EXAM:2021-22"}]
[null,null,"ADMIT CARD",{"$nulls":6}," "]
[null,null,"Roll Number",null,null,"●→",{"$f":"VLOOKUP(A1944,'STUDENT DETAIL'!$C$8:$I$107,3)","v":0},null,"Seal and Signature of Head of Institution"]
[null,null,"Student's Name",null,null,"●→",{"$f":"VLOOKUP(A1944,'STUDENT DETAIL'!$C$8:$I$107,4)","v":0}]
[null,null,"Father's Name",null,null,"●→",{"$f":"VLOOKUP(A1944,'STUDENT DETAIL'!$C$8:$I$107,5)","v":0}]
[null,null,"Mother's Name ",null,null,"●→",{"$f":"VLOOKUP(A1944,'STUDENT DETAIL'!$C$8:$I$107,6)","v":0}]
[null,null,"Class & Section",null,null,"●→",{"$f":"IF(G1949=0,0,CONCATENATE('STUDENT DETAIL'!$E$4,'STUDENT DETAIL'!$H$4))","v":0}]
[null,null,"Date Of Birth",null,null,"●→",{"$f":"VLOOKUP(A1944,'STUDENT DETAIL'!$C$8:$I$107,7)","v":"00:00:00"}]
[null,null,"Time Table"]
[null,null,"Subject",null,null,"Date (Day)",null,"Time"]
[null,null,{"$f":"'TIME TABLE'!$F$5","v":"Hindi"},null,null,{"$f":"IF(C1957=0,0,'TIME TABLE'!$B$5)","v":"2022-03-31"},{"$f":"IF(C1957=0,0,CONCATENATE('TIME TABLE'!$C$5,'TIME TABLE'!$D$5,'TIME TABLE'!$E$5))","v":"(Thursday)"},{"$f":"IF(C1957=0,0,'TIME TABLE'!$C$3)","v":"09:00 AM to 11:45 AM"}]
[null,null,{"$f":"'TIME TABLE'!$F$6","v":"English"},null,null,{"$f":"IF(C1958=0,0,'TIME TABLE'!$B$6)","v":"2022-04-01"},{"$f":"IF(C1958=0,0,CONCATENATE('TIME TABLE'!$C$6,'TIME TABLE'!$D$6,'TIME TABLE'!$E$6))","v":"(Friday)"},{"$f":"IF(C1958=0,0,'TIME TABLE'!$C$3)","v":"09:00 AM to 11:45 AM"}]
[null,null,{"$f":"'TIME TABLE'!$F$7","v":"Science"},null,null,{"$f":"IF(C1959=0,0,'TIME TABLE'!$B$7)","v":"2022-04-02"},{"$f":"IF(C1959=0,0,CONCATENATE('TIME TABLE'!$C$7,'TIME TABLE'!$D$7,'TIME TABLE'!$E$7))","v":"(Saturday)"},{"$f":"IF(C1959=0,0,'TIME TABLE'!$C$3)","v":"09:00 AM to 11:45 AM"}]
[null,null,{"$f":"'TIME TABLE'!$F$8","v":"Mathematics"},null,null,{"$f":"IF(C1960=0,0,'TIME TABLE'!$B$8)","v":"2022-04-03"},{"$f":"IF(C1960=0,0,CONCATENATE('TIME TABLE'!$C$8,'TIME TABLE'!$D$8,'TIME TABLE'!$E$8))","v":"(Sunday)"},{"$f":"IF(C1960=0,0,'TIME TABLE'!$C$3)","v":"09:00 AM to 11:45 AM"}]
[null,null,{"$f":"'TIME TABLE'!$F$9","v":"Social Study"},null,null,{"$f":"IF(C1961=0,0,'TIME TABLE'!$B$9)","v":"2022-04-04"},{"$f":"IF(C1961=0,0,CONCATENATE('TIME TABLE'!$C$9,'TIME TABLE'!$D$9,'TIME TABLE'!$E$9))","v":"(Monday)"},{"$f":"IF(C1961=0,0,'TIME TABLE'!$C$3)","v":"09:00 AM to 11:45 AM"}]
[null,null,{"$f":"'TIME TABLE'!$F$10","v":"Sanskrit"},null,null,{"$f":"IF(C1962=0,0,'TIME TABLE'!$B$10)","v":"2022-04-05"},{"$f":"IF(C1962=0,0,CONCATENATE('TIME TABLE'!$C$10,'TIME TABLE'!$D$10,'TIME TABLE'!$E$10))","v":"(Tuesday)"},{"$f":"IF(C1962=0,0,'TIME TABLE'!$C$3)","v":"09:00 AM to 11:45 AM"}]
[null,null,{"$f":"'TIME TABLE'!$F$11","v":0},null,null,{"$f":"IF(C1963=0,0,'TIME TABLE'!$B$11)","v":"00:00:00"},{"$f":"IF(C1963=0,0,CONCATENATE('TIME TABLE'!$C$11,'TIME TABLE'!$D$11,'TIME TABLE'!$E$11))","v":0},{"$f":"IF(C1963=0,0,'TIME TABLE'!$C$3)","v":0}]
[null,null,{"$f":"'TIME TABLE'!$F$12","v":0},null,null,{"$f":"IF(C1964=0,0,'TIME TABLE'!$B$12)","v":"00:00:00"},{"$f":"IF(C1964=0,0,CONCATENATE('TIME TABLE'!$C$12,'TIME TABLE'!$D$12,'TIME TABLE'!$E$12))","v":0},{"$f":"IF(C1964=0,0,'TIME TABLE'!$C$3)","v":0}]
[null,null,{"$f":"'TIME TABLE'!$F$13","v":0},null,null,{"$f":"IF(C1965=0,0,'TIME TABLE'!$B$13)","v":"00:00:00"},{"$f":"IF(C1965=0,0,CONCATENATE('TIME TABLE'!$C$13,'TIME TABLE'!$D$13,'TIME TABLE'!$E$13))","v":0},{"$f":"IF(C1965=0,0,'TIME TABLE'!$C$3)","v":0}]
[null,null,{"$f":"'TIME TABLE'!$F$14","v":0},null,null,{"$f":"IF(C1966=0,0,'TIME TABLE'!$B$14)","v":"00:00:00"},{"$f":"IF(C1966=0,0,CONCATENATE('TIME TABLE'!$C$14,'TIME TABLE'!$D$14,'TIME TABLE'!$E$14))","v":0},{"$f":"IF(C1966=0,0,'TIME TABLE'!$C$3)","v":0}]
[null,null,"Instructions"]
[null,null,1,"Check the exam time table carefully."]
[null,null,2,"Students must bring the 'Admit Card' and show it to the invigilator(s) on duty and should preserve it for future requirements."]
[null,null,3,"Mobile Phone, Calculator, Digital Watch or any Electronic Device is NOT ALLOWED."]
[null,null,4,"Arrive at the School at least 15 minutes before the start examination."]
[null,null,5,"Student is barred from entering the examination hall 15 minutes after the written examination starts."]
[null,null,6,"Ensure that you use the washroom before arriving for your exam as you will not be permitted to leave during the first hour."]
[null,null,7,"Normally, you are required to answer questionsusing blue or black in . Make sure you bring some spare pens with you."]
[null,null,8,"Keep your eyes on your own paper. Remember, copying is cheating!"]
[null,null,9,"You must remain silent until after you have exited the school building."]
[]
[{"$f":"A1944+1","v":60}]
[{"$nulls":4},{"$f":"MASTER!$E$11","v":"Govt. Sr. Secondary School Raimalwada"}]
[{"$nulls":4},{"$f":"MASTER!$E$14","v":"P.S.-Bapini (Jodhpur)"}]
[null,{"$f":"CONCATENATE(C1982,'TIME TABLE'!$C$5,'ADMIT CARD'!$C1983,$F1983,'ADMIT CARD'!$G1983,'TIME TABLE'!$E$5)","v":"ADMIT CARD(Roll Number●→0)"},{"$f":"CONCATENATE('TIME TABLE'!$B$2,'TIME TABLE'!$F$2)","v":"HALF YEARLY EXAM:2021-22"}]
[null,null,"ADMIT CARD",{"$nulls":6}," "]
[null,null,"Roll Number",null,null,"●→",{"$f":"VLOOKUP(A1978,'STUDENT DETAIL'!$C$8:$I$107,3)","v":0},null,"Seal and Signature of Head of Institution"]
[null,null,"Student's Name",null,null,"●→",{"$f":"VLOOKUP(A1978,'STUDENT DETAIL'!$C$8:$I$107,4)","v":0}]
[null,null,"Father's Name",null,null,"●→",{"$f":"VLOOKUP(A1978,'STUDENT DETAIL'!$C$8:$I$107,5)","v":0}]
[null,null,"Mother's Name ",null,null,"●→",{"$f":"VLOOKUP(A1978,'STUDENT DETAIL'!$C$8:$I$107,6)","v":0}]
[null,null,"Class & Section",null,null,"●→",{"$f":"IF(G1983=0,0,CONCATENATE('STUDENT DETAIL'!$E$4,'STUDENT DETAIL'!$H$4))","v":0}]
[null,null,"Date Of Birth",null,null,"●→",{"$f":"VLOOKUP(A1978,'STUDENT DETAIL'!$C$8:$I$107,7)","v":"00:00:00"}]
[null,null,"Time Table"]
[null,null,"Subject",null,null,"Date (Day)",null,"Time"]
[null,null,{"$f":"'TIME TABLE'!$F$5","v":"Hindi"},null,null,{"$f":"IF(C1991=0,0,'TIME TABLE'!$B$5)","v":"2022-03-31"},{"$f":"IF(C1991=0,0,CONCATENATE('TIME TABLE'!$C$5,'TIME TABLE'!$D$5,'TIME TABLE'!$E$5))","v":"(Thursday)"},{"$f":"IF(C1991=0,0,'TIME TABLE'!$C$3)","v":"09:00 AM to 11:45 AM"}]
[null,null,{"$f":"'TIME TABLE'!$F$6","v":"English"},null,null,{"$f":"IF(C1992=0,0,'TIME TABLE'!$B$6)","v":"2022-04-01"},{"$f":"IF(C1992=0,0,CONCATENATE('TIME TABLE'!$C$6,'TIME TABLE'!$D$6,'TIME TABLE'!$E$6))","v":"(Friday)"},{"$f":"IF(C1992=0,0,'TIME TABLE'!$C$3)","v":"09:00 AM to 11:45 AM"}]
[null,null,{"$f":"'TIME TABLE'!$F$7","v":"Science"},null,null,{"$f":"IF(C1993=0,0,'TIME TABLE'!$B$7)","v":"2022-04-02"},{"$f":"IF(C1993=0,0,CONCATENATE('TIME TABLE'!$C$7,'TIME TABLE'!$D$7,'TIME TABLE'!$E$7))","v":"(Saturday)"},{"$f":"IF(C1993=0,0,'TIME TABLE'!$C$3)","v":"09:00 AM to 11:45 AM"}]
[null,null,{"$f":"'TIME TABLE'!$F$8","v":"Mathematics"},null,null,{"$f":"IF(C1994=0,0,'TIME TABLE'!$B$8)","v":"2022-04-03"},{"$f":"IF(C1994=0,0,CONCATENATE('TIME TABLE'!$C$8,'TIME TABLE'!$D$8,'TIME TABLE'!$E$8))","v":"(Sunday)"},{"$f":"IF(C1994=0,0,'TIME TABLE'!$C$3)","v":"09:00 AM to 11:45 AM"}]
[null,null,{"$f":"'TIME TABLE'!$F$9","v":"Social Study"},null,null,{"$f":"IF(C1995=0,0,'TIME TABLE'!$B$9)","v":"2022-04-04"},{"$f":"IF(C1995=0,0,CONCATENATE('TIME TABLE'!$C$9,'TIME TABLE'!$D$9,'TIME TABLE'!$E$9))","v":"(Monday)"},{"$f":"IF(C1995=0,0,'TIME TABLE'!$C$3)","v":"09:00 AM to 11:45 AM"}]
[null,null,{"$f":"'TIME TABLE'!$F$10","v":"Sanskrit"},null,null,{"$f":"IF(C1996=0,0,'TIME TABLE'!$B$10)","v":"2022-04-05"},{"$f":"IF(C1996=0,0,CONCATENATE('TIME TABLE'!$C$10,'TIME TABLE'!$D$10,'TIME TABLE'!$E$10))","v":"(Tuesday)"},{"$f":"IF(C1996=0,0,'TIME TABLE'!$C$3)","v":"09:00 AM to 11:45 AM"}]
[null,null,{"$f":"'TIME TABLE'!$F$11","v":0},null,null,{"$f":"IF(C1997=0,0,'TIME TABLE'!$B$11)","v":"00:00:00"},{"$f":"IF(C1997=0,0,CONCATENATE('TIME TABLE'!$C$11,'TIME TABLE'!$D$11,'TIME TABLE'!$E$11))","v":0},{"$f":"IF(C1997=0,0,'TIME TABLE'!$C$3)","v":0}]
[null,null,{"$f":"'TIME TABLE'!$F$12","v":0},null,null,{"$f":"IF(C1998=0,0,'TIME TABLE'!$B$12)","v":"00:00:00"},{"$f":"IF(C1998=0,0,CONCATENATE('TIME TABLE'!$C$12,'TIME TABLE'!$D$12,'TIME TABLE'!$E$12))","v":0},{"$f":"IF(C1998=0,0,'TIME TABLE'!$C$3)","v":0}]
[null,null,{"$f":"'TIME TABLE'!$F$13","v":0},null,null,{"$f":"IF(C1999=0,0,'TIME TABLE'!$B$13)","v":"00:00:00"},{"$f":"IF(C1999=0,0,CONCATENATE('TIME TABLE'!$C$13,'TIME TABLE'!$D$13,'TIME TABLE'!$E$13))","v":0},{"$f":"IF(C1999=0,0,'TIME TABLE'!$C$3)","v":0}]
[null,null,{"$f":"'TIME TABLE'!$F$14","v":0},null,null,{"$f":"IF(C2000=0,0,'TIME TABLE'!$B$14)","v":"00:00:00"},{"$f":"IF(C2000=0,0,CONCATENATE('TIME TABLE'!$C$14,'TIME TABLE'!$D$14,'TIME TABLE'!$E$14))","v":0},{"$f":"IF(C2000=0,0,'TIME TABLE'!$C$3)","v":0}]
[null,null,"Instructions"]
[null,null,1,"Check the exam time table carefully."]
[null,null,2,"Students must bring the 'Admit Card' and show it to the invigilator(s) on duty and should preserve it for future requirements."]
[null,null,3,"Mobile Phone, Calculator, Digital Watch or any Electronic Device is NOT ALLOWED."]
[null,null,4,"Arrive at the School at least 15 minutes before the start examination."]
[null,null,5,"Student is barred from entering the examination hall 15 minutes after the written examination starts."]
[null,null,6,"Ensure that you use the washroom before arriving for your exam as you will not be permitted to leave during the first hour."]
[null,null,7,"Normally, you are required to answer questionsusing blue or black in . Make sure you bring some spare pens with you."]
[null,null,8,"Keep your eyes on your own paper. Remember, copying is cheating!"]
[null,null,9,"You must remain silent until after you have exited the school building."]
[{"$f":"A1978+1","v":61}]
[{"$nulls":4},{"$f":"MASTER!$E$11","v":"Govt. Sr. Secondary School Raimalwada"}]
[{"$nulls":4},{"$f":"MASTER!$E$14","v":"P.S.-Bapini (Jodhpur)"}]
[null,{"$f":"CONCATENATE(C2015,'TIME TABLE'!$C$5,'ADMIT CARD'!$C2016,$F2016,'ADMIT CARD'!$G2016,'TIME TABLE'!$E$5)","v":"ADMIT CARD(Roll Number●→0)"},{"$f":"CONCATENATE('TIME TABLE'!$B$2,'TIME TABLE'!$F$2)","v":"HALF YEARLY EXAM:2021-22"}]
[null,null,"ADMIT CARD",{"$nulls":6}," "]
[null,null,"Roll Number",null,null,"●→",{"$f":"VLOOKUP(A2011,'STUDENT DETAIL'!$C$8:$I$107,3)","v":0},null,"Seal and Signature of Head of Institution"]
[null,null,"Student's Name",null,null,"●→",{"$f":"VLOOKUP(A2011,'STUDENT DETAIL'!$C$8:$I$107,4)","v":0}]
[null,null,"Father's Name",null,null,"●→",{"$f":"VLOOKUP(A2011,'STUDENT DETAIL'!$C$8:$I$107,5)","v":0}]
[null,null,"Mother's Name ",null,null,"●→",{"$f":"VLOOKUP(A2011,'STUDENT DETAIL'!$C$8:$I$107,6)","v":0}]
[null,null,"Class & Section",null,null,"●→",{"$f":"IF(G2016=0,0,CONCATENATE('STUDENT DETAIL'!$E$4,'STUDENT DETAIL'!$H$4))","v":0}]
[null,null,"Date Of Birth",null,null,"●→",{"$f":"VLOOKUP(A2011,'STUDENT DETAIL'!$C$8:$I$107,7)","v":"00:00:00"}]
[null,null,"Time Table"]
[null,null,"Subject",null,null,"Date (Day)",null,"Time"]
[null,null,{"$f":"'TIME TABLE'!$F$5","v":"Hindi"},null,null,{"$f":"IF(C2024=0,0,'TIME TABLE'!$B$5)","v":"2022-03-31"},{"$f":"IF(C2024=0,0,CONCATENATE('TIME TABLE'!$C$5,'TIME TABLE'!$D$5,'TIME TABLE'!$E$5))","v":"(Thursday)"},{"$f":"IF(C2024=0,0,'TIME TABLE'!$C$3)","v":"09:00 AM to 11:45 AM"}]
[null,null,{"$f":"'TIME TABLE'!$F$6","v":"English"},null,null,{"$f":"IF(C2025=0,0,'TIME TABLE'!$B$6)","v":"2022-04-01"},{"$f":"IF(C2025=0,0,CONCATENATE('TIME TABLE'!$C$6,'TIME TABLE'!$D$6,'TIME TABLE'!$E$6))","v":"(Friday)"},{"$f":"IF(C2025=0,0,'TIME TABLE'!$C$3)","v":"09:00 AM to 11:45 AM"}]
[null,null,{"$f":"'TIME TABLE'!$F$7","v":"Science"},null,null,{"$f":"IF(C2026=0,0,'TIME TABLE'!$B$7)","v":"2022-04-02"},{"$f":"IF(C2026=0,0,CONCATENATE('TIME TABLE'!$C$7,'TIME TABLE'!$D$7,'TIME TABLE'!$E$7))","v":"(Saturday)"},{"$f":"IF(C2026=0,0,'TIME TABLE'!$C$3)","v":"09:00 AM to 11:45 AM"}]
[null,null,{"$f":"'TIME TABLE'!$F$8","v":"Mathematics"},null,null,{"$f":"IF(C2027=0,0,'TIME TABLE'!$B$8)","v":"2022-04-03"},{"$f":"IF(C2027=0,0,CONCATENATE('TIME TABLE'!$C$8,'TIME TABLE'!$D$8,'TIME TABLE'!$E$8))","v":"(Sunday)"},{"$f":"IF(C2027=0,0,'TIME TABLE'!$C$3)","v":"09:00 AM to 11:45 AM"}]
[null,null,{"$f":"'TIME TABLE'!$F$9","v":"Social Study"},null,null,{"$f":"IF(C2028=0,0,'TIME TABLE'!$B$9)","v":"2022-04-04"},{"$f":"IF(C2028=0,0,CONCATENATE('TIME TABLE'!$C$9,'TIME TABLE'!$D$9,'TIME TABLE'!$E$9))","v":"(Monday)"},{"$f":"IF(C2028=0,0,'TIME TABLE'!$C$3)","v":"09:00 AM to 11:45 AM"}]
[null,null,{"$f":"'TIME TABLE'!$F$10","v":"Sanskrit"},null,null,{"$f":"IF(C2029=0,0,'TIME TABLE'!$B$10)","v":"2022-04-05"},{"$f":"IF(C2029=0,0,CONCATENATE('TIME TABLE'!$C$10,'TIME TABLE'!$D$10,'TIME TABLE'!$E$10))","v":"(Tuesday)"},{"$f":"IF(C2029=0,0,'TIME TABLE'!$C$3)","v":"09:00 AM to 11:45 AM"}]
[null,null,{"$f":"'TIME TABLE'!$F$11","v":0},null,null,{"$f":"IF(C2030=0,0,'TIME TABLE'!$B$11)","v":"00:00:00"},{"$f":"IF(C2030=0,0,CONCATENATE('TIME TABLE'!$C$11,'TIME TABLE'!$D$11,'TIME TABLE'!$E$11))","v":0},{"$f":"IF(C2030=0,0,'TIME TABLE'!$C$3)","v":0}]
[null,null,{"$f":"'TIME TABLE'!$F$12","v":0},null,null,{"$f":"IF(C2031=0,0,'TIME TABLE'!$B$12)","v":"00:00:00"},{"$f":"IF(C2031=0,0,CONCATENATE('TIME TABLE'!$C$12,'TIME TABLE'!$D$12,'TIME TABLE'!$E$12))","v":0},{"$f":"IF(C2031=0,0,'TIME TABLE'!$C$3)","v":0}]
[null,null,{"$f":"'TIME TABLE'!$F$13","v":0},null,null,{"$f":"IF(C2032=0,0,'TIME TABLE'!$B$13)","v":"00:00:00"},{"$f":"IF(C2032=0,0,CONCATENATE('TIME TABLE'!$C$13,'TIME TABLE'!$D$13,'TIME TABLE'!$E$13))","v":0},{"$f":"IF(C2032=0,0,'TIME TABLE'!$C$3)","v":0}]
[null,null,{"$f":"'TIME TABLE'!$F$14","v":0},null,null,{"$f":"IF(C2033=0,0,'TIME TABLE'!$B$14)","v":"00:00:00"},{"$f":"IF(C2033=0,0,CONCATENATE('TIME TABLE'!$C$14,'TIME TABLE'!$D$14,'TIME TABLE'!$E$14))","v":0},{"$f":"IF(C2033=0,0,'TIME TABLE'!$C$3)","v":0}]
[null,null,"Instructions"]
[null,null,1,"Check the exam time table carefully."]
[null,null,2,"Students must bring the 'Admit Card' and show it to the invigilator(s) on duty and should preserve it for future requirements."]
[null,null,3,"Mobile Phone, Calculator, Digital Watch or any Electronic Device is NOT ALLOWED."]
[null,null,4,"Arrive at the School at least 15 minutes before the start examination."]
[null,null,5,"Student is barred from entering the examination hall 15 minutes after the written examination starts."]
[null,null,6,"Ensure that you use the washroom before arriving for your exam as you will not be permitted to leave during the first hour."]
[null,null,7,"Normally, you are required to answer questionsusing blue or black in . Make sure you bring some spare pens with you."]
[null,null,8,"Keep your eyes on your own paper. Remember, copying is cheating!"]
[null,null,9,"You must remain silent until after you have exited the school building."]
[]
[{"$f":"A2011+1","v":62}]
[{"$nulls":4},{"$f":"MASTER!$E$11","v":"Govt. Sr. Secondary School Raimalwada"}]
[{"$nulls":4},{"$f":"MASTER!$E$14","v":"P.S.-Bapini (Jodhpur)"}]
[null,{"$f":"CONCATENATE(C2049,'TIME TABLE'!$C$5,'ADMIT CARD'!$C2050,$F2050,'ADMIT CARD'!$G2050,'TIME TABLE'!$E$5)","v":"ADMIT CARD(Roll Number●→0)"},{"$f":"CONCATENATE('TIME TABLE'!$B$2,'TIME TABLE'!$F$2)","v":"HALF YEARLY EXAM:2021-22"}]
[null,null,"ADMIT CARD",{"$nulls":6}," "]
[null,null,"Roll Number",null,null,"●→",{"$f":"VLOOKUP(A2045,'STUDENT DETAIL'!$C$8:$I$107,3)","v":0},null,"Seal and Signature of Head of Institution"]
[null,null,"Student's Name",null,null,"●→",{"$f":"VLOOKUP(A2045,'STUDENT DETAIL'!$C$8:$I$107,4)","v":0}]
[null,null,"Father's Name",null,null,"●→",{"$f":"VLOOKUP(A2045,'STUDENT DETAIL'!$C$8:$I$107,5)","v":0}]
[null,null,"Mother's Name ",null,null,"●→",{"$f":"VLOOKUP(A2045,'STUDENT DETAIL'!$C$8:$I$107,6)","v":0}]
[null,null,"Class & Section",null,null,"●→",{"$f":"IF(G2050=0,0,CONCATENATE('STUDENT DETAIL'!$E$4,'STUDENT DETAIL'!$H$4))","v":0}]
[null,null,"Date Of Birth",null,null,"●→",{"$f":"VLOOKUP(A2045,'STUDENT DETAIL'!$C$8:$I$107,7)","v":"00:00:00"}]
[null,null,"Time Table"]
[null,null,"Subject",null,null,"Date (Day)",null,"Time"]
[null,null,{"$f":"'TIME TABLE'!$F$5","v":"Hindi"},null,null,{"$f":"IF(C2058=0,0,'TIME TABLE'!$B$5)","v":"2022-03-31"},{"$f":"IF(C2058=0,0,CONCATENATE('TIME TABLE'!$C$5,'TIME TABLE'!$D$5,'TIME TABLE'!$E$5))","v":"(Thursday)"},{"$f":"IF(C2058=0,0,'TIME TABLE'!$C$3)","v":"09:00 AM to 11:45 AM"}]
[null,null,{"$f":"'TIME TABLE'!$F$6","v":"English"},null,null,{"$f":"IF(C2059=0,0,'TIME TABLE'!$B$6)","v":"2022-04-01"},{"$f":"IF(C2059=0,0,CONCATENATE('TIME TABLE'!$C$6,'TIME TABLE'!$D$6,'TIME TABLE'!$E$6))","v":"(Friday)"},{"$f":"IF(C2059=0,0,'TIME TABLE'!$C$3)","v":"09:00 AM to 11:45 AM"}]
[null,null,{"$f":"'TIME TABLE'!$F$7","v":"Science"},null,null,{"$f":"IF(C2060=0,0,'TIME TABLE'!$B$7)","v":"2022-04-02"},{"$f":"IF(C2060=0,0,CONCATENATE('TIME TABLE'!$C$7,'TIME TABLE'!$D$7,'TIME TABLE'!$E$7))","v":"(Saturday)"},{"$f":"IF(C2060=0,0,'TIME TABLE'!$C$3)","v":"09:00 AM to 11:45 AM"}]
[null,null,{"$f":"'TIME TABLE'!$F$8","v":"Mathematics"},null,null,{"$f":"IF(C2061=0,0,'TIME TABLE'!$B$8)","v":"2022-04-03"},{"$f":"IF(C2061=0,0,CONCATENATE('TIME TABLE'!$C$8,'TIME TABLE'!$D$8,'TIME TABLE'!$E$8))","v":"(Sunday)"},{"$f":"IF(C2061=0,0,'TIME TABLE'!$C$3)","v":"09:00 AM to 11:45 AM"}]
[null,null,{"$f":"'TIME TABLE'!$F$9","v":"Social Study"},null,null,{"$f":"IF(C2062=0,0,'TIME TABLE'!$B$9)","v":"2022-04-04"},{"$f":"IF(C2062=0,0,CONCATENATE('TIME TABLE'!$C$9,'TIME TABLE'!$D$9,'TIME TABLE'!$E$9))","v":"(Monday)"},{"$f":"IF(C2062=0,0,'TIME TABLE'!$C$3)","v":"09:00 AM to 11:45 AM"}]
[null,null,{"$f":"'TIME TABLE'!$F$10","v":"Sanskrit"},null,null,{"$f":"IF(C2063=0,0,'TIME TABLE'!$B$10)","v":"2022-04-05"},{"$f":"IF(C2063=0,0,CONCATENATE('TIME TABLE'!$C$10,'TIME TABLE'!$D$10,'TIME TABLE'!$E$10))","v":"(Tuesday)"},{"$f":"IF(C2063=0,0,'TIME TABLE'!$C$3)","v":"09:00 AM to 11:45 AM"}]
[null,null,{"$f":"'TIME TABLE'!$F$11","v":0},null,null,{"$f":"IF(C2064=0,0,'TIME TABLE'!$B$11)","v":"00:00:00"},{"$f":"IF(C2064=0,0,CONCATENATE('TIME TABLE'!$C$11,'TIME TABLE'!$D$11,'TIME TABLE'!$E$11))","v":0},{"$f":"IF(C2064=0,0,'TIME TABLE'!$C$3)","v":0}]
[null,null,{"$f":"'TIME TABLE'!$F$12","v":0},null,null,{"$f":"IF(C2065=0,0,'TIME TABLE'!$B$12)","v":"00:00:00"},{"$f":"IF(C2065=0,0,CONCATENATE('TIME TABLE'!$C$12,'TIME TABLE'!$D$12,'TIME TABLE'!$E$12))","v":0},{"$f":"IF(C2065=0,0,'TIME TABLE'!$C$3)","v":0}]
[null,null,{"$f":"'TIME TABLE'!$F$13","v":0},null,null,{"$f":"IF(C2066=0,0,'TIME TABLE'!$B$13)","v":"00:00:00"},{"$f":"IF(C2066=0,0,CONCATENATE('TIME TABLE'!$C$13,'TIME TABLE'!$D$13,'TIME TABLE'!$E$13))","v":0},{"$f":"IF(C2066=0,0,'TIME TABLE'!$C$3)","v":0}]
[null,null,{"$f":"'TIME TABLE'!$F$14","v":0},null,null,{"$f":"IF(C2067=0,0,'TIME TABLE'!$B$14)","v":"00:00:00"},{"$f":"IF(C2067=0,0,CONCATENATE('TIME TABLE'!$C$14,'TIME TABLE'!$D$14,'TIME TABLE'!$E$14))","v":0},{"$f":"IF(C2067=0,0,'TIME TABLE'!$C$3)","v":0}]
[null,null,"Instructions"]
[null,null,1,"Check the exam time table carefully."]
[null,null,2,"Students must bring the 'Admit Card' and show it to the invigilator(s) on duty and should preserve it for future requirements."]
[null,null,3,"Mobile Phone, Calculator, Digital Watch or any Electronic Device is NOT ALLOWED."]
[null,null,4,"Arrive at the School at least 15 minutes before the start examination."]
[null,null,5,"Student is barred from entering the examination hall 15 minutes after the written examination starts."]
[null,null,6,"Ensure that you use the washroom before arriving for your exam as you will not be permitted to leave during the first hour."]
[null,null,7,"Normally, you are required to answer questionsusing blue or black in . Make sure you bring some spare pens with you."]
[null,null,8,"Keep your eyes on your own paper. Remember, copying is cheating!"]
[null,null,9,"You must remain silent until after you have exited the school building."]
[{"$f":"A2045+1","v":63}]
[{"$nulls":4},{"$f":"MASTER!$E$11","v":"Govt. Sr. Secondary School Raimalwada"}]
[{"$nulls":4},{"$f":"MASTER!$E$14","v":"P.S.-Bapini (Jodhpur)"}]
[null,{"$f":"CONCATENATE(C2082,'TIME TABLE'!$C$5,'ADMIT CARD'!$C2083,$F2083,'ADMIT CARD'!$G2083,'TIME TABLE'!$E$5)","v":"ADMIT CARD(Roll Number●→0)"},{"$f":"CONCATENATE('TIME TABLE'!$B$2,'TIME TABLE'!$F$2)","v":"HALF YEARLY EXAM:2021-22"}]
[null,null,"ADMIT CARD",{"$nulls":6}," "]
[null,null,"Roll Number",null,null,"●→",{"$f":"VLOOKUP(A2078,'STUDENT DETAIL'!$C$8:$I$107,3)","v":0},null,"Seal and Signature of Head of Institution"]
[null,null,"Student's Name",null,null,"●→",{"$f":"VLOOKUP(A2078,'STUDENT DETAIL'!$C$8:$I$107,4)","v":0}]
[null,null,"Father's Name",null,null,"●→",{"$f":"VLOOKUP(A2078,'STUDENT DETAIL'!$C$8:$I$107,5)","v":0}]
[null,null,"Mother's Name ",null,null,"●→",{"$f":"VLOOKUP(A2078,'STUDENT DETAIL'!$C$8:$I$107,6)","v":0}]
[null,null,"Class & Section",null,null,"●→",{"$f":"IF(G2083=0,0,CONCATENATE('STUDENT DETAIL'!$E$4,'STUDENT DETAIL'!$H$4))","v":0}]
[null,null,"Date Of Birth",null,null,"●→",{"$f":"VLOOKUP(A2078,'STUDENT DETAIL'!$C$8:$I$107,7)","v":"00:00:00"}]
[null,null,"Time Table"]
[null,null,"Subject",null,null,"Date (Day)",null,"Time"]
[null,null,{"$f":"'TIME TABLE'!$F$5","v":"Hindi"},null,null,{"$f":"IF(C2091=0,0,'TIME TABLE'!$B$5)","v":"2022-03-31"},{"$f":"IF(C2091=0,0,CONCATENATE('TIME TABLE'!$C$5,'TIME TABLE'!$D$5,'TIME TABLE'!$E$5))","v":"(Thursday)"},{"$f":"IF(C2091=0,0,'TIME TABLE'!$C$3)","v":"09:00 AM to 11:45 AM"}]
[null,null,{"$f":"'TIME TABLE'!$F$6","v":"English"},null,null,{"$f":"IF(C2092=0,0,'TIME TABLE'!$B$6)","v":"2022-04-01"},{"$f":"IF(C2092=0,0,CONCATENATE('TIME TABLE'!$C$6,'TIME TABLE'!$D$6,'TIME TABLE'!$E$6))","v":"(Friday)"},{"$f":"IF(C2092=0,0,'TIME TABLE'!$C$3)","v":"09:00 AM to 11:45 AM"}]
[null,null,{"$f":"'TIME TABLE'!$F$7","v":"Science"},null,null,{"$f":"IF(C2093=0,0,'TIME TABLE'!$B$7)","v":"2022-04-02"},{"$f":"IF(C2093=0,0,CONCATENATE('TIME TABLE'!$C$7,'TIME TABLE'!$D$7,'TIME TABLE'!$E$7))","v":"(Saturday)"},{"$f":"IF(C2093=0,0,'TIME TABLE'!$C$3)","v":"09:00 AM to 11:45 AM"}]
[null,null,{"$f":"'TIME TABLE'!$F$8","v":"Mathematics"},null,null,{"$f":"IF(C2094=0,0,'TIME TABLE'!$B$8)","v":"2022-04-03"},{"$f":"IF(C2094=0,0,CONCATENATE('TIME TABLE'!$C$8,'TIME TABLE'!$D$8,'TIME TABLE'!$E$8))","v":"(Sunday)"},{"$f":"IF(C2094=0,0,'TIME TABLE'!$C$3)","v":"09:00 AM to 11:45 AM"}]
[null,null,{"$f":"'TIME TABLE'!$F$9","v":"Social Study"},null,null,{"$f":"IF(C2095=0,0,'TIME TABLE'!$B$9)","v":"2022-04-04"},{"$f":"IF(C2095=0,0,CONCATENATE('TIME TABLE'!$C$9,'TIME TABLE'!$D$9,'TIME TABLE'!$E$9))","v":"(Monday)"},{"$f":"IF(C2095=0,0,'TIME TABLE'!$C$3)","v":"09:00 AM to 11:45 AM"}]
[null,null,{"$f":"'TIME TABLE'!$F$10","v":"Sanskrit"},null,null,{"$f":"IF(C2096=0,0,'TIME TABLE'!$B$10)","v":"2022-04-05"},{"$f":"IF(C2096=0,0,CONCATENATE('TIME TABLE'!$C$10,'TIME TABLE'!$D$10,'TIME TABLE'!$E$10))","v":"(Tuesday)"},{"$f":"IF(C2096=0,0,'TIME TABLE'!$C$3)","v":"09:00 AM to 11:45 AM"}]
[null,null,{"$f":"'TIME TABLE'!$F$11","v":0},null,null,{"$f":"IF(C2097=0,0,'TIME TABLE'!$B$11)","v":"00:00:00"},{"$f":"IF(C2097=0,0,CONCATENATE('TIME TABLE'!$C$11,'TIME TABLE'!$D$11,'TIME TABLE'!$E$11))","v":0},{"$f":"IF(C2097=0,0,'TIME TABLE'!$C$3)","v":0}]
[null,null,{"$f":"'TIME TABLE'!$F$12","v":0},null,null,{"$f":"IF(C2098=0,0,'TIME TABLE'!$B$12)","v":"00:00:00"},{"$f":"IF(C2098=0,0,CONCATENATE('TIME TABLE'!$C$12,'TIME TABLE'!$D$12,'TIME TABLE'!$E$12))","v":0},{"$f":"IF(C2098=0,0,'TIME TABLE'!$C$3)","v":0}]
[null,null,{"$f":"'TIME TABLE'!$F$13","v":0},null,null,{"$f":"IF(C2099=0,0,'TIME TABLE'!$B$13)","v":"00:00:00"},{"$f":"IF(C2099=0,0,CONCATENATE('TIME TABLE'!$C$13,'TIME TABLE'!$D$13,'TIME TABLE'!$E$13))","v":0},{"$f":"IF(C2099=0,0,'TIME TABLE'!$C$3)","v":0}]
[null,null,{"$f":"'TIME TABLE'!$F$14","v":0},null,null,{"$f":"IF(C2100=0,0,'TIME TABLE'!$B$14)","v":"00:00:00"},{"$f":"IF(C2100=0,0,CONCATENATE('TIME TABLE'!$C$14,'TIME TABLE'!$D$14,'TIME TABLE'!$E$14))","v":0},{"$f":"IF(C2100=0,0,'TIME TABLE'!$C$3)","v":0}]
[null,null,"Instructions"]
[null,null,1,"Check the exam time table carefully."]
[null,null,2,"Students must bring the 'Admit Card' and show it to the invigilator(s) on duty and should preserve it for future requirements."]
[null,null,3,"Mobile Phone, Calculator, Digital Watch or any Electronic Device is NOT ALLOWED."]
[null,null,4,"Arrive at the School at least 15 minutes before the start examination."]
[null,null,5,"Student is barred from entering the examination hall 15 minutes after the written examination starts."]
[null,null,6,"Ensure that you use the washroom before arriving for your exam as you will not be permitted to leave during the first hour."]
[null,null,7,"Normally, you are required to answer questionsusing blue or black in . Make sure you bring some spare pens with you."]
[null,null,8,"Keep your eyes on your own paper. Remember, copying is cheating!"]
[null,null,9,"You must remain silent until after you have exited the school building."]
[]
[{"$f":"A2078+1","v":64}]
[{"$nulls":4},{"$f":"MASTER!$E$11","v":"Govt. Sr. Secondary School Raimalwada"}]
[{"$nulls":4},{"$f":"MASTER!$E$14","v":"P.S.-Bapini (Jodhpur)"}]
[null,{"$f":"CONCATENATE(C2116,'TIME TABLE'!$C$5,'ADMIT CARD'!$C2117,$F2117,'ADMIT CARD'!$G2117,'TIME TABLE'!$E$5)","v":"ADMIT CARD(Roll Number●→0)"},{"$f":"CONCATENATE('TIME TABLE'!$B$2,'TIME TABLE'!$F$2)","v":"HALF YEARLY EXAM:2021-22"}]
[null,null,"ADMIT CARD",{"$nulls":6}," "]
[null,null,"Roll Number",null,null,"●→",{"$f":"VLOOKUP(A2112,'STUDENT DETAIL'!$C$8:$I$107,3)","v":0},null,"Seal and Signature of Head of Institution"]
[null,null,"Student's Name",null,null,"●→",{"$f":"VLOOKUP(A2112,'STUDENT DETAIL'!$C$8:$I$107,4)","v":0}]
[null,null,"Father's Name",null,null,"●→",{"$f":"VLOOKUP(A2112,'STUDENT DETAIL'!$C$8:$I$107,5)","v":0}]
[null,null,"Mother's Name ",null,null,"●→",{"$f":"VLOOKUP(A2112,'STUDENT DETAIL'!$C$8:$I$107,6)","v":0}]
[null,null,"Class & Section",null,null,"●→",{"$f":"IF(G2117=0,0,CONCATENATE('STUDENT DETAIL'!$E$4,'STUDENT DETAIL'!$H$4))","v":0}]
[null,null,"Date Of Birth",null,null,"●→",{"$f":"VLOOKUP(A2112,'STUDENT DETAIL'!$C$8:$I$107,7)","v":"00:00:00"}]
[null,null,"Time Table"]
[null,null,"Subject",null,null,"Date (Day)",null,"Time"]
[null,null,{"$f":"'TIME TABLE'!$F$5","v":"Hindi"},null,null,{"$f":"IF(C2125=0,0,'TIME TABLE'!$B$5)","v":"2022-03-31"},{"$f":"IF(C2125=0,0,CONCATENATE('TIME TABLE'!$C$5,'TIME TABLE'!$D$5,'TIME TABLE'!$E$5))","v":"(Thursday)"},{"$f":"IF(C2125=0,0,'TIME TABLE'!$C$3)","v":"09:00 AM to 11:45 AM"}]
[null,null,{"$f":"'TIME TABLE'!$F$6","v":"English"},null,null,{"$f":"IF(C2126=0,0,'TIME TABLE'!$B$6)","v":"2022-04-01"},{"$f":"IF(C2126=0,0,CONCATENATE('TIME TABLE'!$C$6,'TIME TABLE'!$D$6,'TIME TABLE'!$E$6))","v":"(Friday)"},{"$f":"IF(C2126=0,0,'TIME TABLE'!$C$3)","v":"09:00 AM to 11:45 AM"}]
[null,null,{"$f":"'TIME TABLE'!$F$7","v":"Science"},null,null,{"$f":"IF(C2127=0,0,'TIME TABLE'!$B$7)","v":"2022-04-02"},{"$f":"IF(C2127=0,0,CONCATENATE('TIME TABLE'!$C$7,'TIME TABLE'!$D$7,'TIME TABLE'!$E$7))","v":"(Saturday)"},{"$f":"IF(C2127=0,0,'TIME TABLE'!$C$3)","v":"09:00 AM to 11:45 AM"}]
[null,null,{"$f":"'TIME TABLE'!$F$8","v":"Mathematics"},null,null,{"$f":"IF(C2128=0,0,'TIME TABLE'!$B$8)","v":"2022-04-03"},{"$f":"IF(C2128=0,0,CONCATENATE('TIME TABLE'!$C$8,'TIME TABLE'!$D$8,'TIME TABLE'!$E$8))","v":"(Sunday)"},{"$f":"IF(C2128=0,0,'TIME TABLE'!$C$3)","v":"09:00 AM to 11:45 AM"}]
[null,null,{"$f":"'TIME TABLE'!$F$9","v":"Social Study"},null,null,{"$f":"IF(C2129=0,0,'TIME TABLE'!$B$9)","v":"2022-04-04"},{"$f":"IF(C2129=0,0,CONCATENATE('TIME TABLE'!$C$9,'TIME TABLE'!$D$9,'TIME TABLE'!$E$9))","v":"(Monday)"},{"$f":"IF(C2129=0,0,'TIME TABLE'!$C$3)","v":"09:00 AM to 11:45 AM"}]
[null,null,{"$f":"'TIME TABLE'!$F$10","v":"Sanskrit"},null,null,{"$f":"IF(C2130=0,0,'TIME TABLE'!$B$10)","v":"2022-04-05"},{"$f":"IF(C2130=0,0,CONCATENATE('TIME TABLE'!$C$10,'TIME TABLE'!$D$10,'TIME TABLE'!$E$10))","v":"(Tuesday)"},{"$f":"IF(C2130=0,0,'TIME TABLE'!$C$3)","v":"09:00 AM to 11:45 AM"}]
[null,null,{"$f":"'TIME TABLE'!$F$11","v":0},null,null,{"$f":"IF(C2131=0,0,'TIME TABLE'!$B$11)","v":"00:00:00"},{"$f":"IF(C2131=0,0,CONCATENATE('TIME TABLE'!$C$11,'TIME TABLE'!$D$11,'TIME TABLE'!$E$11))","v":0},{"$f":"IF(C2131=0,0,'TIME TABLE'!$C$3)","v":0}]
[null,null,{"$f":"'TIME TABLE'!$F$12","v":0},null,null,{"$f":"IF(C2132=0,0,'TIME TABLE'!$B$12)","v":"00:00:00"},{"$f":"IF(C2132=0,0,CONCATENATE('TIME TABLE'!$C$12,'TIME TABLE'!$D$12,'TIME TABLE'!$E$12))","v":0},{"$f":"IF(C2132=0,0,'TIME TABLE'!$C$3)","v":0}]
[null,null,{"$f":"'TIME TABLE'!$F$13","v":0},null,null,{"$f":"IF(C2133=0,0,'TIME TABLE'!$B$13)","v":"00:00:00"},{"$f":"IF(C2133=0,0,CONCATENATE('TIME TABLE'!$C$13,'TIME TABLE'!$D$13,'TIME TABLE'!$E$13))","v":0},{"$f":"IF(C2133=0,0,'TIME TABLE'!$C$3)","v":0}]
[null,null,{"$f":"'TIME TABLE'!$F$14","v":0},null,null,{"$f":"IF(C2134=0,0,'TIME TABLE'!$B$14)","v":"00:00:00"},{"$f":"IF(C2134=0,0,CONCATENATE('TIME TABLE'!$C$14,'TIME TABLE'!$D$14,'TIME TABLE'!$E$14))","v":0},{"$f":"IF(C2134=0,0,'TIME TABLE'!$C$3)","v":0}]
[null,null,"Instructions"]
[null,null,1,"Check the exam time table carefully."]
[null,null,2,"Students must bring the 'Admit Card' and show it to the invigilator(s) on duty and should preserve it for future requirements."]
[null,null,3,"Mobile Phone, Calculator, Digital Watch or any Electronic Device is NOT ALLOWED."]
[null,null,4,"Arrive at the School at least 15 minutes before the start examination."]
[null,null,5,"Student is barred from entering the examination hall 15 minutes after the written examination starts."]
[null,null,6,"Ensure that you use the washroom before arriving for your exam as you will not be permitted to leave during the first hour."]
[null,null,7,"Normally, you are required to answer questionsusing blue or black in . Make sure you bring some spare pens with you."]
[null,null,8,"Keep your eyes on your own paper. Remember, copying is cheating!"]
[null,null,9,"You must remain silent until after you have exited the school building."]
[{"$f":"A2112+1","v":65}]
[{"$nulls":4},{"$f":"MASTER!$E$11","v":"Govt. Sr. Secondary School Raimalwada"}]
[{"$nulls":4},{"$f":"MASTER!$E$14","v":"P.S.-Bapini (Jodhpur)"}]
[null,{"$f":"CONCATENATE(C2149,'TIME TABLE'!$C$5,'ADMIT CARD'!$C2150,$F2150,'ADMIT CARD'!$G2150,'TIME TABLE'!$E$5)","v":"ADMIT CARD(Roll Number●→0)"},{"$f":"CONCATENATE('TIME TABLE'!$B$2,'TIME TABLE'!$F$2)","v":"HALF YEARLY EXAM:2021-22"}]
[null,null,"ADMIT CARD",{"$nulls":6}," "]
[null,null,"Roll Number",null,null,"●→",{"$f":"VLOOKUP(A2145,'STUDENT DETAIL'!$C$8:$I$107,3)","v":0},null,"Seal and Signature of Head of Institution"]
[null,null,"Student's Name",null,null,"●→",{"$f":"VLOOKUP(A2145,'STUDENT DETAIL'!$C$8:$I$107,4)","v":0}]
[null,null,"Father's Name",null,null,"●→",{"$f":"VLOOKUP(A2145,'STUDENT DETAIL'!$C$8:$I$107,5)","v":0}]
[null,null,"Mother's Name ",null,null,"●→",{"$f":"VLOOKUP(A2145,'STUDENT DETAIL'!$C$8:$I$107,6)","v":0}]
[null,null,"Class & Section",null,null,"●→",{"$f":"IF(G2150=0,0,CONCATENATE('STUDENT DETAIL'!$E$4,'STUDENT DETAIL'!$H$4))","v":0}]
[null,null,"Date Of Birth",null,null,"●→",{"$f":"VLOOKUP(A2145,'STUDENT DETAIL'!$C$8:$I$107,7)","v":"00:00:00"}]
[null,null,"Time Table"]
[null,null,"Subject",null,null,"Date (Day)",null,"Time"]
[null,null,{"$f":"'TIME TABLE'!$F$5","v":"Hindi"},null,null,{"$f":"IF(C2158=0,0,'TIME TABLE'!$B$5)","v":"2022-03-31"},{"$f":"IF(C2158=0,0,CONCATENATE('TIME TABLE'!$C$5,'TIME TABLE'!$D$5,'TIME TABLE'!$E$5))","v":"(Thursday)"},{"$f":"IF(C2158=0,0,'TIME TABLE'!$C$3)","v":"09:00 AM to 11:45 AM"}]
[null,null,{"$f":"'TIME TABLE'!$F$6","v":"English"},null,null,{"$f":"IF(C2159=0,0,'TIME TABLE'!$B$6)","v":"2022-04-01"},{"$f":"IF(C2159=0,0,CONCATENATE('TIME TABLE'!$C$6,'TIME TABLE'!$D$6,'TIME TABLE'!$E$6))","v":"(Friday)"},{"$f":"IF(C2159=0,0,'TIME TABLE'!$C$3)","v":"09:00 AM to 11:45 AM"}]
[null,null,{"$f":"'TIME TABLE'!$F$7","v":"Science"},null,null,{"$f":"IF(C2160=0,0,'TIME TABLE'!$B$7)","v":"2022-04-02"},{"$f":"IF(C2160=0,0,CONCATENATE('TIME TABLE'!$C$7,'TIME TABLE'!$D$7,'TIME TABLE'!$E$7))","v":"(Saturday)"},{"$f":"IF(C2160=0,0,'TIME TABLE'!$C$3)","v":"09:00 AM to 11:45 AM"}]
[null,null,{"$f":"'TIME TABLE'!$F$8","v":"Mathematics"},null,null,{"$f":"IF(C2161=0,0,'TIME TABLE'!$B$8)","v":"2022-04-03"},{"$f":"IF(C2161=0,0,CONCATENATE('TIME TABLE'!$C$8,'TIME TABLE'!$D$8,'TIME TABLE'!$E$8))","v":"(Sunday)"},{"$f":"IF(C2161=0,0,'TIME TABLE'!$C$3)","v":"09:00 AM to 11:45 AM"}]
[null,null,{"$f":"'TIME TABLE'!$F$9","v":"Social Study"},null,null,{"$f":"IF(C2162=0,0,'TIME TABLE'!$B$9)","v":"2022-04-04"},{"$f":"IF(C2162=0,0,CONCATENATE('TIME TABLE'!$C$9,'TIME TABLE'!$D$9,'TIME TABLE'!$E$9))","v":"(Monday)"},{"$f":"IF(C2162=0,0,'TIME TABLE'!$C$3)","v":"09:00 AM to 11:45 AM"}]
[null,null,{"$f":"'TIME TABLE'!$F$10","v":"Sanskrit"},null,null,{"$f":"IF(C2163=0,0,'TIME TABLE'!$B$10)","v":"2022-04-05"},{"$f":"IF(C2163=0,0,CONCATENATE('TIME TABLE'!$C$10,'TIME TABLE'!$D$10,'TIME TABLE'!$E$10))","v":"(Tuesday)"},{"$f":"IF(C2163=0,0,'TIME TABLE'!$C$3)","v":"09:00 AM to 11:45 AM"}]
[null,null,{"$f":"'TIME TABLE'!$F$11","v":0},null,null,{"$f":"IF(C2164=0,0,'TIME TABLE'!$B$11)","v":"00:00:00"},{"$f":"IF(C2164=0,0,CONCATENATE('TIME TABLE'!$C$11,'TIME TABLE'!$D$11,'TIME TABLE'!$E$11))","v":0},{"$f":"IF(C2164=0,0,'TIME TABLE'!$C$3)","v":0}]
[null,null,{"$f":"'TIME TABLE'!$F$12","v":0},null,null,{"$f":"IF(C2165=0,0,'TIME TABLE'!$B$12)","v":"00:00:00"},{"$f":"IF(C2165=0,0,CONCATENATE('TIME TABLE'!$C$12,'TIME TABLE'!$D$12,'TIME TABLE'!$E$12))","v":0},{"$f":"IF(C2165=0,0,'TIME TABLE'!$C$3)","v":0}]
[null,null,{"$f":"'TIME TABLE'!$F$13","v":0},null,null,{"$f":"IF(C2166=0,0,'TIME TABLE'!$B$13)","v":"00:00:00"},{"$f":"IF(C2166=0,0,CONCATENATE('TIME TABLE'!$C$13,'TIME TABLE'!$D$13,'TIME TABLE'!$E$13))","v":0},{"$f":"IF(C2166=0,0,'TIME TABLE'!$C$3)","v":0}]
[null,null,{"$f":"'TIME TABLE'!$F$14","v":0},null,null,{"$f":"IF(C2167=0,0,'TIME TABLE'!$B$14)","v":"00:00:00"},{"$f":"IF(C2167=0,0,CONCATENATE('TIME TABLE'!$C$14,'TIME TABLE'!$D$14,'TIME TABLE'!$E$14))","v":0},{"$f":"IF(C2167=0,0,'TIME TABLE'!$C$3)","v":0}]
[null,null,"Instructions"]
[null,null,1,"Check the exam time table carefully."]
[null,null,2,"Students must bring the 'Admit Card' and show it to the invigilator(s) on duty and should preserve it for future requirements."]
[null,null,3,"Mobile Phone, Calculator, Digital Watch or any Electronic Device is NOT ALLOWED."]
[null,null,4,"Arrive at the School at least 15 minutes before the start examination."]
[null,null,5,"Student is barred from entering the examination hall 15 minutes after the written examination starts."]
[null,null,6,"Ensure that you use the washroom before arriving for your exam as you will not be permitted to leave during the first hour."]
[null,null,7,"Normally, you are required to answer questionsusing blue or black in . Make sure you bring some spare pens with you."]
[null,null,8,"Keep your eyes on your own paper. Remember, copying is cheating!"]
[null,null,9,"You must remain silent until after you have exited the school building."]
[]
[{"$f":"A2145+1","v":66}]
[{"$nulls":4},{"$f":"MASTER!$E$11","v":"Govt. Sr. Secondary School Raimalwada"}]
[{"$nulls":4},{"$f":"MASTER!$E$14","v":"P.S.-Bapini (Jodhpur)"}]
[null,{"$f":"CONCATENATE(C2183,'TIME TABLE'!$C$5,'ADMIT CARD'!$C2184,$F2184,'ADMIT CARD'!$G2184,'TIME TABLE'!$E$5)","v":"ADMIT CARD(Roll Number●→0)"},{"$f":"CONCATENATE('TIME TABLE'!$B$2,'TIME TABLE'!$F$2)","v":"HALF YEARLY EXAM:2021-22"}]
[null,null,"ADMIT CARD",{"$nulls":6}," "]
[null,null,"Roll Number",null,null,"●→",{"$f":"VLOOKUP(A2179,'STUDENT DETAIL'!$C$8:$I$107,3)","v":0},null,"Seal and Signature of Head of Institution"]
[null,null,"Student's Name",null,null,"●→",{"$f":"VLOOKUP(A2179,'STUDENT DETAIL'!$C$8:$I$107,4)","v":0}]
[null,null,"Father's Name",null,null,"●→",{"$f":"VLOOKUP(A2179,'STUDENT DETAIL'!$C$8:$I$107,5)","v":0}]
[null,null,"Mother's Name ",null,null,"●→",{"$f":"VLOOKUP(A2179,'STUDENT DETAIL'!$C$8:$I$107,6)","v":0}]
[null,null,"Class & Section",null,null,"●→",{"$f":"IF(G2184=0,0,CONCATENATE('STUDENT DETAIL'!$E$4,'STUDENT DETAIL'!$H$4))","v":0}]
[null,null,"Date Of Birth",null,null,"●→",{"$f":"VLOOKUP(A2179,'STUDENT DETAIL'!$C$8:$I$107,7)","v":"00:00:00"}]
[null,null,"Time Table"]
[null,null,"Subject",null,null,"Date (Day)",null,"Time"]
[null,null,{"$f":"'TIME TABLE'!$F$5","v":"Hindi"},null,null,{"$f":"IF(C2192=0,0,'TIME TABLE'!$B$5)","v":"2022-03-31"},{"$f":"IF(C2192=0,0,CONCATENATE('TIME TABLE'!$C$5,'TIME TABLE'!$D$5,'TIME TABLE'!$E$5))","v":"(Thursday)"},{"$f":"IF(C2192=0,0,'TIME TABLE'!$C$3)","v":"09:00 AM to 11:45 AM"}]
[null,null,{"$f":"'TIME TABLE'!$F$6","v":"English"},null,null,{"$f":"IF(C2193=0,0,'TIME TABLE'!$B$6)","v":"2022-04-01"},{"$f":"IF(C2193=0,0,CONCATENATE('TIME TABLE'!$C$6,'TIME TABLE'!$D$6,'TIME TABLE'!$E$6))","v":"(Friday)"},{"$f":"IF(C2193=0,0,'TIME TABLE'!$C$3)","v":"09:00 AM to 11:45 AM"}]
[null,null,{"$f":"'TIME TABLE'!$F$7","v":"Science"},null,null,{"$f":"IF(C2194=0,0,'TIME TABLE'!$B$7)","v":"2022-04-02"},{"$f":"IF(C2194=0,0,CONCATENATE('TIME TABLE'!$C$7,'TIME TABLE'!$D$7,'TIME TABLE'!$E$7))","v":"(Saturday)"},{"$f":"IF(C2194=0,0,'TIME TABLE'!$C$3)","v":"09:00 AM to 11:45 AM"}]
[null,null,{"$f":"'TIME TABLE'!$F$8","v":"Mathematics"},null,null,{"$f":"IF(C2195=0,0,'TIME TABLE'!$B$8)","v":"2022-04-03"},{"$f":"IF(C2195=0,0,CONCATENATE('TIME TABLE'!$C$8,'TIME TABLE'!$D$8,'TIME TABLE'!$E$8))","v":"(Sunday)"},{"$f":"IF(C2195=0,0,'TIME TABLE'!$C$3)","v":"09:00 AM to 11:45 AM"}]
[null,null,{"$f":"'TIME TABLE'!$F$9","v":"Social Study"},null,null,{"$f":"IF(C2196=0,0,'TIME TABLE'!$B$9)","v":"2022-04-04"},{"$f":"IF(C2196=0,0,CONCATENATE('TIME TABLE'!$C$9,'TIME TABLE'!$D$9,'TIME TABLE'!$E$9))","v":"(Monday)"},{"$f":"IF(C2196=0,0,'TIME TABLE'!$C$3)","v":"09:00 AM to 11:45 AM"}]
[null,null,{"$f":"'TIME TABLE'!$F$10","v":"Sanskrit"},null,null,{"$f":"IF(C2197=0,0,'TIME TABLE'!$B$10)","v":"2022-04-05"},{"$f":"IF(C2197=0,0,CONCATENATE('TIME TABLE'!$C$10,'TIME TABLE'!$D$10,'TIME TABLE'!$E$10))","v":"(Tuesday)"},{"$f":"IF(C2197=0,0,'TIME TABLE'!$C$3)","v":"09:00 AM to 11:45 AM"}]
[null,null,{"$f":"'TIME TABLE'!$F$11","v":0},null,null,{"$f":"IF(C2198=0,0,'TIME TABLE'!$B$11)","v":"00:00:00"},{"$f":"IF(C2198=0,0,CONCATENATE('TIME TABLE'!$C$11,'TIME TABLE'!$D$11,'TIME TABLE'!$E$11))","v":0},{"$f":"IF(C2198=0,0,'TIME TABLE'!$C$3)","v":0}]
[null,null,{"$f":"'TIME TABLE'!$F$12","v":0},null,null,{"$f":"IF(C2199=0,0,'TIME TABLE'!$B$12)","v":"00:00:00"},{"$f":"IF(C2199=0,0,CONCATENATE('TIME TABLE'!$C$12,'TIME TABLE'!$D$12,'TIME TABLE'!$E$12))","v":0},{"$f":"IF(C2199=0,0,'TIME TABLE'!$C$3)","v":0}]
[null,null,{"$f":"'TIME TABLE'!$F$13","v":0},null,null,{"$f":"IF(C2200=0,0,'TIME TABLE'!$B$13)","v":"00:00:00"},{"$f":"IF(C2200=0,0,CONCATENATE('TIME TABLE'!$C$13,'TIME TABLE'!$D$13,'TIME TABLE'!$E$13))","v":0},{"$f":"IF(C2200=0,0,'TIME TABLE'!$C$3)","v":0}]
[null,null,{"$f":"'TIME TABLE'!$F$14","v":0},null,null,{"$f":"IF(C2201=0,0,'TIME TABLE'!$B$14)","v":"00:00:00"},{"$f":"IF(C2201=0,0,CONCATENATE('TIME TABLE'!$C$14,'TIME TABLE'!$D$14,'TIME TABLE'!$E$14))","v":0},{"$f":"IF(C2201=0,0,'TIME TABLE'!$C$3)","v":0}]
[null,null,"Instructions"]
[null,null,1,"Check the exam time table carefully."]
[null,null,2,"Students must bring the 'Admit Card' and show it to the invigilator(s) on duty and should preserve it for future requirements."]
[null,null,3,"Mobile Phone, Calculator, Digital Watch or any Electronic Device is NOT ALLOWED."]
[null,null,4,"Arrive at the School at least 15 minutes before the start examination."]
[null,null,5,"Student is barred from entering the examination hall 15 minutes after the written examination starts."]
[null,null,6,"Ensure that you use the washroom before arriving for your exam as you will not be permitted to leave during the first hour."]
[null,null,7,"Normally, you are required to answer questionsusing blue or black in . Make sure you bring some spare pens with you."]
[null,null,8,"Keep your eyes on your own paper. Remember, copying is cheating!"]
[null,null,9,"You must remain silent until after you have exited the school building."]
[{"$f":"A2179+1","v":67}]
[{"$nulls":4},{"$f":"MASTER!$E$11","v":"Govt. Sr. Secondary School Raimalwada"}]
[{"$nulls":4},{"$f":"MASTER!$E$14","v":"P.S.-Bapini (Jodhpur)"}]
[null,{"$f":"CONCATENATE(C2216,'TIME TABLE'!$C$5,'ADMIT CARD'!$C2217,$F2217,'ADMIT CARD'!$G2217,'TIME TABLE'!$E$5)","v":"ADMIT CARD(Roll Number●→0)"},{"$f":"CONCATENATE('TIME TABLE'!$B$2,'TIME TABLE'!$F$2)","v":"HALF YEARLY EXAM:2021-22"}]
[null,null,"ADMIT CARD",{"$nulls":6}," "]
[null,null,"Roll Number",null,null,"●→",{"$f":"VLOOKUP(A2212,'STUDENT DETAIL'!$C$8:$I$107,3)","v":0},null,"Seal and Signature of Head of Institution"]
[null,null,"Student's Name",null,null,"●→",{"$f":"VLOOKUP(A2212,'STUDENT DETAIL'!$C$8:$I$107,4)","v":0}]
[null,null,"Father's Name",null,null,"●→",{"$f":"VLOOKUP(A2212,'STUDENT DETAIL'!$C$8:$I$107,5)","v":0}]
[null,null,"Mother's Name ",null,null,"●→",{"$f":"VLOOKUP(A2212,'STUDENT DETAIL'!$C$8:$I$107,6)","v":0}]
[null,null,"Class & Section",null,null,"●→",{"$f":"IF(G2217=0,0,CONCATENATE('STUDENT DETAIL'!$E$4,'STUDENT DETAIL'!$H$4))","v":0}]
[null,null,"Date Of Birth",null,null,"●→",{"$f":"VLOOKUP(A2212,'STUDENT DETAIL'!$C$8:$I$107,7)","v":"00:00:00"}]
[null,null,"Time Table"]
[null,null,"Subject",null,null,"Date (Day)",null,"Time"]
[null,null,{"$f":"'TIME TABLE'!$F$5","v":"Hindi"},null,null,{"$f":"IF(C2225=0,0,'TIME TABLE'!$B$5)","v":"2022-03-31"},{"$f":"IF(C2225=0,0,CONCATENATE('TIME TABLE'!$C$5,'TIME TABLE'!$D$5,'TIME TABLE'!$E$5))","v":"(Thursday)"},{"$f":"IF(C2225=0,0,'TIME TABLE'!$C$3)","v":"09:00 AM to 11:45 AM"}]
[null,null,{"$f":"'TIME TABLE'!$F$6","v":"English"},null,null,{"$f":"IF(C2226=0,0,'TIME TABLE'!$B$6)","v":"2022-04-01"},{"$f":"IF(C2226=0,0,CONCATENATE('TIME TABLE'!$C$6,'TIME TABLE'!$D$6,'TIME TABLE'!$E$6))","v":"(Friday)"},{"$f":"IF(C2226=0,0,'TIME TABLE'!$C$3)","v":"09:00 AM to 11:45 AM"}]
[null,null,{"$f":"'TIME TABLE'!$F$7","v":"Science"},null,null,{"$f":"IF(C2227=0,0,'TIME TABLE'!$B$7)","v":"2022-04-02"},{"$f":"IF(C2227=0,0,CONCATENATE('TIME TABLE'!$C$7,'TIME TABLE'!$D$7,'TIME TABLE'!$E$7))","v":"(Saturday)"},{"$f":"IF(C2227=0,0,'TIME TABLE'!$C$3)","v":"09:00 AM to 11:45 AM"}]
[null,null,{"$f":"'TIME TABLE'!$F$8","v":"Mathematics"},null,null,{"$f":"IF(C2228=0,0,'TIME TABLE'!$B$8)","v":"2022-04-03"},{"$f":"IF(C2228=0,0,CONCATENATE('TIME TABLE'!$C$8,'TIME TABLE'!$D$8,'TIME TABLE'!$E$8))","v":"(Sunday)"},{"$f":"IF(C2228=0,0,'TIME TABLE'!$C$3)","v":"09:00 AM to 11:45 AM"}]
[null,null,{"$f":"'TIME TABLE'!$F$9","v":"Social Study"},null,null,{"$f":"IF(C2229=0,0,'TIME TABLE'!$B$9)","v":"2022-04-04"},{"$f":"IF(C2229=0,0,CONCATENATE('TIME TABLE'!$C$9,'TIME TABLE'!$D$9,'TIME TABLE'!$E$9))","v":"(Monday)"},{"$f":"IF(C2229=0,0,'TIME TABLE'!$C$3)","v":"09:00 AM to 11:45 AM"}]
[null,null,{"$f":"'TIME TABLE'!$F$10","v":"Sanskrit"},null,null,{"$f":"IF(C2230=0,0,'TIME TABLE'!$B$10)","v":"2022-04-05"},{"$f":"IF(C2230=0,0,CONCATENATE('TIME TABLE'!$C$10,'TIME TABLE'!$D$10,'TIME TABLE'!$E$10))","v":"(Tuesday)"},{"$f":"IF(C2230=0,0,'TIME TABLE'!$C$3)","v":"09:00 AM to 11:45 AM"}]
[null,null,{"$f":"'TIME TABLE'!$F$11","v":0},null,null,{"$f":"IF(C2231=0,0,'TIME TABLE'!$B$11)","v":"00:00:00"},{"$f":"IF(C2231=0,0,CONCATENATE('TIME TABLE'!$C$11,'TIME TABLE'!$D$11,'TIME TABLE'!$E$11))","v":0},{"$f":"IF(C2231=0,0,'TIME TABLE'!$C$3)","v":0}]
[null,null,{"$f":"'TIME TABLE'!$F$12","v":0},null,null,{"$f":"IF(C2232=0,0,'TIME TABLE'!$B$12)","v":"00:00:00"},{"$f":"IF(C2232=0,0,CONCATENATE('TIME TABLE'!$C$12,'TIME TABLE'!$D$12,'TIME TABLE'!$E$12))","v":0},{"$f":"IF(C2232=0,0,'TIME TABLE'!$C$3)","v":0}]
[null,null,{"$f":"'TIME TABLE'!$F$13","v":0},null,null,{"$f":"IF(C2233=0,0,'TIME TABLE'!$B$13)","v":"00:00:00"},{"$f":"IF(C2233=0,0,CONCATENATE('TIME TABLE'!$C$13,'TIME TABLE'!$D$13,'TIME TABLE'!$E$13))","v":0},{"$f":"IF(C2233=0,0,'TIME TABLE'!$C$3)","v":0}]
[null,null,{"$f":"'TIME TABLE'!$F$14","v":0},null,null,{"$f":"IF(C2234=0,0,'TIME TABLE'!$B$14)","v":"00:00:00"},{"$f":"IF(C2234=0,0,CONCATENATE('TIME TABLE'!$C$14,'TIME TABLE'!$D$14,'TIME TABLE'!$E$14))","v":0},{"$f":"IF(C2234=0,0,'TIME TABLE'!$C$3)","v":0}]
[null,null,"Instructions"]
[null,null,1,"Check the exam time table carefully."]
[null,null,2,"Students must bring the 'Admit Card' and show it to the invigilator(s) on duty and should preserve it for future requirements."]
[null,null,3,"Mobile Phone, Calculator, Digital Watch or any Electronic Device is NOT ALLOWED."]
[null,null,4,"Arrive at the School at least 15 minutes before the start examination."]
[null,null,5,"Student is barred from entering the examination hall 15 minutes after the written examination starts."]
[null,null,6,"Ensure that you use the washroom before arriving for your exam as you will not be permitted to leave during the first hour."]
[null,null,7,"Normally, you are required to answer questionsusing blue or black in . Make sure you bring some spare pens with you."]
[null,null,8,"Keep your eyes on your own paper. Remember, copying is cheating!"]
[null,null,9,"You must remain silent until after you have exited the school building."]
[]
[{"$f":"A2212+1","v":68}]
[{"$nulls":4},{"$f":"MASTER!$E$11","v":"Govt. Sr. Secondary School Raimalwada"}]
[{"$nulls":4},{"$f":"MASTER!$E$14","v":"P.S.-Bapini (Jodhpur)"}]
[null,{"$f":"CONCATENATE(C2250,'TIME TABLE'!$C$5,'ADMIT CARD'!$C2251,$F2251,'ADMIT CARD'!$G2251,'TIME TABLE'!$E$5)","v":"ADMIT CARD(Roll Number●→0)"},{"$f":"CONCATENATE('TIME TABLE'!$B$2,'TIME TABLE'!$F$2)","v":"HALF YEARLY EXAM:2021-22"}]
[null,null,"ADMIT CARD",{"$nulls":6}," "]
[null,null,"Roll Number",null,null,"●→",{"$f":"VLOOKUP(A2246,'STUDENT DETAIL'!$C$8:$I$107,3)","v":0},null,"Seal and Signature of Head of Institution"]
[null,null,"Student's Name",null,null,"●→",{"$f":"VLOOKUP(A2246,'STUDENT DETAIL'!$C$8:$I$107,4)","v":0}]
[null,null,"Father's Name",null,null,"●→",{"$f":"VLOOKUP(A2246,'STUDENT DETAIL'!$C$8:$I$107,5)","v":0}]
[null,null,"Mother's Name ",null,null,"●→",{"$f":"VLOOKUP(A2246,'STUDENT DETAIL'!$C$8:$I$107,6)","v":0}]
[null,null,"Class & Section",null,null,"●→",{"$f":"IF(G2251=0,0,CONCATENATE('STUDENT DETAIL'!$E$4,'STUDENT DETAIL'!$H$4))","v":0}]
[null,null,"Date Of Birth",null,null,"●→",{"$f":"VLOOKUP(A2246,'STUDENT DETAIL'!$C$8:$I$107,7)","v":"00:00:00"}]
[null,null,"Time Table"]
[null,null,"Subject",null,null,"Date (Day)",null,"Time"]
[null,null,{"$f":"'TIME TABLE'!$F$5","v":"Hindi"},null,null,{"$f":"IF(C2259=0,0,'TIME TABLE'!$B$5)","v":"2022-03-31"},{"$f":"IF(C2259=0,0,CONCATENATE('TIME TABLE'!$C$5,'TIME TABLE'!$D$5,'TIME TABLE'!$E$5))","v":"(Thursday)"},{"$f":"IF(C2259=0,0,'TIME TABLE'!$C$3)","v":"09:00 AM to 11:45 AM"}]
[null,null,{"$f":"'TIME TABLE'!$F$6","v":"English"},null,null,{"$f":"IF(C2260=0,0,'TIME TABLE'!$B$6)","v":"2022-04-01"},{"$f":"IF(C2260=0,0,CONCATENATE('TIME TABLE'!$C$6,'TIME TABLE'!$D$6,'TIME TABLE'!$E$6))","v":"(Friday)"},{"$f":"IF(C2260=0,0,'TIME TABLE'!$C$3)","v":"09:00 AM to 11:45 AM"}]
[null,null,{"$f":"'TIME TABLE'!$F$7","v":"Science"},null,null,{"$f":"IF(C2261=0,0,'TIME TABLE'!$B$7)","v":"2022-04-02"},{"$f":"IF(C2261=0,0,CONCATENATE('TIME TABLE'!$C$7,'TIME TABLE'!$D$7,'TIME TABLE'!$E$7))","v":"(Saturday)"},{"$f":"IF(C2261=0,0,'TIME TABLE'!$C$3)","v":"09:00 AM to 11:45 AM"}]
[null,null,{"$f":"'TIME TABLE'!$F$8","v":"Mathematics"},null,null,{"$f":"IF(C2262=0,0,'TIME TABLE'!$B$8)","v":"2022-04-03"},{"$f":"IF(C2262=0,0,CONCATENATE('TIME TABLE'!$C$8,'TIME TABLE'!$D$8,'TIME TABLE'!$E$8))","v":"(Sunday)"},{"$f":"IF(C2262=0,0,'TIME TABLE'!$C$3)","v":"09:00 AM to 11:45 AM"}]
[null,null,{"$f":"'TIME TABLE'!$F$9","v":"Social Study"},null,null,{"$f":"IF(C2263=0,0,'TIME TABLE'!$B$9)","v":"2022-04-04"},{"$f":"IF(C2263=0,0,CONCATENATE('TIME TABLE'!$C$9,'TIME TABLE'!$D$9,'TIME TABLE'!$E$9))","v":"(Monday)"},{"$f":"IF(C2263=0,0,'TIME TABLE'!$C$3)","v":"09:00 AM to 11:45 AM"}]
[null,null,{"$f":"'TIME TABLE'!$F$10","v":"Sanskrit"},null,null,{"$f":"IF(C2264=0,0,'TIME TABLE'!$B$10)","v":"2022-04-05"},{"$f":"IF(C2264=0,0,CONCATENATE('TIME TABLE'!$C$10,'TIME TABLE'!$D$10,'TIME TABLE'!$E$10))","v":"(Tuesday)"},{"$f":"IF(C2264=0,0,'TIME TABLE'!$C$3)","v":"09:00 AM to 11:45 AM"}]
[null,null,{"$f":"'TIME TABLE'!$F$11","v":0},null,null,{"$f":"IF(C2265=0,0,'TIME TABLE'!$B$11)","v":"00:00:00"},{"$f":"IF(C2265=0,0,CONCATENATE('TIME TABLE'!$C$11,'TIME TABLE'!$D$11,'TIME TABLE'!$E$11))","v":0},{"$f":"IF(C2265=0,0,'TIME TABLE'!$C$3)","v":0}]
[null,null,{"$f":"'TIME TABLE'!$F$12","v":0},null,null,{"$f":"IF(C2266=0,0,'TIME TABLE'!$B$12)","v":"00:00:00"},{"$f":"IF(C2266=0,0,CONCATENATE('TIME TABLE'!$C$12,'TIME TABLE'!$D$12,'TIME TABLE'!$E$12))","v":0},{"$f":"IF(C2266=0,0,'TIME TABLE'!$C$3)","v":0}]
[null,null,{"$f":"'TIME TABLE'!$F$13","v":0},null,null,{"$f":"IF(C2267=0,0,'TIME TABLE'!$B$13)","v":"00:00:00"},{"$f":"IF(C2267=0,0,CONCATENATE('TIME TABLE'!$C$13,'TIME TABLE'!$D$13,'TIME TABLE'!$E$13))","v":0},{"$f":"IF(C2267=0,0,'TIME TABLE'!$C$3)","v":0}]
[null,null,{"$f":"'TIME TABLE'!$F$14","v":0},null,null,{"$f":"IF(C2268=0,0,'TIME TABLE'!$B$14)","v":"00:00:00"},{"$f":"IF(C2268=0,0,CONCATENATE('TIME TABLE'!$C$14,'TIME TABLE'!$D$14,'TIME TABLE'!$E$14))","v":0},{"$f":"IF(C2268=0,0,'TIME TABLE'!$C$3)","v":0}]
[null,null,"Instructions"]
[null,null,1,"Check the exam time table carefully."]
[null,null,2,"Students must bring the 'Admit Card' and show it to the invigilator(s) on duty and should preserve it for future requirements."]
[null,null,3,"Mobile Phone, Calculator, Digital Watch or any Electronic Device is NOT ALLOWED."]
[null,null,4,"Arrive at the School at least 15 minutes before the start examination."]
[null,null,5,"Student is barred from entering the examination hall 15 minutes after the written examination starts."]
[null,null,6,"Ensure that you use the washroom before arriving for your exam as you will not be permitted to leave during the first hour."]
[null,null,7,"Normally, you are required to answer questionsusing blue or black in . Make sure you bring some spare pens with you."]
[null,null,8,"Keep your eyes on your own paper. Remember, copying is cheating!"]
[null,null,9,"You must remain silent until after you have exited the school building."]
[{"$f":"A2246+1","v":69}]
[{"$nulls":4},{"$f":"MASTER!$E$11","v":"Govt. Sr. Secondary School Raimalwada"}]
[{"$nulls":4},{"$f":"MASTER!$E$14","v":"P.S.-Bapini (Jodhpur)"}]
[null,{"$f":"CONCATENATE(C2283,'TIME TABLE'!$C$5,'ADMIT CARD'!$C2284,$F2284,'ADMIT CARD'!$G2284,'TIME TABLE'!$E$5)","v":"ADMIT CARD(Roll Number●→0)"},{"$f":"CONCATENATE('TIME TABLE'!$B$2,'TIME TABLE'!$F$2)","v":"HALF YEARLY EXAM:2021-22"}]
[null,null,"ADMIT CARD",{"$nulls":6}," "]
[null,null,"Roll Number",null,null,"●→",{"$f":"VLOOKUP(A2279,'STUDENT DETAIL'!$C$8:$I$107,3)","v":0},null,"Seal and Signature of Head of Institution"]
[null,null,"Student's Name",null,null,"●→",{"$f":"VLOOKUP(A2279,'STUDENT DETAIL'!$C$8:$I$107,4)","v":0}]
[null,null,"Father's Name",null,null,"●→",{"$f":"VLOOKUP(A2279,'STUDENT DETAIL'!$C$8:$I$107,5)","v":0}]
[null,null,"Mother's Name ",null,null,"●→",{"$f":"VLOOKUP(A2279,'STUDENT DETAIL'!$C$8:$I$107,6)","v":0}]
[null,null,"Class & Section",null,null,"●→",{"$f":"IF(G2284=0,0,CONCATENATE('STUDENT DETAIL'!$E$4,'STUDENT DETAIL'!$H$4))","v":0}]
[null,null,"Date Of Birth",null,null,"●→",{"$f":"VLOOKUP(A2279,'STUDENT DETAIL'!$C$8:$I$107,7)","v":"00:00:00"}]
[null,null,"Time Table"]
[null,null,"Subject",null,null,"Date (Day)",null,"Time"]
[null,null,{"$f":"'TIME TABLE'!$F$5","v":"Hindi"},null,null,{"$f":"IF(C2292=0,0,'TIME TABLE'!$B$5)","v":"2022-03-31"},{"$f":"IF(C2292=0,0,CONCATENATE('TIME TABLE'!$C$5,'TIME TABLE'!$D$5,'TIME TABLE'!$E$5))","v":"(Thursday)"},{"$f":"IF(C2292=0,0,'TIME TABLE'!$C$3)","v":"09:00 AM to 11:45 AM"}]
[null,null,{"$f":"'TIME TABLE'!$F$6","v":"English"},null,null,{"$f":"IF(C2293=0,0,'TIME TABLE'!$B$6)","v":"2022-04-01"},{"$f":"IF(C2293=0,0,CONCATENATE('TIME TABLE'!$C$6,'TIME TABLE'!$D$6,'TIME TABLE'!$E$6))","v":"(Friday)"},{"$f":"IF(C2293=0,0,'TIME TABLE'!$C$3)","v":"09:00 AM to 11:45 AM"}]
[null,null,{"$f":"'TIME TABLE'!$F$7","v":"Science"},null,null,{"$f":"IF(C2294=0,0,'TIME TABLE'!$B$7)","v":"2022-04-02"},{"$f":"IF(C2294=0,0,CONCATENATE('TIME TABLE'!$C$7,'TIME TABLE'!$D$7,'TIME TABLE'!$E$7))","v":"(Saturday)"},{"$f":"IF(C2294=0,0,'TIME TABLE'!$C$3)","v":"09:00 AM to 11:45 AM"}]
[null,null,{"$f":"'TIME TABLE'!$F$8","v":"Mathematics"},null,null,{"$f":"IF(C2295=0,0,'TIME TABLE'!$B$8)","v":"2022-04-03"},{"$f":"IF(C2295=0,0,CONCATENATE('TIME TABLE'!$C$8,'TIME TABLE'!$D$8,'TIME TABLE'!$E$8))","v":"(Sunday)"},{"$f":"IF(C2295=0,0,'TIME TABLE'!$C$3)","v":"09:00 AM to 11:45 AM"}]
[null,null,{"$f":"'TIME TABLE'!$F$9","v":"Social Study"},null,null,{"$f":"IF(C2296=0,0,'TIME TABLE'!$B$9)","v":"2022-04-04"},{"$f":"IF(C2296=0,0,CONCATENATE('TIME TABLE'!$C$9,'TIME TABLE'!$D$9,'TIME TABLE'!$E$9))","v":"(Monday)"},{"$f":"IF(C2296=0,0,'TIME TABLE'!$C$3)","v":"09:00 AM to 11:45 AM"}]
[null,null,{"$f":"'TIME TABLE'!$F$10","v":"Sanskrit"},null,null,{"$f":"IF(C2297=0,0,'TIME TABLE'!$B$10)","v":"2022-04-05"},{"$f":"IF(C2297=0,0,CONCATENATE('TIME TABLE'!$C$10,'TIME TABLE'!$D$10,'TIME TABLE'!$E$10))","v":"(Tuesday)"},{"$f":"IF(C2297=0,0,'TIME TABLE'!$C$3)","v":"09:00 AM to 11:45 AM"}]
[null,null,{"$f":"'TIME TABLE'!$F$11","v":0},null,null,{"$f":"IF(C2298=0,0,'TIME TABLE'!$B$11)","v":"00:00:00"},{"$f":"IF(C2298=0,0,CONCATENATE('TIME TABLE'!$C$11,'TIME TABLE'!$D$11,'TIME TABLE'!$E$11))","v":0},{"$f":"IF(C2298=0,0,'TIME TABLE'!$C$3)","v":0}]
[null,null,{"$f":"'TIME TABLE'!$F$12","v":0},null,null,{"$f":"IF(C2299=0,0,'TIME TABLE'!$B$12)","v":"00:00:00"},{"$f":"IF(C2299=0,0,CONCATENATE('TIME TABLE'!$C$12,'TIME TABLE'!$D$12,'TIME TABLE'!$E$12))","v":0},{"$f":"IF(C2299=0,0,'TIME TABLE'!$C$3)","v":0}]
[null,null,{"$f":"'TIME TABLE'!$F$13","v":0},null,null,{"$f":"IF(C2300=0,0,'TIME TABLE'!$B$13)","v":"00:00:00"},{"$f":"IF(C2300=0,0,CONCATENATE('TIME TABLE'!$C$13,'TIME TABLE'!$D$13,'TIME TABLE'!$E$13))","v":0},{"$f":"IF(C2300=0,0,'TIME TABLE'!$C$3)","v":0}]
[null,null,{"$f":"'TIME TABLE'!$F$14","v":0},null,null,{"$f":"IF(C2301=0,0,'TIME TABLE'!$B$14)","v":"00:00:00"},{"$f":"IF(C2301=0,0,CONCATENATE('TIME TABLE'!$C$14,'TIME TABLE'!$D$14,'TIME TABLE'!$E$14))","v":0},{"$f":"IF(C2301=0,0,'TIME TABLE'!$C$3)","v":0}]
[null,null,"Instructions"]
[null,null,1,"Check the exam time table carefully."]
[null,null,2,"Students must bring the 'Admit Card' and show it to the invigilator(s) on duty and should preserve it for future requirements."]
[null,null,3,"Mobile Phone, Calculator, Digital Watch or any Electronic Device is NOT ALLOWED."]
[null,null,4,"Arrive at the School at least 15 minutes before the start examination."]
[null,null,5,"Student is barred from entering the examination hall 15 minutes after the written examination starts."]
[null,null,6,"Ensure that you use the washroom before arriving for your exam as you will not be permitted to leave during the first hour."]
[null,null,7,"Normally, you are required to answer questionsusing blue or black in . Make sure you bring some spare pens with you."]
[null,null,8,"Keep your eyes on your own paper. Remember, copying is cheating!"]
[null,null,9,"You must remain silent until after you have exited the school building."]
[]
[{"$f":"A2279+1","v":70}]
[{"$nulls":4},{"$f":"MASTER!$E$11","v":"Govt. Sr. Secondary School Raimalwada"}]
[{"$nulls":4},{"$f":"MASTER!$E$14","v":"P.S.-Bapini (Jodhpur)"}]
[null,{"$f":"CONCATENATE(C2317,'TIME TABLE'!$C$5,'ADMIT CARD'!$C2318,$F2318,'ADMIT CARD'!$G2318,'TIME TABLE'!$E$5)","v":"ADMIT CARD(Roll Number●→0)"},{"$f":"CONCATENATE('TIME TABLE'!$B$2,'TIME TABLE'!$F$2)","v":"HALF YEARLY EXAM:2021-22"}]
[null,null,"ADMIT CARD",{"$nulls":6}," "]
[null,null,"Roll Number",null,null,"●→",{"$f":"VLOOKUP(A2313,'STUDENT DETAIL'!$C$8:$I$107,3)","v":0},null,"Seal and Signature of Head of Institution"]
[null,null,"Student's Name",null,null,"●→",{"$f":"VLOOKUP(A2313,'STUDENT DETAIL'!$C$8:$I$107,4)","v":0}]
[null,null,"Father's Name",null,null,"●→",{"$f":"VLOOKUP(A2313,'STUDENT DETAIL'!$C$8:$I$107,5)","v":0}]
[null,null,"Mother's Name ",null,null,"●→",{"$f":"VLOOKUP(A2313,'STUDENT DETAIL'!$C$8:$I$107,6)","v":0}]
[null,null,"Class & Section",null,null,"●→",{"$f":"IF(G2318=0,0,CONCATENATE('STUDENT DETAIL'!$E$4,'STUDENT DETAIL'!$H$4))","v":0}]
[null,null,"Date Of Birth",null,null,"●→",{"$f":"VLOOKUP(A2313,'STUDENT DETAIL'!$C$8:$I$107,7)","v":"00:00:00"}]
[null,null,"Time Table"]
[null,null,"Subject",null,null,"Date (Day)",null,"Time"]
[null,null,{"$f":"'TIME TABLE'!$F$5","v":"Hindi"},null,null,{"$f":"IF(C2326=0,0,'TIME TABLE'!$B$5)","v":"2022-03-31"},{"$f":"IF(C2326=0,0,CONCATENATE('TIME TABLE'!$C$5,'TIME TABLE'!$D$5,'TIME TABLE'!$E$5))","v":"(Thursday)"},{"$f":"IF(C2326=0,0,'TIME TABLE'!$C$3)","v":"09:00 AM to 11:45 AM"}]
[null,null,{"$f":"'TIME TABLE'!$F$6","v":"English"},null,null,{"$f":"IF(C2327=0,0,'TIME TABLE'!$B$6)","v":"2022-04-01"},{"$f":"IF(C2327=0,0,CONCATENATE('TIME TABLE'!$C$6,'TIME TABLE'!$D$6,'TIME TABLE'!$E$6))","v":"(Friday)"},{"$f":"IF(C2327=0,0,'TIME TABLE'!$C$3)","v":"09:00 AM to 11:45 AM"}]
[null,null,{"$f":"'TIME TABLE'!$F$7","v":"Science"},null,null,{"$f":"IF(C2328=0,0,'TIME TABLE'!$B$7)","v":"2022-04-02"},{"$f":"IF(C2328=0,0,CONCATENATE('TIME TABLE'!$C$7,'TIME TABLE'!$D$7,'TIME TABLE'!$E$7))","v":"(Saturday)"},{"$f":"IF(C2328=0,0,'TIME TABLE'!$C$3)","v":"09:00 AM to 11:45 AM"}]
[null,null,{"$f":"'TIME TABLE'!$F$8","v":"Mathematics"},null,null,{"$f":"IF(C2329=0,0,'TIME TABLE'!$B$8)","v":"2022-04-03"},{"$f":"IF(C2329=0,0,CONCATENATE('TIME TABLE'!$C$8,'TIME TABLE'!$D$8,'TIME TABLE'!$E$8))","v":"(Sunday)"},{"$f":"IF(C2329=0,0,'TIME TABLE'!$C$3)","v":"09:00 AM to 11:45 AM"}]
[null,null,{"$f":"'TIME TABLE'!$F$9","v":"Social Study"},null,null,{"$f":"IF(C2330=0,0,'TIME TABLE'!$B$9)","v":"2022-04-04"},{"$f":"IF(C2330=0,0,CONCATENATE('TIME TABLE'!$C$9,'TIME TABLE'!$D$9,'TIME TABLE'!$E$9))","v":"(Monday)"},{"$f":"IF(C2330=0,0,'TIME TABLE'!$C$3)","v":"09:00 AM to 11:45 AM"}]
[null,null,{"$f":"'TIME TABLE'!$F$10","v":"Sanskrit"},null,null,{"$f":"IF(C2331=0,0,'TIME TABLE'!$B$10)","v":"2022-04-05"},{"$f":"IF(C2331=0,0,CONCATENATE('TIME TABLE'!$C$10,'TIME TABLE'!$D$10,'TIME TABLE'!$E$10))","v":"(Tuesday)"},{"$f":"IF(C2331=0,0,'TIME TABLE'!$C$3)","v":"09:00 AM to 11:45 AM"}]
[null,null,{"$f":"'TIME TABLE'!$F$11","v":0},null,null,{"$f":"IF(C2332=0,0,'TIME TABLE'!$B$11)","v":"00:00:00"},{"$f":"IF(C2332=0,0,CONCATENATE('TIME TABLE'!$C$11,'TIME TABLE'!$D$11,'TIME TABLE'!$E$11))","v":0},{"$f":"IF(C2332=0,0,'TIME TABLE'!$C$3)","v":0}]
[null,null,{"$f":"'TIME TABLE'!$F$12","v":0},null,null,{"$f":"IF(C2333=0,0,'TIME TABLE'!$B$12)","v":"00:00:00"},{"$f":"IF(C2333=0,0,CONCATENATE('TIME TABLE'!$C$12,'TIME TABLE'!$D$12,'TIME TABLE'!$E$12))","v":0},{"$f":"IF(C2333=0,0,'TIME TABLE'!$C$3)","v":0}]
[null,null,{"$f":"'TIME TABLE'!$F$13","v":0},null,null,{"$f":"IF(C2334=0,0,'TIME TABLE'!$B$13)","v":"00:00:00"},{"$f":"IF(C2334=0,0,CONCATENATE('TIME TABLE'!$C$13,'TIME TABLE'!$D$13,'TIME TABLE'!$E$13))","v":0},{"$f":"IF(C2334=0,0,'TIME TABLE'!$C$3)","v":0}]
[null,null,{"$f":"'TIME TABLE'!$F$14","v":0},null,null,{"$f":"IF(C2335=0,0,'TIME TABLE'!$B$14)","v":"00:00:00"},{"$f":"IF(C2335=0,0,CONCATENATE('TIME TABLE'!$C$14,'TIME TABLE'!$D$14,'TIME TABLE'!$E$14))","v":0},{"$f":"IF(C2335=0,0,'TIME TABLE'!$C$3)","v":0}]
[null,null,"Instructions"]
[null,null,1,"Check the exam time table carefully."]
[null,null,2,"Students must bring the 'Admit Card' and show it to the invigilator(s) on duty and should preserve it for future requirements."]
[null,null,3,"Mobile Phone, Calculator, Digital Watch or any Electronic Device is NOT ALLOWED."]
[null,null,4,"Arrive at the School at least 15 minutes before the start examination."]
[null,null,5,"Student is barred from entering the examination hall 15 minutes after the written examination starts."]
[null,null,6,"Ensure that you use the washroom before arriving for your exam as you will not be permitted to leave during the first hour."]
[null,null,7,"Normally, you are required to answer questionsusing blue or black in . Make sure you bring some spare pens with you."]
[null,null,8,"Keep your eyes on your own paper. Remember, copying is cheating!"]
[null,null,9,"You must remain silent until after you have exited the school building."]
[{"$f":"A2313+1","v":71}]
[{"$nulls":4},{"$f":"MASTER!$E$11","v":"Govt. Sr. Secondary School Raimalwada"}]
[{"$nulls":4},{"$f":"MASTER!$E$14","v":"P.S.-Bapini (Jodhpur)"}]
[null,{"$f":"CONCATENATE(C2350,'TIME TABLE'!$C$5,'ADMIT CARD'!$C2351,$F2351,'ADMIT CARD'!$G2351,'TIME TABLE'!$E$5)","v":"ADMIT CARD(Roll Number●→0)"},{"$f":"CONCATENATE('TIME TABLE'!$B$2,'TIME TABLE'!$F$2)","v":"HALF YEARLY EXAM:2021-22"}]
[null,null,"ADMIT CARD",{"$nulls":6}," "]
[null,null,"Roll Number",null,null,"●→",{"$f":"VLOOKUP(A2346,'STUDENT DETAIL'!$C$8:$I$107,3)","v":0},null,"Seal and Signature of Head of Institution"]
[null,null,"Student's Name",null,null,"●→",{"$f":"VLOOKUP(A2346,'STUDENT DETAIL'!$C$8:$I$107,4)","v":0}]
[null,null,"Father's Name",null,null,"●→",{"$f":"VLOOKUP(A2346,'STUDENT DETAIL'!$C$8:$I$107,5)","v":0}]
[null,null,"Mother's Name ",null,null,"●→",{"$f":"VLOOKUP(A2346,'STUDENT DETAIL'!$C$8:$I$107,6)","v":0}]
[null,null,"Class & Section",null,null,"●→",{"$f":"IF(G2351=0,0,CONCATENATE('STUDENT DETAIL'!$E$4,'STUDENT DETAIL'!$H$4))","v":0}]
[null,null,"Date Of Birth",null,null,"●→",{"$f":"VLOOKUP(A2346,'STUDENT DETAIL'!$C$8:$I$107,7)","v":"00:00:00"}]
[null,null,"Time Table"]
[null,null,"Subject",null,null,"Date (Day)",null,"Time"]
[null,null,{"$f":"'TIME TABLE'!$F$5","v":"Hindi"},null,null,{"$f":"IF(C2359=0,0,'TIME TABLE'!$B$5)","v":"2022-03-31"},{"$f":"IF(C2359=0,0,CONCATENATE('TIME TABLE'!$C$5,'TIME TABLE'!$D$5,'TIME TABLE'!$E$5))","v":"(Thursday)"},{"$f":"IF(C2359=0,0,'TIME TABLE'!$C$3)","v":"09:00 AM to 11:45 AM"}]
[null,null,{"$f":"'TIME TABLE'!$F$6","v":"English"},null,null,{"$f":"IF(C2360=0,0,'TIME TABLE'!$B$6)","v":"2022-04-01"},{"$f":"IF(C2360=0,0,CONCATENATE('TIME TABLE'!$C$6,'TIME TABLE'!$D$6,'TIME TABLE'!$E$6))","v":"(Friday)"},{"$f":"IF(C2360=0,0,'TIME TABLE'!$C$3)","v":"09:00 AM to 11:45 AM"}]
[null,null,{"$f":"'TIME TABLE'!$F$7","v":"Science"},null,null,{"$f":"IF(C2361=0,0,'TIME TABLE'!$B$7)","v":"2022-04-02"},{"$f":"IF(C2361=0,0,CONCATENATE('TIME TABLE'!$C$7,'TIME TABLE'!$D$7,'TIME TABLE'!$E$7))","v":"(Saturday)"},{"$f":"IF(C2361=0,0,'TIME TABLE'!$C$3)","v":"09:00 AM to 11:45 AM"}]
[null,null,{"$f":"'TIME TABLE'!$F$8","v":"Mathematics"},null,null,{"$f":"IF(C2362=0,0,'TIME TABLE'!$B$8)","v":"2022-04-03"},{"$f":"IF(C2362=0,0,CONCATENATE('TIME TABLE'!$C$8,'TIME TABLE'!$D$8,'TIME TABLE'!$E$8))","v":"(Sunday)"},{"$f":"IF(C2362=0,0,'TIME TABLE'!$C$3)","v":"09:00 AM to 11:45 AM"}]
[null,null,{"$f":"'TIME TABLE'!$F$9","v":"Social Study"},null,null,{"$f":"IF(C2363=0,0,'TIME TABLE'!$B$9)","v":"2022-04-04"},{"$f":"IF(C2363=0,0,CONCATENATE('TIME TABLE'!$C$9,'TIME TABLE'!$D$9,'TIME TABLE'!$E$9))","v":"(Monday)"},{"$f":"IF(C2363=0,0,'TIME TABLE'!$C$3)","v":"09:00 AM to 11:45 AM"}]
[null,null,{"$f":"'TIME TABLE'!$F$10","v":"Sanskrit"},null,null,{"$f":"IF(C2364=0,0,'TIME TABLE'!$B$10)","v":"2022-04-05"},{"$f":"IF(C2364=0,0,CONCATENATE('TIME TABLE'!$C$10,'TIME TABLE'!$D$10,'TIME TABLE'!$E$10))","v":"(Tuesday)"},{"$f":"IF(C2364=0,0,'TIME TABLE'!$C$3)","v":"09:00 AM to 11:45 AM"}]
[null,null,{"$f":"'TIME TABLE'!$F$11","v":0},null,null,{"$f":"IF(C2365=0,0,'TIME TABLE'!$B$11)","v":"00:00:00"},{"$f":"IF(C2365=0,0,CONCATENATE('TIME TABLE'!$C$11,'TIME TABLE'!$D$11,'TIME TABLE'!$E$11))","v":0},{"$f":"IF(C2365=0,0,'TIME TABLE'!$C$3)","v":0}]
[null,null,{"$f":"'TIME TABLE'!$F$12","v":0},null,null,{"$f":"IF(C2366=0,0,'TIME TABLE'!$B$12)","v":"00:00:00"},{"$f":"IF(C2366=0,0,CONCATENATE('TIME TABLE'!$C$12,'TIME TABLE'!$D$12,'TIME TABLE'!$E$12))","v":0},{"$f":"IF(C2366=0,0,'TIME TABLE'!$C$3)","v":0}]
[null,null,{"$f":"'TIME TABLE'!$F$13","v":0},null,null,{"$f":"IF(C2367=0,0,'TIME TABLE'!$B$13)","v":"00:00:00"},{"$f":"IF(C2367=0,0,CONCATENATE('TIME TABLE'!$C$13,'TIME TABLE'!$D$13,'TIME TABLE'!$E$13))","v":0},{"$f":"IF(C2367=0,0,'TIME TABLE'!$C$3)","v":0}]
[null,null,{"$f":"'TIME TABLE'!$F$14","v":0},null,null,{"$f":"IF(C2368=0,0,'TIME TABLE'!$B$14)","v":"00:00:00"},{"$f":"IF(C2368=0,0,CONCATENATE('TIME TABLE'!$C$14,'TIME TABLE'!$D$14,'TIME TABLE'!$E$14))","v":0},{"$f":"IF(C2368=0,0,'TIME TABLE'!$C$3)","v":0}]
[null,null,"Instructions"]
[null,null,1,"Check the exam time table carefully."]
[null,null,2,"Students must bring the 'Admit Card' and show it to the invigilator(s) on duty and should preserve it for future requirements."]
[null,null,3,"Mobile Phone, Calculator, Digital Watch or any Electronic Device is NOT ALLOWED."]
[null,null,4,"Arrive at the School at least 15 minutes before the start examination."]
[null,null,5,"Student is barred from entering the examination hall 15 minutes after the written examination starts."]
[null,null,6,"Ensure that you use the washroom before arriving for your exam as you will not be permitted to leave during the first hour."]
[null,null,7,"Normally, you are required to answer questionsusing blue or black in . Make sure you bring some spare pens with you."]
[null,null,8,"Keep your eyes on your own paper. Remember, copying is cheating!"]
[null,null,9,"You must remain silent until after you have exited the school building."]
[]
[{"$f":"A2346+1","v":72}]
[{"$nulls":4},{"$f":"MASTER!$E$11","v":"Govt. Sr. Secondary School Raimalwada"}]
[{"$nulls":4},{"$f":"MASTER!$E$14","v":"P.S.-Bapini (Jodhpur)"}]
[null,{"$f":"CONCATENATE(C2384,'TIME TABLE'!$C$5,'ADMIT CARD'!$C2385,$F2385,'ADMIT CARD'!$G2385,'TIME TABLE'!$E$5)","v":"ADMIT CARD(Roll Number●→0)"},{"$f":"CONCATENATE('TIME TABLE'!$B$2,'TIME TABLE'!$F$2)","v":"HALF YEARLY EXAM:2021-22"}]
[null,null,"ADMIT CARD",{"$nulls":6}," "]
[null,null,"Roll Number",null,null,"●→",{"$f":"VLOOKUP(A2380,'STUDENT DETAIL'!$C$8:$I$107,3)","v":0},null,"Seal and Signature of Head of Institution"]
[null,null,"Student's Name",null,null,"●→",{"$f":"VLOOKUP(A2380,'STUDENT DETAIL'!$C$8:$I$107,4)","v":0}]
[null,null,"Father's Name",null,null,"●→",{"$f":"VLOOKUP(A2380,'STUDENT DETAIL'!$C$8:$I$107,5)","v":0}]
[null,null,"Mother's Name ",null,null,"●→",{"$f":"VLOOKUP(A2380,'STUDENT DETAIL'!$C$8:$I$107,6)","v":0}]
[null,null,"Class & Section",null,null,"●→",{"$f":"IF(G2385=0,0,CONCATENATE('STUDENT DETAIL'!$E$4,'STUDENT DETAIL'!$H$4))","v":0}]
[null,null,"Date Of Birth",null,null,"●→",{"$f":"VLOOKUP(A2380,'STUDENT DETAIL'!$C$8:$I$107,7)","v":"00:00:00"}]
[null,null,"Time Table"]
[null,null,"Subject",null,null,"Date (Day)",null,"Time"]
[null,null,{"$f":"'TIME TABLE'!$F$5","v":"Hindi"},null,null,{"$f":"IF(C2393=0,0,'TIME TABLE'!$B$5)","v":"2022-03-31"},{"$f":"IF(C2393=0,0,CONCATENATE('TIME TABLE'!$C$5,'TIME TABLE'!$D$5,'TIME TABLE'!$E$5))","v":"(Thursday)"},{"$f":"IF(C2393=0,0,'TIME TABLE'!$C$3)","v":"09:00 AM to 11:45 AM"}]
[null,null,{"$f":"'TIME TABLE'!$F$6","v":"English"},null,null,{"$f":"IF(C2394=0,0,'TIME TABLE'!$B$6)","v":"2022-04-01"},{"$f":"IF(C2394=0,0,CONCATENATE('TIME TABLE'!$C$6,'TIME TABLE'!$D$6,'TIME TABLE'!$E$6))","v":"(Friday)"},{"$f":"IF(C2394=0,0,'TIME TABLE'!$C$3)","v":"09:00 AM to 11:45 AM"}]
[null,null,{"$f":"'TIME TABLE'!$F$7","v":"Science"},null,null,{"$f":"IF(C2395=0,0,'TIME TABLE'!$B$7)","v":"2022-04-02"},{"$f":"IF(C2395=0,0,CONCATENATE('TIME TABLE'!$C$7,'TIME TABLE'!$D$7,'TIME TABLE'!$E$7))","v":"(Saturday)"},{"$f":"IF(C2395=0,0,'TIME TABLE'!$C$3)","v":"09:00 AM to 11:45 AM"}]
[null,null,{"$f":"'TIME TABLE'!$F$8","v":"Mathematics"},null,null,{"$f":"IF(C2396=0,0,'TIME TABLE'!$B$8)","v":"2022-04-03"},{"$f":"IF(C2396=0,0,CONCATENATE('TIME TABLE'!$C$8,'TIME TABLE'!$D$8,'TIME TABLE'!$E$8))","v":"(Sunday)"},{"$f":"IF(C2396=0,0,'TIME TABLE'!$C$3)","v":"09:00 AM to 11:45 AM"}]
[null,null,{"$f":"'TIME TABLE'!$F$9","v":"Social Study"},null,null,{"$f":"IF(C2397=0,0,'TIME TABLE'!$B$9)","v":"2022-04-04"},{"$f":"IF(C2397=0,0,CONCATENATE('TIME TABLE'!$C$9,'TIME TABLE'!$D$9,'TIME TABLE'!$E$9))","v":"(Monday)"},{"$f":"IF(C2397=0,0,'TIME TABLE'!$C$3)","v":"09:00 AM to 11:45 AM"}]
[null,null,{"$f":"'TIME TABLE'!$F$10","v":"Sanskrit"},null,null,{"$f":"IF(C2398=0,0,'TIME TABLE'!$B$10)","v":"2022-04-05"},{"$f":"IF(C2398=0,0,CONCATENATE('TIME TABLE'!$C$10,'TIME TABLE'!$D$10,'TIME TABLE'!$E$10))","v":"(Tuesday)"},{"$f":"IF(C2398=0,0,'TIME TABLE'!$C$3)","v":"09:00 AM to 11:45 AM"}]
[null,null,{"$f":"'TIME TABLE'!$F$11","v":0},null,null,{"$f":"IF(C2399=0,0,'TIME TABLE'!$B$11)","v":"00:00:00"},{"$f":"IF(C2399=0,0,CONCATENATE('TIME TABLE'!$C$11,'TIME TABLE'!$D$11,'TIME TABLE'!$E$11))","v":0},{"$f":"IF(C2399=0,0,'TIME TABLE'!$C$3)","v":0}]
[null,null,{"$f":"'TIME TABLE'!$F$12","v":0},null,null,{"$f":"IF(C2400=0,0,'TIME TABLE'!$B$12)","v":"00:00:00"},{"$f":"IF(C2400=0,0,CONCATENATE('TIME TABLE'!$C$12,'TIME TABLE'!$D$12,'TIME TABLE'!$E$12))","v":0},{"$f":"IF(C2400=0,0,'TIME TABLE'!$C$3)","v":0}]
[null,null,{"$f":"'TIME TABLE'!$F$13","v":0},null,null,{"$f":"IF(C2401=0,0,'TIME TABLE'!$B$13)","v":"00:00:00"},{"$f":"IF(C2401=0,0,CONCATENATE('TIME TABLE'!$C$13,'TIME TABLE'!$D$13,'TIME TABLE'!$E$13))","v":0},{"$f":"IF(C2401=0,0,'TIME TABLE'!$C$3)","v":0}]
[null,null,{"$f":"'TIME TABLE'!$F$14","v":0},null,null,{"$f":"IF(C2402=0,0,'TIME TABLE'!$B$14)","v":"00:00:00"},{"$f":"IF(C2402=0,0,CONCATENATE('TIME TABLE'!$C$14,'TIME TABLE'!$D$14,'TIME TABLE'!$E$14))","v":0},{"$f":"IF(C2402=0,0,'TIME TABLE'!$C$3)","v":0}]
[null,null,"Instructions"]
[null,null,1,"Check the exam time table carefully."]
[null,null,2,"Students must bring the 'Admit Card' and show it to the invigilator(s) on duty and should preserve it for future requirements."]
[null,null,3,"Mobile Phone, Calculator, Digital Watch or any Electronic Device is NOT ALLOWED."]
[null,null,4,"Arrive at the School at least 15 minutes before the start examination."]
[null,null,5,"Student is barred from entering the examination hall 15 minutes after the written examination starts."]
[null,null,6,"Ensure that you use the washroom before arriving for your exam as you will not be permitted to leave during the first hour."]
[null,null,7,"Normally, you are required to answer questionsusing blue or black in . Make sure you bring some spare pens with you."]
[null,null,8,"Keep your eyes on your own paper. Remember, copying is cheating!"]
[null,null,9,"You must remain silent until after you have exited the school building."]
[{"$f":"A2380+1","v":73}]
[{"$nulls":4},{"$f":"MASTER!$E$11","v":"Govt. Sr. Secondary School Raimalwada"}]
[{"$nulls":4},{"$f":"MASTER!$E$14","v":"P.S.-Bapini (Jodhpur)"}]
[null,{"$f":"CONCATENATE(C2417,'TIME TABLE'!$C$5,'ADMIT CARD'!$C2418,$F2418,'ADMIT CARD'!$G2418,'TIME TABLE'!$E$5)","v":"ADMIT CARD(Roll Number●→0)"},{"$f":"CONCATENATE('TIME TABLE'!$B$2,'TIME TABLE'!$F$2)","v":"HALF YEARLY EXAM:2021-22"}]
[null,null,"ADMIT CARD",{"$nulls":6}," "]
[null,null,"Roll Number",null,null,"●→",{"$f":"VLOOKUP(A2413,'STUDENT DETAIL'!$C$8:$I$107,3)","v":0},null,"Seal and Signature of Head of Institution"]
[null,null,"Student's Name",null,null,"●→",{"$f":"VLOOKUP(A2413,'STUDENT DETAIL'!$C$8:$I$107,4)","v":0}]
[null,null,"Father's Name",null,null,"●→",{"$f":"VLOOKUP(A2413,'STUDENT DETAIL'!$C$8:$I$107,5)","v":0}]
[null,null,"Mother's Name ",null,null,"●→",{"$f":"VLOOKUP(A2413,'STUDENT DETAIL'!$C$8:$I$107,6)","v":0}]
[null,null,"Class & Section",null,null,"●→",{"$f":"IF(G2418=0,0,CONCATENATE('STUDENT DETAIL'!$E$4,'STUDENT DETAIL'!$H$4))","v":0}]
[null,null,"Date Of Birth",null,null,"●→",{"$f":"VLOOKUP(A2413,'STUDENT DETAIL'!$C$8:$I$107,7)","v":"00:00:00"}]
[null,null,"Time Table"]
[null,null,"Subject",null,null,"Date (Day)",null,"Time"]
[null,null,{"$f":"'TIME TABLE'!$F$5","v":"Hindi"},null,null,{"$f":"IF(C2426=0,0,'TIME TABLE'!$B$5)","v":"2022-03-31"},{"$f":"IF(C2426=0,0,CONCATENATE('TIME TABLE'!$C$5,'TIME TABLE'!$D$5,'TIME TABLE'!$E$5))","v":"(Thursday)"},{"$f":"IF(C2426=0,0,'TIME TABLE'!$C$3)","v":"09:00 AM to 11:45 AM"}]
[null,null,{"$f":"'TIME TABLE'!$F$6","v":"English"},null,null,{"$f":"IF(C2427=0,0,'TIME TABLE'!$B$6)","v":"2022-04-01"},{"$f":"IF(C2427=0,0,CONCATENATE('TIME TABLE'!$C$6,'TIME TABLE'!$D$6,'TIME TABLE'!$E$6))","v":"(Friday)"},{"$f":"IF(C2427=0,0,'TIME TABLE'!$C$3)","v":"09:00 AM to 11:45 AM"}]
[null,null,{"$f":"'TIME TABLE'!$F$7","v":"Science"},null,null,{"$f":"IF(C2428=0,0,'TIME TABLE'!$B$7)","v":"2022-04-02"},{"$f":"IF(C2428=0,0,CONCATENATE('TIME TABLE'!$C$7,'TIME TABLE'!$D$7,'TIME TABLE'!$E$7))","v":"(Saturday)"},{"$f":"IF(C2428=0,0,'TIME TABLE'!$C$3)","v":"09:00 AM to 11:45 AM"}]
[null,null,{"$f":"'TIME TABLE'!$F$8","v":"Mathematics"},null,null,{"$f":"IF(C2429=0,0,'TIME TABLE'!$B$8)","v":"2022-04-03"},{"$f":"IF(C2429=0,0,CONCATENATE('TIME TABLE'!$C$8,'TIME TABLE'!$D$8,'TIME TABLE'!$E$8))","v":"(Sunday)"},{"$f":"IF(C2429=0,0,'TIME TABLE'!$C$3)","v":"09:00 AM to 11:45 AM"}]
[null,null,{"$f":"'TIME TABLE'!$F$9","v":"Social Study"},null,null,{"$f":"IF(C2430=0,0,'TIME TABLE'!$B$9)","v":"2022-04-04"},{"$f":"IF(C2430=0,0,CONCATENATE('TIME TABLE'!$C$9,'TIME TABLE'!$D$9,'TIME TABLE'!$E$9))","v":"(Monday)"},{"$f":"IF(C2430=0,0,'TIME TABLE'!$C$3)","v":"09:00 AM to 11:45 AM"}]
[null,null,{"$f":"'TIME TABLE'!$F$10","v":"Sanskrit"},null,null,{"$f":"IF(C2431=0,0,'TIME TABLE'!$B$10)","v":"2022-04-05"},{"$f":"IF(C2431=0,0,CONCATENATE('TIME TABLE'!$C$10,'TIME TABLE'!$D$10,'TIME TABLE'!$E$10))","v":"(Tuesday)"},{"$f":"IF(C2431=0,0,'TIME TABLE'!$C$3)","v":"09:00 AM to 11:45 AM"}]
[null,null,{"$f":"'TIME TABLE'!$F$11","v":0},null,null,{"$f":"IF(C2432=0,0,'TIME TABLE'!$B$11)","v":"00:00:00"},{"$f":"IF(C2432=0,0,CONCATENATE('TIME TABLE'!$C$11,'TIME TABLE'!$D$11,'TIME TABLE'!$E$11))","v":0},{"$f":"IF(C2432=0,0,'TIME TABLE'!$C$3)","v":0}]
[null,null,{"$f":"'TIME TABLE'!$F$12","v":0},null,null,{"$f":"IF(C2433=0,0,'TIME TABLE'!$B$12)","v":"00:00:00"},{"$f":"IF(C2433=0,0,CONCATENATE('TIME TABLE'!$C$12,'TIME TABLE'!$D$12,'TIME TABLE'!$E$12))","v":0},{"$f":"IF(C2433=0,0,'TIME TABLE'!$C$3)","v":0}]
[null,null,{"$f":"'TIME TABLE'!$F$13","v":0},null,null,{"$f":"IF(C2434=0,0,'TIME TABLE'!$B$13)","v":"00:00:00"},{"$f":"IF(C2434=0,0,CONCATENATE('TIME TABLE'!$C$13,'TIME TABLE'!$D$13,'TIME TABLE'!$E$13))","v":0},{"$f":"IF(C2434=0,0,'TIME TABLE'!$C$3)","v":0}]
[null,null,{"$f":"'TIME TABLE'!$F$14","v":0},null,null,{"$f":"IF(C2435=0,0,'TIME TABLE'!$B$14)","v":"00:00:00"},{"$f":"IF(C2435=0,0,CONCATENATE('TIME TABLE'!$C$14,'TIME TABLE'!$D$14,'TIME TABLE'!$E$14))","v":0},{"$f":"IF(C2435=0,0,'TIME TABLE'!$C$3)","v":0}]
[null,null,"Instructions"]
[null,null,1,"Check the exam time table carefully."]
[null,null,2,"Students must bring the 'Admit Card' and show it to the invigilator(s) on duty and should preserve it for future requirements."]
[null,null,3,"Mobile Phone, Calculator, Digital Watch or any Electronic Device is NOT ALLOWED."]
[null,null,4,"Arrive at the School at least 15 minutes before the start examination."]
[null,null,5,"Student is barred from entering the examination hall 15 minutes after the written examination starts."]
[null,null,6,"Ensure that you use the washroom before arriving for your exam as you will not be permitted to leave during the first hour."]
[null,null,7,"Normally, you are required to answer questionsusing blue or black in . Make sure you bring some spare pens with you."]
[null,null,8,"Keep your eyes on your own paper. Remember, copying is cheating!"]
[null,null,9,"You must remain silent until after you have exited the school building."]
[]
[{"$f":"A2413+1","v":74}]
[{"$nulls":4},{"$f":"MASTER!$E$11","v":"Govt. Sr. Secondary School Raimalwada"}]
[{"$nulls":4},{"$f":"MASTER!$E$14","v":"P.S.-Bapini (Jodhpur)"}]
[null,{"$f":"CONCATENATE(C2451,'TIME TABLE'!$C$5,'ADMIT CARD'!$C2452,$F2452,'ADMIT CARD'!$G2452,'TIME TABLE'!$E$5)","v":"ADMIT CARD(Roll Number●→0)"},{"$f":"CONCATENATE('TIME TABLE'!$B$2,'TIME TABLE'!$F$2)","v":"HALF YEARLY EXAM:2021-22"}]
[null,null,"ADMIT CARD",{"$nulls":6}," "]
[null,null,"Roll Number",null,null,"●→",{"$f":"VLOOKUP(A2447,'STUDENT DETAIL'!$C$8:$I$107,3)","v":0},null,"Seal and Signature of Head of Institution"]
[null,null,"Student's Name",null,null,"●→",{"$f":"VLOOKUP(A2447,'STUDENT DETAIL'!$C$8:$I$107,4)","v":0}]
[null,null,"Father's Name",null,null,"●→",{"$f":"VLOOKUP(A2447,'STUDENT DETAIL'!$C$8:$I$107,5)","v":0}]
[null,null,"Mother's Name ",null,null,"●→",{"$f":"VLOOKUP(A2447,'STUDENT DETAIL'!$C$8:$I$107,6)","v":0}]
[null,null,"Class & Section",null,null,"●→",{"$f":"IF(G2452=0,0,CONCATENATE('STUDENT DETAIL'!$E$4,'STUDENT DETAIL'!$H$4))","v":0}]
[null,null,"Date Of Birth",null,null,"●→",{"$f":"VLOOKUP(A2447,'STUDENT DETAIL'!$C$8:$I$107,7)","v":"00:00:00"}]
[null,null,"Time Table"]
[null,null,"Subject",null,null,"Date (Day)",null,"Time"]
[null,null,{"$f":"'TIME TABLE'!$F$5","v":"Hindi"},null,null,{"$f":"IF(C2460=0,0,'TIME TABLE'!$B$5)","v":"2022-03-31"},{"$f":"IF(C2460=0,0,CONCATENATE('TIME TABLE'!$C$5,'TIME TABLE'!$D$5,'TIME TABLE'!$E$5))","v":"(Thursday)"},{"$f":"IF(C2460=0,0,'TIME TABLE'!$C$3)","v":"09:00 AM to 11:45 AM"}]
[null,null,{"$f":"'TIME TABLE'!$F$6","v":"English"},null,null,{"$f":"IF(C2461=0,0,'TIME TABLE'!$B$6)","v":"2022-04-01"},{"$f":"IF(C2461=0,0,CONCATENATE('TIME TABLE'!$C$6,'TIME TABLE'!$D$6,'TIME TABLE'!$E$6))","v":"(Friday)"},{"$f":"IF(C2461=0,0,'TIME TABLE'!$C$3)","v":"09:00 AM to 11:45 AM"}]
[null,null,{"$f":"'TIME TABLE'!$F$7","v":"Science"},null,null,{"$f":"IF(C2462=0,0,'TIME TABLE'!$B$7)","v":"2022-04-02"},{"$f":"IF(C2462=0,0,CONCATENATE('TIME TABLE'!$C$7,'TIME TABLE'!$D$7,'TIME TABLE'!$E$7))","v":"(Saturday)"},{"$f":"IF(C2462=0,0,'TIME TABLE'!$C$3)","v":"09:00 AM to 11:45 AM"}]
[null,null,{"$f":"'TIME TABLE'!$F$8","v":"Mathematics"},null,null,{"$f":"IF(C2463=0,0,'TIME TABLE'!$B$8)","v":"2022-04-03"},{"$f":"IF(C2463=0,0,CONCATENATE('TIME TABLE'!$C$8,'TIME TABLE'!$D$8,'TIME TABLE'!$E$8))","v":"(Sunday)"},{"$f":"IF(C2463=0,0,'TIME TABLE'!$C$3)","v":"09:00 AM to 11:45 AM"}]
[null,null,{"$f":"'TIME TABLE'!$F$9","v":"Social Study"},null,null,{"$f":"IF(C2464=0,0,'TIME TABLE'!$B$9)","v":"2022-04-04"},{"$f":"IF(C2464=0,0,CONCATENATE('TIME TABLE'!$C$9,'TIME TABLE'!$D$9,'TIME TABLE'!$E$9))","v":"(Monday)"},{"$f":"IF(C2464=0,0,'TIME TABLE'!$C$3)","v":"09:00 AM to 11:45 AM"}]
[null,null,{"$f":"'TIME TABLE'!$F$10","v":"Sanskrit"},null,null,{"$f":"IF(C2465=0,0,'TIME TABLE'!$B$10)","v":"2022-04-05"},{"$f":"IF(C2465=0,0,CONCATENATE('TIME TABLE'!$C$10,'TIME TABLE'!$D$10,'TIME TABLE'!$E$10))","v":"(Tuesday)"},{"$f":"IF(C2465=0,0,'TIME TABLE'!$C$3)","v":"09:00 AM to 11:45 AM"}]
[null,null,{"$f":"'TIME TABLE'!$F$11","v":0},null,null,{"$f":"IF(C2466=0,0,'TIME TABLE'!$B$11)","v":"00:00:00"},{"$f":"IF(C2466=0,0,CONCATENATE('TIME TABLE'!$C$11,'TIME TABLE'!$D$11,'TIME TABLE'!$E$11))","v":0},{"$f":"IF(C2466=0,0,'TIME TABLE'!$C$3)","v":0}]
[null,null,{"$f":"'TIME TABLE'!$F$12","v":0},null,null,{"$f":"IF(C2467=0,0,'TIME TABLE'!$B$12)","v":"00:00:00"},{"$f":"IF(C2467=0,0,CONCATENATE('TIME TABLE'!$C$12,'TIME TABLE'!$D$12,'TIME TABLE'!$E$12))","v":0},{"$f":"IF(C2467=0,0,'TIME TABLE'!$C$3)","v":0}]
[null,null,{"$f":"'TIME TABLE'!$F$13","v":0},null,null,{"$f":"IF(C2468=0,0,'TIME TABLE'!$B$13)","v":"00:00:00"},{"$f":"IF(C2468=0,0,CONCATENATE('TIME TABLE'!$C$13,'TIME TABLE'!$D$13,'TIME TABLE'!$E$13))","v":0},{"$f":"IF(C2468=0,0,'TIME TABLE'!$C$3)","v":0}]
[null,null,{"$f":"'TIME TABLE'!$F$14","v":0},null,null,{"$f":"IF(C2469=0,0,'TIME TABLE'!$B$14)","v":"00:00:00"},{"$f":"IF(C2469=0,0,CONCATENATE('TIME TABLE'!$C$14,'TIME TABLE'!$D$14,'TIME TABLE'!$E$14))","v":0},{"$f":"IF(C2469=0,0,'TIME TABLE'!$C$3)","v":0}]
[null,null,"Instructions"]
[null,null,1,"Check the exam time table carefully."]
[null,null,2,"Students must bring the 'Admit Card' and show it to the invigilator(s) on duty and should preserve it for future requirements."]
[null,null,3,"Mobile Phone, Calculator, Digital Watch or any Electronic Device is NOT ALLOWED."]
[null,null,4,"Arrive at the School at least 15 minutes before the start examination."]
[null,null,5,"Student is barred from entering the examination hall 15 minutes after the written examination starts."]
[null,null,6,"Ensure that you use the washroom before arriving for your exam as you will not be permitted to leave during the first hour."]
[null,null,7,"Normally, you are required to answer questionsusing blue or black in . Make sure you bring some spare pens with you."]
[null,null,8,"Keep your eyes on your own paper. Remember, copying is cheating!"]
[null,null,9,"You must remain silent until after you have exited the school building."]
[{"$f":"A2447+1","v":75}]
[{"$nulls":4},{"$f":"MASTER!$E$11","v":"Govt. Sr. Secondary School Raimalwada"}]
[{"$nulls":4},{"$f":"MASTER!$E$14","v":"P.S.-Bapini (Jodhpur)"}]
[null,{"$f":"CONCATENATE(C2484,'TIME TABLE'!$C$5,'ADMIT CARD'!$C2485,$F2485,'ADMIT CARD'!$G2485,'TIME TABLE'!$E$5)","v":"ADMIT CARD(Roll Number●→0)"},{"$f":"CONCATENATE('TIME TABLE'!$B$2,'TIME TABLE'!$F$2)","v":"HALF YEARLY EXAM:2021-22"}]
[null,null,"ADMIT CARD",{"$nulls":6}," "]
[null,null,"Roll Number",null,null,"●→",{"$f":"VLOOKUP(A2480,'STUDENT DETAIL'!$C$8:$I$107,3)","v":0},null,"Seal and Signature of Head of Institution"]
[null,null,"Student's Name",null,null,"●→",{"$f":"VLOOKUP(A2480,'STUDENT DETAIL'!$C$8:$I$107,4)","v":0}]
[null,null,"Father's Name",null,null,"●→",{"$f":"VLOOKUP(A2480,'STUDENT DETAIL'!$C$8:$I$107,5)","v":0}]
[null,null,"Mother's Name ",null,null,"●→",{"$f":"VLOOKUP(A2480,'STUDENT DETAIL'!$C$8:$I$107,6)","v":0}]
[null,null,"Class & Section",null,null,"●→",{"$f":"IF(G2485=0,0,CONCATENATE('STUDENT DETAIL'!$E$4,'STUDENT DETAIL'!$H$4))","v":0}]
[null,null,"Date Of Birth",null,null,"●→",{"$f":"VLOOKUP(A2480,'STUDENT DETAIL'!$C$8:$I$107,7)","v":"00:00:00"}]
[null,null,"Time Table"]
[null,null,"Subject",null,null,"Date (Day)",null,"Time"]
[null,null,{"$f":"'TIME TABLE'!$F$5","v":"Hindi"},null,null,{"$f":"IF(C2493=0,0,'TIME TABLE'!$B$5)","v":"2022-03-31"},{"$f":"IF(C2493=0,0,CONCATENATE('TIME TABLE'!$C$5,'TIME TABLE'!$D$5,'TIME TABLE'!$E$5))","v":"(Thursday)"},{"$f":"IF(C2493=0,0,'TIME TABLE'!$C$3)","v":"09:00 AM to 11:45 AM"}]
[null,null,{"$f":"'TIME TABLE'!$F$6","v":"English"},null,null,{"$f":"IF(C2494=0,0,'TIME TABLE'!$B$6)","v":"2022-04-01"},{"$f":"IF(C2494=0,0,CONCATENATE('TIME TABLE'!$C$6,'TIME TABLE'!$D$6,'TIME TABLE'!$E$6))","v":"(Friday)"},{"$f":"IF(C2494=0,0,'TIME TABLE'!$C$3)","v":"09:00 AM to 11:45 AM"}]
[null,null,{"$f":"'TIME TABLE'!$F$7","v":"Science"},null,null,{"$f":"IF(C2495=0,0,'TIME TABLE'!$B$7)","v":"2022-04-02"},{"$f":"IF(C2495=0,0,CONCATENATE('TIME TABLE'!$C$7,'TIME TABLE'!$D$7,'TIME TABLE'!$E$7))","v":"(Saturday)"},{"$f":"IF(C2495=0,0,'TIME TABLE'!$C$3)","v":"09:00 AM to 11:45 AM"}]
[null,null,{"$f":"'TIME TABLE'!$F$8","v":"Mathematics"},null,null,{"$f":"IF(C2496=0,0,'TIME TABLE'!$B$8)","v":"2022-04-03"},{"$f":"IF(C2496=0,0,CONCATENATE('TIME TABLE'!$C$8,'TIME TABLE'!$D$8,'TIME TABLE'!$E$8))","v":"(Sunday)"},{"$f":"IF(C2496=0,0,'TIME TABLE'!$C$3)","v":"09:00 AM to 11:45 AM"}]
[null,null,{"$f":"'TIME TABLE'!$F$9","v":"Social Study"},null,null,{"$f":"IF(C2497=0,0,'TIME TABLE'!$B$9)","v":"2022-04-04"},{"$f":"IF(C2497=0,0,CONCATENATE('TIME TABLE'!$C$9,'TIME TABLE'!$D$9,'TIME TABLE'!$E$9))","v":"(Monday)"},{"$f":"IF(C2497=0,0,'TIME TABLE'!$C$3)","v":"09:00 AM to 11:45 AM"}]
[null,null,{"$f":"'TIME TABLE'!$F$10","v":"Sanskrit"},null,null,{"$f":"IF(C2498=0,0,'TIME TABLE'!$B$10)","v":"2022-04-05"},{"$f":"IF(C2498=0,0,CONCATENATE('TIME TABLE'!$C$10,'TIME TABLE'!$D$10,'TIME TABLE'!$E$10))","v":"(Tuesday)"},{"$f":"IF(C2498=0,0,'TIME TABLE'!$C$3)","v":"09:00 AM to 11:45 AM"}]
[null,null,{"$f":"'TIME TABLE'!$F$11","v":0},null,null,{"$f":"IF(C2499=0,0,'TIME TABLE'!$B$11)","v":"00:00:00"},{"$f":"IF(C2499=0,0,CONCATENATE('TIME TABLE'!$C$11,'TIME TABLE'!$D$11,'TIME TABLE'!$E$11))","v":0},{"$f":"IF(C2499=0,0,'TIME TABLE'!$C$3)","v":0}]
[null,null,{"$f":"'TIME TABLE'!$F$12","v":0},null,null,{"$f":"IF(C2500=0,0,'TIME TABLE'!$B$12)","v":"00:00:00"},{"$f":"IF(C2500=0,0,CONCATENATE('TIME TABLE'!$C$12,'TIME TABLE'!$D$12,'TIME TABLE'!$E$12))","v":0},{"$f":"IF(C2500=0,0,'TIME TABLE'!$C$3)","v":0}]
[null,null,{"$f":"'TIME TABLE'!$F$13","v":0},null,null,{"$f":"IF(C2501=0,0,'TIME TABLE'!$B$13)","v":"00:00:00"},{"$f":"IF(C2501=0,0,CONCATENATE('TIME TABLE'!$C$13,'TIME TABLE'!$D$13,'TIME TABLE'!$E$13))","v":0},{"$f":"IF(C2501=0,0,'TIME TABLE'!$C$3)","v":0}]
[null,null,{"$f":"'TIME TABLE'!$F$14","v":0},null,null,{"$f":"IF(C2502=0,0,'TIME TABLE'!$B$14)","v":"00:00:00"},{"$f":"IF(C2502=0,0,CONCATENATE('TIME TABLE'!$C$14,'TIME TABLE'!$D$14,'TIME TABLE'!$E$14))","v":0},{"$f":"IF(C2502=0,0,'TIME TABLE'!$C$3)","v":0}]
[null,null,"Instructions"]
[null,null,1,"Check the exam time table carefully."]
[null,null,2,"Students must bring the 'Admit Card' and show it to the invigilator(s) on duty and should preserve it for future requirements."]
[null,null,3,"Mobile Phone, Calculator, Digital Watch or any Electronic Device is NOT ALLOWED."]
[null,null,4,"Arrive at the School at least 15 minutes before the start examination."]
[null,null,5,"Student is barred from entering the examination hall 15 minutes after the written examination starts."]
[null,null,6,"Ensure that you use the washroom before arriving for your exam as you will not be permitted to leave during the first hour."]
[null,null,7,"Normally, you are required to answer questionsusing blue or black in . Make sure you bring some spare pens with you."]
[null,null,8,"Keep your eyes on your own paper. Remember, copying is cheating!"]
[null,null,9,"You must remain silent until after you have exited the school building."]
[]
[{"$f":"A2480+1","v":76}]
[{"$nulls":4},{"$f":"MASTER!$E$11","v":"Govt. Sr. Secondary School Raimalwada"}]
[{"$nulls":4},{"$f":"MASTER!$E$14","v":"P.S.-Bapini (Jodhpur)"}]
[null,{"$f":"CONCATENATE(C2518,'TIME TABLE'!$C$5,'ADMIT CARD'!$C2519,$F2519,'ADMIT CARD'!$G2519,'TIME TABLE'!$E$5)","v":"ADMIT CARD(Roll Number●→0)"},{"$f":"CONCATENATE('TIME TABLE'!$B$2,'TIME TABLE'!$F$2)","v":"HALF YEARLY EXAM:2021-22"}]
[null,null,"ADMIT CARD",{"$nulls":6}," "]
[null,null,"Roll Number",null,null,"●→",{"$f":"VLOOKUP(A2514,'STUDENT DETAIL'!$C$8:$I$107,3)","v":0},null,"Seal and Signature of Head of Institution"]
[null,null,"Student's Name",null,null,"●→",{"$f":"VLOOKUP(A2514,'STUDENT DETAIL'!$C$8:$I$107,4)","v":0}]
[null,null,"Father's Name",null,null,"●→",{"$f":"VLOOKUP(A2514,'STUDENT DETAIL'!$C$8:$I$107,5)","v":0}]
[null,null,"Mother's Name ",null,null,"●→",{"$f":"VLOOKUP(A2514,'STUDENT DETAIL'!$C$8:$I$107,6)","v":0}]
[null,null,"Class & Section",null,null,"●→",{"$f":"IF(G2519=0,0,CONCATENATE('STUDENT DETAIL'!$E$4,'STUDENT DETAIL'!$H$4))","v":0}]
[null,null,"Date Of Birth",null,null,"●→",{"$f":"VLOOKUP(A2514,'STUDENT DETAIL'!$C$8:$I$107,7)","v":"00:00:00"}]
[null,null,"Time Table"]
[null,null,"Subject",null,null,"Date (Day)",null,"Time"]
[null,null,{"$f":"'TIME TABLE'!$F$5","v":"Hindi"},null,null,{"$f":"IF(C2527=0,0,'TIME TABLE'!$B$5)","v":"2022-03-31"},{"$f":"IF(C2527=0,0,CONCATENATE('TIME TABLE'!$C$5,'TIME TABLE'!$D$5,'TIME TABLE'!$E$5))","v":"(Thursday)"},{"$f":"IF(C2527=0,0,'TIME TABLE'!$C$3)","v":"09:00 AM to 11:45 AM"}]
[null,null,{"$f":"'TIME TABLE'!$F$6","v":"English"},null,null,{"$f":"IF(C2528=0,0,'TIME TABLE'!$B$6)","v":"2022-04-01"},{"$f":"IF(C2528=0,0,CONCATENATE('TIME TABLE'!$C$6,'TIME TABLE'!$D$6,'TIME TABLE'!$E$6))","v":"(Friday)"},{"$f":"IF(C2528=0,0,'TIME TABLE'!$C$3)","v":"09:00 AM to 11:45 AM"}]
[null,null,{"$f":"'TIME TABLE'!$F$7","v":"Science"},null,null,{"$f":"IF(C2529=0,0,'TIME TABLE'!$B$7)","v":"2022-04-02"},{"$f":"IF(C2529=0,0,CONCATENATE('TIME TABLE'!$C$7,'TIME TABLE'!$D$7,'TIME TABLE'!$E$7))","v":"(Saturday)"},{"$f":"IF(C2529=0,0,'TIME TABLE'!$C$3)","v":"09:00 AM to 11:45 AM"}]
[null,null,{"$f":"'TIME TABLE'!$F$8","v":"Mathematics"},null,null,{"$f":"IF(C2530=0,0,'TIME TABLE'!$B$8)","v":"2022-04-03"},{"$f":"IF(C2530=0,0,CONCATENATE('TIME TABLE'!$C$8,'TIME TABLE'!$D$8,'TIME TABLE'!$E$8))","v":"(Sunday)"},{"$f":"IF(C2530=0,0,'TIME TABLE'!$C$3)","v":"09:00 AM to 11:45 AM"}]
[null,null,{"$f":"'TIME TABLE'!$F$9","v":"Social Study"},null,null,{"$f":"IF(C2531=0,0,'TIME TABLE'!$B$9)","v":"2022-04-04"},{"$f":"IF(C2531=0,0,CONCATENATE('TIME TABLE'!$C$9,'TIME TABLE'!$D$9,'TIME TABLE'!$E$9))","v":"(Monday)"},{"$f":"IF(C2531=0,0,'TIME TABLE'!$C$3)","v":"09:00 AM to 11:45 AM"}]
[null,null,{"$f":"'TIME TABLE'!$F$10","v":"Sanskrit"},null,null,{"$f":"IF(C2532=0,0,'TIME TABLE'!$B$10)","v":"2022-04-05"},{"$f":"IF(C2532=0,0,CONCATENATE('TIME TABLE'!$C$10,'TIME TABLE'!$D$10,'TIME TABLE'!$E$10))","v":"(Tuesday)"},{"$f":"IF(C2532=0,0,'TIME TABLE'!$C$3)","v":"09:00 AM to 11:45 AM"}]
[null,null,{"$f":"'TIME TABLE'!$F$11","v":0},null,null,{"$f":"IF(C2533=0,0,'TIME TABLE'!$B$11)","v":"00:00:00"},{"$f":"IF(C2533=0,0,CONCATENATE('TIME TABLE'!$C$11,'TIME TABLE'!$D$11,'TIME TABLE'!$E$11))","v":0},{"$f":"IF(C2533=0,0,'TIME TABLE'!$C$3)","v":0}]
[null,null,{"$f":"'TIME TABLE'!$F$12","v":0},null,null,{"$f":"IF(C2534=0,0,'TIME TABLE'!$B$12)","v":"00:00:00"},{"$f":"IF(C2534=0,0,CONCATENATE('TIME TABLE'!$C$12,'TIME TABLE'!$D$12,'TIME TABLE'!$E$12))","v":0},{"$f":"IF(C2534=0,0,'TIME TABLE'!$C$3)","v":0}]
[null,null,{"$f":"'TIME TABLE'!$F$13","v":0},null,null,{"$f":"IF(C2535=0,0,'TIME TABLE'!$B$13)","v":"00:00:00"},{"$f":"IF(C2535=0,0,CONCATENATE('TIME TABLE'!$C$13,'TIME TABLE'!$D$13,'TIME TABLE'!$E$13))","v":0},{"$f":"IF(C2535=0,0,'TIME TABLE'!$C$3)","v":0}]
[null,null,{"$f":"'TIME TABLE'!$F$14","v":0},null,null,{"$f":"IF(C2536=0,0,'TIME TABLE'!$B$14)","v":"00:00:00"},{"$f":"IF(C2536=0,0,CONCATENATE('TIME TABLE'!$C$14,'TIME TABLE'!$D$14,'TIME TABLE'!$E$14))","v":0},{"$f":"IF(C2536=0,0,'TIME TABLE'!$C$3)","v":0}]
[null,null,"Instructions"]
[null,null,1,"Check the exam time table carefully."]
[null,null,2,"Students must bring the 'Admit Card' and show it to the invigilator(s) on duty and should preserve it for future requirements."]
[null,null,3,"Mobile Phone, Calculator, Digital Watch or any Electronic Device is NOT ALLOWED."]
[null,null,4,"Arrive at the School at least 15 minutes before the start examination."]
[null,null,5,"Student is barred from entering the examination hall 15 minutes after the written examination starts."]
[null,null,6,"Ensure that you use the washroom before arriving for your exam as you will not be permitted to leave during the first hour."]
[null,null,7,"Normally, you are required to answer questionsusing blue or black in . Make sure you bring some spare pens with you."]
[null,null,8,"Keep your eyes on your own paper. Remember, copying is cheating!"]
[null,null,9,"You must remain silent until after you have exited the school building."]
[{"$f":"A2514+1","v":77}]
[{"$nulls":4},{"$f":"MASTER!$E$11","v":"Govt. Sr. Secondary School Raimalwada"}]
[{"$nulls":4},{"$f":"MASTER!$E$14","v":"P.S.-Bapini (Jodhpur)"}]
[null,{"$f":"CONCATENATE(C2551,'TIME TABLE'!$C$5,'ADMIT CARD'!$C2552,$F2552,'ADMIT CARD'!$G2552,'TIME TABLE'!$E$5)","v":"ADMIT CARD(Roll Number●→0)"},{"$f":"CONCATENATE('TIME TABLE'!$B$2,'TIME TABLE'!$F$2)","v":"HALF YEARLY EXAM:2021-22"}]
[null,null,"ADMIT CARD",{"$nulls":6}," "]
[null,null,"Roll Number",null,null,"●→",{"$f":"VLOOKUP(A2547,'STUDENT DETAIL'!$C$8:$I$107,3)","v":0},null,"Seal and Signature of Head of Institution"]
[null,null,"Student's Name",null,null,"●→",{"$f":"VLOOKUP(A2547,'STUDENT DETAIL'!$C$8:$I$107,4)","v":0}]
[null,null,"Father's Name",null,null,"●→",{"$f":"VLOOKUP(A2547,'STUDENT DETAIL'!$C$8:$I$107,5)","v":0}]
[null,null,"Mother's Name ",null,null,"●→",{"$f":"VLOOKUP(A2547,'STUDENT DETAIL'!$C$8:$I$107,6)","v":0}]
[null,null,"Class & Section",null,null,"●→",{"$f":"IF(G2552=0,0,CONCATENATE('STUDENT DETAIL'!$E$4,'STUDENT DETAIL'!$H$4))","v":0}]
[null,null,"Date Of Birth",null,null,"●→",{"$f":"VLOOKUP(A2547,'STUDENT DETAIL'!$C$8:$I$107,7)","v":"00:00:00"}]
[null,null,"Time Table"]
[null,null,"Subject",null,null,"Date (Day)",null,"Time"]
[null,null,{"$f":"'TIME TABLE'!$F$5","v":"Hindi"},null,null,{"$f":"IF(C2560=0,0,'TIME TABLE'!$B$5)","v":"2022-03-31"},{"$f":"IF(C2560=0,0,CONCATENATE('TIME TABLE'!$C$5,'TIME TABLE'!$D$5,'TIME TABLE'!$E$5))","v":"(Thursday)"},{"$f":"IF(C2560=0,0,'TIME TABLE'!$C$3)","v":"09:00 AM to 11:45 AM"}]
[null,null,{"$f":"'TIME TABLE'!$F$6","v":"English"},null,null,{"$f":"IF(C2561=0,0,'TIME TABLE'!$B$6)","v":"2022-04-01"},{"$f":"IF(C2561=0,0,CONCATENATE('TIME TABLE'!$C$6,'TIME TABLE'!$D$6,'TIME TABLE'!$E$6))","v":"(Friday)"},{"$f":"IF(C2561=0,0,'TIME TABLE'!$C$3)","v":"09:00 AM to 11:45 AM"}]
[null,null,{"$f":"'TIME TABLE'!$F$7","v":"Science"},null,null,{"$f":"IF(C2562=0,0,'TIME TABLE'!$B$7)","v":"2022-04-02"},{"$f":"IF(C2562=0,0,CONCATENATE('TIME TABLE'!$C$7,'TIME TABLE'!$D$7,'TIME TABLE'!$E$7))","v":"(Saturday)"},{"$f":"IF(C2562=0,0,'TIME TABLE'!$C$3)","v":"09:00 AM to 11:45 AM"}]
[null,null,{"$f":"'TIME TABLE'!$F$8","v":"Mathematics"},null,null,{"$f":"IF(C2563=0,0,'TIME TABLE'!$B$8)","v":"2022-04-03"},{"$f":"IF(C2563=0,0,CONCATENATE('TIME TABLE'!$C$8,'TIME TABLE'!$D$8,'TIME TABLE'!$E$8))","v":"(Sunday)"},{"$f":"IF(C2563=0,0,'TIME TABLE'!$C$3)","v":"09:00 AM to 11:45 AM"}]
[null,null,{"$f":"'TIME TABLE'!$F$9","v":"Social Study"},null,null,{"$f":"IF(C2564=0,0,'TIME TABLE'!$B$9)","v":"2022-04-04"},{"$f":"IF(C2564=0,0,CONCATENATE('TIME TABLE'!$C$9,'TIME TABLE'!$D$9,'TIME TABLE'!$E$9))","v":"(Monday)"},{"$f":"IF(C2564=0,0,'TIME TABLE'!$C$3)","v":"09:00 AM to 11:45 AM"}]
[null,null,{"$f":"'TIME TABLE'!$F$10","v":"Sanskrit"},null,null,{"$f":"IF(C2565=0,0,'TIME TABLE'!$B$10)","v":"2022-04-05"},{"$f":"IF(C2565=0,0,CONCATENATE('TIME TABLE'!$C$10,'TIME TABLE'!$D$10,'TIME TABLE'!$E$10))","v":"(Tuesday)"},{"$f":"IF(C2565=0,0,'TIME TABLE'!$C$3)","v":"09:00 AM to 11:45 AM"}]
[null,null,{"$f":"'TIME TABLE'!$F$11","v":0},null,null,{"$f":"IF(C2566=0,0,'TIME TABLE'!$B$11)","v":"00:00:00"},{"$f":"IF(C2566=0,0,CONCATENATE('TIME TABLE'!$C$11,'TIME TABLE'!$D$11,'TIME TABLE'!$E$11))","v":0},{"$f":"IF(C2566=0,0,'TIME TABLE'!$C$3)","v":0}]
[null,null,{"$f":"'TIME TABLE'!$F$12","v":0},null,null,{"$f":"IF(C2567=0,0,'TIME TABLE'!$B$12)","v":"00:00:00"},{"$f":"IF(C2567=0,0,CONCATENATE('TIME TABLE'!$C$12,'TIME TABLE'!$D$12,'TIME TABLE'!$E$12))","v":0},{"$f":"IF(C2567=0,0,'TIME TABLE'!$C$3)","v":0}]
[null,null,{"$f":"'TIME TABLE'!$F$13","v":0},null,null,{"$f":"IF(C2568=0,0,'TIME TABLE'!$B$13)","v":"00:00:00"},{"$f":"IF(C2568=0,0,CONCATENATE('TIME TABLE'!$C$13,'TIME TABLE'!$D$13,'TIME TABLE'!$E$13))","v":0},{"$f":"IF(C2568=0,0,'TIME TABLE'!$C$3)","v":0}]
[null,null,{"$f":"'TIME TABLE'!$F$14","v":0},null,null,{"$f":"IF(C2569=0,0,'TIME TABLE'!$B$14)","v":"00:00:00"},{"$f":"IF(C2569=0,0,CONCATENATE('TIME TABLE'!$C$14,'TIME TABLE'!$D$14,'TIME TABLE'!$E$14))","v":0},{"$f":"IF(C2569=0,0,'TIME TABLE'!$C$3)","v":0}]
[null,null,"Instructions"]
[null,null,1,"Check the exam time table carefully."]
[null,null,2,"Students must bring the 'Admit Card' and show it to the invigilator(s) on duty and should preserve it for future requirements."]
[null,null,3,"Mobile Phone, Calculator, Digital Watch or any Electronic Device is NOT ALLOWED."]
[null,null,4,"Arrive at the School at least 15 minutes before the start examination."]
[null,null,5,"Student is barred from entering the examination hall 15 minutes after the written examination starts."]
[null,null,6,"Ensure that you use the washroom before arriving for your exam as you will not be permitted to leave during the first hour."]
[null,null,7,"Normally, you are required to answer questionsusing blue or black in . Make sure you bring some spare pens with you."]
[null,null,8,"Keep your eyes on your own paper. Remember, copying is cheating!"]
[null,null,9,"You must remain silent until after you have exited the school building."]
[]
[{"$f":"A2547+1","v":78}]
[{"$nulls":4},{"$f":"MASTER!$E$11","v":"Govt. Sr. Secondary School Raimalwada"}]
[{"$nulls":4},{"$f":"MASTER!$E$14","v":"P.S.-Bapini (Jodhpur)"}]
[null,{"$f":"CONCATENATE(C2585,'TIME TABLE'!$C$5,'ADMIT CARD'!$C2586,$F2586,'ADMIT CARD'!$G2586,'TIME TABLE'!$E$5)","v":"ADMIT CARD(Roll Number●→0)"},{"$f":"CONCATENATE('TIME TABLE'!$B$2,'TIME TABLE'!$F$2)","v":"HALF YEARLY EXAM:2021-22"}]
[null,null,"ADMIT CARD",{"$nulls":6}," "]
[null,null,"Roll Number",null,null,"●→",{"$f":"VLOOKUP(A2581,'STUDENT DETAIL'!$C$8:$I$107,3)","v":0},null,"Seal and Signature of Head of Institution"]
[null,null,"Student's Name",null,null,"●→",{"$f":"VLOOKUP(A2581,'STUDENT DETAIL'!$C$8:$I$107,4)","v":0}]
[null,null,"Father's Name",null,null,"●→",{"$f":"VLOOKUP(A2581,'STUDENT DETAIL'!$C$8:$I$107,5)","v":0}]
[null,null,"Mother's Name ",null,null,"●→",{"$f":"VLOOKUP(A2581,'STUDENT DETAIL'!$C$8:$I$107,6)","v":0}]
[null,null,"Class & Section",null,null,"●→",{"$f":"IF(G2586=0,0,CONCATENATE('STUDENT DETAIL'!$E$4,'STUDENT DETAIL'!$H$4))","v":0}]
[null,null,"Date Of Birth",null,null,"●→",{"$f":"VLOOKUP(A2581,'STUDENT DETAIL'!$C$8:$I$107,7)","v":"00:00:00"}]
[null,null,"Time Table"]
[null,null,"Subject",null,null,"Date (Day)",null,"Time"]
[null,null,{"$f":"'TIME TABLE'!$F$5","v":"Hindi"},null,null,{"$f":"IF(C2594=0,0,'TIME TABLE'!$B$5)","v":"2022-03-31"},{"$f":"IF(C2594=0,0,CONCATENATE('TIME TABLE'!$C$5,'TIME TABLE'!$D$5,'TIME TABLE'!$E$5))","v":"(Thursday)"},{"$f":"IF(C2594=0,0,'TIME TABLE'!$C$3)","v":"09:00 AM to 11:45 AM"}]
[null,null,{"$f":"'TIME TABLE'!$F$6","v":"English"},null,null,{"$f":"IF(C2595=0,0,'TIME TABLE'!$B$6)","v":"2022-04-01"},{"$f":"IF(C2595=0,0,CONCATENATE('TIME TABLE'!$C$6,'TIME TABLE'!$D$6,'TIME TABLE'!$E$6))","v":"(Friday)"},{"$f":"IF(C2595=0,0,'TIME TABLE'!$C$3)","v":"09:00 AM to 11:45 AM"}]
[null,null,{"$f":"'TIME TABLE'!$F$7","v":"Science"},null,null,{"$f":"IF(C2596=0,0,'TIME TABLE'!$B$7)","v":"2022-04-02"},{"$f":"IF(C2596=0,0,CONCATENATE('TIME TABLE'!$C$7,'TIME TABLE'!$D$7,'TIME TABLE'!$E$7))","v":"(Saturday)"},{"$f":"IF(C2596=0,0,'TIME TABLE'!$C$3)","v":"09:00 AM to 11:45 AM"}]
[null,null,{"$f":"'TIME TABLE'!$F$8","v":"Mathematics"},null,null,{"$f":"IF(C2597=0,0,'TIME TABLE'!$B$8)","v":"2022-04-03"},{"$f":"IF(C2597=0,0,CONCATENATE('TIME TABLE'!$C$8,'TIME TABLE'!$D$8,'TIME TABLE'!$E$8))","v":"(Sunday)"},{"$f":"IF(C2597=0,0,'TIME TABLE'!$C$3)","v":"09:00 AM to 11:45 AM"}]
[null,null,{"$f":"'TIME TABLE'!$F$9","v":"Social Study"},null,null,{"$f":"IF(C2598=0,0,'TIME TABLE'!$B$9)","v":"2022-04-04"},{"$f":"IF(C2598=0,0,CONCATENATE('TIME TABLE'!$C$9,'TIME TABLE'!$D$9,'TIME TABLE'!$E$9))","v":"(Monday)"},{"$f":"IF(C2598=0,0,'TIME TABLE'!$C$3)","v":"09:00 AM to 11:45 AM"}]
[null,null,{"$f":"'TIME TABLE'!$F$10","v":"Sanskrit"},null,null,{"$f":"IF(C2599=0,0,'TIME TABLE'!$B$10)","v":"2022-04-05"},{"$f":"IF(C2599=0,0,CONCATENATE('TIME TABLE'!$C$10,'TIME TABLE'!$D$10,'TIME TABLE'!$E$10))","v":"(Tuesday)"},{"$f":"IF(C2599=0,0,'TIME TABLE'!$C$3)","v":"09:00 AM to 11:45 AM"}]
[null,null,{"$f":"'TIME TABLE'!$F$11","v":0},null,null,{"$f":"IF(C2600=0,0,'TIME TABLE'!$B$11)","v":"00:00:00"},{"$f":"IF(C2600=0,0,CONCATENATE('TIME TABLE'!$C$11,'TIME TABLE'!$D$11,'TIME TABLE'!$E$11))","v":0},{"$f":"IF(C2600=0,0,'TIME TABLE'!$C$3)","v":0}]
[null,null,{"$f":"'TIME TABLE'!$F$12","v":0},null,null,{"$f":"IF(C2601=0,0,'TIME TABLE'!$B$12)","v":"00:00:00"},{"$f":"IF(C2601=0,0,CONCATENATE('TIME TABLE'!$C$12,'TIME TABLE'!$D$12,'TIME TABLE'!$E$12))","v":0},{"$f":"IF(C2601=0,0,'TIME TABLE'!$C$3)","v":0}]
[null,null,{"$f":"'TIME TABLE'!$F$13","v":0},null,null,{"$f":"IF(C2602=0,0,'TIME TABLE'!$B$13)","v":"00:00:00"},{"$f":"IF(C2602=0,0,CONCATENATE('TIME TABLE'!$C$13,'TIME TABLE'!$D$13,'TIME TABLE'!$E$13))","v":0},{"$f":"IF(C2602=0,0,'TIME TABLE'!$C$3)","v":0}]
[null,null,{"$f":"'TIME TABLE'!$F$14","v":0},null,null,{"$f":"IF(C2603=0,0,'TIME TABLE'!$B$14)","v":"00:00:00"},{"$f":"IF(C2603=0,0,CONCATENATE('TIME TABLE'!$C$14,'TIME TABLE'!$D$14,'TIME TABLE'!$E$14))","v":0},{"$f":"IF(C2603=0,0,'TIME TABLE'!$C$3)","v":0}]
[null,null,"Instructions"]
[null,null,1,"Check the exam time table carefully."]
[null,null,2,"Students must bring the 'Admit Card' and show it to the invigilator(s) on duty and should preserve it for future requirements."]
[null,null,3,"Mobile Phone, Calculator, Digital Watch or any Electronic Device is NOT ALLOWED."]
[null,null,4,"Arrive at the School at least 15 minutes before the start examination."]
[null,null,5,"Student is barred from entering the examination hall 15 minutes after the written examination starts."]
[null,null,6,"Ensure that you use the washroom before arriving for your exam as you will not be permitted to leave during the first hour."]
[null,null,7,"Normally, you are required to answer questionsusing blue or black in . Make sure you bring some spare pens with you."]
[null,null,8,"Keep your eyes on your own paper. Remember, copying is cheating!"]
[null,null,9,"You must remain silent until after you have exited the school building."]
[{"$f":"A2581+1","v":79}]
[{"$nulls":4},{"$f":"MASTER!$E$11","v":"Govt. Sr. Secondary School Raimalwada"}]
[{"$nulls":4},{"$f":"MASTER!$E$14","v":"P.S.-Bapini (Jodhpur)"}]
[null,{"$f":"CONCATENATE(C2618,'TIME TABLE'!$C$5,'ADMIT CARD'!$C2619,$F2619,'ADMIT CARD'!$G2619,'TIME TABLE'!$E$5)","v":"ADMIT CARD(Roll Number●→0)"},{"$f":"CONCATENATE('TIME TABLE'!$B$2,'TIME TABLE'!$F$2)","v":"HALF YEARLY EXAM:2021-22"}]
[null,null,"ADMIT CARD",{"$nulls":6}," "]
[null,null,"Roll Number",null,null,"●→",{"$f":"VLOOKUP(A2614,'STUDENT DETAIL'!$C$8:$I$107,3)","v":0},null,"Seal and Signature of Head of Institution"]
[null,null,"Student's Name",null,null,"●→",{"$f":"VLOOKUP(A2614,'STUDENT DETAIL'!$C$8:$I$107,4)","v":0}]
[null,null,"Father's Name",null,null,"●→",{"$f":"VLOOKUP(A2614,'STUDENT DETAIL'!$C$8:$I$107,5)","v":0}]
[null,null,"Mother's Name ",null,null,"●→",{"$f":"VLOOKUP(A2614,'STUDENT DETAIL'!$C$8:$I$107,6)","v":0}]
[null,null,"Class & Section",null,null,"●→",{"$f":"IF(G2619=0,0,CONCATENATE('STUDENT DETAIL'!$E$4,'STUDENT DETAIL'!$H$4))","v":0}]
[null,null,"Date Of Birth",null,null,"●→",{"$f":"VLOOKUP(A2614,'STUDENT DETAIL'!$C$8:$I$107,7)","v":"00:00:00"}]
[null,null,"Time Table"]
[null,null,"Subject",null,null,"Date (Day)",null,"Time"]
[null,null,{"$f":"'TIME TABLE'!$F$5","v":"Hindi"},null,null,{"$f":"IF(C2627=0,0,'TIME TABLE'!$B$5)","v":"2022-03-31"},{"$f":"IF(C2627=0,0,CONCATENATE('TIME TABLE'!$C$5,'TIME TABLE'!$D$5,'TIME TABLE'!$E$5))","v":"(Thursday)"},{"$f":"IF(C2627=0,0,'TIME TABLE'!$C$3)","v":"09:00 AM to 11:45 AM"}]
[null,null,{"$f":"'TIME TABLE'!$F$6","v":"English"},null,null,{"$f":"IF(C2628=0,0,'TIME TABLE'!$B$6)","v":"2022-04-01"},{"$f":"IF(C2628=0,0,CONCATENATE('TIME TABLE'!$C$6,'TIME TABLE'!$D$6,'TIME TABLE'!$E$6))","v":"(Friday)"},{"$f":"IF(C2628=0,0,'TIME TABLE'!$C$3)","v":"09:00 AM to 11:45 AM"}]
[null,null,{"$f":"'TIME TABLE'!$F$7","v":"Science"},null,null,{"$f":"IF(C2629=0,0,'TIME TABLE'!$B$7)","v":"2022-04-02"},{"$f":"IF(C2629=0,0,CONCATENATE('TIME TABLE'!$C$7,'TIME TABLE'!$D$7,'TIME TABLE'!$E$7))","v":"(Saturday)"},{"$f":"IF(C2629=0,0,'TIME TABLE'!$C$3)","v":"09:00 AM to 11:45 AM"}]
[null,null,{"$f":"'TIME TABLE'!$F$8","v":"Mathematics"},null,null,{"$f":"IF(C2630=0,0,'TIME TABLE'!$B$8)","v":"2022-04-03"},{"$f":"IF(C2630=0,0,CONCATENATE('TIME TABLE'!$C$8,'TIME TABLE'!$D$8,'TIME TABLE'!$E$8))","v":"(Sunday)"},{"$f":"IF(C2630=0,0,'TIME TABLE'!$C$3)","v":"09:00 AM to 11:45 AM"}]
[null,null,{"$f":"'TIME TABLE'!$F$9","v":"Social Study"},null,null,{"$f":"IF(C2631=0,0,'TIME TABLE'!$B$9)","v":"2022-04-04"},{"$f":"IF(C2631=0,0,CONCATENATE('TIME TABLE'!$C$9,'TIME TABLE'!$D$9,'TIME TABLE'!$E$9))","v":"(Monday)"},{"$f":"IF(C2631=0,0,'TIME TABLE'!$C$3)","v":"09:00 AM to 11:45 AM"}]
[null,null,{"$f":"'TIME TABLE'!$F$10","v":"Sanskrit"},null,null,{"$f":"IF(C2632=0,0,'TIME TABLE'!$B$10)","v":"2022-04-05"},{"$f":"IF(C2632=0,0,CONCATENATE('TIME TABLE'!$C$10,'TIME TABLE'!$D$10,'TIME TABLE'!$E$10))","v":"(Tuesday)"},{"$f":"IF(C2632=0,0,'TIME TABLE'!$C$3)","v":"09:00 AM to 11:45 AM"}]
[null,null,{"$f":"'TIME TABLE'!$F$11","v":0},null,null,{"$f":"IF(C2633=0,0,'TIME TABLE'!$B$11)","v":"00:00:00"},{"$f":"IF(C2633=0,0,CONCATENATE('TIME TABLE'!$C$11,'TIME TABLE'!$D$11,'TIME TABLE'!$E$11))","v":0},{"$f":"IF(C2633=0,0,'TIME TABLE'!$C$3)","v":0}]
[null,null,{"$f":"'TIME TABLE'!$F$12","v":0},null,null,{"$f":"IF(C2634=0,0,'TIME TABLE'!$B$12)","v":"00:00:00"},{"$f":"IF(C2634=0,0,CONCATENATE('TIME TABLE'!$C$12,'TIME TABLE'!$D$12,'TIME TABLE'!$E$12))","v":0},{"$f":"IF(C2634=0,0,'TIME TABLE'!$C$3)","v":0}]
[null,null,{"$f":"'TIME TABLE'!$F$13","v":0},null,null,{"$f":"IF(C2635=0,0,'TIME TABLE'!$B$13)","v":"00:00:00"},{"$f":"IF(C2635=0,0,CONCATENATE('TIME TABLE'!$C$13,'TIME TABLE'!$D$13,'TIME TABLE'!$E$13))","v":0},{"$f":"IF(C2635=0,0,'TIME TABLE'!$C$3)","v":0}]
[null,null,{"$f":"'TIME TABLE'!$F$14","v":0},null,null,{"$f":"IF(C2636=0,0,'TIME TABLE'!$B$14)","v":"00:00:00"},{"$f":"IF(C2636=0,0,CONCATENATE('TIME TABLE'!$C$14,'TIME TABLE'!$D$14,'TIME TABLE'!$E$14))","v":0},{"$f":"IF(C2636=0,0,'TIME TABLE'!$C$3)","v":0}]
[null,null,"Instructions"]
[null,null,1,"Check the exam time table carefully."]
[null,null,2,"Students must bring the 'Admit Card' and show it to the invigilator(s) on duty and should preserve it for future requirements."]
[null,null,3,"Mobile Phone, Calculator, Digital Watch or any Electronic Device is NOT ALLOWED."]
[null,null,4,"Arrive at the School at least 15 minutes before the start examination."]
[null,null,5,"Student is barred from entering the examination hall 15 minutes after the written examination starts."]
[null,null,6,"Ensure that you use the washroom before arriving for your exam as you will not be permitted to leave during the first hour."]
[null,null,7,"Normally, you are required to answer questionsusing blue or black in . Make sure you bring some spare pens with you."]
[null,null,8,"Keep your eyes on your own paper. Remember, copying is cheating!"]
[null,null,9,"You must remain silent until after you have exited the school building."]
[]
[{"$f":"A2614+1","v":80}]
[{"$nulls":4},{"$f":"MASTER!$E$11","v":"Govt. Sr. Secondary School Raimalwada"}]
[{"$nulls":4},{"$f":"MASTER!$E$14","v":"P.S.-Bapini (Jodhpur)"}]
[null,{"$f":"CONCATENATE(C2652,'TIME TABLE'!$C$5,'ADMIT CARD'!$C2653,$F2653,'ADMIT CARD'!$G2653,'TIME TABLE'!$E$5)","v":"ADMIT CARD(Roll Number●→0)"},{"$f":"CONCATENATE('TIME TABLE'!$B$2,'TIME TABLE'!$F$2)","v":"HALF YEARLY EXAM:2021-22"}]
[null,null,"ADMIT CARD",{"$nulls":6}," "]
[null,null,"Roll Number",null,null,"●→",{"$f":"VLOOKUP(A2648,'STUDENT DETAIL'!$C$8:$I$107,3)","v":0},null,"Seal and Signature of Head of Institution"]
[null,null,"Student's Name",null,null,"●→",{"$f":"VLOOKUP(A2648,'STUDENT DETAIL'!$C$8:$I$107,4)","v":0}]
[null,null,"Father's Name",null,null,"●→",{"$f":"VLOOKUP(A2648,'STUDENT DETAIL'!$C$8:$I$107,5)","v":0}]
[null,null,"Mother's Name ",null,null,"●→",{"$f":"VLOOKUP(A2648,'STUDENT DETAIL'!$C$8:$I$107,6)","v":0}]
[null,null,"Class & Section",null,null,"●→",{"$f":"IF(G2653=0,0,CONCATENATE('STUDENT DETAIL'!$E$4,'STUDENT DETAIL'!$H$4))","v":0}]
[null,null,"Date Of Birth",null,null,"●→",{"$f":"VLOOKUP(A2648,'STUDENT DETAIL'!$C$8:$I$107,7)","v":"00:00:00"}]
[null,null,"Time Table"]
[null,null,"Subject",null,null,"Date (Day)",null,"Time"]
[null,null,{"$f":"'TIME TABLE'!$F$5","v":"Hindi"},null,null,{"$f":"IF(C2661=0,0,'TIME TABLE'!$B$5)","v":"2022-03-31"},{"$f":"IF(C2661=0,0,CONCATENATE('TIME TABLE'!$C$5,'TIME TABLE'!$D$5,'TIME TABLE'!$E$5))","v":"(Thursday)"},{"$f":"IF(C2661=0,0,'TIME TABLE'!$C$3)","v":"09:00 AM to 11:45 AM"}]
[null,null,{"$f":"'TIME TABLE'!$F$6","v":"English"},null,null,{"$f":"IF(C2662=0,0,'TIME TABLE'!$B$6)","v":"2022-04-01"},{"$f":"IF(C2662=0,0,CONCATENATE('TIME TABLE'!$C$6,'TIME TABLE'!$D$6,'TIME TABLE'!$E$6))","v":"(Friday)"},{"$f":"IF(C2662=0,0,'TIME TABLE'!$C$3)","v":"09:00 AM to 11:45 AM"}]
[null,null,{"$f":"'TIME TABLE'!$F$7","v":"Science"},null,null,{"$f":"IF(C2663=0,0,'TIME TABLE'!$B$7)","v":"2022-04-02"},{"$f":"IF(C2663=0,0,CONCATENATE('TIME TABLE'!$C$7,'TIME TABLE'!$D$7,'TIME TABLE'!$E$7))","v":"(Saturday)"},{"$f":"IF(C2663=0,0,'TIME TABLE'!$C$3)","v":"09:00 AM to 11:45 AM"}]
[null,null,{"$f":"'TIME TABLE'!$F$8","v":"Mathematics"},null,null,{"$f":"IF(C2664=0,0,'TIME TABLE'!$B$8)","v":"2022-04-03"},{"$f":"IF(C2664=0,0,CONCATENATE('TIME TABLE'!$C$8,'TIME TABLE'!$D$8,'TIME TABLE'!$E$8))","v":"(Sunday)"},{"$f":"IF(C2664=0,0,'TIME TABLE'!$C$3)","v":"09:00 AM to 11:45 AM"}]
[null,null,{"$f":"'TIME TABLE'!$F$9","v":"Social Study"},null,null,{"$f":"IF(C2665=0,0,'TIME TABLE'!$B$9)","v":"2022-04-04"},{"$f":"IF(C2665=0,0,CONCATENATE('TIME TABLE'!$C$9,'TIME TABLE'!$D$9,'TIME TABLE'!$E$9))","v":"(Monday)"},{"$f":"IF(C2665=0,0,'TIME TABLE'!$C$3)","v":"09:00 AM to 11:45 AM"}]
[null,null,{"$f":"'TIME TABLE'!$F$10","v":"Sanskrit"},null,null,{"$f":"IF(C2666=0,0,'TIME TABLE'!$B$10)","v":"2022-04-05"},{"$f":"IF(C2666=0,0,CONCATENATE('TIME TABLE'!$C$10,'TIME TABLE'!$D$10,'TIME TABLE'!$E$10))","v":"(Tuesday)"},{"$f":"IF(C2666=0,0,'TIME TABLE'!$C$3)","v":"09:00 AM to 11:45 AM"}]
[null,null,{"$f":"'TIME TABLE'!$F$11","v":0},null,null,{"$f":"IF(C2667=0,0,'TIME TABLE'!$B$11)","v":"00:00:00"},{"$f":"IF(C2667=0,0,CONCATENATE('TIME TABLE'!$C$11,'TIME TABLE'!$D$11,'TIME TABLE'!$E$11))","v":0},{"$f":"IF(C2667=0,0,'TIME TABLE'!$C$3)","v":0}]
[null,null,{"$f":"'TIME TABLE'!$F$12","v":0},null,null,{"$f":"IF(C2668=0,0,'TIME TABLE'!$B$12)","v":"00:00:00"},{"$f":"IF(C2668=0,0,CONCATENATE('TIME TABLE'!$C$12,'TIME TABLE'!$D$12,'TIME TABLE'!$E$12))","v":0},{"$f":"IF(C2668=0,0,'TIME TABLE'!$C$3)","v":0}]
[null,null,{"$f":"'TIME TABLE'!$F$13","v":0},null,null,{"$f":"IF(C2669=0,0,'TIME TABLE'!$B$13)","v":"00:00:00"},{"$f":"IF(C2669=0,0,CONCATENATE('TIME TABLE'!$C$13,'TIME TABLE'!$D$13,'TIME TABLE'!$E$13))","v":0},{"$f":"IF(C2669=0,0,'TIME TABLE'!$C$3)","v":0}]
[null,null,{"$f":"'TIME TABLE'!$F$14","v":0},null,null,{"$f":"IF(C2670=0,0,'TIME TABLE'!$B$14)","v":"00:00:00"},{"$f":"IF(C2670=0,0,CONCATENATE('TIME TABLE'!$C$14,'TIME TABLE'!$D$14,'TIME TABLE'!$E$14))","v":0},{"$f":"IF(C2670=0,0,'TIME TABLE'!$C$3)","v":0}]
[null,null,"Instructions"]
[null,null,1,"Check the exam time table carefully."]
[null,null,2,"Students must bring the 'Admit Card' and show it to the invigilator(s) on duty and should preserve it for future requirements."]
[null,null,3,"Mobile Phone, Calculator, Digital Watch or any Electronic Device is NOT ALLOWED."]
[null,null,4,"Arrive at the School at least 15 minutes before the start examination."]
[null,null,5,"Student is barred from entering the examination hall 15 minutes after the written examination starts."]
[null,null,6,"Ensure that you use the washroom before arriving for your exam as you will not be permitted to leave during the first hour."]
[null,null,7,"Normally, you are required to answer questionsusing blue or black in . Make sure you bring some spare pens with you."]
[null,null,8,"Keep your eyes on your own paper. Remember, copying is cheating!"]
[null,null,9,"You must remain silent until after you have exited the school building."]
[{"$f":"A2648+1","v":81}]
[{"$nulls":4},{"$f":"MASTER!$E$11","v":"Govt. Sr. Secondary School Raimalwada"}]
[{"$nulls":4},{"$f":"MASTER!$E$14","v":"P.S.-Bapini (Jodhpur)"}]
[null,{"$f":"CONCATENATE(C2685,'TIME TABLE'!$C$5,'ADMIT CARD'!$C2686,$F2686,'ADMIT CARD'!$G2686,'TIME TABLE'!$E$5)","v":"ADMIT CARD(Roll Number●→0)"},{"$f":"CONCATENATE('TIME TABLE'!$B$2,'TIME TABLE'!$F$2)","v":"HALF YEARLY EXAM:2021-22"}]
[null,null,"ADMIT CARD",{"$nulls":6}," "]
[null,null,"Roll Number",null,null,"●→",{"$f":"VLOOKUP(A2681,'STUDENT DETAIL'!$C$8:$I$107,3)","v":0},null,"Seal and Signature of Head of Institution"]
[null,null,"Student's Name",null,null,"●→",{"$f":"VLOOKUP(A2681,'STUDENT DETAIL'!$C$8:$I$107,4)","v":0}]
[null,null,"Father's Name",null,null,"●→",{"$f":"VLOOKUP(A2681,'STUDENT DETAIL'!$C$8:$I$107,5)","v":0}]
[null,null,"Mother's Name ",null,null,"●→",{"$f":"VLOOKUP(A2681,'STUDENT DETAIL'!$C$8:$I$107,6)","v":0}]
[null,null,"Class & Section",null,null,"●→",{"$f":"IF(G2686=0,0,CONCATENATE('STUDENT DETAIL'!$E$4,'STUDENT DETAIL'!$H$4))","v":0}]
[null,null,"Date Of Birth",null,null,"●→",{"$f":"VLOOKUP(A2681,'STUDENT DETAIL'!$C$8:$I$107,7)","v":"00:00:00"}]
[null,null,"Time Table"]
[null,null,"Subject",null,null,"Date (Day)",null,"Time"]
[null,null,{"$f":"'TIME TABLE'!$F$5","v":"Hindi"},null,null,{"$f":"IF(C2694=0,0,'TIME TABLE'!$B$5)","v":"2022-03-31"},{"$f":"IF(C2694=0,0,CONCATENATE('TIME TABLE'!$C$5,'TIME TABLE'!$D$5,'TIME TABLE'!$E$5))","v":"(Thursday)"},{"$f":"IF(C2694=0,0,'TIME TABLE'!$C$3)","v":"09:00 AM to 11:45 AM"}]
[null,null,{"$f":"'TIME TABLE'!$F$6","v":"English"},null,null,{"$f":"IF(C2695=0,0,'TIME TABLE'!$B$6)","v":"2022-04-01"},{"$f":"IF(C2695=0,0,CONCATENATE('TIME TABLE'!$C$6,'TIME TABLE'!$D$6,'TIME TABLE'!$E$6))","v":"(Friday)"},{"$f":"IF(C2695=0,0,'TIME TABLE'!$C$3)","v":"09:00 AM to 11:45 AM"}]
[null,null,{"$f":"'TIME TABLE'!$F$7","v":"Science"},null,null,{"$f":"IF(C2696=0,0,'TIME TABLE'!$B$7)","v":"2022-04-02"},{"$f":"IF(C2696=0,0,CONCATENATE('TIME TABLE'!$C$7,'TIME TABLE'!$D$7,'TIME TABLE'!$E$7))","v":"(Saturday)"},{"$f":"IF(C2696=0,0,'TIME TABLE'!$C$3)","v":"09:00 AM to 11:45 AM"}]
[null,null,{"$f":"'TIME TABLE'!$F$8","v":"Mathematics"},null,null,{"$f":"IF(C2697=0,0,'TIME TABLE'!$B$8)","v":"2022-04-03"},{"$f":"IF(C2697=0,0,CONCATENATE('TIME TABLE'!$C$8,'TIME TABLE'!$D$8,'TIME TABLE'!$E$8))","v":"(Sunday)"},{"$f":"IF(C2697=0,0,'TIME TABLE'!$C$3)","v":"09:00 AM to 11:45 AM"}]
[null,null,{"$f":"'TIME TABLE'!$F$9","v":"Social Study"},null,null,{"$f":"IF(C2698=0,0,'TIME TABLE'!$B$9)","v":"2022-04-04"},{"$f":"IF(C2698=0,0,CONCATENATE('TIME TABLE'!$C$9,'TIME TABLE'!$D$9,'TIME TABLE'!$E$9))","v":"(Monday)"},{"$f":"IF(C2698=0,0,'TIME TABLE'!$C$3)","v":"09:00 AM to 11:45 AM"}]
[null,null,{"$f":"'TIME TABLE'!$F$10","v":"Sanskrit"},null,null,{"$f":"IF(C2699=0,0,'TIME TABLE'!$B$10)","v":"2022-04-05"},{"$f":"IF(C2699=0,0,CONCATENATE('TIME TABLE'!$C$10,'TIME TABLE'!$D$10,'TIME TABLE'!$E$10))","v":"(Tuesday)"},{"$f":"IF(C2699=0,0,'TIME TABLE'!$C$3)","v":"09:00 AM to 11:45 AM"}]
[null,null,{"$f":"'TIME TABLE'!$F$11","v":0},null,null,{"$f":"IF(C2700=0,0,'TIME TABLE'!$B$11)","v":"00:00:00"},{"$f":"IF(C2700=0,0,CONCATENATE('TIME TABLE'!$C$11,'TIME TABLE'!$D$11,'TIME TABLE'!$E$11))","v":0},{"$f":"IF(C2700=0,0,'TIME TABLE'!$C$3)","v":0}]
[null,null,{"$f":"'TIME TABLE'!$F$12","v":0},null,null,{"$f":"IF(C2701=0,0,'TIME TABLE'!$B$12)","v":"00:00:00"},{"$f":"IF(C2701=0,0,CONCATENATE('TIME TABLE'!$C$12,'TIME TABLE'!$D$12,'TIME TABLE'!$E$12))","v":0},{"$f":"IF(C2701=0,0,'TIME TABLE'!$C$3)","v":0}]
[null,null,{"$f":"'TIME TABLE'!$F$13","v":0},null,null,{"$f":"IF(C2702=0,0,'TIME TABLE'!$B$13)","v":"00:00:00"},{"$f":"IF(C2702=0,0,CONCATENATE('TIME TABLE'!$C$13,'TIME TABLE'!$D$13,'TIME TABLE'!$E$13))","v":0},{"$f":"IF(C2702=0,0,'TIME TABLE'!$C$3)","v":0}]
[null,null,{"$f":"'TIME TABLE'!$F$14","v":0},null,null,{"$f":"IF(C2703=0,0,'TIME TABLE'!$B$14)","v":"00:00:00"},{"$f":"IF(C2703=0,0,CONCATENATE('TIME TABLE'!$C$14,'TIME TABLE'!$D$14,'TIME TABLE'!$E$14))","v":0},{"$f":"IF(C2703=0,0,'TIME TABLE'!$C$3)","v":0}]
[null,null,"Instructions"]
[null,null,1,"Check the exam time table carefully."]
[null,null,2,"Students must bring the 'Admit Card' and show it to the invigilator(s) on duty and should preserve it for future requirements."]
[null,null,3,"Mobile Phone, Calculator, Digital Watch or any Electronic Device is NOT ALLOWED."]
[null,null,4,"Arrive at the School at least 15 minutes before the start examination."]
[null,null,5,"Student is barred from entering the examination hall 15 minutes after the written examination starts."]
[null,null,6,"Ensure that you use the washroom before arriving for your exam as you will not be permitted to leave during the first hour."]
[null,null,7,"Normally, you are required to answer questionsusing blue or black in . Make sure you bring some spare pens with you."]
[null,null,8,"Keep your eyes on your own paper. Remember, copying is cheating!"]
[null,null,9,"You must remain silent until after you have exited the school building."]
[]
[{"$f":"A2681+1","v":82}]
[{"$nulls":4},{"$f":"MASTER!$E$11","v":"Govt. Sr. Secondary School Raimalwada"}]
[{"$nulls":4},{"$f":"MASTER!$E$14","v":"P.S.-Bapini (Jodhpur)"}]
[null,{"$f":"CONCATENATE(C2719,'TIME TABLE'!$C$5,'ADMIT CARD'!$C2720,$F2720,'ADMIT CARD'!$G2720,'TIME TABLE'!$E$5)","v":"ADMIT CARD(Roll Number●→0)"},{"$f":"CONCATENATE('TIME TABLE'!$B$2,'TIME TABLE'!$F$2)","v":"HALF YEARLY EXAM:2021-22"}]
[null,null,"ADMIT CARD",{"$nulls":6}," "]
[null,null,"Roll Number",null,null,"●→",{"$f":"VLOOKUP(A2715,'STUDENT DETAIL'!$C$8:$I$107,3)","v":0},null,"Seal and Signature of Head of Institution"]
[null,null,"Student's Name",null,null,"●→",{"$f":"VLOOKUP(A2715,'STUDENT DETAIL'!$C$8:$I$107,4)","v":0}]
[null,null,"Father's Name",null,null,"●→",{"$f":"VLOOKUP(A2715,'STUDENT DETAIL'!$C$8:$I$107,5)","v":0}]
[null,null,"Mother's Name ",null,null,"●→",{"$f":"VLOOKUP(A2715,'STUDENT DETAIL'!$C$8:$I$107,6)","v":0}]
[null,null,"Class & Section",null,null,"●→",{"$f":"IF(G2720=0,0,CONCATENATE('STUDENT DETAIL'!$E$4,'STUDENT DETAIL'!$H$4))","v":0}]
[null,null,"Date Of Birth",null,null,"●→",{"$f":"VLOOKUP(A2715,'STUDENT DETAIL'!$C$8:$I$107,7)","v":"00:00:00"}]
[null,null,"Time Table"]
[null,null,"Subject",null,null,"Date (Day)",null,"Time"]
[null,null,{"$f":"'TIME TABLE'!$F$5","v":"Hindi"},null,null,{"$f":"IF(C2728=0,0,'TIME TABLE'!$B$5)","v":"2022-03-31"},{"$f":"IF(C2728=0,0,CONCATENATE('TIME TABLE'!$C$5,'TIME TABLE'!$D$5,'TIME TABLE'!$E$5))","v":"(Thursday)"},{"$f":"IF(C2728=0,0,'TIME TABLE'!$C$3)","v":"09:00 AM to 11:45 AM"}]
[null,null,{"$f":"'TIME TABLE'!$F$6","v":"English"},null,null,{"$f":"IF(C2729=0,0,'TIME TABLE'!$B$6)","v":"2022-04-01"},{"$f":"IF(C2729=0,0,CONCATENATE('TIME TABLE'!$C$6,'TIME TABLE'!$D$6,'TIME TABLE'!$E$6))","v":"(Friday)"},{"$f":"IF(C2729=0,0,'TIME TABLE'!$C$3)","v":"09:00 AM to 11:45 AM"}]
[null,null,{"$f":"'TIME TABLE'!$F$7","v":"Science"},null,null,{"$f":"IF(C2730=0,0,'TIME TABLE'!$B$7)","v":"2022-04-02"},{"$f":"IF(C2730=0,0,CONCATENATE('TIME TABLE'!$C$7,'TIME TABLE'!$D$7,'TIME TABLE'!$E$7))","v":"(Saturday)"},{"$f":"IF(C2730=0,0,'TIME TABLE'!$C$3)","v":"09:00 AM to 11:45 AM"}]
[null,null,{"$f":"'TIME TABLE'!$F$8","v":"Mathematics"},null,null,{"$f":"IF(C2731=0,0,'TIME TABLE'!$B$8)","v":"2022-04-03"},{"$f":"IF(C2731=0,0,CONCATENATE('TIME TABLE'!$C$8,'TIME TABLE'!$D$8,'TIME TABLE'!$E$8))","v":"(Sunday)"},{"$f":"IF(C2731=0,0,'TIME TABLE'!$C$3)","v":"09:00 AM to 11:45 AM"}]
[null,null,{"$f":"'TIME TABLE'!$F$9","v":"Social Study"},null,null,{"$f":"IF(C2732=0,0,'TIME TABLE'!$B$9)","v":"2022-04-04"},{"$f":"IF(C2732=0,0,CONCATENATE('TIME TABLE'!$C$9,'TIME TABLE'!$D$9,'TIME TABLE'!$E$9))","v":"(Monday)"},{"$f":"IF(C2732=0,0,'TIME TABLE'!$C$3)","v":"09:00 AM to 11:45 AM"}]
[null,null,{"$f":"'TIME TABLE'!$F$10","v":"Sanskrit"},null,null,{"$f":"IF(C2733=0,0,'TIME TABLE'!$B$10)","v":"2022-04-05"},{"$f":"IF(C2733=0,0,CONCATENATE('TIME TABLE'!$C$10,'TIME TABLE'!$D$10,'TIME TABLE'!$E$10))","v":"(Tuesday)"},{"$f":"IF(C2733=0,0,'TIME TABLE'!$C$3)","v":"09:00 AM to 11:45 AM"}]
[null,null,{"$f":"'TIME TABLE'!$F$11","v":0},null,null,{"$f":"IF(C2734=0,0,'TIME TABLE'!$B$11)","v":"00:00:00"},{"$f":"IF(C2734=0,0,CONCATENATE('TIME TABLE'!$C$11,'TIME TABLE'!$D$11,'TIME TABLE'!$E$11))","v":0},{"$f":"IF(C2734=0,0,'TIME TABLE'!$C$3)","v":0}]
[null,null,{"$f":"'TIME TABLE'!$F$12","v":0},null,null,{"$f":"IF(C2735=0,0,'TIME TABLE'!$B$12)","v":"00:00:00"},{"$f":"IF(C2735=0,0,CONCATENATE('TIME TABLE'!$C$12,'TIME TABLE'!$D$12,'TIME TABLE'!$E$12))","v":0},{"$f":"IF(C2735=0,0,'TIME TABLE'!$C$3)","v":0}]
[null,null,{"$f":"'TIME TABLE'!$F$13","v":0},null,null,{"$f":"IF(C2736=0,0,'TIME TABLE'!$B$13)","v":"00:00:00"},{"$f":"IF(C2736=0,0,CONCATENATE('TIME TABLE'!$C$13,'TIME TABLE'!$D$13,'TIME TABLE'!$E$13))","v":0},{"$f":"IF(C2736=0,0,'TIME TABLE'!$C$3)","v":0}]
[null,null,{"$f":"'TIME TABLE'!$F$14","v":0},null,null,{"$f":"IF(C2737=0,0,'TIME TABLE'!$B$14)","v":"00:00:00"},{"$f":"IF(C2737=0,0,CONCATENATE('TIME TABLE'!$C$14,'TIME TABLE'!$D$14,'TIME TABLE'!$E$14))","v":0},{"$f":"IF(C2737=0,0,'TIME TABLE'!$C$3)","v":0}]
[null,null,"Instructions"]
[null,null,1,"Check the exam time table carefully."]
[null,null,2,"Students must bring the 'Admit Card' and show it to the invigilator(s) on duty and should preserve it for future requirements."]
[null,null,3,"Mobile Phone, Calculator, Digital Watch or any Electronic Device is NOT ALLOWED."]
[null,null,4,"Arrive at the School at least 15 minutes before the start examination."]
[null,null,5,"Student is barred from entering the examination hall 15 minutes after the written examination starts."]
[null,null,6,"Ensure that you use the washroom before arriving for your exam as you will not be permitted to leave during the first hour."]
[null,null,7,"Normally, you are required to answer questionsusing blue or black in . Make sure you bring some spare pens with you."]
[null,null,8,"Keep your eyes on your own paper. Remember, copying is cheating!"]
[null,null,9,"You must remain silent until after you have exited the school building."]
[{"$f":"A2715+1","v":83}]
[{"$nulls":4},{"$f":"MASTER!$E$11","v":"Govt. Sr. Secondary School Raimalwada"}]
[{"$nulls":4},{"$f":"MASTER!$E$14","v":"P.S.-Bapini (Jodhpur)"}]
[null,{"$f":"CONCATENATE(C2752,'TIME TABLE'!$C$5,'ADMIT CARD'!$C2753,$F2753,'ADMIT CARD'!$G2753,'TIME TABLE'!$E$5)","v":"ADMIT CARD(Roll Number●→0)"},{"$f":"CONCATENATE('TIME TABLE'!$B$2,'TIME TABLE'!$F$2)","v":"HALF YEARLY EXAM:2021-22"}]
[null,null,"ADMIT CARD",{"$nulls":6}," "]
[null,null,"Roll Number",null,null,"●→",{"$f":"VLOOKUP(A2748,'STUDENT DETAIL'!$C$8:$I$107,3)","v":0},null,"Seal and Signature of Head of Institution"]
[null,null,"Student's Name",null,null,"●→",{"$f":"VLOOKUP(A2748,'STUDENT DETAIL'!$C$8:$I$107,4)","v":0}]
[null,null,"Father's Name",null,null,"●→",{"$f":"VLOOKUP(A2748,'STUDENT DETAIL'!$C$8:$I$107,5)","v":0}]
[null,null,"Mother's Name ",null,null,"●→",{"$f":"VLOOKUP(A2748,'STUDENT DETAIL'!$C$8:$I$107,6)","v":0}]
[null,null,"Class & Section",null,null,"●→",{"$f":"IF(G2753=0,0,CONCATENATE('STUDENT DETAIL'!$E$4,'STUDENT DETAIL'!$H$4))","v":0}]
[null,null,"Date Of Birth",null,null,"●→",{"$f":"VLOOKUP(A2748,'STUDENT DETAIL'!$C$8:$I$107,7)","v":"00:00:00"}]
[null,null,"Time Table"]
[null,null,"Subject",null,null,"Date (Day)",null,"Time"]
[null,null,{"$f":"'TIME TABLE'!$F$5","v":"Hindi"},null,null,{"$f":"IF(C2761=0,0,'TIME TABLE'!$B$5)","v":"2022-03-31"},{"$f":"IF(C2761=0,0,CONCATENATE('TIME TABLE'!$C$5,'TIME TABLE'!$D$5,'TIME TABLE'!$E$5))","v":"(Thursday)"},{"$f":"IF(C2761=0,0,'TIME TABLE'!$C$3)","v":"09:00 AM to 11:45 AM"}]
[null,null,{"$f":"'TIME TABLE'!$F$6","v":"English"},null,null,{"$f":"IF(C2762=0,0,'TIME TABLE'!$B$6)","v":"2022-04-01"},{"$f":"IF(C2762=0,0,CONCATENATE('TIME TABLE'!$C$6,'TIME TABLE'!$D$6,'TIME TABLE'!$E$6))","v":"(Friday)"},{"$f":"IF(C2762=0,0,'TIME TABLE'!$C$3)","v":"09:00 AM to 11:45 AM"}]
[null,null,{"$f":"'TIME TABLE'!$F$7","v":"Science"},null,null,{"$f":"IF(C2763=0,0,'TIME TABLE'!$B$7)","v":"2022-04-02"},{"$f":"IF(C2763=0,0,CONCATENATE('TIME TABLE'!$C$7,'TIME TABLE'!$D$7,'TIME TABLE'!$E$7))","v":"(Saturday)"},{"$f":"IF(C2763=0,0,'TIME TABLE'!$C$3)","v":"09:00 AM to 11:45 AM"}]
[null,null,{"$f":"'TIME TABLE'!$F$8","v":"Mathematics"},null,null,{"$f":"IF(C2764=0,0,'TIME TABLE'!$B$8)","v":"2022-04-03"},{"$f":"IF(C2764=0,0,CONCATENATE('TIME TABLE'!$C$8,'TIME TABLE'!$D$8,'TIME TABLE'!$E$8))","v":"(Sunday)"},{"$f":"IF(C2764=0,0,'TIME TABLE'!$C$3)","v":"09:00 AM to 11:45 AM"}]
[null,null,{"$f":"'TIME TABLE'!$F$9","v":"Social Study"},null,null,{"$f":"IF(C2765=0,0,'TIME TABLE'!$B$9)","v":"2022-04-04"},{"$f":"IF(C2765=0,0,CONCATENATE('TIME TABLE'!$C$9,'TIME TABLE'!$D$9,'TIME TABLE'!$E$9))","v":"(Monday)"},{"$f":"IF(C2765=0,0,'TIME TABLE'!$C$3)","v":"09:00 AM to 11:45 AM"}]
[null,null,{"$f":"'TIME TABLE'!$F$10","v":"Sanskrit"},null,null,{"$f":"IF(C2766=0,0,'TIME TABLE'!$B$10)","v":"2022-04-05"},{"$f":"IF(C2766=0,0,CONCATENATE('TIME TABLE'!$C$10,'TIME TABLE'!$D$10,'TIME TABLE'!$E$10))","v":"(Tuesday)"},{"$f":"IF(C2766=0,0,'TIME TABLE'!$C$3)","v":"09:00 AM to 11:45 AM"}]
[null,null,{"$f":"'TIME TABLE'!$F$11","v":0},null,null,{"$f":"IF(C2767=0,0,'TIME TABLE'!$B$11)","v":"00:00:00"},{"$f":"IF(C2767=0,0,CONCATENATE('TIME TABLE'!$C$11,'TIME TABLE'!$D$11,'TIME TABLE'!$E$11))","v":0},{"$f":"IF(C2767=0,0,'TIME TABLE'!$C$3)","v":0}]
[null,null,{"$f":"'TIME TABLE'!$F$12","v":0},null,null,{"$f":"IF(C2768=0,0,'TIME TABLE'!$B$12)","v":"00:00:00"},{"$f":"IF(C2768=0,0,CONCATENATE('TIME TABLE'!$C$12,'TIME TABLE'!$D$12,'TIME TABLE'!$E$12))","v":0},{"$f":"IF(C2768=0,0,'TIME TABLE'!$C$3)","v":0}]
[null,null,{"$f":"'TIME TABLE'!$F$13","v":0},null,null,{"$f":"IF(C2769=0,0,'TIME TABLE'!$B$13)","v":"00:00:00"},{"$f":"IF(C2769=0,0,CONCATENATE('TIME TABLE'!$C$13,'TIME TABLE'!$D$13,'TIME TABLE'!$E$13))","v":0},{"$f":"IF(C2769=0,0,'TIME TABLE'!$C$3)","v":0}]
[null,null,{"$f":"'TIME TABLE'!$F$14","v":0},null,null,{"$f":"IF(C2770=0,0,'TIME TABLE'!$B$14)","v":"00:00:00"},{"$f":"IF(C2770=0,0,CONCATENATE('TIME TABLE'!$C$14,'TIME TABLE'!$D$14,'TIME TABLE'!$E$14))","v":0},{"$f":"IF(C2770=0,0,'TIME TABLE'!$C$3)","v":0}]
[null,null,"Instructions"]
[null,null,1,"Check the exam time table carefully."]
[null,null,2,"Students must bring the 'Admit Card' and show it to the invigilator(s) on duty and should preserve it for future requirements."]
[null,null,3,"Mobile Phone, Calculator, Digital Watch or any Electronic Device is NOT ALLOWED."]
[null,null,4,"Arrive at the School at least 15 minutes before the start examination."]
[null,null,5,"Student is barred from entering the examination hall 15 minutes after the written examination starts."]
[null,null,6,"Ensure that you use the washroom before arriving for your exam as you will not be permitted to leave during the first hour."]
[null,null,7,"Normally, you are required to answer questionsusing blue or black in . Make sure you bring some spare pens with you."]
[null,null,8,"Keep your eyes on your own paper. Remember, copying is cheating!"]
[null,null,9,"You must remain silent until after you have exited the school building."]
[]
[{"$f":"A2748+1","v":84}]
[{"$nulls":4},{"$f":"MASTER!$E$11","v":"Govt. Sr. Secondary School Raimalwada"}]
[{"$nulls":4},{"$f":"MASTER!$E$14","v":"P.S.-Bapini (Jodhpur)"}]
[null,{"$f":"CONCATENATE(C2786,'TIME TABLE'!$C$5,'ADMIT CARD'!$C2787,$F2787,'ADMIT CARD'!$G2787,'TIME TABLE'!$E$5)","v":"ADMIT CARD(Roll Number●→0)"},{"$f":"CONCATENATE('TIME TABLE'!$B$2,'TIME TABLE'!$F$2)","v":"HALF YEARLY EXAM:2021-22"}]
[null,null,"ADMIT CARD",{"$nulls":6}," "]
[null,null,"Roll Number",null,null,"●→",{"$f":"VLOOKUP(A2782,'STUDENT DETAIL'!$C$8:$I$107,3)","v":0},null,"Seal and Signature of Head of Institution"]
[null,null,"Student's Name",null,null,"●→",{"$f":"VLOOKUP(A2782,'STUDENT DETAIL'!$C$8:$I$107,4)","v":0}]
[null,null,"Father's Name",null,null,"●→",{"$f":"VLOOKUP(A2782,'STUDENT DETAIL'!$C$8:$I$107,5)","v":0}]
[null,null,"Mother's Name ",null,null,"●→",{"$f":"VLOOKUP(A2782,'STUDENT DETAIL'!$C$8:$I$107,6)","v":0}]
[null,null,"Class & Section",null,null,"●→",{"$f":"IF(G2787=0,0,CONCATENATE('STUDENT DETAIL'!$E$4,'STUDENT DETAIL'!$H$4))","v":0}]
[null,null,"Date Of Birth",null,null,"●→",{"$f":"VLOOKUP(A2782,'STUDENT DETAIL'!$C$8:$I$107,7)","v":"00:00:00"}]
[null,null,"Time Table"]
[null,null,"Subject",null,null,"Date (Day)",null,"Time"]
[null,null,{"$f":"'TIME TABLE'!$F$5","v":"Hindi"},null,null,{"$f":"IF(C2795=0,0,'TIME TABLE'!$B$5)","v":"2022-03-31"},{"$f":"IF(C2795=0,0,CONCATENATE('TIME TABLE'!$C$5,'TIME TABLE'!$D$5,'TIME TABLE'!$E$5))","v":"(Thursday)"},{"$f":"IF(C2795=0,0,'TIME TABLE'!$C$3)","v":"09:00 AM to 11:45 AM"}]
[null,null,{"$f":"'TIME TABLE'!$F$6","v":"English"},null,null,{"$f":"IF(C2796=0,0,'TIME TABLE'!$B$6)","v":"2022-04-01"},{"$f":"IF(C2796=0,0,CONCATENATE('TIME TABLE'!$C$6,'TIME TABLE'!$D$6,'TIME TABLE'!$E$6))","v":"(Friday)"},{"$f":"IF(C2796=0,0,'TIME TABLE'!$C$3)","v":"09:00 AM to 11:45 AM"}]
[null,null,{"$f":"'TIME TABLE'!$F$7","v":"Science"},null,null,{"$f":"IF(C2797=0,0,'TIME TABLE'!$B$7)","v":"2022-04-02"},{"$f":"IF(C2797=0,0,CONCATENATE('TIME TABLE'!$C$7,'TIME TABLE'!$D$7,'TIME TABLE'!$E$7))","v":"(Saturday)"},{"$f":"IF(C2797=0,0,'TIME TABLE'!$C$3)","v":"09:00 AM to 11:45 AM"}]
[null,null,{"$f":"'TIME TABLE'!$F$8","v":"Mathematics"},null,null,{"$f":"IF(C2798=0,0,'TIME TABLE'!$B$8)","v":"2022-04-03"},{"$f":"IF(C2798=0,0,CONCATENATE('TIME TABLE'!$C$8,'TIME TABLE'!$D$8,'TIME TABLE'!$E$8))","v":"(Sunday)"},{"$f":"IF(C2798=0,0,'TIME TABLE'!$C$3)","v":"09:00 AM to 11:45 AM"}]
[null,null,{"$f":"'TIME TABLE'!$F$9","v":"Social Study"},null,null,{"$f":"IF(C2799=0,0,'TIME TABLE'!$B$9)","v":"2022-04-04"},{"$f":"IF(C2799=0,0,CONCATENATE('TIME TABLE'!$C$9,'TIME TABLE'!$D$9,'TIME TABLE'!$E$9))","v":"(Monday)"},{"$f":"IF(C2799=0,0,'TIME TABLE'!$C$3)","v":"09:00 AM to 11:45 AM"}]
[null,null,{"$f":"'TIME TABLE'!$F$10","v":"Sanskrit"},null,null,{"$f":"IF(C2800=0,0,'TIME TABLE'!$B$10)","v":"2022-04-05"},{"$f":"IF(C2800=0,0,CONCATENATE('TIME TABLE'!$C$10,'TIME TABLE'!$D$10,'TIME TABLE'!$E$10))","v":"(Tuesday)"},{"$f":"IF(C2800=0,0,'TIME TABLE'!$C$3)","v":"09:00 AM to 11:45 AM"}]
[null,null,{"$f":"'TIME TABLE'!$F$11","v":0},null,null,{"$f":"IF(C2801=0,0,'TIME TABLE'!$B$11)","v":"00:00:00"},{"$f":"IF(C2801=0,0,CONCATENATE('TIME TABLE'!$C$11,'TIME TABLE'!$D$11,'TIME TABLE'!$E$11))","v":0},{"$f":"IF(C2801=0,0,'TIME TABLE'!$C$3)","v":0}]
[null,null,{"$f":"'TIME TABLE'!$F$12","v":0},null,null,{"$f":"IF(C2802=0,0,'TIME TABLE'!$B$12)","v":"00:00:00"},{"$f":"IF(C2802=0,0,CONCATENATE('TIME TABLE'!$C$12,'TIME TABLE'!$D$12,'TIME TABLE'!$E$12))","v":0},{"$f":"IF(C2802=0,0,'TIME TABLE'!$C$3)","v":0}]
[null,null,{"$f":"'TIME TABLE'!$F$13","v":0},null,null,{"$f":"IF(C2803=0,0,'TIME TABLE'!$B$13)","v":"00:00:00"},{"$f":"IF(C2803=0,0,CONCATENATE('TIME TABLE'!$C$13,'TIME TABLE'!$D$13,'TIME TABLE'!$E$13))","v":0},{"$f":"IF(C2803=0,0,'TIME TABLE'!$C$3)","v":0}]
[null,null,{"$f":"'TIME TABLE'!$F$14","v":0},null,null,{"$f":"IF(C2804=0,0,'TIME TABLE'!$B$14)","v":"00:00:00"},{"$f":"IF(C2804=0,0,CONCATENATE('TIME TABLE'!$C$14,'TIME TABLE'!$D$14,'TIME TABLE'!$E$14))","v":0},{"$f":"IF(C2804=0,0,'TIME TABLE'!$C$3)","v":0}]
[null,null,"Instructions"]
[null,null,1,"Check the exam time table carefully."]
[null,null,2,"Students must bring the 'Admit Card' and show it to the invigilator(s) on duty and should preserve it for future requirements."]
[null,null,3,"Mobile Phone, Calculator, Digital Watch or any Electronic Device is NOT ALLOWED."]
[null,null,4,"Arrive at the School at least 15 minutes before the start examination."]
[null,null,5,"Student is barred from entering the examination hall 15 minutes after the written examination starts."]
[null,null,6,"Ensure that you use the washroom before arriving for your exam as you will not be permitted to leave during the first hour."]
[null,null,7,"Normally, you are required to answer questionsusing blue or black in . Make sure you bring some spare pens with you."]
[null,null,8,"Keep your eyes on your own paper. Remember, copying is cheating!"]
[null,null,9,"You must remain silent until after you have exited the school building."]
[{"$f":"A2782+1","v":85}]
[{"$nulls":4},{"$f":"MASTER!$E$11","v":"Govt. Sr. Secondary School Raimalwada"}]
[{"$nulls":4},{"$f":"MASTER!$E$14","v":"P.S.-Bapini (Jodhpur)"}]
[null,{"$f":"CONCATENATE(C2819,'TIME TABLE'!$C$5,'ADMIT CARD'!$C2820,$F2820,'ADMIT CARD'!$G2820,'TIME TABLE'!$E$5)","v":"ADMIT CARD(Roll Number●→0)"},{"$f":"CONCATENATE('TIME TABLE'!$B$2,'TIME TABLE'!$F$2)","v":"HALF YEARLY EXAM:2021-22"}]
[null,null,"ADMIT CARD",{"$nulls":6}," "]
[null,null,"Roll Number",null,null,"●→",{"$f":"VLOOKUP(A2815,'STUDENT DETAIL'!$C$8:$I$107,3)","v":0},null,"Seal and Signature of Head of Institution"]
[null,null,"Student's Name",null,null,"●→",{"$f":"VLOOKUP(A2815,'STUDENT DETAIL'!$C$8:$I$107,4)","v":0}]
[null,null,"Father's Name",null,null,"●→",{"$f":"VLOOKUP(A2815,'STUDENT DETAIL'!$C$8:$I$107,5)","v":0}]
[null,null,"Mother's Name ",null,null,"●→",{"$f":"VLOOKUP(A2815,'STUDENT DETAIL'!$C$8:$I$107,6)","v":0}]
[null,null,"Class & Section",null,null,"●→",{"$f":"IF(G2820=0,0,CONCATENATE('STUDENT DETAIL'!$E$4,'STUDENT DETAIL'!$H$4))","v":0}]
[null,null,"Date Of Birth",null,null,"●→",{"$f":"VLOOKUP(A2815,'STUDENT DETAIL'!$C$8:$I$107,7)","v":"00:00:00"}]
[null,null,"Time Table"]
[null,null,"Subject",null,null,"Date (Day)",null,"Time"]
[null,null,{"$f":"'TIME TABLE'!$F$5","v":"Hindi"},null,null,{"$f":"IF(C2828=0,0,'TIME TABLE'!$B$5)","v":"2022-03-31"},{"$f":"IF(C2828=0,0,CONCATENATE('TIME TABLE'!$C$5,'TIME TABLE'!$D$5,'TIME TABLE'!$E$5))","v":"(Thursday)"},{"$f":"IF(C2828=0,0,'TIME TABLE'!$C$3)","v":"09:00 AM to 11:45 AM"}]
[null,null,{"$f":"'TIME TABLE'!$F$6","v":"English"},null,null,{"$f":"IF(C2829=0,0,'TIME TABLE'!$B$6)","v":"2022-04-01"},{"$f":"IF(C2829=0,0,CONCATENATE('TIME TABLE'!$C$6,'TIME TABLE'!$D$6,'TIME TABLE'!$E$6))","v":"(Friday)"},{"$f":"IF(C2829=0,0,'TIME TABLE'!$C$3)","v":"09:00 AM to 11:45 AM"}]
[null,null,{"$f":"'TIME TABLE'!$F$7","v":"Science"},null,null,{"$f":"IF(C2830=0,0,'TIME TABLE'!$B$7)","v":"2022-04-02"},{"$f":"IF(C2830=0,0,CONCATENATE('TIME TABLE'!$C$7,'TIME TABLE'!$D$7,'TIME TABLE'!$E$7))","v":"(Saturday)"},{"$f":"IF(C2830=0,0,'TIME TABLE'!$C$3)","v":"09:00 AM to 11:45 AM"}]
[null,null,{"$f":"'TIME TABLE'!$F$8","v":"Mathematics"},null,null,{"$f":"IF(C2831=0,0,'TIME TABLE'!$B$8)","v":"2022-04-03"},{"$f":"IF(C2831=0,0,CONCATENATE('TIME TABLE'!$C$8,'TIME TABLE'!$D$8,'TIME TABLE'!$E$8))","v":"(Sunday)"},{"$f":"IF(C2831=0,0,'TIME TABLE'!$C$3)","v":"09:00 AM to 11:45 AM"}]
[null,null,{"$f":"'TIME TABLE'!$F$9","v":"Social Study"},null,null,{"$f":"IF(C2832=0,0,'TIME TABLE'!$B$9)","v":"2022-04-04"},{"$f":"IF(C2832=0,0,CONCATENATE('TIME TABLE'!$C$9,'TIME TABLE'!$D$9,'TIME TABLE'!$E$9))","v":"(Monday)"},{"$f":"IF(C2832=0,0,'TIME TABLE'!$C$3)","v":"09:00 AM to 11:45 AM"}]
[null,null,{"$f":"'TIME TABLE'!$F$10","v":"Sanskrit"},null,null,{"$f":"IF(C2833=0,0,'TIME TABLE'!$B$10)","v":"2022-04-05"},{"$f":"IF(C2833=0,0,CONCATENATE('TIME TABLE'!$C$10,'TIME TABLE'!$D$10,'TIME TABLE'!$E$10))","v":"(Tuesday)"},{"$f":"IF(C2833=0,0,'TIME TABLE'!$C$3)","v":"09:00 AM to 11:45 AM"}]
[null,null,{"$f":"'TIME TABLE'!$F$11","v":0},null,null,{"$f":"IF(C2834=0,0,'TIME TABLE'!$B$11)","v":"00:00:00"},{"$f":"IF(C2834=0,0,CONCATENATE('TIME TABLE'!$C$11,'TIME TABLE'!$D$11,'TIME TABLE'!$E$11))","v":0},{"$f":"IF(C2834=0,0,'TIME TABLE'!$C$3)","v":0}]
[null,null,{"$f":"'TIME TABLE'!$F$12","v":0},null,null,{"$f":"IF(C2835=0,0,'TIME TABLE'!$B$12)","v":"00:00:00"},{"$f":"IF(C2835=0,0,CONCATENATE('TIME TABLE'!$C$12,'TIME TABLE'!$D$12,'TIME TABLE'!$E$12))","v":0},{"$f":"IF(C2835=0,0,'TIME TABLE'!$C$3)","v":0}]
[null,null,{"$f":"'TIME TABLE'!$F$13","v":0},null,null,{"$f":"IF(C2836=0,0,'TIME TABLE'!$B$13)","v":"00:00:00"},{"$f":"IF(C2836=0,0,CONCATENATE('TIME TABLE'!$C$13,'TIME TABLE'!$D$13,'TIME TABLE'!$E$13))","v":0},{"$f":"IF(C2836=0,0,'TIME TABLE'!$C$3)","v":0}]
[null,null,{"$f":"'TIME TABLE'!$F$14","v":0},null,null,{"$f":"IF(C2837=0,0,'TIME TABLE'!$B$14)","v":"00:00:00"},{"$f":"IF(C2837=0,0,CONCATENATE('TIME TABLE'!$C$14,'TIME TABLE'!$D$14,'TIME TABLE'!$E$14))","v":0},{"$f":"IF(C2837=0,0,'TIME TABLE'!$C$3)","v":0}]
[null,null,"Instructions"]
[null,null,1,"Check the exam time table carefully."]
[null,null,2,"Students must bring the 'Admit Card' and show it to the invigilator(s) on duty and should preserve it for future requirements."]
[null,null,3,"Mobile Phone, Calculator, Digital Watch or any Electronic Device is NOT ALLOWED."]
[null,null,4,"Arrive at the School at least 15 minutes before the start examination."]
[null,null,5,"Student is barred from entering the examination hall 15 minutes after the written examination starts."]
[null,null,6,"Ensure that you use the washroom before arriving for your exam as you will not be permitted to leave during the first hour."]
[null,null,7,"Normally, you are required to answer questionsusing blue or black in . Make sure you bring some spare pens with you."]
[null,null,8,"Keep your eyes on your own paper. Remember, copying is cheating!"]
[null,null,9,"You must remain silent until after you have exited the school building."]
[]
[{"$f":"A2815+1","v":86}]
[{"$nulls":4},{"$f":"MASTER!$E$11","v":"Govt. Sr. Secondary School Raimalwada"}]
[{"$nulls":4},{"$f":"MASTER!$E$14","v":"P.S.-Bapini (Jodhpur)"}]
[null,{"$f":"CONCATENATE(C2853,'TIME TABLE'!$C$5,'ADMIT CARD'!$C2854,$F2854,'ADMIT CARD'!$G2854,'TIME TABLE'!$E$5)","v":"ADMIT CARD(Roll Number●→0)"},{"$f":"CONCATENATE('TIME TABLE'!$B$2,'TIME TABLE'!$F$2)","v":"HALF YEARLY EXAM:2021-22"}]
[null,null,"ADMIT CARD",{"$nulls":6}," "]
[null,null,"Roll Number",null,null,"●→",{"$f":"VLOOKUP(A2849,'STUDENT DETAIL'!$C$8:$I$107,3)","v":0},null,"Seal and Signature of Head of Institution"]
[null,null,"Student's Name",null,null,"●→",{"$f":"VLOOKUP(A2849,'STUDENT DETAIL'!$C$8:$I$107,4)","v":0}]
[null,null,"Father's Name",null,null,"●→",{"$f":"VLOOKUP(A2849,'STUDENT DETAIL'!$C$8:$I$107,5)","v":0}]
[null,null,"Mother's Name ",null,null,"●→",{"$f":"VLOOKUP(A2849,'STUDENT DETAIL'!$C$8:$I$107,6)","v":0}]
[null,null,"Class & Section",null,null,"●→",{"$f":"IF(G2854=0,0,CONCATENATE('STUDENT DETAIL'!$E$4,'STUDENT DETAIL'!$H$4))","v":0}]
[null,null,"Date Of Birth",null,null,"●→",{"$f":"VLOOKUP(A2849,'STUDENT DETAIL'!$C$8:$I$107,7)","v":"00:00:00"}]
[null,null,"Time Table"]
[null,null,"Subject",null,null,"Date (Day)",null,"Time"]
[null,null,{"$f":"'TIME TABLE'!$F$5","v":"Hindi"},null,null,{"$f":"IF(C2862=0,0,'TIME TABLE'!$B$5)","v":"2022-03-31"},{"$f":"IF(C2862=0,0,CONCATENATE('TIME TABLE'!$C$5,'TIME TABLE'!$D$5,'TIME TABLE'!$E$5))","v":"(Thursday)"},{"$f":"IF(C2862=0,0,'TIME TABLE'!$C$3)","v":"09:00 AM to 11:45 AM"}]
[null,null,{"$f":"'TIME TABLE'!$F$6","v":"English"},null,null,{"$f":"IF(C2863=0,0,'TIME TABLE'!$B$6)","v":"2022-04-01"},{"$f":"IF(C2863=0,0,CONCATENATE('TIME TABLE'!$C$6,'TIME TABLE'!$D$6,'TIME TABLE'!$E$6))","v":"(Friday)"},{"$f":"IF(C2863=0,0,'TIME TABLE'!$C$3)","v":"09:00 AM to 11:45 AM"}]
[null,null,{"$f":"'TIME TABLE'!$F$7","v":"Science"},null,null,{"$f":"IF(C2864=0,0,'TIME TABLE'!$B$7)","v":"2022-04-02"},{"$f":"IF(C2864=0,0,CONCATENATE('TIME TABLE'!$C$7,'TIME TABLE'!$D$7,'TIME TABLE'!$E$7))","v":"(Saturday)"},{"$f":"IF(C2864=0,0,'TIME TABLE'!$C$3)","v":"09:00 AM to 11:45 AM"}]
[null,null,{"$f":"'TIME TABLE'!$F$8","v":"Mathematics"},null,null,{"$f":"IF(C2865=0,0,'TIME TABLE'!$B$8)","v":"2022-04-03"},{"$f":"IF(C2865=0,0,CONCATENATE('TIME TABLE'!$C$8,'TIME TABLE'!$D$8,'TIME TABLE'!$E$8))","v":"(Sunday)"},{"$f":"IF(C2865=0,0,'TIME TABLE'!$C$3)","v":"09:00 AM to 11:45 AM"}]
[null,null,{"$f":"'TIME TABLE'!$F$9","v":"Social Study"},null,null,{"$f":"IF(C2866=0,0,'TIME TABLE'!$B$9)","v":"2022-04-04"},{"$f":"IF(C2866=0,0,CONCATENATE('TIME TABLE'!$C$9,'TIME TABLE'!$D$9,'TIME TABLE'!$E$9))","v":"(Monday)"},{"$f":"IF(C2866=0,0,'TIME TABLE'!$C$3)","v":"09:00 AM to 11:45 AM"}]
[null,null,{"$f":"'TIME TABLE'!$F$10","v":"Sanskrit"},null,null,{"$f":"IF(C2867=0,0,'TIME TABLE'!$B$10)","v":"2022-04-05"},{"$f":"IF(C2867=0,0,CONCATENATE('TIME TABLE'!$C$10,'TIME TABLE'!$D$10,'TIME TABLE'!$E$10))","v":"(Tuesday)"},{"$f":"IF(C2867=0,0,'TIME TABLE'!$C$3)","v":"09:00 AM to 11:45 AM"}]
[null,null,{"$f":"'TIME TABLE'!$F$11","v":0},null,null,{"$f":"IF(C2868=0,0,'TIME TABLE'!$B$11)","v":"00:00:00"},{"$f":"IF(C2868=0,0,CONCATENATE('TIME TABLE'!$C$11,'TIME TABLE'!$D$11,'TIME TABLE'!$E$11))","v":0},{"$f":"IF(C2868=0,0,'TIME TABLE'!$C$3)","v":0}]
[null,null,{"$f":"'TIME TABLE'!$F$12","v":0},null,null,{"$f":"IF(C2869=0,0,'TIME TABLE'!$B$12)","v":"00:00:00"},{"$f":"IF(C2869=0,0,CONCATENATE('TIME TABLE'!$C$12,'TIME TABLE'!$D$12,'TIME TABLE'!$E$12))","v":0},{"$f":"IF(C2869=0,0,'TIME TABLE'!$C$3)","v":0}]
[null,null,{"$f":"'TIME TABLE'!$F$13","v":0},null,null,{"$f":"IF(C2870=0,0,'TIME TABLE'!$B$13)","v":"00:00:00"},{"$f":"IF(C2870=0,0,CONCATENATE('TIME TABLE'!$C$13,'TIME TABLE'!$D$13,'TIME TABLE'!$E$13))","v":0},{"$f":"IF(C2870=0,0,'TIME TABLE'!$C$3)","v":0}]
[null,null,{"$f":"'TIME TABLE'!$F$14","v":0},null,null,{"$f":"IF(C2871=0,0,'TIME TABLE'!$B$14)","v":"00:00:00"},{"$f":"IF(C2871=0,0,CONCATENATE('TIME TABLE'!$C$14,'TIME TABLE'!$D$14,'TIME TABLE'!$E$14))","v":0},{"$f":"IF(C2871=0,0,'TIME TABLE'!$C$3)","v":0}]
[null,null,"Instructions"]
[null,null,1,"Check the exam time table carefully."]
[null,null,2,"Students must bring the 'Admit Card' and show it to the invigilator(s) on duty and should preserve it for future requirements."]
[null,null,3,"Mobile Phone, Calculator, Digital Watch or any Electronic Device is NOT ALLOWED."]
[null,null,4,"Arrive at the School at least 15 minutes before the start examination."]
[null,null,5,"Student is barred from entering the examination hall 15 minutes after the written examination starts."]
[null,null,6,"Ensure that you use the washroom before arriving for your exam as you will not be permitted to leave during the first hour."]
[null,null,7,"Normally, you are required to answer questionsusing blue or black in . Make sure you bring some spare pens with you."]
[null,null,8,"Keep your eyes on your own paper. Remember, copying is cheating!"]
[null,null,9,"You must remain silent until after you have exited the school building."]
[{"$f":"A2849+1","v":87}]
[{"$nulls":4},{"$f":"MASTER!$E$11","v":"Govt. Sr. Secondary School Raimalwada"}]
[{"$nulls":4},{"$f":"MASTER!$E$14","v":"P.S.-Bapini (Jodhpur)"}]
[null,{"$f":"CONCATENATE(C2886,'TIME TABLE'!$C$5,'ADMIT CARD'!$C2887,$F2887,'ADMIT CARD'!$G2887,'TIME TABLE'!$E$5)","v":"ADMIT CARD(Roll Number●→0)"},{"$f":"CONCATENATE('TIME TABLE'!$B$2,'TIME TABLE'!$F$2)","v":"HALF YEARLY EXAM:2021-22"}]
[null,null,"ADMIT CARD",{"$nulls":6}," "]
[null,null,"Roll Number",null,null,"●→",{"$f":"VLOOKUP(A2882,'STUDENT DETAIL'!$C$8:$I$107,3)","v":0},null,"Seal and Signature of Head of Institution"]
[null,null,"Student's Name",null,null,"●→",{"$f":"VLOOKUP(A2882,'STUDENT DETAIL'!$C$8:$I$107,4)","v":0}]
[null,null,"Father's Name",null,null,"●→",{"$f":"VLOOKUP(A2882,'STUDENT DETAIL'!$C$8:$I$107,5)","v":0}]
[null,null,"Mother's Name ",null,null,"●→",{"$f":"VLOOKUP(A2882,'STUDENT DETAIL'!$C$8:$I$107,6)","v":0}]
[null,null,"Class & Section",null,null,"●→",{"$f":"IF(G2887=0,0,CONCATENATE('STUDENT DETAIL'!$E$4,'STUDENT DETAIL'!$H$4))","v":0}]
[null,null,"Date Of Birth",null,null,"●→",{"$f":"VLOOKUP(A2882,'STUDENT DETAIL'!$C$8:$I$107,7)","v":"00:00:00"}]
[null,null,"Time Table"]
[null,null,"Subject",null,null,"Date (Day)",null,"Time"]
[null,null,{"$f":"'TIME TABLE'!$F$5","v":"Hindi"},null,null,{"$f":"IF(C2895=0,0,'TIME TABLE'!$B$5)","v":"2022-03-31"},{"$f":"IF(C2895=0,0,CONCATENATE('TIME TABLE'!$C$5,'TIME TABLE'!$D$5,'TIME TABLE'!$E$5))","v":"(Thursday)"},{"$f":"IF(C2895=0,0,'TIME TABLE'!$C$3)","v":"09:00 AM to 11:45 AM"}]
[null,null,{"$f":"'TIME TABLE'!$F$6","v":"English"},null,null,{"$f":"IF(C2896=0,0,'TIME TABLE'!$B$6)","v":"2022-04-01"},{"$f":"IF(C2896=0,0,CONCATENATE('TIME TABLE'!$C$6,'TIME TABLE'!$D$6,'TIME TABLE'!$E$6))","v":"(Friday)"},{"$f":"IF(C2896=0,0,'TIME TABLE'!$C$3)","v":"09:00 AM to 11:45 AM"}]
[null,null,{"$f":"'TIME TABLE'!$F$7","v":"Science"},null,null,{"$f":"IF(C2897=0,0,'TIME TABLE'!$B$7)","v":"2022-04-02"},{"$f":"IF(C2897=0,0,CONCATENATE('TIME TABLE'!$C$7,'TIME TABLE'!$D$7,'TIME TABLE'!$E$7))","v":"(Saturday)"},{"$f":"IF(C2897=0,0,'TIME TABLE'!$C$3)","v":"09:00 AM to 11:45 AM"}]
[null,null,{"$f":"'TIME TABLE'!$F$8","v":"Mathematics"},null,null,{"$f":"IF(C2898=0,0,'TIME TABLE'!$B$8)","v":"2022-04-03"},{"$f":"IF(C2898=0,0,CONCATENATE('TIME TABLE'!$C$8,'TIME TABLE'!$D$8,'TIME TABLE'!$E$8))","v":"(Sunday)"},{"$f":"IF(C2898=0,0,'TIME TABLE'!$C$3)","v":"09:00 AM to 11:45 AM"}]
[null,null,{"$f":"'TIME TABLE'!$F$9","v":"Social Study"},null,null,{"$f":"IF(C2899=0,0,'TIME TABLE'!$B$9)","v":"2022-04-04"},{"$f":"IF(C2899=0,0,CONCATENATE('TIME TABLE'!$C$9,'TIME TABLE'!$D$9,'TIME TABLE'!$E$9))","v":"(Monday)"},{"$f":"IF(C2899=0,0,'TIME TABLE'!$C$3)","v":"09:00 AM to 11:45 AM"}]
[null,null,{"$f":"'TIME TABLE'!$F$10","v":"Sanskrit"},null,null,{"$f":"IF(C2900=0,0,'TIME TABLE'!$B$10)","v":"2022-04-05"},{"$f":"IF(C2900=0,0,CONCATENATE('TIME TABLE'!$C$10,'TIME TABLE'!$D$10,'TIME TABLE'!$E$10))","v":"(Tuesday)"},{"$f":"IF(C2900=0,0,'TIME TABLE'!$C$3)","v":"09:00 AM to 11:45 AM"}]
[null,null,{"$f":"'TIME TABLE'!$F$11","v":0},null,null,{"$f":"IF(C2901=0,0,'TIME TABLE'!$B$11)","v":"00:00:00"},{"$f":"IF(C2901=0,0,CONCATENATE('TIME TABLE'!$C$11,'TIME TABLE'!$D$11,'TIME TABLE'!$E$11))","v":0},{"$f":"IF(C2901=0,0,'TIME TABLE'!$C$3)","v":0}]
[null,null,{"$f":"'TIME TABLE'!$F$12","v":0},null,null,{"$f":"IF(C2902=0,0,'TIME TABLE'!$B$12)","v":"00:00:00"},{"$f":"IF(C2902=0,0,CONCATENATE('TIME TABLE'!$C$12,'TIME TABLE'!$D$12,'TIME TABLE'!$E$12))","v":0},{"$f":"IF(C2902=0,0,'TIME TABLE'!$C$3)","v":0}]
[null,null,{"$f":"'TIME TABLE'!$F$13","v":0},null,null,{"$f":"IF(C2903=0,0,'TIME TABLE'!$B$13)","v":"00:00:00"},{"$f":"IF(C2903=0,0,CONCATENATE('TIME TABLE'!$C$13,'TIME TABLE'!$D$13,'TIME TABLE'!$E$13))","v":0},{"$f":"IF(C2903=0,0,'TIME TABLE'!$C$3)","v":0}]
[null,null,{"$f":"'TIME TABLE'!$F$14","v":0},null,null,{"$f":"IF(C2904=0,0,'TIME TABLE'!$B$14)","v":"00:00:00"},{"$f":"IF(C2904=0,0,CONCATENATE('TIME TABLE'!$C$14,'TIME TABLE'!$D$14,'TIME TABLE'!$E$14))","v":0},{"$f":"IF(C2904=0,0,'TIME TABLE'!$C$3)","v":0}]
[null,null,"Instructions"]
[null,null,1,"Check the exam time table carefully."]
[null,null,2,"Students must bring the 'Admit Card' and show it to the invigilator(s) on duty and should preserve it for future requirements."]
[null,null,3,"Mobile Phone, Calculator, Digital Watch or any Electronic Device is NOT ALLOWED."]
[null,null,4,"Arrive at the School at least 15 minutes before the start examination."]
[null,null,5,"Student is barred from entering the examination hall 15 minutes after the written examination starts."]
[null,null,6,"Ensure that you use the washroom before arriving for your exam as you will not be permitted to leave during the first hour."]
[null,null,7,"Normally, you are required to answer questionsusing blue or black in . Make sure you bring some spare pens with you."]
[null,null,8,"Keep your eyes on your own paper. Remember, copying is cheating!"]
[null,null,9,"You must remain silent until after you have exited the school building."]
[]
[{"$f":"A2882+1","v":88}]
[{"$nulls":4},{"$f":"MASTER!$E$11","v":"Govt. Sr. Secondary School Raimalwada"}]
[{"$nulls":4},{"$f":"MASTER!$E$14","v":"P.S.-Bapini (Jodhpur)"}]
[null,{"$f":"CONCATENATE(C2920,'TIME TABLE'!$C$5,'ADMIT CARD'!$C2921,$F2921,'ADMIT CARD'!$G2921,'TIME TABLE'!$E$5)","v":"ADMIT CARD(Roll Number●→0)"},{"$f":"CONCATENATE('TIME TABLE'!$B$2,'TIME TABLE'!$F$2)","v":"HALF YEARLY EXAM:2021-22"}]
[null,null,"ADMIT CARD",{"$nulls":6}," "]
[null,null,"Roll Number",null,null,"●→",{"$f":"VLOOKUP(A2916,'STUDENT DETAIL'!$C$8:$I$107,3)","v":0},null,"Seal and Signature of Head of Institution"]
[null,null,"Student's Name",null,null,"●→",{"$f":"VLOOKUP(A2916,'STUDENT DETAIL'!$C$8:$I$107,4)","v":0}]
[null,null,"Father's Name",null,null,"●→",{"$f":"VLOOKUP(A2916,'STUDENT DETAIL'!$C$8:$I$107,5)","v":0}]
[null,null,"Mother's Name ",null,null,"●→",{"$f":"VLOOKUP(A2916,'STUDENT DETAIL'!$C$8:$I$107,6)","v":0}]
[null,null,"Class & Section",null,null,"●→",{"$f":"IF(G2921=0,0,CONCATENATE('STUDENT DETAIL'!$E$4,'STUDENT DETAIL'!$H$4))","v":0}]
[null,null,"Date Of Birth",null,null,"●→",{"$f":"VLOOKUP(A2916,'STUDENT DETAIL'!$C$8:$I$107,7)","v":"00:00:00"}]
[null,null,"Time Table"]
[null,null,"Subject",null,null,"Date (Day)",null,"Time"]
[null,null,{"$f":"'TIME TABLE'!$F$5","v":"Hindi"},null,null,{"$f":"IF(C2929=0,0,'TIME TABLE'!$B$5)","v":"2022-03-31"},{"$f":"IF(C2929=0,0,CONCATENATE('TIME TABLE'!$C$5,'TIME TABLE'!$D$5,'TIME TABLE'!$E$5))","v":"(Thursday)"},{"$f":"IF(C2929=0,0,'TIME TABLE'!$C$3)","v":"09:00 AM to 11:45 AM"}]
[null,null,{"$f":"'TIME TABLE'!$F$6","v":"English"},null,null,{"$f":"IF(C2930=0,0,'TIME TABLE'!$B$6)","v":"2022-04-01"},{"$f":"IF(C2930=0,0,CONCATENATE('TIME TABLE'!$C$6,'TIME TABLE'!$D$6,'TIME TABLE'!$E$6))","v":"(Friday)"},{"$f":"IF(C2930=0,0,'TIME TABLE'!$C$3)","v":"09:00 AM to 11:45 AM"}]
[null,null,{"$f":"'TIME TABLE'!$F$7","v":"Science"},null,null,{"$f":"IF(C2931=0,0,'TIME TABLE'!$B$7)","v":"2022-04-02"},{"$f":"IF(C2931=0,0,CONCATENATE('TIME TABLE'!$C$7,'TIME TABLE'!$D$7,'TIME TABLE'!$E$7))","v":"(Saturday)"},{"$f":"IF(C2931=0,0,'TIME TABLE'!$C$3)","v":"09:00 AM to 11:45 AM"}]
[null,null,{"$f":"'TIME TABLE'!$F$8","v":"Mathematics"},null,null,{"$f":"IF(C2932=0,0,'TIME TABLE'!$B$8)","v":"2022-04-03"},{"$f":"IF(C2932=0,0,CONCATENATE('TIME TABLE'!$C$8,'TIME TABLE'!$D$8,'TIME TABLE'!$E$8))","v":"(Sunday)"},{"$f":"IF(C2932=0,0,'TIME TABLE'!$C$3)","v":"09:00 AM to 11:45 AM"}]
[null,null,{"$f":"'TIME TABLE'!$F$9","v":"Social Study"},null,null,{"$f":"IF(C2933=0,0,'TIME TABLE'!$B$9)","v":"2022-04-04"},{"$f":"IF(C2933=0,0,CONCATENATE('TIME TABLE'!$C$9,'TIME TABLE'!$D$9,'TIME TABLE'!$E$9))","v":"(Monday)"},{"$f":"IF(C2933=0,0,'TIME TABLE'!$C$3)","v":"09:00 AM to 11:45 AM"}]
[null,null,{"$f":"'TIME TABLE'!$F$10","v":"Sanskrit"},null,null,{"$f":"IF(C2934=0,0,'TIME TABLE'!$B$10)","v":"2022-04-05"},{"$f":"IF(C2934=0,0,CONCATENATE('TIME TABLE'!$C$10,'TIME TABLE'!$D$10,'TIME TABLE'!$E$10))","v":"(Tuesday)"},{"$f":"IF(C2934=0,0,'TIME TABLE'!$C$3)","v":"09:00 AM to 11:45 AM"}]
[null,null,{"$f":"'TIME TABLE'!$F$11","v":0},null,null,{"$f":"IF(C2935=0,0,'TIME TABLE'!$B$11)","v":"00:00:00"},{"$f":"IF(C2935=0,0,CONCATENATE('TIME TABLE'!$C$11,'TIME TABLE'!$D$11,'TIME TABLE'!$E$11))","v":0},{"$f":"IF(C2935=0,0,'TIME TABLE'!$C$3)","v":0}]
[null,null,{"$f":"'TIME TABLE'!$F$12","v":0},null,null,{"$f":"IF(C2936=0,0,'TIME TABLE'!$B$12)","v":"00:00:00"},{"$f":"IF(C2936=0,0,CONCATENATE('TIME TABLE'!$C$12,'TIME TABLE'!$D$12,'TIME TABLE'!$E$12))","v":0},{"$f":"IF(C2936=0,0,'TIME TABLE'!$C$3)","v":0}]
[null,null,{"$f":"'TIME TABLE'!$F$13","v":0},null,null,{"$f":"IF(C2937=0,0,'TIME TABLE'!$B$13)","v":"00:00:00"},{"$f":"IF(C2937=0,0,CONCATENATE('TIME TABLE'!$C$13,'TIME TABLE'!$D$13,'TIME TABLE'!$E$13))","v":0},{"$f":"IF(C2937=0,0,'TIME TABLE'!$C$3)","v":0}]
[null,null,{"$f":"'TIME TABLE'!$F$14","v":0},null,null,{"$f":"IF(C2938=0,0,'TIME TABLE'!$B$14)","v":"00:00:00"},{"$f":"IF(C2938=0,0,CONCATENATE('TIME TABLE'!$C$14,'TIME TABLE'!$D$14,'TIME TABLE'!$E$14))","v":0},{"$f":"IF(C2938=0,0,'TIME TABLE'!$C$3)","v":0}]
[null,null,"Instructions"]
[null,null,1,"Check the exam time table carefully."]
[null,null,2,"Students must bring the 'Admit Card' and show it to the invigilator(s) on duty and should preserve it for future requirements."]
[null,null,3,"Mobile Phone, Calculator, Digital Watch or any Electronic Device is NOT ALLOWED."]
[null,null,4,"Arrive at the School at least 15 minutes before the start examination."]
[null,null,5,"Student is barred from entering the examination hall 15 minutes after the written examination starts."]
[null,null,6,"Ensure that you use the washroom before arriving for your exam as you will not be permitted to leave during the first hour."]
[null,null,7,"Normally, you are required to answer questionsusing blue or black in . Make sure you bring some spare pens with you."]
[null,null,8,"Keep your eyes on your own paper. Remember, copying is cheating!"]
[null,null,9,"You must remain silent until after you have exited the school building."]
[{"$f":"A2916+1","v":89}]
[{"$nulls":4},{"$f":"MASTER!$E$11","v":"Govt. Sr. Secondary School Raimalwada"}]
[{"$nulls":4},{"$f":"MASTER!$E$14","v":"P.S.-Bapini (Jodhpur)"}]
[null,{"$f":"CONCATENATE(C2953,'TIME TABLE'!$C$5,'ADMIT CARD'!$C2954,$F2954,'ADMIT CARD'!$G2954,'TIME TABLE'!$E$5)","v":"ADMIT CARD(Roll Number●→0)"},{"$f":"CONCATENATE('TIME TABLE'!$B$2,'TIME TABLE'!$F$2)","v":"HALF YEARLY EXAM:2021-22"}]
[null,null,"ADMIT CARD",{"$nulls":6}," "]
[null,null,"Roll Number",null,null,"●→",{"$f":"VLOOKUP(A2949,'STUDENT DETAIL'!$C$8:$I$107,3)","v":0},null,"Seal and Signature of Head of Institution"]
[null,null,"Student's Name",null,null,"●→",{"$f":"VLOOKUP(A2949,'STUDENT DETAIL'!$C$8:$I$107,4)","v":0}]
[null,null,"Father's Name",null,null,"●→",{"$f":"VLOOKUP(A2949,'STUDENT DETAIL'!$C$8:$I$107,5)","v":0}]
[null,null,"Mother's Name ",null,null,"●→",{"$f":"VLOOKUP(A2949,'STUDENT DETAIL'!$C$8:$I$107,6)","v":0}]
[null,null,"Class & Section",null,null,"●→",{"$f":"IF(G2954=0,0,CONCATENATE('STUDENT DETAIL'!$E$4,'STUDENT DETAIL'!$H$4))","v":0}]
[null,null,"Date Of Birth",null,null,"●→",{"$f":"VLOOKUP(A2949,'STUDENT DETAIL'!$C$8:$I$107,7)","v":"00:00:00"}]
[null,null,"Time Table"]
[null,null,"Subject",null,null,"Date (Day)",null,"Time"]
[null,null,{"$f":"'TIME TABLE'!$F$5","v":"Hindi"},null,null,{"$f":"IF(C2962=0,0,'TIME TABLE'!$B$5)","v":"2022-03-31"},{"$f":"IF(C2962=0,0,CONCATENATE('TIME TABLE'!$C$5,'TIME TABLE'!$D$5,'TIME TABLE'!$E$5))","v":"(Thursday)"},{"$f":"IF(C2962=0,0,'TIME TABLE'!$C$3)","v":"09:00 AM to 11:45 AM"}]
[null,null,{"$f":"'TIME TABLE'!$F$6","v":"English"},null,null,{"$f":"IF(C2963=0,0,'TIME TABLE'!$B$6)","v":"2022-04-01"},{"$f":"IF(C2963=0,0,CONCATENATE('TIME TABLE'!$C$6,'TIME TABLE'!$D$6,'TIME TABLE'!$E$6))","v":"(Friday)"},{"$f":"IF(C2963=0,0,'TIME TABLE'!$C$3)","v":"09:00 AM to 11:45 AM"}]
[null,null,{"$f":"'TIME TABLE'!$F$7","v":"Science"},null,null,{"$f":"IF(C2964=0,0,'TIME TABLE'!$B$7)","v":"2022-04-02"},{"$f":"IF(C2964=0,0,CONCATENATE('TIME TABLE'!$C$7,'TIME TABLE'!$D$7,'TIME TABLE'!$E$7))","v":"(Saturday)"},{"$f":"IF(C2964=0,0,'TIME TABLE'!$C$3)","v":"09:00 AM to 11:45 AM"}]
[null,null,{"$f":"'TIME TABLE'!$F$8","v":"Mathematics"},null,null,{"$f":"IF(C2965=0,0,'TIME TABLE'!$B$8)","v":"2022-04-03"},{"$f":"IF(C2965=0,0,CONCATENATE('TIME TABLE'!$C$8,'TIME TABLE'!$D$8,'TIME TABLE'!$E$8))","v":"(Sunday)"},{"$f":"IF(C2965=0,0,'TIME TABLE'!$C$3)","v":"09:00 AM to 11:45 AM"}]
[null,null,{"$f":"'TIME TABLE'!$F$9","v":"Social Study"},null,null,{"$f":"IF(C2966=0,0,'TIME TABLE'!$B$9)","v":"2022-04-04"},{"$f":"IF(C2966=0,0,CONCATENATE('TIME TABLE'!$C$9,'TIME TABLE'!$D$9,'TIME TABLE'!$E$9))","v":"(Monday)"},{"$f":"IF(C2966=0,0,'TIME TABLE'!$C$3)","v":"09:00 AM to 11:45 AM"}]
[null,null,{"$f":"'TIME TABLE'!$F$10","v":"Sanskrit"},null,null,{"$f":"IF(C2967=0,0,'TIME TABLE'!$B$10)","v":"2022-04-05"},{"$f":"IF(C2967=0,0,CONCATENATE('TIME TABLE'!$C$10,'TIME TABLE'!$D$10,'TIME TABLE'!$E$10))","v":"(Tuesday)"},{"$f":"IF(C2967=0,0,'TIME TABLE'!$C$3)","v":"09:00 AM to 11:45 AM"}]
[null,null,{"$f":"'TIME TABLE'!$F$11","v":0},null,null,{"$f":"IF(C2968=0,0,'TIME TABLE'!$B$11)","v":"00:00:00"},{"$f":"IF(C2968=0,0,CONCATENATE('TIME TABLE'!$C$11,'TIME TABLE'!$D$11,'TIME TABLE'!$E$11))","v":0},{"$f":"IF(C2968=0,0,'TIME TABLE'!$C$3)","v":0}]
[null,null,{"$f":"'TIME TABLE'!$F$12","v":0},null,null,{"$f":"IF(C2969=0,0,'TIME TABLE'!$B$12)","v":"00:00:00"},{"$f":"IF(C2969=0,0,CONCATENATE('TIME TABLE'!$C$12,'TIME TABLE'!$D$12,'TIME TABLE'!$E$12))","v":0},{"$f":"IF(C2969=0,0,'TIME TABLE'!$C$3)","v":0}]
[null,null,{"$f":"'TIME TABLE'!$F$13","v":0},null,null,{"$f":"IF(C2970=0,0,'TIME TABLE'!$B$13)","v":"00:00:00"},{"$f":"IF(C2970=0,0,CONCATENATE('TIME TABLE'!$C$13,'TIME TABLE'!$D$13,'TIME TABLE'!$E$13))","v":0},{"$f":"IF(C2970=0,0,'TIME TABLE'!$C$3)","v":0}]
[null,null,{"$f":"'TIME TABLE'!$F$14","v":0},null,null,{"$f":"IF(C2971=0,0,'TIME TABLE'!$B$14)","v":"00:00:00"},{"$f":"IF(C2971=0,0,CONCATENATE('TIME TABLE'!$C$14,'TIME TABLE'!$D$14,'TIME TABLE'!$E$14))","v":0},{"$f":"IF(C2971=0,0,'TIME TABLE'!$C$3)","v":0}]
[null,null,"Instructions"]
[null,null,1,"Check the exam time table carefully."]
[null,null,2,"Students must bring the 'Admit Card' and show it to the invigilator(s) on duty and should preserve it for future requirements."]
[null,null,3,"Mobile Phone, Calculator, Digital Watch or any Electronic Device is NOT ALLOWED."]
[null,null,4,"Arrive at the School at least 15 minutes before the start examination."]
[null,null,5,"Student is barred from entering the examination hall 15 minutes after the written examination starts."]
[null,null,6,"Ensure that you use the washroom before arriving for your exam as you will not be permitted to leave during the first hour."]
[null,null,7,"Normally, you are required to answer questionsusing blue or black in . Make sure you bring some spare pens with you."]
[null,null,8,"Keep your eyes on your own paper. Remember, copying is cheating!"]
[null,null,9,"You must remain silent until after you have exited the school building."]
[]
[{"$f":"A2949+1","v":90}]
[{"$nulls":4},{"$f":"MASTER!$E$11","v":"Govt. Sr. Secondary School Raimalwada"}]
[{"$nulls":4},{"$f":"MASTER!$E$14","v":"P.S.-Bapini (Jodhpur)"}]
[null,{"$f":"CONCATENATE(C2987,'TIME TABLE'!$C$5,'ADMIT CARD'!$C2988,$F2988,'ADMIT CARD'!$G2988,'TIME TABLE'!$E$5)","v":"ADMIT CARD(Roll Number●→0)"},{"$f":"CONCATENATE('TIME TABLE'!$B$2,'TIME TABLE'!$F$2)","v":"HALF YEARLY EXAM:2021-22"}]
[null,null,"ADMIT CARD",{"$nulls":6}," "]
[null,null,"Roll Number",null,null,"●→",{"$f":"VLOOKUP(A2983,'STUDENT DETAIL'!$C$8:$I$107,3)","v":0},null,"Seal and Signature of Head of Institution"]
[null,null,"Student's Name",null,null,"●→",{"$f":"VLOOKUP(A2983,'STUDENT DETAIL'!$C$8:$I$107,4)","v":0}]
[null,null,"Father's Name",null,null,"●→",{"$f":"VLOOKUP(A2983,'STUDENT DETAIL'!$C$8:$I$107,5)","v":0}]
[null,null,"Mother's Name ",null,null,"●→",{"$f":"VLOOKUP(A2983,'STUDENT DETAIL'!$C$8:$I$107,6)","v":0}]
[null,null,"Class & Section",null,null,"●→",{"$f":"IF(G2988=0,0,CONCATENATE('STUDENT DETAIL'!$E$4,'STUDENT DETAIL'!$H$4))","v":0}]
[null,null,"Date Of Birth",null,null,"●→",{"$f":"VLOOKUP(A2983,'STUDENT DETAIL'!$C$8:$I$107,7)","v":"00:00:00"}]
[null,null,"Time Table"]
[null,null,"Subject",null,null,"Date (Day)",null,"Time"]
[null,null,{"$f":"'TIME TABLE'!$F$5","v":"Hindi"},null,null,{"$f":"IF(C2996=0,0,'TIME TABLE'!$B$5)","v":"2022-03-31"},{"$f":"IF(C2996=0,0,CONCATENATE('TIME TABLE'!$C$5,'TIME TABLE'!$D$5,'TIME TABLE'!$E$5))","v":"(Thursday)"},{"$f":"IF(C2996=0,0,'TIME TABLE'!$C$3)","v":"09:00 AM to 11:45 AM"}]
[null,null,{"$f":"'TIME TABLE'!$F$6","v":"English"},null,null,{"$f":"IF(C2997=0,0,'TIME TABLE'!$B$6)","v":"2022-04-01"},{"$f":"IF(C2997=0,0,CONCATENATE('TIME TABLE'!$C$6,'TIME TABLE'!$D$6,'TIME TABLE'!$E$6))","v":"(Friday)"},{"$f":"IF(C2997=0,0,'TIME TABLE'!$C$3)","v":"09:00 AM to 11:45 AM"}]
[null,null,{"$f":"'TIME TABLE'!$F$7","v":"Science"},null,null,{"$f":"IF(C2998=0,0,'TIME TABLE'!$B$7)","v":"2022-04-02"},{"$f":"IF(C2998=0,0,CONCATENATE('TIME TABLE'!$C$7,'TIME TABLE'!$D$7,'TIME TABLE'!$E$7))","v":"(Saturday)"},{"$f":"IF(C2998=0,0,'TIME TABLE'!$C$3)","v":"09:00 AM to 11:45 AM"}]
[null,null,{"$f":"'TIME TABLE'!$F$8","v":"Mathematics"},null,null,{"$f":"IF(C2999=0,0,'TIME TABLE'!$B$8)","v":"2022-04-03"},{"$f":"IF(C2999=0,0,CONCATENATE('TIME TABLE'!$C$8,'TIME TABLE'!$D$8,'TIME TABLE'!$E$8))","v":"(Sunday)"},{"$f":"IF(C2999=0,0,'TIME TABLE'!$C$3)","v":"09:00 AM to 11:45 AM"}]
[null,null,{"$f":"'TIME TABLE'!$F$9","v":"Social Study"},null,null,{"$f":"IF(C3000=0,0,'TIME TABLE'!$B$9)","v":"2022-04-04"},{"$f":"IF(C3000=0,0,CONCATENATE('TIME TABLE'!$C$9,'TIME TABLE'!$D$9,'TIME TABLE'!$E$9))","v":"(Monday)"},{"$f":"IF(C3000=0,0,'TIME TABLE'!$C$3)","v":"09:00 AM to 11:45 AM"}]
[null,null,{"$f":"'TIME TABLE'!$F$10","v":"Sanskrit"},null,null,{"$f":"IF(C3001=0,0,'TIME TABLE'!$B$10)","v":"2022-04-05"},{"$f":"IF(C3001=0,0,CONCATENATE('TIME TABLE'!$C$10,'TIME TABLE'!$D$10,'TIME TABLE'!$E$10))","v":"(Tuesday)"},{"$f":"IF(C3001=0,0,'TIME TABLE'!$C$3)","v":"09:00 AM to 11:45 AM"}]
[null,null,{"$f":"'TIME TABLE'!$F$11","v":0},null,null,{"$f":"IF(C3002=0,0,'TIME TABLE'!$B$11)","v":"00:00:00"},{"$f":"IF(C3002=0,0,CONCATENATE('TIME TABLE'!$C$11,'TIME TABLE'!$D$11,'TIME TABLE'!$E$11))","v":0},{"$f":"IF(C3002=0,0,'TIME TABLE'!$C$3)","v":0}]
[null,null,{"$f":"'TIME TABLE'!$F$12","v":0},null,null,{"$f":"IF(C3003=0,0,'TIME TABLE'!$B$12)","v":"00:00:00"},{"$f":"IF(C3003=0,0,CONCATENATE('TIME TABLE'!$C$12,'TIME TABLE'!$D$12,'TIME TABLE'!$E$12))","v":0},{"$f":"IF(C3003=0,0,'TIME TABLE'!$C$3)","v":0}]
[null,null,{"$f":"'TIME TABLE'!$F$13","v":0},null,null,{"$f":"IF(C3004=0,0,'TIME TABLE'!$B$13)","v":"00:00:00"},{"$f":"IF(C3004=0,0,CONCATENATE('TIME TABLE'!$C$13,'TIME TABLE'!$D$13,'TIME TABLE'!$E$13))","v":0},{"$f":"IF(C3004=0,0,'TIME TABLE'!$C$3)","v":0}]
[null,null,{"$f":"'TIME TABLE'!$F$14","v":0},null,null,{"$f":"IF(C3005=0,0,'TIME TABLE'!$B$14)","v":"00:00:00"},{"$f":"IF(C3005=0,0,CONCATENATE('TIME TABLE'!$C$14,'TIME TABLE'!$D$14,'TIME TABLE'!$E$14))","v":0},{"$f":"IF(C3005=0,0,'TIME TABLE'!$C$3)","v":0}]
[null,null,"Instructions"]
[null,null,1,"Check the exam time table carefully."]
[null,null,2,"Students must bring the 'Admit Card' and show it to the invigilator(s) on duty and should preserve it for future requirements."]
[null,null,3,"Mobile Phone, Calculator, Digital Watch or any Electronic Device is NOT ALLOWED."]
[null,null,4,"Arrive at the School at least 15 minutes before the start examination."]
[null,null,5,"Student is barred from entering the examination hall 15 minutes after the written examination starts."]
[null,null,6,"Ensure that you use the washroom before arriving for your exam as you will not be permitted to leave during the first hour."]
[null,null,7,"Normally, you are required to answer questionsusing blue or black in . Make sure you bring some spare pens with you."]
[null,null,8,"Keep your eyes on your own paper. Remember, copying is cheating!"]
[null,null,9,"You must remain silent until after you have exited the school building."]
[{"$f":"A2983+1","v":91}]
[{"$nulls":4},{"$f":"MASTER!$E$11","v":"Govt. Sr. Secondary School Raimalwada"}]
[{"$nulls":4},{"$f":"MASTER!$E$14","v":"P.S.-Bapini (Jodhpur)"}]
[null,{"$f":"CONCATENATE(C3020,'TIME TABLE'!$C$5,'ADMIT CARD'!$C3021,$F3021,'ADMIT CARD'!$G3021,'TIME TABLE'!$E$5)","v":"ADMIT CARD(Roll Number●→0)"},{"$f":"CONCATENATE('TIME TABLE'!$B$2,'TIME TABLE'!$F$2)","v":"HALF YEARLY EXAM:2021-22"}]
[null,null,"ADMIT CARD",{"$nulls":6}," "]
[null,null,"Roll Number",null,null,"●→",{"$f":"VLOOKUP(A3016,'STUDENT DETAIL'!$C$8:$I$107,3)","v":0},null,"Seal and Signature of Head of Institution"]
[null,null,"Student's Name",null,null,"●→",{"$f":"VLOOKUP(A3016,'STUDENT DETAIL'!$C$8:$I$107,4)","v":0}]
[null,null,"Father's Name",null,null,"●→",{"$f":"VLOOKUP(A3016,'STUDENT DETAIL'!$C$8:$I$107,5)","v":0}]
[null,null,"Mother's Name ",null,null,"●→",{"$f":"VLOOKUP(A3016,'STUDENT DETAIL'!$C$8:$I$107,6)","v":0}]
[null,null,"Class & Section",null,null,"●→",{"$f":"IF(G3021=0,0,CONCATENATE('STUDENT DETAIL'!$E$4,'STUDENT DETAIL'!$H$4))","v":0}]
[null,null,"Date Of Birth",null,null,"●→",{"$f":"VLOOKUP(A3016,'STUDENT DETAIL'!$C$8:$I$107,7)","v":"00:00:00"}]
[null,null,"Time Table"]
[null,null,"Subject",null,null,"Date (Day)",null,"Time"]
[null,null,{"$f":"'TIME TABLE'!$F$5","v":"Hindi"},null,null,{"$f":"IF(C3029=0,0,'TIME TABLE'!$B$5)","v":"2022-03-31"},{"$f":"IF(C3029=0,0,CONCATENATE('TIME TABLE'!$C$5,'TIME TABLE'!$D$5,'TIME TABLE'!$E$5))","v":"(Thursday)"},{"$f":"IF(C3029=0,0,'TIME TABLE'!$C$3)","v":"09:00 AM to 11:45 AM"}]
[null,null,{"$f":"'TIME TABLE'!$F$6","v":"English"},null,null,{"$f":"IF(C3030=0,0,'TIME TABLE'!$B$6)","v":"2022-04-01"},{"$f":"IF(C3030=0,0,CONCATENATE('TIME TABLE'!$C$6,'TIME TABLE'!$D$6,'TIME TABLE'!$E$6))","v":"(Friday)"},{"$f":"IF(C3030=0,0,'TIME TABLE'!$C$3)","v":"09:00 AM to 11:45 AM"}]
[null,null,{"$f":"'TIME TABLE'!$F$7","v":"Science"},null,null,{"$f":"IF(C3031=0,0,'TIME TABLE'!$B$7)","v":"2022-04-02"},{"$f":"IF(C3031=0,0,CONCATENATE('TIME TABLE'!$C$7,'TIME TABLE'!$D$7,'TIME TABLE'!$E$7))","v":"(Saturday)"},{"$f":"IF(C3031=0,0,'TIME TABLE'!$C$3)","v":"09:00 AM to 11:45 AM"}]
[null,null,{"$f":"'TIME TABLE'!$F$8","v":"Mathematics"},null,null,{"$f":"IF(C3032=0,0,'TIME TABLE'!$B$8)","v":"2022-04-03"},{"$f":"IF(C3032=0,0,CONCATENATE('TIME TABLE'!$C$8,'TIME TABLE'!$D$8,'TIME TABLE'!$E$8))","v":"(Sunday)"},{"$f":"IF(C3032=0,0,'TIME TABLE'!$C$3)","v":"09:00 AM to 11:45 AM"}]
[null,null,{"$f":"'TIME TABLE'!$F$9","v":"Social Study"},null,null,{"$f":"IF(C3033=0,0,'TIME TABLE'!$B$9)","v":"2022-04-04"},{"$f":"IF(C3033=0,0,CONCATENATE('TIME TABLE'!$C$9,'TIME TABLE'!$D$9,'TIME TABLE'!$E$9))","v":"(Monday)"},{"$f":"IF(C3033=0,0,'TIME TABLE'!$C$3)","v":"09:00 AM to 11:45 AM"}]
[null,null,{"$f":"'TIME TABLE'!$F$10","v":"Sanskrit"},null,null,{"$f":"IF(C3034=0,0,'TIME TABLE'!$B$10)","v":"2022-04-05"},{"$f":"IF(C3034=0,0,CONCATENATE('TIME TABLE'!$C$10,'TIME TABLE'!$D$10,'TIME TABLE'!$E$10))","v":"(Tuesday)"},{"$f":"IF(C3034=0,0,'TIME TABLE'!$C$3)","v":"09:00 AM to 11:45 AM"}]
[null,null,{"$f":"'TIME TABLE'!$F$11","v":0},null,null,{"$f":"IF(C3035=0,0,'TIME TABLE'!$B$11)","v":"00:00:00"},{"$f":"IF(C3035=0,0,CONCATENATE('TIME TABLE'!$C$11,'TIME TABLE'!$D$11,'TIME TABLE'!$E$11))","v":0},{"$f":"IF(C3035=0,0,'TIME TABLE'!$C$3)","v":0}]
[null,null,{"$f":"'TIME TABLE'!$F$12","v":0},null,null,{"$f":"IF(C3036=0,0,'TIME TABLE'!$B$12)","v":"00:00:00"},{"$f":"IF(C3036=0,0,CONCATENATE('TIME TABLE'!$C$12,'TIME TABLE'!$D$12,'TIME TABLE'!$E$12))","v":0},{"$f":"IF(C3036=0,0,'TIME TABLE'!$C$3)","v":0}]
[null,null,{"$f":"'TIME TABLE'!$F$13","v":0},null,null,{"$f":"IF(C3037=0,0,'TIME TABLE'!$B$13)","v":"00:00:00"},{"$f":"IF(C3037=0,0,CONCATENATE('TIME TABLE'!$C$13,'TIME TABLE'!$D$13,'TIME TABLE'!$E$13))","v":0},{"$f":"IF(C3037=0,0,'TIME TABLE'!$C$3)","v":0}]
[null,null,{"$f":"'TIME TABLE'!$F$14","v":0},null,null,{"$f":"IF(C3038=0,0,'TIME TABLE'!$B$14)","v":"00:00:00"},{"$f":"IF(C3038=0,0,CONCATENATE('TIME TABLE'!$C$14,'TIME TABLE'!$D$14,'TIME TABLE'!$E$14))","v":0},{"$f":"IF(C3038=0,0,'TIME TABLE'!$C$3)","v":0}]
[null,null,"Instructions"]
[null,null,1,"Check the exam time table carefully."]
[null,null,2,"Students must bring the 'Admit Card' and show it to the invigilator(s) on duty and should preserve it for future requirements."]
[null,null,3,"Mobile Phone, Calculator, Digital Watch or any Electronic Device is NOT ALLOWED."]
[null,null,4,"Arrive at the School at least 15 minutes before the start examination."]
[null,null,5,"Student is barred from entering the examination hall 15 minutes after the written examination starts."]
[null,null,6,"Ensure that you use the washroom before arriving for your exam as you will not be permitted to leave during the first hour."]
[null,null,7,"Normally, you are required to answer questionsusing blue or black in . Make sure you bring some spare pens with you."]
[null,null,8,"Keep your eyes on your own paper. Remember, copying is cheating!"]
[null,null,9,"You must remain silent until after you have exited the school building."]
[]
[{"$f":"A3016+1","v":92}]
[{"$nulls":4},{"$f":"MASTER!$E$11","v":"Govt. Sr. Secondary School Raimalwada"}]
[{"$nulls":4},{"$f":"MASTER!$E$14","v":"P.S.-Bapini (Jodhpur)"}]
[null,{"$f":"CONCATENATE(C3054,'TIME TABLE'!$C$5,'ADMIT CARD'!$C3055,$F3055,'ADMIT CARD'!$G3055,'TIME TABLE'!$E$5)","v":"ADMIT CARD(Roll Number●→0)"},{"$f":"CONCATENATE('TIME TABLE'!$B$2,'TIME TABLE'!$F$2)","v":"HALF YEARLY EXAM:2021-22"}]
[null,null,"ADMIT CARD",{"$nulls":6}," "]
[null,null,"Roll Number",null,null,"●→",{"$f":"VLOOKUP(A3050,'STUDENT DETAIL'!$C$8:$I$107,3)","v":0},null,"Seal and Signature of Head of Institution"]
[null,null,"Student's Name",null,null,"●→",{"$f":"VLOOKUP(A3050,'STUDENT DETAIL'!$C$8:$I$107,4)","v":0}]
[null,null,"Father's Name",null,null,"●→",{"$f":"VLOOKUP(A3050,'STUDENT DETAIL'!$C$8:$I$107,5)","v":0}]
[null,null,"Mother's Name ",null,null,"●→",{"$f":"VLOOKUP(A3050,'STUDENT DETAIL'!$C$8:$I$107,6)","v":0}]
[null,null,"Class & Section",null,null,"●→",{"$f":"IF(G3055=0,0,CONCATENATE('STUDENT DETAIL'!$E$4,'STUDENT DETAIL'!$H$4))","v":0}]
[null,null,"Date Of Birth",null,null,"●→",{"$f":"VLOOKUP(A3050,'STUDENT DETAIL'!$C$8:$I$107,7)","v":"00:00:00"}]
[null,null,"Time Table"]
[null,null,"Subject",null,null,"Date (Day)",null,"Time"]
[null,null,{"$f":"'TIME TABLE'!$F$5","v":"Hindi"},null,null,{"$f":"IF(C3063=0,0,'TIME TABLE'!$B$5)","v":"2022-03-31"},{"$f":"IF(C3063=0,0,CONCATENATE('TIME TABLE'!$C$5,'TIME TABLE'!$D$5,'TIME TABLE'!$E$5))","v":"(Thursday)"},{"$f":"IF(C3063=0,0,'TIME TABLE'!$C$3)","v":"09:00 AM to 11:45 AM"}]
[null,null,{"$f":"'TIME TABLE'!$F$6","v":"English"},null,null,{"$f":"IF(C3064=0,0,'TIME TABLE'!$B$6)","v":"2022-04-01"},{"$f":"IF(C3064=0,0,CONCATENATE('TIME TABLE'!$C$6,'TIME TABLE'!$D$6,'TIME TABLE'!$E$6))","v":"(Friday)"},{"$f":"IF(C3064=0,0,'TIME TABLE'!$C$3)","v":"09:00 AM to 11:45 AM"}]
[null,null,{"$f":"'TIME TABLE'!$F$7","v":"Science"},null,null,{"$f":"IF(C3065=0,0,'TIME TABLE'!$B$7)","v":"2022-04-02"},{"$f":"IF(C3065=0,0,CONCATENATE('TIME TABLE'!$C$7,'TIME TABLE'!$D$7,'TIME TABLE'!$E$7))","v":"(Saturday)"},{"$f":"IF(C3065=0,0,'TIME TABLE'!$C$3)","v":"09:00 AM to 11:45 AM"}]
[null,null,{"$f":"'TIME TABLE'!$F$8","v":"Mathematics"},null,null,{"$f":"IF(C3066=0,0,'TIME TABLE'!$B$8)","v":"2022-04-03"},{"$f":"IF(C3066=0,0,CONCATENATE('TIME TABLE'!$C$8,'TIME TABLE'!$D$8,'TIME TABLE'!$E$8))","v":"(Sunday)"},{"$f":"IF(C3066=0,0,'TIME TABLE'!$C$3)","v":"09:00 AM to 11:45 AM"}]
[null,null,{"$f":"'TIME TABLE'!$F$9","v":"Social Study"},null,null,{"$f":"IF(C3067=0,0,'TIME TABLE'!$B$9)","v":"2022-04-04"},{"$f":"IF(C3067=0,0,CONCATENATE('TIME TABLE'!$C$9,'TIME TABLE'!$D$9,'TIME TABLE'!$E$9))","v":"(Monday)"},{"$f":"IF(C3067=0,0,'TIME TABLE'!$C$3)","v":"09:00 AM to 11:45 AM"}]
[null,null,{"$f":"'TIME TABLE'!$F$10","v":"Sanskrit"},null,null,{"$f":"IF(C3068=0,0,'TIME TABLE'!$B$10)","v":"2022-04-05"},{"$f":"IF(C3068=0,0,CONCATENATE('TIME TABLE'!$C$10,'TIME TABLE'!$D$10,'TIME TABLE'!$E$10))","v":"(Tuesday)"},{"$f":"IF(C3068=0,0,'TIME TABLE'!$C$3)","v":"09:00 AM to 11:45 AM"}]
[null,null,{"$f":"'TIME TABLE'!$F$11","v":0},null,null,{"$f":"IF(C3069=0,0,'TIME TABLE'!$B$11)","v":"00:00:00"},{"$f":"IF(C3069=0,0,CONCATENATE('TIME TABLE'!$C$11,'TIME TABLE'!$D$11,'TIME TABLE'!$E$11))","v":0},{"$f":"IF(C3069=0,0,'TIME TABLE'!$C$3)","v":0}]
[null,null,{"$f":"'TIME TABLE'!$F$12","v":0},null,null,{"$f":"IF(C3070=0,0,'TIME TABLE'!$B$12)","v":"00:00:00"},{"$f":"IF(C3070=0,0,CONCATENATE('TIME TABLE'!$C$12,'TIME TABLE'!$D$12,'TIME TABLE'!$E$12))","v":0},{"$f":"IF(C3070=0,0,'TIME TABLE'!$C$3)","v":0}]
[null,null,{"$f":"'TIME TABLE'!$F$13","v":0},null,null,{"$f":"IF(C3071=0,0,'TIME TABLE'!$B$13)","v":"00:00:00"},{"$f":"IF(C3071=0,0,CONCATENATE('TIME TABLE'!$C$13,'TIME TABLE'!$D$13,'TIME TABLE'!$E$13))","v":0},{"$f":"IF(C3071=0,0,'TIME TABLE'!$C$3)","v":0}]
[null,null,{"$f":"'TIME TABLE'!$F$14","v":0},null,null,{"$f":"IF(C3072=0,0,'TIME TABLE'!$B$14)","v":"00:00:00"},{"$f":"IF(C3072=0,0,CONCATENATE('TIME TABLE'!$C$14,'TIME TABLE'!$D$14,'TIME TABLE'!$E$14))","v":0},{"$f":"IF(C3072=0,0,'TIME TABLE'!$C$3)","v":0}]
[null,null,"Instructions"]
[null,null,1,"Check the exam time table carefully."]
[null,null,2,"Students must bring the 'Admit Card' and show it to the invigilator(s) on duty and should preserve it for future requirements."]
[null,null,3,"Mobile Phone, Calculator, Digital Watch or any Electronic Device is NOT ALLOWED."]
[null,null,4,"Arrive at the School at least 15 minutes before the start examination."]
[null,null,5,"Student is barred from entering the examination hall 15 minutes after the written examination starts."]
[null,null,6,"Ensure that you use the washroom before arriving for your exam as you will not be permitted to leave during the first hour."]
[null,null,7,"Normally, you are required to answer questionsusing blue or black in . Make sure you bring some spare pens with you."]
[null,null,8,"Keep your eyes on your own paper. Remember, copying is cheating!"]
[null,null,9,"You must remain silent until after you have exited the school building."]
[{"$f":"A3050+1","v":93}]
[{"$nulls":4},{"$f":"MASTER!$E$11","v":"Govt. Sr. Secondary School Raimalwada"}]
[{"$nulls":4},{"$f":"MASTER!$E$14","v":"P.S.-Bapini (Jodhpur)"}]
[null,{"$f":"CONCATENATE(C3087,'TIME TABLE'!$C$5,'ADMIT CARD'!$C3088,$F3088,'ADMIT CARD'!$G3088,'TIME TABLE'!$E$5)","v":"ADMIT CARD(Roll Number●→0)"},{"$f":"CONCATENATE('TIME TABLE'!$B$2,'TIME TABLE'!$F$2)","v":"HALF YEARLY EXAM:2021-22"}]
[null,null,"ADMIT CARD",{"$nulls":6}," "]
[null,null,"Roll Number",null,null,"●→",{"$f":"VLOOKUP(A3083,'STUDENT DETAIL'!$C$8:$I$107,3)","v":0},null,"Seal and Signature of Head of Institution"]
[null,null,"Student's Name",null,null,"●→",{"$f":"VLOOKUP(A3083,'STUDENT DETAIL'!$C$8:$I$107,4)","v":0}]
[null,null,"Father's Name",null,null,"●→",{"$f":"VLOOKUP(A3083,'STUDENT DETAIL'!$C$8:$I$107,5)","v":0}]
[null,null,"Mother's Name ",null,null,"●→",{"$f":"VLOOKUP(A3083,'STUDENT DETAIL'!$C$8:$I$107,6)","v":0}]
[null,null,"Class & Section",null,null,"●→",{"$f":"IF(G3088=0,0,CONCATENATE('STUDENT DETAIL'!$E$4,'STUDENT DETAIL'!$H$4))","v":0}]
[null,null,"Date Of Birth",null,null,"●→",{"$f":"VLOOKUP(A3083,'STUDENT DETAIL'!$C$8:$I$107,7)","v":"00:00:00"}]
[null,null,"Time Table"]
[null,null,"Subject",null,null,"Date (Day)",null,"Time"]
[null,null,{"$f":"'TIME TABLE'!$F$5","v":"Hindi"},null,null,{"$f":"IF(C3096=0,0,'TIME TABLE'!$B$5)","v":"2022-03-31"},{"$f":"IF(C3096=0,0,CONCATENATE('TIME TABLE'!$C$5,'TIME TABLE'!$D$5,'TIME TABLE'!$E$5))","v":"(Thursday)"},{"$f":"IF(C3096=0,0,'TIME TABLE'!$C$3)","v":"09:00 AM to 11:45 AM"}]
[null,null,{"$f":"'TIME TABLE'!$F$6","v":"English"},null,null,{"$f":"IF(C3097=0,0,'TIME TABLE'!$B$6)","v":"2022-04-01"},{"$f":"IF(C3097=0,0,CONCATENATE('TIME TABLE'!$C$6,'TIME TABLE'!$D$6,'TIME TABLE'!$E$6))","v":"(Friday)"},{"$f":"IF(C3097=0,0,'TIME TABLE'!$C$3)","v":"09:00 AM to 11:45 AM"}]
[null,null,{"$f":"'TIME TABLE'!$F$7","v":"Science"},null,null,{"$f":"IF(C3098=0,0,'TIME TABLE'!$B$7)","v":"2022-04-02"},{"$f":"IF(C3098=0,0,CONCATENATE('TIME TABLE'!$C$7,'TIME TABLE'!$D$7,'TIME TABLE'!$E$7))","v":"(Saturday)"},{"$f":"IF(C3098=0,0,'TIME TABLE'!$C$3)","v":"09:00 AM to 11:45 AM"}]
[null,null,{"$f":"'TIME TABLE'!$F$8","v":"Mathematics"},null,null,{"$f":"IF(C3099=0,0,'TIME TABLE'!$B$8)","v":"2022-04-03"},{"$f":"IF(C3099=0,0,CONCATENATE('TIME TABLE'!$C$8,'TIME TABLE'!$D$8,'TIME TABLE'!$E$8))","v":"(Sunday)"},{"$f":"IF(C3099=0,0,'TIME TABLE'!$C$3)","v":"09:00 AM to 11:45 AM"}]
[null,null,{"$f":"'TIME TABLE'!$F$9","v":"Social Study"},null,null,{"$f":"IF(C3100=0,0,'TIME TABLE'!$B$9)","v":"2022-04-04"},{"$f":"IF(C3100=0,0,CONCATENATE('TIME TABLE'!$C$9,'TIME TABLE'!$D$9,'TIME TABLE'!$E$9))","v":"(Monday)"},{"$f":"IF(C3100=0,0,'TIME TABLE'!$C$3)","v":"09:00 AM to 11:45 AM"}]
[null,null,{"$f":"'TIME TABLE'!$F$10","v":"Sanskrit"},null,null,{"$f":"IF(C3101=0,0,'TIME TABLE'!$B$10)","v":"2022-04-05"},{"$f":"IF(C3101=0,0,CONCATENATE('TIME TABLE'!$C$10,'TIME TABLE'!$D$10,'TIME TABLE'!$E$10))","v":"(Tuesday)"},{"$f":"IF(C3101=0,0,'TIME TABLE'!$C$3)","v":"09:00 AM to 11:45 AM"}]
[null,null,{"$f":"'TIME TABLE'!$F$11","v":0},null,null,{"$f":"IF(C3102=0,0,'TIME TABLE'!$B$11)","v":"00:00:00"},{"$f":"IF(C3102=0,0,CONCATENATE('TIME TABLE'!$C$11,'TIME TABLE'!$D$11,'TIME TABLE'!$E$11))","v":0},{"$f":"IF(C3102=0,0,'TIME TABLE'!$C$3)","v":0}]
[null,null,{"$f":"'TIME TABLE'!$F$12","v":0},null,null,{"$f":"IF(C3103=0,0,'TIME TABLE'!$B$12)","v":"00:00:00"},{"$f":"IF(C3103=0,0,CONCATENATE('TIME TABLE'!$C$12,'TIME TABLE'!$D$12,'TIME TABLE'!$E$12))","v":0},{"$f":"IF(C3103=0,0,'TIME TABLE'!$C$3)","v":0}]
[null,null,{"$f":"'TIME TABLE'!$F$13","v":0},null,null,{"$f":"IF(C3104=0,0,'TIME TABLE'!$B$13)","v":"00:00:00"},{"$f":"IF(C3104=0,0,CONCATENATE('TIME TABLE'!$C$13,'TIME TABLE'!$D$13,'TIME TABLE'!$E$13))","v":0},{"$f":"IF(C3104=0,0,'TIME TABLE'!$C$3)","v":0}]
[null,null,{"$f":"'TIME TABLE'!$F$14","v":0},null,null,{"$f":"IF(C3105=0,0,'TIME TABLE'!$B$14)","v":"00:00:00"},{"$f":"IF(C3105=0,0,CONCATENATE('TIME TABLE'!$C$14,'TIME TABLE'!$D$14,'TIME TABLE'!$E$14))","v":0},{"$f":"IF(C3105=0,0,'TIME TABLE'!$C$3)","v":0}]
[null,null,"Instructions"]
[null,null,1,"Check the exam time table carefully."]
[null,null,2,"Students must bring the 'Admit Card' and show it to the invigilator(s) on duty and should preserve it for future requirements."]
[null,null,3,"Mobile Phone, Calculator, Digital Watch or any Electronic Device is NOT ALLOWED."]
[null,null,4,"Arrive at the School at least 15 minutes before the start examination."]
[null,null,5,"Student is barred from entering the examination hall 15 minutes after the written examination starts."]
[null,null,6,"Ensure that you use the washroom before arriving for your exam as you will not be permitted to leave during the first hour."]
[null,null,7,"Normally, you are required to answer questionsusing blue or black in . Make sure you bring some spare pens with you."]
[null,null,8,"Keep your eyes on your own paper. Remember, copying is cheating!"]
[null,null,9,"You must remain silent until after you have exited the school building."]
[]
[{"$f":"A3083+1","v":94}]
[{"$nulls":4},{"$f":"MASTER!$E$11","v":"Govt. Sr. Secondary School Raimalwada"}]
[{"$nulls":4},{"$f":"MASTER!$E$14","v":"P.S.-Bapini (Jodhpur)"}]
[null,{"$f":"CONCATENATE(C3121,'TIME TABLE'!$C$5,'ADMIT CARD'!$C3122,$F3122,'ADMIT CARD'!$G3122,'TIME TABLE'!$E$5)","v":"ADMIT CARD(Roll Number●→0)"},{"$f":"CONCATENATE('TIME TABLE'!$B$2,'TIME TABLE'!$F$2)","v":"HALF YEARLY EXAM:2021-22"}]
[null,null,"ADMIT CARD",{"$nulls":6}," "]
[null,null,"Roll Number",null,null,"●→",{"$f":"VLOOKUP(A3117,'STUDENT DETAIL'!$C$8:$I$107,3)","v":0},null,"Seal and Signature of Head of Institution"]
[null,null,"Student's Name",null,null,"●→",{"$f":"VLOOKUP(A3117,'STUDENT DETAIL'!$C$8:$I$107,4)","v":0}]
[null,null,"Father's Name",null,null,"●→",{"$f":"VLOOKUP(A3117,'STUDENT DETAIL'!$C$8:$I$107,5)","v":0}]
[null,null,"Mother's Name ",null,null,"●→",{"$f":"VLOOKUP(A3117,'STUDENT DETAIL'!$C$8:$I$107,6)","v":0}]
[null,null,"Class & Section",null,null,"●→",{"$f":"IF(G3122=0,0,CONCATENATE('STUDENT DETAIL'!$E$4,'STUDENT DETAIL'!$H$4))","v":0}]
[null,null,"Date Of Birth",null,null,"●→",{"$f":"VLOOKUP(A3117,'STUDENT DETAIL'!$C$8:$I$107,7)","v":"00:00:00"}]
[null,null,"Time Table"]
[null,null,"Subject",null,null,"Date (Day)",null,"Time"]
[null,null,{"$f":"'TIME TABLE'!$F$5","v":"Hindi"},null,null,{"$f":"IF(C3130=0,0,'TIME TABLE'!$B$5)","v":"2022-03-31"},{"$f":"IF(C3130=0,0,CONCATENATE('TIME TABLE'!$C$5,'TIME TABLE'!$D$5,'TIME TABLE'!$E$5))","v":"(Thursday)"},{"$f":"IF(C3130=0,0,'TIME TABLE'!$C$3)","v":"09:00 AM to 11:45 AM"}]
[null,null,{"$f":"'TIME TABLE'!$F$6","v":"English"},null,null,{"$f":"IF(C3131=0,0,'TIME TABLE'!$B$6)","v":"2022-04-01"},{"$f":"IF(C3131=0,0,CONCATENATE('TIME TABLE'!$C$6,'TIME TABLE'!$D$6,'TIME TABLE'!$E$6))","v":"(Friday)"},{"$f":"IF(C3131=0,0,'TIME TABLE'!$C$3)","v":"09:00 AM to 11:45 AM"}]
[null,null,{"$f":"'TIME TABLE'!$F$7","v":"Science"},null,null,{"$f":"IF(C3132=0,0,'TIME TABLE'!$B$7)","v":"2022-04-02"},{"$f":"IF(C3132=0,0,CONCATENATE('TIME TABLE'!$C$7,'TIME TABLE'!$D$7,'TIME TABLE'!$E$7))","v":"(Saturday)"},{"$f":"IF(C3132=0,0,'TIME TABLE'!$C$3)","v":"09:00 AM to 11:45 AM"}]
[null,null,{"$f":"'TIME TABLE'!$F$8","v":"Mathematics"},null,null,{"$f":"IF(C3133=0,0,'TIME TABLE'!$B$8)","v":"2022-04-03"},{"$f":"IF(C3133=0,0,CONCATENATE('TIME TABLE'!$C$8,'TIME TABLE'!$D$8,'TIME TABLE'!$E$8))","v":"(Sunday)"},{"$f":"IF(C3133=0,0,'TIME TABLE'!$C$3)","v":"09:00 AM to 11:45 AM"}]
[null,null,{"$f":"'TIME TABLE'!$F$9","v":"Social Study"},null,null,{"$f":"IF(C3134=0,0,'TIME TABLE'!$B$9)","v":"2022-04-04"},{"$f":"IF(C3134=0,0,CONCATENATE('TIME TABLE'!$C$9,'TIME TABLE'!$D$9,'TIME TABLE'!$E$9))","v":"(Monday)"},{"$f":"IF(C3134=0,0,'TIME TABLE'!$C$3)","v":"09:00 AM to 11:45 AM"}]
[null,null,{"$f":"'TIME TABLE'!$F$10","v":"Sanskrit"},null,null,{"$f":"IF(C3135=0,0,'TIME TABLE'!$B$10)","v":"2022-04-05"},{"$f":"IF(C3135=0,0,CONCATENATE('TIME TABLE'!$C$10,'TIME TABLE'!$D$10,'TIME TABLE'!$E$10))","v":"(Tuesday)"},{"$f":"IF(C3135=0,0,'TIME TABLE'!$C$3)","v":"09:00 AM to 11:45 AM"}]
[null,null,{"$f":"'TIME TABLE'!$F$11","v":0},null,null,{"$f":"IF(C3136=0,0,'TIME TABLE'!$B$11)","v":"00:00:00"},{"$f":"IF(C3136=0,0,CONCATENATE('TIME TABLE'!$C$11,'TIME TABLE'!$D$11,'TIME TABLE'!$E$11))","v":0},{"$f":"IF(C3136=0,0,'TIME TABLE'!$C$3)","v":0}]
[null,null,{"$f":"'TIME TABLE'!$F$12","v":0},null,null,{"$f":"IF(C3137=0,0,'TIME TABLE'!$B$12)","v":"00:00:00"},{"$f":"IF(C3137=0,0,CONCATENATE('TIME TABLE'!$C$12,'TIME TABLE'!$D$12,'TIME TABLE'!$E$12))","v":0},{"$f":"IF(C3137=0,0,'TIME TABLE'!$C$3)","v":0}]
[null,null,{"$f":"'TIME TABLE'!$F$13","v":0},null,null,{"$f":"IF(C3138=0,0,'TIME TABLE'!$B$13)","v":"00:00:00"},{"$f":"IF(C3138=0,0,CONCATENATE('TIME TABLE'!$C$13,'TIME TABLE'!$D$13,'TIME TABLE'!$E$13))","v":0},{"$f":"IF(C3138=0,0,'TIME TABLE'!$C$3)","v":0}]
[null,null,{"$f":"'TIME TABLE'!$F$14","v":0},null,null,{"$f":"IF(C3139=0,0,'TIME TABLE'!$B$14)","v":"00:00:00"},{"$f":"IF(C3139=0,0,CONCATENATE('TIME TABLE'!$C$14,'TIME TABLE'!$D$14,'TIME TABLE'!$E$14))","v":0},{"$f":"IF(C3139=0,0,'TIME TABLE'!$C$3)","v":0}]
[null,null,"Instructions"]
[null,null,1,"Check the exam time table carefully."]
[null,null,2,"Students must bring the 'Admit Card' and show it to the invigilator(s) on duty and should preserve it for future requirements."]
[null,null,3,"Mobile Phone, Calculator, Digital Watch or any Electronic Device is NOT ALLOWED."]
[null,null,4,"Arrive at the School at least 15 minutes before the start examination."]
[null,null,5,"Student is barred from entering the examination hall 15 minutes after the written examination starts."]
[null,null,6,"Ensure that you use the washroom before arriving for your exam as you will not be permitted to leave during the first hour."]
[null,null,7,"Normally, you are required to answer questionsusing blue or black in . Make sure you bring some spare pens with you."]
[null,null,8,"Keep your eyes on your own paper. Remember, copying is cheating!"]
[null,null,9,"You must remain silent until after you have exited the school building."]
[{"$f":"A3117+1","v":95}]
[{"$nulls":4},{"$f":"MASTER!$E$11","v":"Govt. Sr. Secondary School Raimalwada"}]
[{"$nulls":4},{"$f":"MASTER!$E$14","v":"P.S.-Bapini (Jodhpur)"}]
[null,{"$f":"CONCATENATE(C3154,'TIME TABLE'!$C$5,'ADMIT CARD'!$C3155,$F3155,'ADMIT CARD'!$G3155,'TIME TABLE'!$E$5)","v":"ADMIT CARD(Roll Number●→0)"},{"$f":"CONCATENATE('TIME TABLE'!$B$2,'TIME TABLE'!$F$2)","v":"HALF YEARLY EXAM:2021-22"}]
[null,null,"ADMIT CARD",{"$nulls":6}," "]
[null,null,"Roll Number",null,null,"●→",{"$f":"VLOOKUP(A3150,'STUDENT DETAIL'!$C$8:$I$107,3)","v":0},null,"Seal and Signature of Head of Institution"]
[null,null,"Student's Name",null,null,"●→",{"$f":"VLOOKUP(A3150,'STUDENT DETAIL'!$C$8:$I$107,4)","v":0}]
[null,null,"Father's Name",null,null,"●→",{"$f":"VLOOKUP(A3150,'STUDENT DETAIL'!$C$8:$I$107,5)","v":0}]
[null,null,"Mother's Name ",null,null,"●→",{"$f":"VLOOKUP(A3150,'STUDENT DETAIL'!$C$8:$I$107,6)","v":0}]
[null,null,"Class & Section",null,null,"●→",{"$f":"IF(G3155=0,0,CONCATENATE('STUDENT DETAIL'!$E$4,'STUDENT DETAIL'!$H$4))","v":0}]
[null,null,"Date Of Birth",null,null,"●→",{"$f":"VLOOKUP(A3150,'STUDENT DETAIL'!$C$8:$I$107,7)","v":"00:00:00"}]
[null,null,"Time Table"]
[null,null,"Subject",null,null,"Date (Day)",null,"Time"]
[null,null,{"$f":"'TIME TABLE'!$F$5","v":"Hindi"},null,null,{"$f":"IF(C3163=0,0,'TIME TABLE'!$B$5)","v":"2022-03-31"},{"$f":"IF(C3163=0,0,CONCATENATE('TIME TABLE'!$C$5,'TIME TABLE'!$D$5,'TIME TABLE'!$E$5))","v":"(Thursday)"},{"$f":"IF(C3163=0,0,'TIME TABLE'!$C$3)","v":"09:00 AM to 11:45 AM"}]
[null,null,{"$f":"'TIME TABLE'!$F$6","v":"English"},null,null,{"$f":"IF(C3164=0,0,'TIME TABLE'!$B$6)","v":"2022-04-01"},{"$f":"IF(C3164=0,0,CONCATENATE('TIME TABLE'!$C$6,'TIME TABLE'!$D$6,'TIME TABLE'!$E$6))","v":"(Friday)"},{"$f":"IF(C3164=0,0,'TIME TABLE'!$C$3)","v":"09:00 AM to 11:45 AM"}]
[null,null,{"$f":"'TIME TABLE'!$F$7","v":"Science"},null,null,{"$f":"IF(C3165=0,0,'TIME TABLE'!$B$7)","v":"2022-04-02"},{"$f":"IF(C3165=0,0,CONCATENATE('TIME TABLE'!$C$7,'TIME TABLE'!$D$7,'TIME TABLE'!$E$7))","v":"(Saturday)"},{"$f":"IF(C3165=0,0,'TIME TABLE'!$C$3)","v":"09:00 AM to 11:45 AM"}]
[null,null,{"$f":"'TIME TABLE'!$F$8","v":"Mathematics"},null,null,{"$f":"IF(C3166=0,0,'TIME TABLE'!$B$8)","v":"2022-04-03"},{"$f":"IF(C3166=0,0,CONCATENATE('TIME TABLE'!$C$8,'TIME TABLE'!$D$8,'TIME TABLE'!$E$8))","v":"(Sunday)"},{"$f":"IF(C3166=0,0,'TIME TABLE'!$C$3)","v":"09:00 AM to 11:45 AM"}]
[null,null,{"$f":"'TIME TABLE'!$F$9","v":"Social Study"},null,null,{"$f":"IF(C3167=0,0,'TIME TABLE'!$B$9)","v":"2022-04-04"},{"$f":"IF(C3167=0,0,CONCATENATE('TIME TABLE'!$C$9,'TIME TABLE'!$D$9,'TIME TABLE'!$E$9))","v":"(Monday)"},{"$f":"IF(C3167=0,0,'TIME TABLE'!$C$3)","v":"09:00 AM to 11:45 AM"}]
[null,null,{"$f":"'TIME TABLE'!$F$10","v":"Sanskrit"},null,null,{"$f":"IF(C3168=0,0,'TIME TABLE'!$B$10)","v":"2022-04-05"},{"$f":"IF(C3168=0,0,CONCATENATE('TIME TABLE'!$C$10,'TIME TABLE'!$D$10,'TIME TABLE'!$E$10))","v":"(Tuesday)"},{"$f":"IF(C3168=0,0,'TIME TABLE'!$C$3)","v":"09:00 AM to 11:45 AM"}]
[null,null,{"$f":"'TIME TABLE'!$F$11","v":0},null,null,{"$f":"IF(C3169=0,0,'TIME TABLE'!$B$11)","v":"00:00:00"},{"$f":"IF(C3169=0,0,CONCATENATE('TIME TABLE'!$C$11,'TIME TABLE'!$D$11,'TIME TABLE'!$E$11))","v":0},{"$f":"IF(C3169=0,0,'TIME TABLE'!$C$3)","v":0}]
[null,null,{"$f":"'TIME TABLE'!$F$12","v":0},null,null,{"$f":"IF(C3170=0,0,'TIME TABLE'!$B$12)","v":"00:00:00"},{"$f":"IF(C3170=0,0,CONCATENATE('TIME TABLE'!$C$12,'TIME TABLE'!$D$12,'TIME TABLE'!$E$12))","v":0},{"$f":"IF(C3170=0,0,'TIME TABLE'!$C$3)","v":0}]
[null,null,{"$f":"'TIME TABLE'!$F$13","v":0},null,null,{"$f":"IF(C3171=0,0,'TIME TABLE'!$B$13)","v":"00:00:00"},{"$f":"IF(C3171=0,0,CONCATENATE('TIME TABLE'!$C$13,'TIME TABLE'!$D$13,'TIME TABLE'!$E$13))","v":0},{"$f":"IF(C3171=0,0,'TIME TABLE'!$C$3)","v":0}]
[null,null,{"$f":"'TIME TABLE'!$F$14","v":0},null,null,{"$f":"IF(C3172=0,0,'TIME TABLE'!$B$14)","v":"00:00:00"},{"$f":"IF(C3172=0,0,CONCATENATE('TIME TABLE'!$C$14,'TIME TABLE'!$D$14,'TIME TABLE'!$E$14))","v":0},{"$f":"IF(C3172=0,0,'TIME TABLE'!$C$3)","v":0}]
[null,null,"Instructions"]
[null,null,1,"Check the exam time table carefully."]
[null,null,2,"Students must bring the 'Admit Card' and show it to the invigilator(s) on duty and should preserve it for future requirements."]
[null,null,3,"Mobile Phone, Calculator, Digital Watch or any Electronic Device is NOT ALLOWED."]
[null,null,4,"Arrive at the School at least 15 minutes before the start examination."]
[null,null,5,"Student is barred from entering the examination hall 15 minutes after the written examination starts."]
[null,null,6,"Ensure that you use the washroom before arriving for your exam as you will not be permitted to leave during the first hour."]
[null,null,7,"Normally, you are required to answer questionsusing blue or black in . Make sure you bring some spare pens with you."]
[null,null,8,"Keep your eyes on your own paper. Remember, copying is cheating!"]
[null,null,9,"You must remain silent until after you have exited the school building."]
[]
[{"$f":"A3150+1","v":96}]
[{"$nulls":4},{"$f":"MASTER!$E$11","v":"Govt. Sr. Secondary School Raimalwada"}]
[{"$nulls":4},{"$f":"MASTER!$E$14","v":"P.S.-Bapini (Jodhpur)"}]
[null,{"$f":"CONCATENATE(C3188,'TIME TABLE'!$C$5,'ADMIT CARD'!$C3189,$F3189,'ADMIT CARD'!$G3189,'TIME TABLE'!$E$5)","v":"ADMIT CARD(Roll Number●→0)"},{"$f":"CONCATENATE('TIME TABLE'!$B$2,'TIME TABLE'!$F$2)","v":"HALF YEARLY EXAM:2021-22"}]
[null,null,"ADMIT CARD",{"$nulls":6}," "]
[null,null,"Roll Number",null,null,"●→",{"$f":"VLOOKUP(A3184,'STUDENT DETAIL'!$C$8:$I$107,3)","v":0},null,"Seal and Signature of Head of Institution"]
[null,null,"Student's Name",null,null,"●→",{"$f":"VLOOKUP(A3184,'STUDENT DETAIL'!$C$8:$I$107,4)","v":0}]
[null,null,"Father's Name",null,null,"●→",{"$f":"VLOOKUP(A3184,'STUDENT DETAIL'!$C$8:$I$107,5)","v":0}]
[null,null,"Mother's Name ",null,null,"●→",{"$f":"VLOOKUP(A3184,'STUDENT DETAIL'!$C$8:$I$107,6)","v":0}]
[null,null,"Class & Section",null,null,"●→",{"$f":"IF(G3189=0,0,CONCATENATE('STUDENT DETAIL'!$E$4,'STUDENT DETAIL'!$H$4))","v":0}]
[null,null,"Date Of Birth",null,null,"●→",{"$f":"VLOOKUP(A3184,'STUDENT DETAIL'!$C$8:$I$107,7)","v":"00:00:00"}]
[null,null,"Time Table"]
[null,null,"Subject",null,null,"Date (Day)",null,"Time"]
[null,null,{"$f":"'TIME TABLE'!$F$5","v":"Hindi"},null,null,{"$f":"IF(C3197=0,0,'TIME TABLE'!$B$5)","v":"2022-03-31"},{"$f":"IF(C3197=0,0,CONCATENATE('TIME TABLE'!$C$5,'TIME TABLE'!$D$5,'TIME TABLE'!$E$5))","v":"(Thursday)"},{"$f":"IF(C3197=0,0,'TIME TABLE'!$C$3)","v":"09:00 AM to 11:45 AM"}]
[null,null,{"$f":"'TIME TABLE'!$F$6","v":"English"},null,null,{"$f":"IF(C3198=0,0,'TIME TABLE'!$B$6)","v":"2022-04-01"},{"$f":"IF(C3198=0,0,CONCATENATE('TIME TABLE'!$C$6,'TIME TABLE'!$D$6,'TIME TABLE'!$E$6))","v":"(Friday)"},{"$f":"IF(C3198=0,0,'TIME TABLE'!$C$3)","v":"09:00 AM to 11:45 AM"}]
[null,null,{"$f":"'TIME TABLE'!$F$7","v":"Science"},null,null,{"$f":"IF(C3199=0,0,'TIME TABLE'!$B$7)","v":"2022-04-02"},{"$f":"IF(C3199=0,0,CONCATENATE('TIME TABLE'!$C$7,'TIME TABLE'!$D$7,'TIME TABLE'!$E$7))","v":"(Saturday)"},{"$f":"IF(C3199=0,0,'TIME TABLE'!$C$3)","v":"09:00 AM to 11:45 AM"}]
[null,null,{"$f":"'TIME TABLE'!$F$8","v":"Mathematics"},null,null,{"$f":"IF(C3200=0,0,'TIME TABLE'!$B$8)","v":"2022-04-03"},{"$f":"IF(C3200=0,0,CONCATENATE('TIME TABLE'!$C$8,'TIME TABLE'!$D$8,'TIME TABLE'!$E$8))","v":"(Sunday)"},{"$f":"IF(C3200=0,0,'TIME TABLE'!$C$3)","v":"09:00 AM to 11:45 AM"}]
[null,null,{"$f":"'TIME TABLE'!$F$9","v":"Social Study"},null,null,{"$f":"IF(C3201=0,0,'TIME TABLE'!$B$9)","v":"2022-04-04"},{"$f":"IF(C3201=0,0,CONCATENATE('TIME TABLE'!$C$9,'TIME TABLE'!$D$9,'TIME TABLE'!$E$9))","v":"(Monday)"},{"$f":"IF(C3201=0,0,'TIME TABLE'!$C$3)","v":"09:00 AM to 11:45 AM"}]
[null,null,{"$f":"'TIME TABLE'!$F$10","v":"Sanskrit"},null,null,{"$f":"IF(C3202=0,0,'TIME TABLE'!$B$10)","v":"2022-04-05"},{"$f":"IF(C3202=0,0,CONCATENATE('TIME TABLE'!$C$10,'TIME TABLE'!$D$10,'TIME TABLE'!$E$10))","v":"(Tuesday)"},{"$f":"IF(C3202=0,0,'TIME TABLE'!$C$3)","v":"09:00 AM to 11:45 AM"}]
[null,null,{"$f":"'TIME TABLE'!$F$11","v":0},null,null,{"$f":"IF(C3203=0,0,'TIME TABLE'!$B$11)","v":"00:00:00"},{"$f":"IF(C3203=0,0,CONCATENATE('TIME TABLE'!$C$11,'TIME TABLE'!$D$11,'TIME TABLE'!$E$11))","v":0},{"$f":"IF(C3203=0,0,'TIME TABLE'!$C$3)","v":0}]
[null,null,{"$f":"'TIME TABLE'!$F$12","v":0},null,null,{"$f":"IF(C3204=0,0,'TIME TABLE'!$B$12)","v":"00:00:00"},{"$f":"IF(C3204=0,0,CONCATENATE('TIME TABLE'!$C$12,'TIME TABLE'!$D$12,'TIME TABLE'!$E$12))","v":0},{"$f":"IF(C3204=0,0,'TIME TABLE'!$C$3)","v":0}]
[null,null,{"$f":"'TIME TABLE'!$F$13","v":0},null,null,{"$f":"IF(C3205=0,0,'TIME TABLE'!$B$13)","v":"00:00:00"},{"$f":"IF(C3205=0,0,CONCATENATE('TIME TABLE'!$C$13,'TIME TABLE'!$D$13,'TIME TABLE'!$E$13))","v":0},{"$f":"IF(C3205=0,0,'TIME TABLE'!$C$3)","v":0}]
[null,null,{"$f":"'TIME TABLE'!$F$14","v":0},null,null,{"$f":"IF(C3206=0,0,'TIME TABLE'!$B$14)","v":"00:00:00"},{"$f":"IF(C3206=0,0,CONCATENATE('TIME TABLE'!$C$14,'TIME TABLE'!$D$14,'TIME TABLE'!$E$14))","v":0},{"$f":"IF(C3206=0,0,'TIME TABLE'!$C$3)","v":0}]
[null,null,"Instructions"]
[null,null,1,"Check the exam time table carefully."]
[null,null,2,"Students must bring the 'Admit Card' and show it to the invigilator(s) on duty and should preserve it for future requirements."]
[null,null,3,"Mobile Phone, Calculator, Digital Watch or any Electronic Device is NOT ALLOWED."]
[null,null,4,"Arrive at the School at least 15 minutes before the start examination."]
[null,null,5,"Student is barred from entering the examination hall 15 minutes after the written examination starts."]
[null,null,6,"Ensure that you use the washroom before arriving for your exam as you will not be permitted to leave during the first hour."]
[null,null,7,"Normally, you are required to answer questionsusing blue or black in . Make sure you bring some spare pens with you."]
[null,null,8,"Keep your eyes on your own paper. Remember, copying is cheating!"]
[null,null,9,"You must remain silent until after you have exited the school building."]
[{"$f":"A3184+1","v":97}]
[{"$nulls":4},{"$f":"MASTER!$E$11","v":"Govt. Sr. Secondary School Raimalwada"}]
[{"$nulls":4},{"$f":"MASTER!$E$14","v":"P.S.-Bapini (Jodhpur)"}]
[null,{"$f":"CONCATENATE(C3221,'TIME TABLE'!$C$5,'ADMIT CARD'!$C3222,$F3222,'ADMIT CARD'!$G3222,'TIME TABLE'!$E$5)","v":"ADMIT CARD(Roll Number●→0)"},{"$f":"CONCATENATE('TIME TABLE'!$B$2,'TIME TABLE'!$F$2)","v":"HALF YEARLY EXAM:2021-22"}]
[null,null,"ADMIT CARD",{"$nulls":6}," "]
[null,null,"Roll Number",null,null,"●→",{"$f":"VLOOKUP(A3217,'STUDENT DETAIL'!$C$8:$I$107,3)","v":0},null,"Seal and Signature of Head of Institution"]
[null,null,"Student's Name",null,null,"●→",{"$f":"VLOOKUP(A3217,'STUDENT DETAIL'!$C$8:$I$107,4)","v":0}]
[null,null,"Father's Name",null,null,"●→",{"$f":"VLOOKUP(A3217,'STUDENT DETAIL'!$C$8:$I$107,5)","v":0}]
[null,null,"Mother's Name ",null,null,"●→",{"$f":"VLOOKUP(A3217,'STUDENT DETAIL'!$C$8:$I$107,6)","v":0}]
[null,null,"Class & Section",null,null,"●→",{"$f":"IF(G3222=0,0,CONCATENATE('STUDENT DETAIL'!$E$4,'STUDENT DETAIL'!$H$4))","v":0}]
[null,null,"Date Of Birth",null,null,"●→",{"$f":"VLOOKUP(A3217,'STUDENT DETAIL'!$C$8:$I$107,7)","v":"00:00:00"}]
[null,null,"Time Table"]
[null,null,"Subject",null,null,"Date (Day)",null,"Time"]
[null,null,{"$f":"'TIME TABLE'!$F$5","v":"Hindi"},null,null,{"$f":"IF(C3230=0,0,'TIME TABLE'!$B$5)","v":"2022-03-31"},{"$f":"IF(C3230=0,0,CONCATENATE('TIME TABLE'!$C$5,'TIME TABLE'!$D$5,'TIME TABLE'!$E$5))","v":"(Thursday)"},{"$f":"IF(C3230=0,0,'TIME TABLE'!$C$3)","v":"09:00 AM to 11:45 AM"}]
[null,null,{"$f":"'TIME TABLE'!$F$6","v":"English"},null,null,{"$f":"IF(C3231=0,0,'TIME TABLE'!$B$6)","v":"2022-04-01"},{"$f":"IF(C3231=0,0,CONCATENATE('TIME TABLE'!$C$6,'TIME TABLE'!$D$6,'TIME TABLE'!$E$6))","v":"(Friday)"},{"$f":"IF(C3231=0,0,'TIME TABLE'!$C$3)","v":"09:00 AM to 11:45 AM"}]
[null,null,{"$f":"'TIME TABLE'!$F$7","v":"Science"},null,null,{"$f":"IF(C3232=0,0,'TIME TABLE'!$B$7)","v":"2022-04-02"},{"$f":"IF(C3232=0,0,CONCATENATE('TIME TABLE'!$C$7,'TIME TABLE'!$D$7,'TIME TABLE'!$E$7))","v":"(Saturday)"},{"$f":"IF(C3232=0,0,'TIME TABLE'!$C$3)","v":"09:00 AM to 11:45 AM"}]
[null,null,{"$f":"'TIME TABLE'!$F$8","v":"Mathematics"},null,null,{"$f":"IF(C3233=0,0,'TIME TABLE'!$B$8)","v":"2022-04-03"},{"$f":"IF(C3233=0,0,CONCATENATE('TIME TABLE'!$C$8,'TIME TABLE'!$D$8,'TIME TABLE'!$E$8))","v":"(Sunday)"},{"$f":"IF(C3233=0,0,'TIME TABLE'!$C$3)","v":"09:00 AM to 11:45 AM"}]
[null,null,{"$f":"'TIME TABLE'!$F$9","v":"Social Study"},null,null,{"$f":"IF(C3234=0,0,'TIME TABLE'!$B$9)","v":"2022-04-04"},{"$f":"IF(C3234=0,0,CONCATENATE('TIME TABLE'!$C$9,'TIME TABLE'!$D$9,'TIME TABLE'!$E$9))","v":"(Monday)"},{"$f":"IF(C3234=0,0,'TIME TABLE'!$C$3)","v":"09:00 AM to 11:45 AM"}]
[null,null,{"$f":"'TIME TABLE'!$F$10","v":"Sanskrit"},null,null,{"$f":"IF(C3235=0,0,'TIME TABLE'!$B$10)","v":"2022-04-05"},{"$f":"IF(C3235=0,0,CONCATENATE('TIME TABLE'!$C$10,'TIME TABLE'!$D$10,'TIME TABLE'!$E$10))","v":"(Tuesday)"},{"$f":"IF(C3235=0,0,'TIME TABLE'!$C$3)","v":"09:00 AM to 11:45 AM"}]
[null,null,{"$f":"'TIME TABLE'!$F$11","v":0},null,null,{"$f":"IF(C3236=0,0,'TIME TABLE'!$B$11)","v":"00:00:00"},{"$f":"IF(C3236=0,0,CONCATENATE('TIME TABLE'!$C$11,'TIME TABLE'!$D$11,'TIME TABLE'!$E$11))","v":0},{"$f":"IF(C3236=0,0,'TIME TABLE'!$C$3)","v":0}]
[null,null,{"$f":"'TIME TABLE'!$F$12","v":0},null,null,{"$f":"IF(C3237=0,0,'TIME TABLE'!$B$12)","v":"00:00:00"},{"$f":"IF(C3237=0,0,CONCATENATE('TIME TABLE'!$C$12,'TIME TABLE'!$D$12,'TIME TABLE'!$E$12))","v":0},{"$f":"IF(C3237=0,0,'TIME TABLE'!$C$3)","v":0}]
[null,null,{"$f":"'TIME TABLE'!$F$13","v":0},null,null,{"$f":"IF(C3238=0,0,'TIME TABLE'!$B$13)","v":"00:00:00"},{"$f":"IF(C3238=0,0,CONCATENATE('TIME TABLE'!$C$13,'TIME TABLE'!$D$13,'TIME TABLE'!$E$13))","v":0},{"$f":"IF(C3238=0,0,'TIME TABLE'!$C$3)","v":0}]
[null,null,{"$f":"'TIME TABLE'!$F$14","v":0},null,null,{"$f":"IF(C3239=0,0,'TIME TABLE'!$B$14)","v":"00:00:00"},{"$f":"IF(C3239=0,0,CONCATENATE('TIME TABLE'!$C$14,'TIME TABLE'!$D$14,'TIME TABLE'!$E$14))","v":0},{"$f":"IF(C3239=0,0,'TIME TABLE'!$C$3)","v":0}]
[null,null,"Instructions"]
[null,null,1,"Check the exam time table carefully."]
[null,null,2,"Students must bring the 'Admit Card' and show it to the invigilator(s) on duty and should preserve it for future requirements."]
[null,null,3,"Mobile Phone, Calculator, Digital Watch or any Electronic Device is NOT ALLOWED."]
[null,null,4,"Arrive at the School at least 15 minutes before the start examination."]
[null,null,5,"Student is barred from entering the examination hall 15 minutes after the written examination starts."]
[null,null,6,"Ensure that you use the washroom before arriving for your exam as you will not be permitted to leave during the first hour."]
[null,null,7,"Normally, you are required to answer questionsusing blue or black in . Make sure you bring some spare pens with you."]
[null,null,8,"Keep your eyes on your own paper. Remember, copying is cheating!"]
[null,null,9,"You must remain silent until after you have exited the school building."]
[]
[{"$f":"A3217+1","v":98}]
[{"$nulls":4},{"$f":"MASTER!$E$11","v":"Govt. Sr. Secondary School Raimalwada"}]
[{"$nulls":4},{"$f":"MASTER!$E$14","v":"P.S.-Bapini (Jodhpur)"}]
[null,{"$f":"CONCATENATE(C3255,'TIME TABLE'!$C$5,'ADMIT CARD'!$C3256,$F3256,'ADMIT CARD'!$G3256,'TIME TABLE'!$E$5)","v":"ADMIT CARD(Roll Number●→0)"},{"$f":"CONCATENATE('TIME TABLE'!$B$2,'TIME TABLE'!$F$2)","v":"HALF YEARLY EXAM:2021-22"}]
[null,null,"ADMIT CARD",{"$nulls":6}," "]
[null,null,"Roll Number",null,null,"●→",{"$f":"VLOOKUP(A3251,'STUDENT DETAIL'!$C$8:$I$107,3)","v":0},null,"Seal and Signature of Head of Institution"]
[null,null,"Student's Name",null,null,"●→",{"$f":"VLOOKUP(A3251,'STUDENT DETAIL'!$C$8:$I$107,4)","v":0}]
[null,null,"Father's Name",null,null,"●→",{"$f":"VLOOKUP(A3251,'STUDENT DETAIL'!$C$8:$I$107,5)","v":0}]
[null,null,"Mother's Name ",null,null,"●→",{"$f":"VLOOKUP(A3251,'STUDENT DETAIL'!$C$8:$I$107,6)","v":0}]
[null,null,"Class & Section",null,null,"●→",{"$f":"IF(G3256=0,0,CONCATENATE('STUDENT DETAIL'!$E$4,'STUDENT DETAIL'!$H$4))","v":0}]
[null,null,"Date Of Birth",null,null,"●→",{"$f":"VLOOKUP(A3251,'STUDENT DETAIL'!$C$8:$I$107,7)","v":"00:00:00"}]
[null,null,"Time Table"]
[null,null,"Subject",null,null,"Date (Day)",null,"Time"]
[null,null,{"$f":"'TIME TABLE'!$F$5","v":"Hindi"},null,null,{"$f":"IF(C3264=0,0,'TIME TABLE'!$B$5)","v":"2022-03-31"},{"$f":"IF(C3264=0,0,CONCATENATE('TIME TABLE'!$C$5,'TIME TABLE'!$D$5,'TIME TABLE'!$E$5))","v":"(Thursday)"},{"$f":"IF(C3264=0,0,'TIME TABLE'!$C$3)","v":"09:00 AM to 11:45 AM"}]
[null,null,{"$f":"'TIME TABLE'!$F$6","v":"English"},null,null,{"$f":"IF(C3265=0,0,'TIME TABLE'!$B$6)","v":"2022-04-01"},{"$f":"IF(C3265=0,0,CONCATENATE('TIME TABLE'!$C$6,'TIME TABLE'!$D$6,'TIME TABLE'!$E$6))","v":"(Friday)"},{"$f":"IF(C3265=0,0,'TIME TABLE'!$C$3)","v":"09:00 AM to 11:45 AM"}]
[null,null,{"$f":"'TIME TABLE'!$F$7","v":"Science"},null,null,{"$f":"IF(C3266=0,0,'TIME TABLE'!$B$7)","v":"2022-04-02"},{"$f":"IF(C3266=0,0,CONCATENATE('TIME TABLE'!$C$7,'TIME TABLE'!$D$7,'TIME TABLE'!$E$7))","v":"(Saturday)"},{"$f":"IF(C3266=0,0,'TIME TABLE'!$C$3)","v":"09:00 AM to 11:45 AM"}]
[null,null,{"$f":"'TIME TABLE'!$F$8","v":"Mathematics"},null,null,{"$f":"IF(C3267=0,0,'TIME TABLE'!$B$8)","v":"2022-04-03"},{"$f":"IF(C3267=0,0,CONCATENATE('TIME TABLE'!$C$8,'TIME TABLE'!$D$8,'TIME TABLE'!$E$8))","v":"(Sunday)"},{"$f":"IF(C3267=0,0,'TIME TABLE'!$C$3)","v":"09:00 AM to 11:45 AM"}]
[null,null,{"$f":"'TIME TABLE'!$F$9","v":"Social Study"},null,null,{"$f":"IF(C3268=0,0,'TIME TABLE'!$B$9)","v":"2022-04-04"},{"$f":"IF(C3268=0,0,CONCATENATE('TIME TABLE'!$C$9,'TIME TABLE'!$D$9,'TIME TABLE'!$E$9))","v":"(Monday)"},{"$f":"IF(C3268=0,0,'TIME TABLE'!$C$3)","v":"09:00 AM to 11:45 AM"}]
[null,null,{"$f":"'TIME TABLE'!$F$10","v":"Sanskrit"},null,null,{"$f":"IF(C3269=0,0,'TIME TABLE'!$B$10)","v":"2022-04-05"},{"$f":"IF(C3269=0,0,CONCATENATE('TIME TABLE'!$C$10,'TIME TABLE'!$D$10,'TIME TABLE'!$E$10))","v":"(Tuesday)"},{"$f":"IF(C3269=0,0,'TIME TABLE'!$C$3)","v":"09:00 AM to 11:45 AM"}]
[null,null,{"$f":"'TIME TABLE'!$F$11","v":0},null,null,{"$f":"IF(C3270=0,0,'TIME TABLE'!$B$11)","v":"00:00:00"},{"$f":"IF(C3270=0,0,CONCATENATE('TIME TABLE'!$C$11,'TIME TABLE'!$D$11,'TIME TABLE'!$E$11))","v":0},{"$f":"IF(C3270=0,0,'TIME TABLE'!$C$3)","v":0}]
[null,null,{"$f":"'TIME TABLE'!$F$12","v":0},null,null,{"$f":"IF(C3271=0,0,'TIME TABLE'!$B$12)","v":"00:00:00"},{"$f":"IF(C3271=0,0,CONCATENATE('TIME TABLE'!$C$12,'TIME TABLE'!$D$12,'TIME TABLE'!$E$12))","v":0},{"$f":"IF(C3271=0,0,'TIME TABLE'!$C$3)","v":0}]
[null,null,{"$f":"'TIME TABLE'!$F$13","v":0},null,null,{"$f":"IF(C3272=0,0,'TIME TABLE'!$B$13)","v":"00:00:00"},{"$f":"IF(C3272=0,0,CONCATENATE('TIME TABLE'!$C$13,'TIME TABLE'!$D$13,'TIME TABLE'!$E$13))","v":0},{"$f":"IF(C3272=0,0,'TIME TABLE'!$C$3)","v":0}]
[null,null,{"$f":"'TIME TABLE'!$F$14","v":0},null,null,{"$f":"IF(C3273=0,0,'TIME TABLE'!$B$14)","v":"00:00:00"},{"$f":"IF(C3273=0,0,CONCATENATE('TIME TABLE'!$C$14,'TIME TABLE'!$D$14,'TIME TABLE'!$E$14))","v":0},{"$f":"IF(C3273=0,0,'TIME TABLE'!$C$3)","v":0}]
[null,null,"Instructions"]
[null,null,1,"Check the exam time table carefully."]
[null,null,2,"Students must bring the 'Admit Card' and show it to the invigilator(s) on duty and should preserve it for future requirements."]
[null,null,3,"Mobile Phone, Calculator, Digital Watch or any Electronic Device is NOT ALLOWED."]
[null,null,4,"Arrive at the School at least 15 minutes before the start examination."]
[null,null,5,"Student is barred from entering the examination hall 15 minutes after the written examination starts."]
[null,null,6,"Ensure that you use the washroom before arriving for your exam as you will not be permitted to leave during the first hour."]
[null,null,7,"Normally, you are required to answer questionsusing blue or black in . Make sure you bring some spare pens with you."]
[null,null,8,"Keep your eyes on your own paper. Remember, copying is cheating!"]
[null,null,9,"You must remain silent until after you have exited the school building."]
[{"$f":"A3251+1","v":99}]
[{"$nulls":4},{"$f":"MASTER!$E$11","v":"Govt. Sr. Secondary School Raimalwada"}]
[{"$nulls":4},{"$f":"MASTER!$E$14","v":"P.S.-Bapini (Jodhpur)"}]
[null,{"$f":"CONCATENATE(C3288,'TIME TABLE'!$C$5,'ADMIT CARD'!$C3289,$F3289,'ADMIT CARD'!$G3289,'TIME TABLE'!$E$5)","v":"ADMIT CARD(Roll Number●→0)"},{"$f":"CONCATENATE('TIME TABLE'!$B$2,'TIME TABLE'!$F$2)","v":"HALF YEARLY EXAM:2021-22"}]
[null,null,"ADMIT CARD",{"$nulls":6}," "]
[null,null,"Roll Number",null,null,"●→",{"$f":"VLOOKUP(A3284,'STUDENT DETAIL'!$C$8:$I$107,3)","v":0},null,"Seal and Signature of Head of Institution"]
[null,null,"Student's Name",null,null,"●→",{"$f":"VLOOKUP(A3284,'STUDENT DETAIL'!$C$8:$I$107,4)","v":0}]
[null,null,"Father's Name",null,null,"●→",{"$f":"VLOOKUP(A3284,'STUDENT DETAIL'!$C$8:$I$107,5)","v":0}]
[null,null,"Mother's Name ",null,null,"●→",{"$f":"VLOOKUP(A3284,'STUDENT DETAIL'!$C$8:$I$107,6)","v":0}]
[null,null,"Class & Section",null,null,"●→",{"$f":"IF(G3289=0,0,CONCATENATE('STUDENT DETAIL'!$E$4,'STUDENT DETAIL'!$H$4))","v":0}]
[null,null,"Date Of Birth",null,null,"●→",{"$f":"VLOOKUP(A3284,'STUDENT DETAIL'!$C$8:$I$107,7)","v":"00:00:00"}]
[null,null,"Time Table"]
[null,null,"Subject",null,null,"Date (Day)",null,"Time"]
[null,null,{"$f":"'TIME TABLE'!$F$5","v":"Hindi"},null,null,{"$f":"IF(C3297=0,0,'TIME TABLE'!$B$5)","v":"2022-03-31"},{"$f":"IF(C3297=0,0,CONCATENATE('TIME TABLE'!$C$5,'TIME TABLE'!$D$5,'TIME TABLE'!$E$5))","v":"(Thursday)"},{"$f":"IF(C3297=0,0,'TIME TABLE'!$C$3)","v":"09:00 AM to 11:45 AM"}]
[null,null,{"$f":"'TIME TABLE'!$F$6","v":"English"},null,null,{"$f":"IF(C3298=0,0,'TIME TABLE'!$B$6)","v":"2022-04-01"},{"$f":"IF(C3298=0,0,CONCATENATE('TIME TABLE'!$C$6,'TIME TABLE'!$D$6,'TIME TABLE'!$E$6))","v":"(Friday)"},{"$f":"IF(C3298=0,0,'TIME TABLE'!$C$3)","v":"09:00 AM to 11:45 AM"}]
[null,null,{"$f":"'TIME TABLE'!$F$7","v":"Science"},null,null,{"$f":"IF(C3299=0,0,'TIME TABLE'!$B$7)","v":"2022-04-02"},{"$f":"IF(C3299=0,0,CONCATENATE('TIME TABLE'!$C$7,'TIME TABLE'!$D$7,'TIME TABLE'!$E$7))","v":"(Saturday)"},{"$f":"IF(C3299=0,0,'TIME TABLE'!$C$3)","v":"09:00 AM to 11:45 AM"}]
[null,null,{"$f":"'TIME TABLE'!$F$8","v":"Mathematics"},null,null,{"$f":"IF(C3300=0,0,'TIME TABLE'!$B$8)","v":"2022-04-03"},{"$f":"IF(C3300=0,0,CONCATENATE('TIME TABLE'!$C$8,'TIME TABLE'!$D$8,'TIME TABLE'!$E$8))","v":"(Sunday)"},{"$f":"IF(C3300=0,0,'TIME TABLE'!$C$3)","v":"09:00 AM to 11:45 AM"}]
[null,null,{"$f":"'TIME TABLE'!$F$9","v":"Social Study"},null,null,{"$f":"IF(C3301=0,0,'TIME TABLE'!$B$9)","v":"2022-04-04"},{"$f":"IF(C3301=0,0,CONCATENATE('TIME TABLE'!$C$9,'TIME TABLE'!$D$9,'TIME TABLE'!$E$9))","v":"(Monday)"},{"$f":"IF(C3301=0,0,'TIME TABLE'!$C$3)","v":"09:00 AM to 11:45 AM"}]
[null,null,{"$f":"'TIME TABLE'!$F$10","v":"Sanskrit"},null,null,{"$f":"IF(C3302=0,0,'TIME TABLE'!$B$10)","v":"2022-04-05"},{"$f":"IF(C3302=0,0,CONCATENATE('TIME TABLE'!$C$10,'TIME TABLE'!$D$10,'TIME TABLE'!$E$10))","v":"(Tuesday)"},{"$f":"IF(C3302=0,0,'TIME TABLE'!$C$3)","v":"09:00 AM to 11:45 AM"}]
[null,null,{"$f":"'TIME TABLE'!$F$11","v":0},null,null,{"$f":"IF(C3303=0,0,'TIME TABLE'!$B$11)","v":"00:00:00"},{"$f":"IF(C3303=0,0,CONCATENATE('TIME TABLE'!$C$11,'TIME TABLE'!$D$11,'TIME TABLE'!$E$11))","v":0},{"$f":"IF(C3303=0,0,'TIME TABLE'!$C$3)","v":0}]
[null,null,{"$f":"'TIME TABLE'!$F$12","v":0},null,null,{"$f":"IF(C3304=0,0,'TIME TABLE'!$B$12)","v":"00:00:00"},{"$f":"IF(C3304=0,0,CONCATENATE('TIME TABLE'!$C$12,'TIME TABLE'!$D$12,'TIME TABLE'!$E$12))","v":0},{"$f":"IF(C3304=0,0,'TIME TABLE'!$C$3)","v":0}]
[null,null,{"$f":"'TIME TABLE'!$F$13","v":0},null,null,{"$f":"IF(C3305=0,0,'TIME TABLE'!$B$13)","v":"00:00:00"},{"$f":"IF(C3305=0,0,CONCATENATE('TIME TABLE'!$C$13,'TIME TABLE'!$D$13,'TIME TABLE'!$E$13))","v":0},{"$f":"IF(C3305=0,0,'TIME TABLE'!$C$3)","v":0}]
[null,null,{"$f":"'TIME TABLE'!$F$14","v":0},null,null,{"$f":"IF(C3306=0,0,'TIME TABLE'!$B$14)","v":"00:00:00"},{"$f":"IF(C3306=0,0,CONCATENATE('TIME TABLE'!$C$14,'TIME TABLE'!$D$14,'TIME TABLE'!$E$14))","v":0},{"$f":"IF(C3306=0,0,'TIME TABLE'!$C$3)","v":0}]
[null,null,"Instructions"]
[null,null,1,"Check the exam time table carefully."]
[null,null,2,"Students must bring the 'Admit Card' and show it to the invigilator(s) on duty and should preserve it for future requirements."]
[null,null,3,"Mobile Phone, Calculator, Digital Watch or any Electronic Device is NOT ALLOWED."]
[null,null,4,"Arrive at the School at least 15 minutes before the start examination."]
[null,null,5,"Student is barred from entering the examination hall 15 minutes after the written examination starts."]
[null,null,6,"Ensure that you use the washroom before arriving for your exam as you will not be permitted to leave during the first hour."]
[null,null,7,"Normally, you are required to answer questionsusing blue or black in . Make sure you bring some spare pens with you."]
[null,null,8,"Keep your eyes on your own paper. Remember, copying is cheating!"]
[null,null,9,"You must remain silent until after you have exited the school building."]
[]
[{"$f":"A3284+1","v":100}]
[{"$nulls":4},{"$f":"MASTER!$E$11","v":"Govt. Sr. Secondary School Raimalwada"}]
[{"$nulls":4},{"$f":"MASTER!$E$14","v":"P.S.-Bapini (Jodhpur)"}]
[null,{"$f":"CONCATENATE(C3322,'TIME TABLE'!$C$5,'ADMIT CARD'!$C3323,$F3323,'ADMIT CARD'!$G3323,'TIME TABLE'!$E$5)","v":"ADMIT CARD(Roll Number●→0)"},{"$f":"CONCATENATE('TIME TABLE'!$B$2,'TIME TABLE'!$F$2)","v":"HALF YEARLY EXAM:2021-22"}]
[null,null,"ADMIT CARD",{"$nulls":6}," "]
[null,null,"Roll Number",null,null,"●→",{"$f":"VLOOKUP(A3318,'STUDENT DETAIL'!$C$8:$I$107,3)","v":0},null,"Seal and Signature of Head of Institution"]
[null,null,"Student's Name",null,null,"●→",{"$f":"VLOOKUP(A3318,'STUDENT DETAIL'!$C$8:$I$107,4)","v":0}]
[null,null,"Father's Name",null,null,"●→",{"$f":"VLOOKUP(A3318,'STUDENT DETAIL'!$C$8:$I$107,5)","v":0}]
[null,null,"Mother's Name ",null,null,"●→",{"$f":"VLOOKUP(A3318,'STUDENT DETAIL'!$C$8:$I$107,6)","v":0}]
[null,null,"Class & Section",null,null,"●→",{"$f":"IF(G3323=0,0,CONCATENATE('STUDENT DETAIL'!$E$4,'STUDENT DETAIL'!$H$4))","v":0}]
[null,null,"Date Of Birth",null,null,"●→",{"$f":"VLOOKUP(A3318,'STUDENT DETAIL'!$C$8:$I$107,7)","v":"00:00:00"}]
[null,null,"Time Table"]
[null,null,"Subject",null,null,"Date (Day)",null,"Time"]
[null,null,{"$f":"'TIME TABLE'!$F$5","v":"Hindi"},null,null,{"$f":"IF(C3331=0,0,'TIME TABLE'!$B$5)","v":"2022-03-31"},{"$f":"IF(C3331=0,0,CONCATENATE('TIME TABLE'!$C$5,'TIME TABLE'!$D$5,'TIME TABLE'!$E$5))","v":"(Thursday)"},{"$f":"IF(C3331=0,0,'TIME TABLE'!$C$3)","v":"09:00 AM to 11:45 AM"}]
[null,null,{"$f":"'TIME TABLE'!$F$6","v":"English"},null,null,{"$f":"IF(C3332=0,0,'TIME TABLE'!$B$6)","v":"2022-04-01"},{"$f":"IF(C3332=0,0,CONCATENATE('TIME TABLE'!$C$6,'TIME TABLE'!$D$6,'TIME TABLE'!$E$6))","v":"(Friday)"},{"$f":"IF(C3332=0,0,'TIME TABLE'!$C$3)","v":"09:00 AM to 11:45 AM"}]
[null,null,{"$f":"'TIME TABLE'!$F$7","v":"Science"},null,null,{"$f":"IF(C3333=0,0,'TIME TABLE'!$B$7)","v":"2022-04-02"},{"$f":"IF(C3333=0,0,CONCATENATE('TIME TABLE'!$C$7,'TIME TABLE'!$D$7,'TIME TABLE'!$E$7))","v":"(Saturday)"},{"$f":"IF(C3333=0,0,'TIME TABLE'!$C$3)","v":"09:00 AM to 11:45 AM"}]
[null,null,{"$f":"'TIME TABLE'!$F$8","v":"Mathematics"},null,null,{"$f":"IF(C3334=0,0,'TIME TABLE'!$B$8)","v":"2022-04-03"},{"$f":"IF(C3334=0,0,CONCATENATE('TIME TABLE'!$C$8,'TIME TABLE'!$D$8,'TIME TABLE'!$E$8))","v":"(Sunday)"},{"$f":"IF(C3334=0,0,'TIME TABLE'!$C$3)","v":"09:00 AM to 11:45 AM"}]
[null,null,{"$f":"'TIME TABLE'!$F$9","v":"Social Study"},null,null,{"$f":"IF(C3335=0,0,'TIME TABLE'!$B$9)","v":"2022-04-04"},{"$f":"IF(C3335=0,0,CONCATENATE('TIME TABLE'!$C$9,'TIME TABLE'!$D$9,'TIME TABLE'!$E$9))","v":"(Monday)"},{"$f":"IF(C3335=0,0,'TIME TABLE'!$C$3)","v":"09:00 AM to 11:45 AM"}]
[null,null,{"$f":"'TIME TABLE'!$F$10","v":"Sanskrit"},null,null,{"$f":"IF(C3336=0,0,'TIME TABLE'!$B$10)","v":"2022-04-05"},{"$f":"IF(C3336=0,0,CONCATENATE('TIME TABLE'!$C$10,'TIME TABLE'!$D$10,'TIME TABLE'!$E$10))","v":"(Tuesday)"},{"$f":"IF(C3336=0,0,'TIME TABLE'!$C$3)","v":"09:00 AM to 11:45 AM"}]
[null,null,{"$f":"'TIME TABLE'!$F$11","v":0},null,null,{"$f":"IF(C3337=0,0,'TIME TABLE'!$B$11)","v":"00:00:00"},{"$f":"IF(C3337=0,0,CONCATENATE('TIME TABLE'!$C$11,'TIME TABLE'!$D$11,'TIME TABLE'!$E$11))","v":0},{"$f":"IF(C3337=0,0,'TIME TABLE'!$C$3)","v":0}]
[null,null,{"$f":"'TIME TABLE'!$F$12","v":0},null,null,{"$f":"IF(C3338=0,0,'TIME TABLE'!$B$12)","v":"00:00:00"},{"$f":"IF(C3338=0,0,CONCATENATE('TIME TABLE'!$C$12,'TIME TABLE'!$D$12,'TIME TABLE'!$E$12))","v":0},{"$f":"IF(C3338=0,0,'TIME TABLE'!$C$3)","v":0}]
[null,null,{"$f":"'TIME TABLE'!$F$13","v":0},null,null,{"$f":"IF(C3339=0,0,'TIME TABLE'!$B$13)","v":"00:00:00"},{"$f":"IF(C3339=0,0,CONCATENATE('TIME TABLE'!$C$13,'TIME TABLE'!$D$13,'TIME TABLE'!$E$13))","v":0},{"$f":"IF(C3339=0,0,'TIME TABLE'!$C$3)","v":0}]
[null,null,{"$f":"'TIME TABLE'!$F$14","v":0},null,null,{"$f":"IF(C3340=0,0,'TIME TABLE'!$B$14)","v":"00:00:00"},{"$f":"IF(C3340=0,0,CONCATENATE('TIME TABLE'!$C$14,'TIME TABLE'!$D$14,'TIME TABLE'!$E$14))","v":0},{"$f":"IF(C3340=0,0,'TIME TABLE'!$C$3)","v":0}]
[null,null,"Instructions"]
[null,null,1,"Check the exam time table carefully."]
[null,null,2,"Students must bring the 'Admit Card' and show it to the invigilator(s) on duty and should preserve it for future requirements."]
[null,null,3,"Mobile Phone, Calculator, Digital Watch or any Electronic Device is NOT ALLOWED."]
[null,null,4,"Arrive at the School at least 15 minutes before the start examination."]
[null,null,5,"Student is barred from entering the examination hall 15 minutes after the written examination starts."]
[null,null,6,"Ensure that you use the washroom before arriving for your exam as you will not be permitted to leave during the first hour."]
[null,null,7,"Normally, you are required to answer questionsusing blue or black in . Make sure you bring some spare pens with you."]
[null,null,8,"Keep your eyes on your own paper. Remember, copying is cheating!"]
[null,null,9,"You must remain silent until after you have exited the school building."]