{"text_format":"3","workbook":"xlsx","n_sheets":4,"sheets":["MASTER","STUDENT DETAIL","TIME TABLE","ADMIT CARD"],"not_rendered":{"images":2,"defined_names":3},"read":"whole","date_system":"1900"}

{"sheet":"MASTER","index":0,"n_rows":22,"n_cols":20,"rows_kept":22,"merged":[[0,0,0,14],[1,1,1,3],[1,4,1,6],[1,7,1,9],[1,10,21,10],[1,11,1,13],[1,14,21,14],[2,0,21,0],[2,1,2,9],[2,11,3,13],[3,1,3,9],[4,1,4,9],[4,11,12,13],[5,1,5,2],[5,4,5,9],[6,1,6,9],[7,1,8,2],[7,3,8,3],[7,4,8,9],[9,1,9,9],[10,1,11,2],[10,3,11,3],[10,4,11,9],[12,1,12,9],[13,1,14,2],[13,3,14,3],[13,4,14,9],[14,11,16,13],[15,1,15,9],[16,1,16,2],[16,4,16,9],[17,1,17,9],[17,11,17,13],[18,1,18,2],[18,4,18,9],[18,11,21,13],[19,1,19,9],[20,1,20,2],[20,4,20,9],[21,1,21,9]]}
[]
[null,"t; fgUn",null,null,"oUns ekrje~",null,null,"t; fgUn"]
[]
[null,"ADMIT CARD GENERATOR PROGRAM",{"$nulls":16},"2019-20","PRIMARY"]
[{"$nulls":18},"2019-21","UPPER PRIMARY"]
[null,"SESSION",null,":-","2021-22",{"$nulls":13},"2019-22","SECONDARY"]
[{"$nulls":18},"2019-21","UPPER PRIMARY"]
[null,"Exam Type",null,":-","HALF YEARLY EXAM"]
[{"$nulls":18},"2019-24"]
[]
{"$rows_left_out":13}
{"sheet":"STUDENT DETAIL","index":1,"n_rows":132,"n_cols":38,"rows_kept":132,"merged":[[0,2,0,8],[0,9,0,19],[0,20,106,21],[1,2,1,6],[1,7,1,8],[1,9,1,19],[2,2,2,3],[2,4,2,5],[2,7,2,8],[2,9,3,14],[2,15,5,15],[2,16,5,16],[2,17,5,17],[2,18,5,18],[2,19,5,19],[3,2,3,3],[3,4,3,5],[3,7,3,8],[4,2,4,8],[4,9,5,9],[4,10,5,10],[4,11,5,11],[4,12,5,12],[4,13,5,13],[4,14,5,14]]}
[null,null,{"$f":"MASTER!E11","v":"Govt. Sr. Secondary School Raimalwada"}]
[null,null,"Print Admit Card",{"$nulls":4},"GoTo Time Table"]
[null,null,"School U-Dise Code :-",null,{"$f":"MASTER!E17","v":"08151106901"},null,"Session :-",{"$f":"MASTER!E6","v":"2021-22"},null,"Subject Wise Result",{"$nulls":5},"Subject Which Failed","Subject Which supplymentry","Subject Which 1 Grace","Subject Which 2 Grace","Subject Which Re-Exam"]
[null,null,"Class -",null,4,null,"Saction :-","(A)"]
[null,null,"Student Related Basic Details",{"$nulls":6},"Hindi","English","Sanskrit","Math","Science","social Science"]
[null,null,"Sr. No.","Class","Roll No.","Student's Name","Father's Name","Mother's Name","Date Of Birth"]
[null,null,0,0,null,0,0,0,0,{"$f":"#REF!","v":{"$error":"#REF!"}},{"$f":"#REF!","v":{"$error":"#REF!"}},{"$f":"#REF!","v":{"$error":"#REF!"}},{"$f":"#REF!","v":{"$error":"#REF!"}},{"$f":"#REF!","v":{"$error":"#REF!"}},{"$f":"#REF!","v":{"$error":"#REF!"}},{"$f":"COUNTIF(J7:O7,\"F\")+COUNTIF(J7:O7,\"AB\")","v":0},{"$f":"COUNTIF(J7:O7,\"S\")","v":0},{"$f":"COUNTIF(J7:O7,\"G1\")","v":0},{"$f":"COUNTIF(J7:O7,\"G2\")","v":0}]
[{"$f":"E8","v":901},1,1,{"$f":"IF(E8>0,$E$4,0)","v":4},901,"Akshya","Ram","Seeta","2000-02-05",{"$f":"#REF!","v":{"$error":"#REF!"}},{"$f":"#REF!","v":{"$error":"#REF!"}},{"$f":"#REF!","v":{"$error":"#REF!"}},{"$f":"#REF!","v":{"$error":"#REF!"}},{"$f":"#REF!","v":{"$error":"#REF!"}},{"$f":"#REF!","v":{"$error":"#REF!"}},{"$f":"COUNTIF(J8:O8,\"F\")+COUNTIF(J8:O8,\"AB\")","v":0},{"$f":"COUNTIF(J8:O8,\"S\")","v":0},{"$f":"COUNTIF(J8:O8,\"G1\")","v":0},{"$f":"COUNTIF(J8:O8,\"G2\")","v":0},{"$nulls":3},{"$f":"#REF!","v":{"$error":"#REF!"}},"/",{"$f":"#REF!","v":{"$error":"#REF!"}},{"$f":"CONCATENATE(W8,X8,Y8)","v":{"$error":"#REF!"}},{"$f":"#REF!","v":{"$error":"#REF!"}},"/",{"$f":"#REF!","v":{"$error":"#REF!"}},{"$f":"CONCATENATE(AA8,AB8,AC8)","v":{"$error":"#REF!"}},{"$f":"#REF!","v":{"$error":"#REF!"}},"/",{"$f":"#REF!","v":{"$error":"#REF!"}},{"$f":"CONCATENATE(AE8,AF8,AG8)","v":{"$error":"#REF!"}},{"$f":"#REF!","v":{"$error":"#REF!"}},"/",{"$f":"#REF!","v":{"$error":"#REF!"}},{"$f":"CONCATENATE(AI8,AJ8,AK8)","v":{"$error":"#REF!"}}]
[{"$f":"E9","v":0},2,2,{"$f":"IF(E9>0,$E$4,0)","v":0},{"$nulls":5},{"$f":"#REF!","v":{"$error":"#REF!"}},{"$f":"#REF!","v":{"$error":"#REF!"}},{"$f":"#REF!","v":{"$error":"#REF!"}},{"$f":"#REF!","v":{"$error":"#REF!"}},{"$f":"#REF!","v":{"$error":"#REF!"}},{"$f":"#REF!","v":{"$error":"#REF!"}},{"$f":"COUNTIF(J9:O9,\"F\")+COUNTIF(J9:O9,\"AB\")","v":0},{"$f":"COUNTIF(J9:O9,\"S\")","v":0},{"$f":"COUNTIF(J9:O9,\"G1\")","v":0},{"$f":"COUNTIF(J9:O9,\"G2\")","v":0},{"$nulls":3},{"$f":"#REF!","v":{"$error":"#REF!"}},"/",{"$f":"#REF!","v":{"$error":"#REF!"}},{"$f":"CONCATENATE(W9,X9,Y9)","v":{"$error":"#REF!"}},{"$f":"#REF!","v":{"$error":"#REF!"}},"/",{"$f":"#REF!","v":{"$error":"#REF!"}},{"$f":"CONCATENATE(AA9,AB9,AC9)","v":{"$error":"#REF!"}},{"$f":"#REF!","v":{"$error":"#REF!"}},"/",{"$f":"#REF!","v":{"$error":"#REF!"}},{"$f":"CONCATENATE(AE9,AF9,AG9)","v":{"$error":"#REF!"}},{"$f":"#REF!","v":{"$error":"#REF!"}},"/",{"$f":"#REF!","v":{"$error":"#REF!"}},{"$f":"CONCATENATE(AI9,AJ9,AK9)","v":{"$error":"#REF!"}}]
[0,3,3,0,{"$nulls":5},{"$f":"#REF!","v":{"$error":"#REF!"}},{"$f":"#REF!","v":{"$error":"#REF!"}},{"$f":"#REF!","v":{"$error":"#REF!"}},{"$f":"#REF!","v":{"$error":"#REF!"}},{"$f":"#REF!","v":{"$error":"#REF!"}},{"$f":"#REF!","v":{"$error":"#REF!"}},0,0,0,0,{"$nulls":3},{"$f":"#REF!","v":{"$error":"#REF!"}},"/",{"$f":"#REF!","v":{"$error":"#REF!"}},{"$error":"#REF!"},{"$f":"#REF!","v":{"$error":"#REF!"}},"/",{"$f":"#REF!","v":{"$error":"#REF!"}},{"$error":"#REF!"},{"$f":"#REF!","v":{"$error":"#REF!"}},"/",{"$f":"#REF!","v":{"$error":"#REF!"}},{"$error":"#REF!"},{"$f":"#REF!","v":{"$error":"#REF!"}},"/",{"$f":"#REF!","v":{"$error":"#REF!"}},{"$error":"#REF!"}]
{"$rows_left_out":123}
{"sheet":"TIME TABLE","index":2,"n_rows":14,"n_cols":7,"rows_kept":14,"merged":[[0,0,14,0],[0,1,0,6],[0,7,14,7],[1,1,1,5],[2,2,2,4],[2,6,3,6],[3,1,3,4],[4,5,4,6],[5,5,5,6],[6,5,6,6],[7,5,7,6],[8,5,8,6],[9,5,9,6],[10,5,10,6],[11,5,11,6],[12,5,12,6],[13,5,13,6],[14,1,14,6]]}
[null,{"$f":"MASTER!E11","v":"Govt. Sr. Secondary School Raimalwada"}]
[null,{"$f":"CONCATENATE(MASTER!E8,\":\",MASTER!E6)","v":"HALF YEARLY EXAM:2021-22"},{"$nulls":4},"TIME TABLE"]
[null,"Exam Time:-","09:00 AM to 11:45 AM",null,null,"Class","Subjects"]
[null,"Date (Day) ↓",{"$nulls":3},{"$f":"'STUDENT DETAIL'!E4","v":4}]
[null,"2022-03-31","(",{"$f":"IF(B5=0,0,TEXT(B5,\"dddd\"))","v":"Thursday"},")","Hindi"]
[null,{"$f":"B5+1","v":"2022-04-01"},"(",{"$f":"IF(B6=0,0,TEXT(B6,\"dddd\"))","v":"Friday"},")","English"]
[null,{"$f":"B6+1","v":"2022-04-02"},"(","Saturday",")","Science"]
[null,"2022-04-03","(","Sunday",")","Mathematics"]
[null,"2022-04-04","(","Monday",")","Social Study"]
[null,"2022-04-05","(","Tuesday",")","Sanskrit"]
{"$rows_left_out":5}
{"sheet":"ADMIT CARD","index":3,"n_rows":3350,"n_cols":10,"rows_kept":3350,"merged":[[1672,3,1672,8],[1673,3,1673,8],[1674,3,1674,8],[1675,1,1675,8],[1676,0,1707,0],[1676,1,1677,3],[1676,4,1676,8],[1677,4,1677,8],[1678,1,1707,1],[1678,2,1678,8],[1679,2,1679,8],[1680,2,1680,4],[1680,6,1680,7],[1680,8,1685,8],[1694,2,1694,4],[1696,2,1696,4],[1696,7,1696,8],[1697,2,1697,4],[1697,7,1697,8],[1701,3,1701,8],[1703,3,1703,8],[1704,3,1704,8],[1705,3,1705,8],[1706,3,1706,8],[1708,0,1708,8],[1709,1,1709,8],[1710,0,1741,0],[1710,1,1711,3],[1710,4,1710,8],[1711,4,1711,8],[1712,1,1741,1],[1712,2,1712,8],[1713,2,1713,8],[1714,2,1714,4],[1714,6,1714,7],[1714,8,1719,8],[1715,2,1715,4],[1715,6,1715,7],[1716,2,1716,4],[1716,6,1716,7],[1717,2,1717,4],[1717,6,1717,7],[1718,2,1718,4],[1718,6,1718,7],[1719,2,1719,4],[1719,6,1719,7],[1720,2,1720,8],[1721,2,1721,4],[1721,5,1721,6],[1723,2,1723,4],[1723,7,1723,8],[1724,2,1724,4],[1724,7,1724,8],[1725,2,1725,4],[1725,7,1725,8],[1726,2,1726,4],[1726,7,1726,8],[1727,2,1727,4],[1727,7,1727,8],[1728,2,1728,4],[1728,7,1728,8],[1729,2,1729,4],[1729,7,1729,8],[1733,3,1733,8],[1734,3,1734,8],[1735,3,1735,8],[1736,3,1736,8],[1737,3,1737,8],[1738,3,1738,8],[1739,3,1739,8],[1743,4,1743,8],[1745,2,1745,8],[1747,2,1747,4],[1747,6,1747,7],[1748,2,1748,4],[1748,6,1748,7],[1749,2,1749,4],[1749,6,1749,7],[1750,2,1750,4],[1750,6,1750,7],[1751,2,1751,4],[1751,6,1751,7],[1754,2,1754,4],[1754,7,1754,8],[1755,2,1755,4],[1755,7,1755,8],[1756,2,1756,4],[1756,7,1756,8],[1757,2,1757,4],[1757,7,1757,8],[1758,2,1758,4],[1758,7,1758,8],[1759,2,1759,4],[1759,7,1759,8],[1766,3,1766,8],[1767,3,1767,8],[1768,3,1768,8],[1769,3,1769,8],[1770,3,1770,8],[1771,3,1771,8],[1772,3,1772,8],[1773,3,1773,8],[1774,3,1774,8],[1775,0,1775,8],[1776,1,1776,8],[1777,0,1808,0],[1777,1,1778,3],[1777,4,1777,8],[1778,4,1778,8],[1779,1,1808,1],[1779,2,1779,8],[1780,2,1780,8],[1781,2,1781,4],[1781,6,1781,7],[1781,8,1786,8],[1782,2,1782,4],[1782,6,1782,7],[1783,2,1783,4],[1808,3,1808,8],[1809,1,1809,8],[1810,0,1841,0],[1810,1,1811,3],[1810,4,1810,8],[1814,2,1814,4],[1815,2,1815,4],[1816,2,1816,4],[1817,2,1817,4],[1818,2,1818,4],[1830,2,1830,4],[1830,7,1830,8],[1831,2,1831,4],[1831,7,1831,8],[1832,2,1832,8],[1833,3,1833,8],[1834,3,1834,8],[1855,7,1855,8],[1856,2,1856,4],[1856,7,1856,8],[1857,2,1857,4],[1857,7,1857,8],[1858,2,1858,4],[1858,7,1858,8],[1859,2,1859,4],[1859,7,1859,8],[1860,2,1860,4],[1860,7,1860,8],[1861,2,1861,4],[1864,2,1864,4],[1865,2,1865,4],[1876,1,1876,8],[1877,0,1908,0],[1877,1,1878,3],[1877,4,1877,8],[1878,4,1878,8],[1879,1,1908,1],[1879,2,1879,8],[1880,2,1880,8],[1881,2,1881,4],[1881,6,1881,7],[1881,8,1886,8],[1882,2,1882,4],[1882,6,1882,7],[1883,2,1883,4],[1883,6,1883,7],[1884,2,1884,4],[1884,6,1884,7],[1893,2,1893,4],[1894,2,1894,4],[1895,2,1895,4],[1896,2,1896,4],[1897,2,1897,4],[1898,2,1898,4],[1899,2,1899,8],[1908,3,1908,8],[1919,6,1919,7],[1920,2,1920,4],[1920,6,1920,7],[1921,2,1921,8],[1922,2,1922,4],[1922,5,1922,6],[1923,2,1923,4],[1924,2,1924,4],[1925,2,1925,4],[1926,2,1926,4],[1927,2,1927,4],[1928,2,1928,4],[1930,2,1930,4],[1930,7,1930,8],[1931,2,1931,4],[1931,7,1931,8],[1932,2,1932,4],[1932,7,1932,8],[1938,3,1938,8],[1939,3,1939,8],[1940,3,1940,8],[1941,3,1941,8],[1942,3,1942,8],[1952,2,1952,4],[1952,6,1952,7],[1953,2,1953,4],[1953,6,1953,7],[1955,2,1955,4],[1955,5,1955,6],[1955,7,1955,8],[1956,2,1956,4],[1956,7,1956,8],[1957,2,1957,4],[1957,7,1957,8],[1958,2,1958,4],[1958,7,1958,8],[1959,2,1959,4],[1959,7,1959,8],[1960,2,1960,4],[1960,7,1960,8],[1961,2,1961,4],[1961,7,1961,8],[1962,2,1962,4],[1962,7,1962,8],[1963,2,1963,4],[1963,7,1963,8],[1964,2,1964,4],[1964,7,1964,8],[1965,2,1965,4],[1965,7,1965,8],[1966,2,1966,8],[1967,3,1967,8],[1968,3,1968,8],[1969,3,1969,8],[1970,3,1970,8],[1971,3,1971,8],[1972,3,1972,8],[1973,3,1973,8],[1974,3,1974,8],[1975,3,1975,8],[1976,0,1976,8],[1977,1,1977,8],[1978,0,2009,0],[1978,1,1979,3],[1978,4,1978,8],[1979,4,1979,8],[1980,1,2009,1],[1980,2,1980,8],[1981,2,1981,8],[1982,2,1982,4],[1982,6,1982,7],[1982,8,1987,8],[1983,2,1983,4],[1983,6,1983,7],[1984,2,1984,4],[1984,6,1984,7],[1985,2,1985,4],[1985,6,1985,7],[1986,2,1986,4],[1986,6,1986,7],[1987,2,1987,4],[1987,6,1987,7],[1988,2,1988,8],[1989,2,1989,4],[1989,5,1989,6],[1989,7,1989,8],[1990,2,1990,4],[1990,7,1990,8],[1991,2,1991,4],[1991,7,1991,8],[1992,2,1992,4],[1992,7,1992,8],[1993,2,1993,4],[1993,7,1993,8],[1994,2,1994,4],[1994,7,1994,8],[1995,2,1995,4],[1995,7,1995,8],[1996,2,1996,4],[1996,7,1996,8],[1997,2,1997,4],[1997,7,1997,8],[1998,2,1998,4],[1998,7,1998,8],[1999,2,1999,4],[1999,7,1999,8],[2000,2,2000,8],[2001,3,2001,8],[2002,3,2002,8],[2003,3,2003,8],[2004,3,2004,8],[2005,3,2005,8],[2006,3,2006,8],[2007,3,2007,8],[2008,3,2008,8],[2009,3,2009,8],[2010,1,2010,8],[2011,0,2042,0],[2011,1,2012,3],[2015,2,2015,4],[2015,6,2015,7],[2016,2,2016,4],[2016,6,2016,7],[2018,2,2018,4],[2019,2,2019,4],[2020,2,2020,4],[2022,2,2022,4],[2022,7,2022,8],[2023,2,2023,4],[2023,7,2023,8],[2024,2,2024,4],[2024,7,2024,8],[2034,3,2034,8],[2037,3,2037,8],[2038,3,2038,8],[2039,3,2039,8],[2040,3,2040,8],[2041,3,2041,8],[2047,2,2047,8],[2049,2,2049,4],[2050,2,2050,4],[2051,2,2051,4],[2052,2,2052,4],[2053,2,2053,4],[2054,2,2054,4],[2055,2,2055,8],[2063,7,2063,8],[2064,2,2064,4],[2064,7,2064,8],[2065,2,2065,4],[2065,7,2065,8],[2066,2,2066,4],[2066,7,2066,8],[2067,2,2067,8],[2068,3,2068,8],[2069,3,2069,8],[2070,3,2070,8],[2082,2,2082,4],[2083,2,2083,4],[2091,7,2091,8],[2092,2,2092,4],[2092,7,2092,8],[2093,2,2093,4],[2093,7,2093,8],[2094,2,2094,4],[2094,7,2094,8],[2095,2,2095,4],[2095,7,2095,8],[2096,2,2096,4],[2096,7,2096,8],[2097,2,2097,4],[2112,0,2143,0],[2112,1,2113,3],[2112,4,2112,8],[2113,4,2113,8],[2114,1,2143,1],[2114,2,2114,8],[2115,2,2115,8],[2116,2,2116,4],[2116,6,2116,7],[2116,8,2121,8],[2117,2,2117,4],[2117,6,2117,7],[2118,2,2118,4],[2118,6,2118,7],[2119,2,2119,4],[2119,6,2119,7],[2120,2,2120,4],[2120,6,2120,7],[2129,2,2129,4],[2130,2,2130,4],[2131,2,2131,4],[2132,2,2132,4],[2133,2,2133,4],[2153,6,2153,7],[2154,2,2154,4],[2154,6,2154,7],[2155,2,2155,8],[2156,2,2156,4],[2156,5,2156,6],[2159,2,2159,4],[2160,2,2160,4],[2161,2,2161,4],[2162,2,2162,4],[2163,2,2163,4],[2164,2,2164,4],[2166,2,2166,4],[2166,7,2166,8],[2171,3,2171,8],[2172,3,2172,8],[2173,3,2173,8],[2174,3,2174,8],[2175,3,2175,8],[2176,3,2176,8],[2177,0,2177,8],[2178,1,2178,8],[2179,0,2210,0],[2179,1,2180,3],[2179,4,2179,8],[2180,4,2180,8],[2181,1,2210,1],[2181,2,2181,8],[2188,2,2188,4],[2188,6,2188,7],[2190,2,2190,4],[2191,2,2191,4],[2192,2,2192,4],[2193,2,2193,4],[2193,7,2193,8],[2194,2,2194,4],[2194,7,2194,8],[2195,2,2195,4],[2195,7,2195,8],[2196,2,2196,4],[2196,7,2196,8],[2197,2,2197,4],[2197,7,2197,8],[2198,2,2198,4],[2198,7,2198,8],[2199,2,2199,4],[2199,7,2199,8],[2200,2,2200,4],[2200,7,2200,8],[2201,2,2201,8],[2202,3,2202,8],[2203,3,2203,8],[2204,3,2204,8],[2205,3,2205,8],[2206,3,2206,8],[2207,3,2207,8],[2208,3,2208,8],[2209,3,2209,8],[2210,3,2210,8],[2218,2,2218,4],[2218,6,2218,7],[2219,2,2219,4],[2219,6,2219,7],[2220,2,2220,4],[2220,6,2220,7],[2221,2,2221,4],[2221,6,2221,7],[2223,2,2223,4],[2225,2,2225,4],[2225,7,2225,8],[2226,2,2226,4],[2226,7,2226,8],[2227,2,2227,4],[2227,7,2227,8],[2228,2,2228,4],[2228,7,2228,8],[2229,2,2229,4],[2229,7,2229,8],[2230,2,2230,4],[2230,7,2230,8],[2231,2,2231,4],[2231,7,2231,8],[2244,0,2244,8],[2245,1,2245,8],[2246,0,2277,0],[2246,1,2247,3],[2246,4,2246,8],[2247,4,2247,8],[2248,1,2277,1],[2248,2,2248,8],[2249,2,2249,8],[2250,2,2250,4],[2250,6,2250,7],[2250,8,2255,8],[2251,2,2251,4],[2251,6,2251,7],[2252,2,2252,4],[2252,6,2252,7],[2253,2,2253,4],[2253,6,2253,7],[2254,2,2254,4],[2254,6,2254,7],[2255,2,2255,4],[2255,6,2255,7],[2256,2,2256,8],[2257,2,2257,4],[2257,5,2257,6],[2257,7,2257,8],[2258,2,2258,4],[2258,7,2258,8],[2259,2,2259,4],[2259,7,2259,8],[2260,2,2260,4],[2260,7,2260,8],[2261,2,2261,4],[2269,3,2269,8],[2270,3,2270,8],[2274,3,2274,8],[2275,3,2275,8],[2276,3,2276,8],[2277,3,2277,8],[2278,1,2278,8],[2279,0,2310,0],[2279,1,2280,3],[2279,4,2279,8],[2280,4,2280,8],[2281,1,2310,1],[2281,2,2281,8],[2282,2,2282,8],[2283,2,2283,4],[2283,6,2283,7],[2283,8,2288,8],[2284,2,2284,4],[2284,6,2284,7],[2285,2,2285,4],[2285,6,2285,7],[2286,2,2286,4],[2286,6,2286,7],[2287,2,2287,4],[2287,6,2287,7],[2288,2,2288,4],[2288,6,2288,7],[2289,2,2289,8],[2290,2,2290,4],[2290,5,2290,6],[2290,7,2290,8],[2317,2,2317,4],[2318,2,2318,4],[2319,2,2319,4],[2324,2,2324,4],[2324,5,2324,6],[2324,7,2324,8],[2325,2,2325,4],[2325,7,2325,8],[2326,2,2326,4],[2326,7,2326,8],[2327,2,2327,4],[2327,7,2327,8],[2328,2,2328,4],[2328,7,2328,8],[2335,2,2335,8],[2341,3,2341,8],[2342,3,2342,8],[2343,3,2343,8],[2344,3,2344,8],[2345,1,2345,8],[2346,0,2377,0],[2346,1,2347,3],[2346,4,2346,8],[2347,4,2347,8],[2348,1,2377,1],[2348,2,2348,8],[2349,2,2349,8],[2350,2,2350,4],[2350,6,2350,7],[2350,8,2355,8],[2351,2,2351,4],[2351,6,2351,7],[2352,2,2352,4],[2352,6,2352,7],[2353,2,2353,4],[2353,6,2353,7],[2354,2,2354,4],[2365,2,2365,4],[2366,2,2366,4],[2367,2,2367,4],[2378,0,2378,8],[2379,1,2379,8],[2380,0,2411,0],[2380,1,2381,3],[2380,4,2380,8],[2381,4,2381,8],[2382,1,2411,1],[2382,2,2382,8],[2383,2,2383,8],[2384,2,2384,4],[2384,6,2384,7],[2393,2,2393,4],[2393,7,2393,8],[2394,2,2394,4],[2394,7,2394,8],[2395,2,2395,4],[2395,7,2395,8],[2396,2,2396,4],[2397,2,2397,4],[2398,2,2398,4],[2399,2,2399,4],[2400,2,2400,4],[2410,3,2410,8],[2411,3,2411,8],[2421,2,2421,4],[2421,6,2421,7],[2422,2,2422,4],[2422,6,2422,7],[2423,2,2423,8],[2424,2,2424,4],[2424,5,2424,6],[2424,7,2424,8],[2425,2,2425,4],[2426,2,2426,4],[2427,2,2427,4],[2428,2,2428,4],[2429,2,2429,4],[2431,2,2431,4],[2431,7,2431,8],[2432,2,2432,4],[2432,7,2432,8],[2433,2,2433,4],[2433,7,2433,8],[2434,2,2434,4],[2434,7,2434,8],[2439,3,2439,8],[2440,3,2440,8],[2441,3,2441,8],[2442,3,2442,8],[2443,3,2443,8],[2444,3,2444,8],[2454,2,2454,4],[2454,6,2454,7],[2455,2,2455,4],[2455,6,2455,7],[2456,2,2456,4],[2456,6,2456,7],[2458,2,2458,4],[2459,2,2459,4],[2460,7,2460,8],[2461,2,2461,4],[2461,7,2461,8],[2462,2,2462,4],[2462,7,2462,8],[2463,2,2463,4],[2463,7,2463,8],[2464,2,2464,4],[2464,7,2464,8],[2465,2,2465,4],[2465,7,2465,8],[2466,2,2466,4],[2466,7,2466,8],[2467,2,2467,4],[2467,7,2467,8],[2468,2,2468,4],[2468,7,2468,8],[2469,2,2469,8],[2470,3,2470,8],[2471,3,2471,8],[2472,3,2472,8],[2473,3,2473,8],[2474,3,2474,8],[2475,3,2475,8],[2476,3,2476,8],[2477,3,2477,8],[2478,3,2478,8],[2479,1,2479,8],[2480,0,2511,0],[2480,1,2481,3],[2480,4,2480,8],[2481,4,2481,8],[2482,1,2511,1],[2482,2,2482,8],[2483,2,2483,8],[2484,2,2484,4],[2484,6,2484,7],[2485,2,2485,4],[2485,6,2485,7],[2486,2,2486,4],[2486,6,2486,7],[2487,2,2487,4],[2487,6,2487,7],[2488,2,2488,4],[2488,6,2488,7],[2491,2,2491,4],[2491,7,2491,8],[2492,2,2492,4],[2492,7,2492,8],[2493,2,2493,4],[2495,2,2495,4],[2495,7,2495,8],[2496,2,2496,4],[2496,7,2496,8],[2503,3,2503,8],[2504,3,2504,8],[2505,3,2505,8],[2506,3,2506,8],[2508,3,2508,8],[2509,3,2509,8],[2510,3,2510,8],[2511,3,2511,8],[2512,0,2512,8],[2518,2,2518,4],[2518,6,2518,7],[2520,2,2520,4],[2521,2,2521,4],[2522,2,2522,4],[2523,2,2523,4],[2525,2,2525,4],[2525,7,2525,8],[2526,2,2526,4],[2526,7,2526,8],[2534,7,2534,8],[2535,2,2535,4],[2535,7,2535,8],[2536,2,2536,8],[2537,3,2537,8],[2538,3,2538,8],[2539,3,2539,8],[2540,3,2540,8],[2541,3,2541,8],[2542,3,2542,8],[2543,3,2543,8],[2551,2,2551,4],[2552,2,2552,4],[2553,2,2553,4],[2554,2,2554,4],[2555,2,2555,4],[2564,2,2564,4],[2564,7,2564,8],[2565,2,2565,4],[2565,7,2565,8],[2566,2,2566,4],[2566,7,2566,8],[2567,2,2567,4],[2567,7,2567,8],[2568,2,2568,4],[2568,7,2568,8],[2569,2,2569,8],[2585,2,2585,4],[2592,5,2592,6],[2592,7,2592,8],[2593,2,2593,4],[2593,7,2593,8],[2594,2,2594,4],[2594,7,2594,8],[2595,2,2595,4],[2595,7,2595,8],[2596,2,2596,4],[2596,7,2596,8],[2597,2,2597,4],[2597,7,2597,8],[2598,2,2598,4],[2598,7,2598,8],[2599,2,2599,4],[2599,7,2599,8],[2601,2,2601,4],[2602,2,2602,4],[2622,6,2622,7],[2623,2,2623,4],[2623,6,2623,7],[2624,2,2624,8],[2625,2,2625,4],[2625,5,2625,6],[2625,7,2625,8],[2626,2,2626,4],[2626,7,2626,8],[2627,2,2627,4],[2627,7,2627,8],[2628,2,2628,4],[2631,2,2631,4],[2632,2,2632,4],[2633,2,2633,4],[2634,2,2634,4],[2635,2,2635,4],[2643,3,2643,8],[2644,3,2644,8],[2645,3,2645,8],[2646,0,2646,8],[2647,1,2647,8],[2648,0,2679,0],[2648,1,2649,3],[2648,4,2648,8],[2649,4,2649,8],[2650,1,2679,1],[2650,2,2650,8],[2658,2,2658,8],[2660,2,2660,4],[2660,7,2660,8],[2661,2,2661,4],[2661,7,2661,8],[2662,2,2662,4],[2662,7,2662,8],[2663,2,2663,4],[2663,7,2663,8],[2664,2,2664,4],[2664,7,2664,8],[2665,2,2665,4],[2665,7,2665,8],[2667,2,2667,4],[2667,7,2667,8],[2668,2,2668,4],[2668,7,2668,8],[2669,2,2669,4],[2669,7,2669,8],[2675,3,2675,8],[2676,3,2676,8],[2677,3,2677,8],[2678,3,2678,8],[2679,3,2679,8],[2690,2,2690,4],[2690,6,2690,7],[2692,2,2692,4],[2693,2,2693,4],[2694,2,2694,4],[2695,2,2695,4],[2696,2,2696,4],[2696,7,2696,8],[2697,2,2697,4],[2697,7,2697,8],[2698,2,2698,4],[2698,7,2698,8],[2699,2,2699,4],[2699,7,2699,8],[2700,2,2700,4],[2700,7,2700,8],[2701,2,2701,4],[2701,7,2701,8],[2702,2,2702,4],[2702,7,2702,8],[2703,2,2703,8],[2704,3,2704,8],[2705,3,2705,8],[2706,3,2706,8],[2707,3,2707,8],[2708,3,2708,8],[2709,3,2709,8],[2710,3,2710,8],[2711,3,2711,8],[2712,3,2712,8],[2713,0,2713,8],[2714,1,2714,8],[2715,0,2746,0],[2715,1,2716,3],[2715,4,2715,8],[2716,4,2716,8],[2717,1,2746,1],[2717,2,2717,8],[2718,2,2718,8],[2719,2,2719,4],[2719,6,2719,7],[2719,8,2724,8],[2720,2,2720,4],[2720,6,2720,7],[2721,2,2721,4],[2721,6,2721,7],[2722,2,2722,4],[2722,6,2722,7],[2723,2,2723,4],[2723,6,2723,7],[2724,2,2724,4],[2724,6,2724,7],[2725,2,2725,8],[2726,2,2726,4],[2726,5,2726,6],[2726,7,2726,8],[2727,2,2727,4],[2727,7,2727,8],[2728,2,2728,4],[2728,7,2728,8],[2729,2,2729,4],[2729,7,2729,8],[2730,2,2730,4],[2730,7,2730,8],[2731,2,2731,4],[2731,7,2731,8],[2732,2,2732,4],[2732,7,2732,8],[2733,2,2733,4],[2733,7,2733,8],[2734,2,2734,4],[2734,7,2734,8],[2735,2,2735,4],[2735,7,2735,8],[2736,2,2736,4],[2736,7,2736,8],[2737,2,2737,8],[2738,3,2738,8],[2739,3,2739,8],[2740,3,2740,8],[2741,3,2741,8],[2742,3,2742,8],[2743,3,2743,8],[2744,3,2744,8],[2745,3,2745,8],[2746,3,2746,8],[2747,1,2747,8],[2748,0,2779,0],[2752,2,2752,4],[2752,6,2752,7],[2753,2,2753,4],[2753,6,2753,7],[2754,2,2754,4],[2754,6,2754,7],[2756,2,2756,4],[2757,2,2757,4],[2759,2,2759,4],[2759,7,2759,8],[2760,2,2760,4],[2760,7,2760,8],[2761,2,2761,4],[2761,7,2761,8],[2762,2,2762,4],[2762,7,2762,8],[2771,3,2771,8],[2772,3,2772,8],[2777,3,2777,8],[2778,3,2778,8],[2779,3,2779,8],[2780,0,2780,8],[2781,1,2781,8],[2782,0,2813,0],[2784,2,2784,8],[2786,2,2786,4],[2787,2,2787,4],[2788,2,2788,4],[2789,2,2789,4],[2790,2,2790,4],[2791,2,2791,4],[2792,2,2792,8],[2802,7,2802,8],[2803,2,2803,4],[2803,7,2803,8],[2804,2,2804,8],[2805,3,2805,8],[2806,3,2806,8],[2819,2,2819,4],[2820,2,2820,4],[2821,2,2821,4],[2828,7,2828,8],[2829,2,2829,4],[2829,7,2829,8],[2830,2,2830,4],[2830,7,2830,8],[2831,2,2831,4],[2831,7,2831,8],[2832,2,2832,4],[2832,7,2832,8],[2833,2,2833,4],[2833,7,2833,8],[2834,2,2834,4],[2834,7,2834,8],[2835,2,2835,4],[2835,7,2835,8],[2851,2,2851,8],[2858,6,2858,7],[2859,2,2859,8],[2860,2,2860,4],[2860,5,2860,6],[2860,7,2860,8],[2861,2,2861,4],[2861,7,2861,8],[2862,2,2862,4],[2862,7,2862,8],[2863,2,2863,4],[2863,7,2863,8],[2864,2,2864,4],[2867,2,2867,4],[2868,2,2868,4],[2869,2,2869,4],[2870,2,2870,4],[2879,3,2879,8],[2880,3,2880,8],[2881,1,2881,8],[2882,0,2913,0],[2882,1,2883,3],[2882,4,2882,8],[2883,4,2883,8],[2884,1,2913,1],[2884,2,2884,8],[2885,2,2885,8],[2886,2,2886,4],[2886,6,2886,7],[2886,8,2891,8],[2887,2,2887,4],[2887,6,2887,7],[2888,2,2888,4],[2888,6,2888,7],[2896,2,2896,4],[2897,2,2897,4],[2898,2,2898,4],[2899,2,2899,4],[2900,2,2900,4],[2901,2,2901,4],[2903,2,2903,4],[2903,7,2903,8],[2911,3,2911,8],[2912,3,2912,8],[2913,3,2913,8],[2925,2,2925,4],[2925,6,2925,7],[2926,2,2926,8],[2927,2,2927,4],[2927,5,2927,6],[2927,7,2927,8],[2928,2,2928,4],[2929,2,2929,4],[2930,2,2930,4],[2931,2,2931,4],[2933,2,2933,4],[2933,7,2933,8],[2934,2,2934,4],[2934,7,2934,8],[2935,2,2935,4],[2935,7,2935,8],[2936,2,2936,4],[2936,7,2936,8],[2937,2,2937,4],[2937,7,2937,8],[2941,3,2941,8],[2942,3,2942,8],[2943,3,2943,8],[2944,3,2944,8],[2945,3,2945,8],[2946,3,2946,8],[2947,3,2947,8]],"merged_total":5550,"flags":["merged_cut"]}
[1]
[{"$nulls":4},{"$f":"MASTER!$E$11","v":"Govt. Sr. Secondary School Raimalwada"}]
[{"$nulls":4},{"$f":"MASTER!$E$14","v":"P.S.-Bapini (Jodhpur)"}]
[null,{"$f":"CONCATENATE(C5,'TIME TABLE'!$C$5,'ADMIT CARD'!$C6,$F6,'ADMIT CARD'!$G6,'TIME TABLE'!$E$5)","v":"ADMIT CARD(Roll Number●→901)"},{"$f":"CONCATENATE('TIME TABLE'!$B$2,'TIME TABLE'!$F$2)","v":"HALF YEARLY EXAM:2021-22"}]
[null,null,"ADMIT CARD",{"$nulls":6}," "]
[null,null,"Roll Number",null,null,"●→",{"$f":"VLOOKUP(A1,'STUDENT DETAIL'!$C$8:$I$107,3)","v":901},null,"Seal and Signature of Head of Institution"]
[null,null,"Student's Name",null,null,"●→",{"$f":"VLOOKUP(A1,'STUDENT DETAIL'!$C$8:$I$107,4)","v":"Akshya"}]
[null,null,"Father's Name",null,null,"●→",{"$f":"VLOOKUP(A1,'STUDENT DETAIL'!$C$8:$I$107,5)","v":"Ram"}]
[null,null,"Mother's Name ",null,null,"●→",{"$f":"VLOOKUP(A1,'STUDENT DETAIL'!$C$8:$I$107,6)","v":"Seeta"}]
[null,null,"Class & Section",null,null,"●→",{"$f":"IF(G6=0,0,CONCATENATE('STUDENT DETAIL'!$E$4,'STUDENT DETAIL'!$H$4))","v":"4(A)"}]
{"$rows_left_out":3340}