{"text_format":"3","workbook":"xlsx","n_sheets":4,"sheets":["info","SD DATA","Teacher Data","icard"],"not_rendered":{"images":15,"defined_names":10},"read":"whole","date_system":"1900"}

{"sheet":"info","index":0,"n_rows":30,"n_cols":25,"rows_kept":30,"merged":[[0,1,0,23],[0,24,4,32],[1,1,1,23],[2,0,2,23],[3,1,3,23],[4,1,4,23],[5,1,5,23],[6,1,6,23],[7,1,7,23],[8,1,8,23],[9,1,9,23],[10,1,10,23],[11,1,11,23],[11,24,21,32],[12,1,12,23],[13,2,13,4],[13,5,13,9],[13,15,13,20],[13,21,13,23],[14,1,14,23],[15,1,15,23],[16,1,16,23],[17,0,17,23],[18,1,18,23],[19,0,19,23],[20,1,20,23],[21,0,21,23],[22,1,22,23],[22,24,24,32],[23,0,23,23],[24,2,24,6],[24,7,24,9],[24,10,24,15],[24,16,24,20],[25,1,25,23],[26,1,26,23],[27,1,27,23],[28,1,28,23],[29,1,29,5],[29,6,29,23]]}
[null,"TEACHER ICARD SOFTWARE esa vkidk Lokxr gS A",{"$nulls":22},"jk/kkLokeh "]
[null,"dqN dj.kh; dk;Z"]
["INSTRUCTION FOR TEACHER ICARD"]
[1,";g SOFTWARE fo|ky; esa dk;Zjr deZpkfj;ksa ds ifjp; i= ds fy;s cuk;k gS"]
[2,"bl izksxzke esa loZizFke 'kkykniZ.k esa ykWfxu ds ckn download tab esa teacher detail dowonload djsa A"]
[3,"blds ckn teacher detail dh lEiw.kZ 'khV dks select djds copy djs vkSj bl software ds SD data  esa paste djsaA"]
[4,"blds ckn teacher data lock esa tk;s vkSj insert tab esa ls picture select djs vkSj mldks resize djsA"]
[5,";kn jgs ! vkidks fdlh Hkh deZpkjh dh tkudkjh esa cnyko djuk gS rks SD data  esa gh djs A"]
[6,"vc vkidks icard sheet esa ftl depkjh dk ifjp; i= print ysuk gS mldk dzekad cnys vkbZ dkMZ rS;kj ---------------"]
[7]
[8]
[9]
[10]
[9828120697,null,9828120697,null,null,"nksLrks vf/kd tkudkjh gsrq esjk ;wV;wc psuy ns[ks vkSj ykbd vkSj lCldzkbc t#j djs rkfd vkus okyk izksxke vki rd igWqp ldsA ",{"$nulls":9},"https://youtu.be/3yHQVnwH1W0",{"$nulls":5},"Like subscribe t#j djs"]
[1,"OLD TAX REGIME  sheet  esa gkml yksu C;kt ,ao vU; vk; rFkk Chapter VI A Deduction dh jkf'k dk bUnzkt djs tks lsy vuykWd gSA"]
[2,"OLD TAX  REGIME sheet  esa dsoy vuykWd 'khV esa gh bUnzkt djs vU; osru ls dVus okyh jkf'k Lor vk tk,xh A"]
[3,"bl 'khV esa Refundable amount (+) esa gS rks vkidks jkf'k okil feysxh vU;Fkk vkidk VSDl cdk;k gSA "]
["INSTRUCTION FOR NEW TAX REGIME"]
[1,"NEW TAX REGIME  sheet  esa 70 izdkj dh dVksfr ls oafpr gksuk iMsXkk dsoy NPS  dh DVkSfr vf/kdre 50000 dh NwV ns; gS vU; lsy ykWd gSA"]
["INSTRUCTION FOR PAY SLIP SHEET"]
[1,"\"PAY SLIP  sheet\"  esa vki ftl ekg dh is Lyhi ysuh gks ml ekg dk p;u djs vki dh is Lyhi rS;kj gS ckdh  lsy ykWd gSA A4 page size ( margin full page)"]
["INSTRUCTION FOR PRINT"]
[1,"lHkh 'khV A4 page size ij Margin full page esa lsV fd;k gqvk gS vki fizV ys ldrs gsA 7pay matrix chart sheet legal page ls  print  fudky ldrs gSA"]
["bl odZcqd dks jktLFkku ds f'k{kk foHkkx ds deZpkfj;ksa dh lqfo/kk ds fy, rS;kj fd;k gqvk gS A blesa lHkh x.kuk ,ao ladyu dks iw.kZ lko/kkuh ds lkFk iz;ksx  fd;k gSa exj fdlh izdkj dh =qfV ,ao pwd ds fy;s rS;kjdRrkZ ftEesnkj ugha gksxkA vk;dj foHkkx ds vkns'kkuqlkj x.kuk ,ao fu;e gh ekU; gksxs A"]
[10,null,"FOR MORE MY EXCEL SOFTWARE & EDU.NEWS ---",{"$nulls":4},"http://www.shalasugam.com",null,null,"http://www.ashwinikumar.com",{"$nulls":5},"http://www.rajsevak.com"]
[null,";g izksxzke vkidks dSls yxk A"]
[null,"vkidk Lusg feyrk jgs "]
[null,"fot; dqekj iztkir       v/;kid         jktdh; mPp ek/;fed fo|ky; vkyfu;kokl iapk;r lfesfr fj;kacMh ftyk &ukXkkSj "]
[null,"bl izkxzke esa fdlh izdkj ds lq/kkj ;k lq>ko gsrq lEidZ djs esjh esy vkbZ Mh && gupskalani@gmail.com"]
[null,"vkids fo|ky; dk uke ;gkWa fy[ks  &&&",{"$nulls":4}," jktdh; mPp ek/;fed fo|ky; vkyfu;kokl ftyk &ukXkkSj"]

{"sheet":"SD DATA","index":1,"n_rows":29,"n_cols":13,"rows_kept":29}
["NAME","EmployeeID","FatherName","Gender","DOB","Post","Subject","Date Of Joining","Address","Aadhar No","PAN No","Mobile No","Blood Group"]
["VIJAY KUMAR PRAJAPAT","RJNA00000000000","RAMSUKH PRAJAPAT","M","1978-04-04","Teacher (III Gr.) Level 25","English","2016-05-15","VP-ALNIYAWAS BLOCK- BHERUNDA TEH-RIYAN BARI","00000000000","XXXXP0000J","XXXXXX0670","O+"]
["VIJAY KUMAR PRAJAPAT","RJNA00000000001","RAMSUKH PRAJAPAT","M","1978-04-05","Teacher (III Gr.) Level 24","English","2016-05-16","VP-ALNIYAWAS BLOCK- BHERUNDA TEH-RIYAN BARI","XXXXXXXX3647","XXXXP0000J","XXXXXX0671","O+"]
["VIJAY KUMAR PRAJAPAT","RJNA00000000002","RAMSUKH PRAJAPAT","M","1978-04-06","Teacher (III Gr.) Level 23","English","2016-05-17","VP-ALNIYAWAS BLOCK- BHERUNDA TEH-RIYAN BARI","XXXXXXXX3648","XXXXP0000J","XXXXXX0672","O+"]
["VIJAY KUMAR PRAJAPAT","RJNA00000000003","RAMSUKH PRAJAPAT","M","1978-04-07","Teacher (III Gr.) Level 22","English","2016-05-18","VP-ALNIYAWAS BLOCK- BHERUNDA TEH-RIYAN BARI","XXXXXXXX3649","XXXXP0000J","XXXXXX0673","O+"]
["VIJAY KUMAR PRAJAPAT","RJNA00000000004","RAMSUKH PRAJAPAT","M","1978-04-08","Teacher (III Gr.) Level 21","English","2016-05-19","VP-ALNIYAWAS BLOCK- BHERUNDA TEH-RIYAN BARI","XXXXXXXX3650","XXXXP0000J","XXXXXX0674","O+"]
["VIJAY KUMAR PRAJAPAT","RJNA00000000005","RAMSUKH PRAJAPAT","M","1978-04-09","Teacher (III Gr.) Level 20","English","2016-05-20","VP-ALNIYAWAS BLOCK- BHERUNDA TEH-RIYAN BARI","XXXXXXXX3651","XXXXP0000J","XXXXXX0675","O+"]
["VIJAY KUMAR PRAJAPAT","RJNA00000000006","RAMSUKH PRAJAPAT","M","1978-04-10","Teacher (III Gr.) Level 19","English","2016-05-21","VP-ALNIYAWAS BLOCK- BHERUNDA TEH-RIYAN BARI","XXXXXXXX3652","XXXXP0000J","XXXXXX0676","O+"]
["VIJAY KUMAR PRAJAPAT","RJNA00000000007","RAMSUKH PRAJAPAT","M","1978-04-11","Teacher (III Gr.) Level 18","English","2016-05-22","VP-ALNIYAWAS BLOCK- BHERUNDA TEH-RIYAN BARI","XXXXXXXX3653","XXXXP0000J","XXXXXX0677","O+"]
["VIJAY KUMAR PRAJAPAT","RJNA00000000008","RAMSUKH PRAJAPAT","M","1978-04-12","Teacher (III Gr.) Level 17","English","2016-05-23","VP-ALNIYAWAS BLOCK- BHERUNDA TEH-RIYAN BARI","XXXXXXXX3654","XXXXP0000J","XXXXXX0678","O+"]
["VIJAY KUMAR PRAJAPAT","RJNA00000000009","RAMSUKH PRAJAPAT","M","1978-04-13","Teacher (III Gr.) Level 16","English","2016-05-24","VP-ALNIYAWAS BLOCK- BHERUNDA TEH-RIYAN BARI","XXXXXXXX3655","XXXXP0000J","XXXXXX0679","O+"]
["VIJAY KUMAR PRAJAPAT","RJNA00000000010","RAMSUKH PRAJAPAT","M","1978-04-14","Teacher (III Gr.) Level 15","English","2016-05-25","VP-ALNIYAWAS BLOCK- BHERUNDA TEH-RIYAN BARI","XXXXXXXX3656","XXXXP0000J","XXXXXX0680","O+"]
["VIJAY KUMAR PRAJAPAT","RJNA00000000011","RAMSUKH PRAJAPAT","M","1978-04-15","Teacher (III Gr.) Level 14","English","2016-05-26","VP-ALNIYAWAS BLOCK- BHERUNDA TEH-RIYAN BARI","XXXXXXXX3657","XXXXP0000J","XXXXXX0681","O+"]
["VIJAY KUMAR PRAJAPAT","RJNA00000000012","RAMSUKH PRAJAPAT","M","1978-04-16","Teacher (III Gr.) Level 13","English","2016-05-27","VP-ALNIYAWAS BLOCK- BHERUNDA TEH-RIYAN BARI","XXXXXXXX3658","XXXXP0000J","XXXXXX0682","O+"]
["VIJAY KUMAR PRAJAPAT","RJNA00000000013","RAMSUKH PRAJAPAT","M","1978-04-17","Teacher (III Gr.) Level 12","English","2016-05-28","VP-ALNIYAWAS BLOCK- BHERUNDA TEH-RIYAN BARI","XXXXXXXX3659","XXXXP0000J","XXXXXX0683","O+"]
["VIJAY KUMAR PRAJAPAT","RJNA00000000014","RAMSUKH PRAJAPAT","M","1978-04-18","Teacher (III Gr.) Level 11","English","2016-05-29","VP-ALNIYAWAS BLOCK- BHERUNDA TEH-RIYAN BARI","XXXXXXXX3660","XXXXP0000J","XXXXXX0684","O+"]
["VIJAY KUMAR PRAJAPAT","RJNA00000000015","RAMSUKH PRAJAPAT","M","1978-04-19","Teacher (III Gr.) Level 10","English","2016-05-30","VP-ALNIYAWAS BLOCK- BHERUNDA TEH-RIYAN BARI","XXXXXXXX3661","XXXXP0000J","XXXXXX0685","O+"]
["VIJAY KUMAR PRAJAPAT","RJNA00000000016","RAMSUKH PRAJAPAT","M","1978-04-20","Teacher (III Gr.) Level 9","English","2016-05-31","VP-ALNIYAWAS BLOCK- BHERUNDA TEH-RIYAN BARI","XXXXXXXX3662","XXXXP0000J","XXXXXX0686","O+"]
["VIJAY KUMAR PRAJAPAT","RJNA00000000017","RAMSUKH PRAJAPAT","M","1978-04-21","Teacher (III Gr.) Level 8","English","2016-06-01","VP-ALNIYAWAS BLOCK- BHERUNDA TEH-RIYAN BARI","XXXXXXXX3663","XXXXP0000J","XXXXXX0687","O+"]
["VIJAY KUMAR PRAJAPAT","RJNA00000000018","RAMSUKH PRAJAPAT","M","1978-04-22","Teacher (III Gr.) Level 7","English","2016-06-02","VP-ALNIYAWAS BLOCK- BHERUNDA TEH-RIYAN BARI","XXXXXXXX3664","XXXXP0000J","XXXXXX0688","O+"]
["VIJAY KUMAR PRAJAPAT","RJNA00000000019","RAMSUKH PRAJAPAT","M","1978-04-23","Teacher (III Gr.) Level 6","English","2016-06-03","VP-ALNIYAWAS BLOCK- BHERUNDA TEH-RIYAN BARI","XXXXXXXX3665","XXXXP0000J","XXXXXX0689","O+"]
["VIJAY KUMAR PRAJAPAT","RJNA00000000020","RAMSUKH PRAJAPAT","M","1978-04-24","Teacher (III Gr.) Level 5","English","2016-06-04","VP-ALNIYAWAS BLOCK- BHERUNDA TEH-RIYAN BARI","XXXXXXXX3666","XXXXP0000J","XXXXXX0690","O+"]
["VIJAY KUMAR PRAJAPAT","RJNA00000000021","RAMSUKH PRAJAPAT","M","1978-04-25","Teacher (III Gr.) Level 4","English","2016-06-05","VP-ALNIYAWAS BLOCK- BHERUNDA TEH-RIYAN BARI","XXXXXXXX3667","XXXXP0000J","XXXXXX0691","O+"]
["VIJAY KUMAR PRAJAPAT","RJNA00000000022","RAMSUKH PRAJAPAT","M","1978-04-26","Teacher (III Gr.) Level 3","English","2016-06-06","VP-ALNIYAWAS BLOCK- BHERUNDA TEH-RIYAN BARI","XXXXXXXX3668","XXXXP0000J","XXXXXX0692","O+"]
["VIJAY KUMAR PRAJAPAT","RJNA00000000023","RAMSUKH PRAJAPAT","M","1978-04-27","Teacher (III Gr.) Level 2","English","2016-06-07","VP-ALNIYAWAS BLOCK- BHERUNDA TEH-RIYAN BARI","XXXXXXXX3669","XXXXP0000J","XXXXXX0693","O+"]
["VIJAY KUMAR PRAJAPAT","RJNA00000000024","RAMSUKH PRAJAPAT","M","1978-04-28","Teacher (III Gr.) Level 1","English","2016-06-08","VP-ALNIYAWAS BLOCK- BHERUNDA TEH-RIYAN BARI","XXXXXXXX3670","XXXXP0000J","XXXXXX0694","O+"]
["VIJAY KUMAR PRAJAPAT","RJNA00000000025","RAMSUKH PRAJAPAT","M","1978-04-29","Teacher (III Gr.) Level 0","English","2016-06-09","VP-ALNIYAWAS BLOCK- BHERUNDA TEH-RIYAN BARI","XXXXXXXX3671","XXXXP0000J","XXXXXX0695","O+"]
["VIJAY KUMAR PRAJAPAT","RJNA00000000026","RAMSUKH PRAJAPAT","M","1978-04-30","Teacher (III Gr.) Level 1","English","2016-06-10","VP-ALNIYAWAS BLOCK- BHERUNDA TEH-RIYAN BARI","XXXXXXXX3672","XXXXP0000J","XXXXXX0696","O+"]
["VIJAY KUMAR PRAJAPAT","RJNA00000000027","RAMSUKH PRAJAPAT","M","1978-05-01","Teacher (III Gr.) Level 2","English","2016-06-11","VP-ALNIYAWAS BLOCK- BHERUNDA TEH-RIYAN BARI","XXXXXXXX3673","XXXXP0000J","XXXXXX0697","O+"]

{"sheet":"Teacher Data","index":2,"n_rows":43,"n_cols":15,"rows_kept":43}
["SNO","PHOTO","Name","EmployeeID","FatherName","Gender","DOB","Post","Subject","Date Of Joining","Address","Aadhar No","PAN No","Mobile No","Blood Group"]
[null,null,"NAME","EmployeeID","FatherName","Gender","DOB","Post","Subject","Date Of Joining","Address","Aadhar No","PAN No","Mobile No","Blood Group"]
[1,null,{"$f":"'SD DATA'!A2","v":"VIJAY KUMAR PRAJAPAT"},{"$f":"'SD DATA'!B2","v":"RJNA00000000000"},{"$f":"'SD DATA'!C2","v":"RAMSUKH PRAJAPAT"},{"$f":"'SD DATA'!D2","v":"M"},{"$f":"'SD DATA'!E2","v":"1978-04-04"},{"$f":"'SD DATA'!F2","v":"Teacher (III Gr.) Level 25"},{"$f":"'SD DATA'!G2","v":"English"},{"$f":"'SD DATA'!H2","v":"2016-05-15"},{"$f":"'SD DATA'!I2","v":"VP-ALNIYAWAS BLOCK- BHERUNDA TEH-RIYAN BARI"},{"$f":"'SD DATA'!J2","v":"00000000000"},{"$f":"'SD DATA'!K2","v":"XXXXP0000J"},{"$f":"'SD DATA'!L2","v":"XXXXXX0670"},{"$f":"'SD DATA'!M2","v":"O+"}]
[2,null,{"$f":"'SD DATA'!A3","v":"VIJAY KUMAR PRAJAPAT"},{"$f":"'SD DATA'!B3","v":"RJNA00000000001"},{"$f":"'SD DATA'!C3","v":"RAMSUKH PRAJAPAT"},{"$f":"'SD DATA'!D3","v":"M"},{"$f":"'SD DATA'!E3","v":"1978-04-05"},{"$f":"'SD DATA'!F3","v":"Teacher (III Gr.) Level 24"},{"$f":"'SD DATA'!G3","v":"English"},{"$f":"'SD DATA'!H3","v":"2016-05-16"},{"$f":"'SD DATA'!I3","v":"VP-ALNIYAWAS BLOCK- BHERUNDA TEH-RIYAN BARI"},{"$f":"'SD DATA'!J3","v":"XXXXXXXX3647"},{"$f":"'SD DATA'!K3","v":"XXXXP0000J"},{"$f":"'SD DATA'!L3","v":"XXXXXX0671"},{"$f":"'SD DATA'!M3","v":"O+"}]
[3,null,{"$f":"'SD DATA'!A4","v":"VIJAY KUMAR PRAJAPAT"},{"$f":"'SD DATA'!B4","v":"RJNA00000000002"},{"$f":"'SD DATA'!C4","v":"RAMSUKH PRAJAPAT"},{"$f":"'SD DATA'!D4","v":"M"},{"$f":"'SD DATA'!E4","v":"1978-04-06"},{"$f":"'SD DATA'!F4","v":"Teacher (III Gr.) Level 23"},{"$f":"'SD DATA'!G4","v":"English"},{"$f":"'SD DATA'!H4","v":"2016-05-17"},{"$f":"'SD DATA'!I4","v":"VP-ALNIYAWAS BLOCK- BHERUNDA TEH-RIYAN BARI"},{"$f":"'SD DATA'!J4","v":"XXXXXXXX3648"},{"$f":"'SD DATA'!K4","v":"XXXXP0000J"},{"$f":"'SD DATA'!L4","v":"XXXXXX0672"},{"$f":"'SD DATA'!M4","v":"O+"}]
[4,null,{"$f":"'SD DATA'!A5","v":"VIJAY KUMAR PRAJAPAT"},{"$f":"'SD DATA'!B5","v":"RJNA00000000003"},{"$f":"'SD DATA'!C5","v":"RAMSUKH PRAJAPAT"},{"$f":"'SD DATA'!D5","v":"M"},{"$f":"'SD DATA'!E5","v":"1978-04-07"},{"$f":"'SD DATA'!F5","v":"Teacher (III Gr.) Level 22"},{"$f":"'SD DATA'!G5","v":"English"},{"$f":"'SD DATA'!H5","v":"2016-05-18"},{"$f":"'SD DATA'!I5","v":"VP-ALNIYAWAS BLOCK- BHERUNDA TEH-RIYAN BARI"},{"$f":"'SD DATA'!J5","v":"XXXXXXXX3649"},{"$f":"'SD DATA'!K5","v":"XXXXP0000J"},{"$f":"'SD DATA'!L5","v":"XXXXXX0673"},{"$f":"'SD DATA'!M5","v":"O+"}]
[5,null,{"$f":"'SD DATA'!A6","v":"VIJAY KUMAR PRAJAPAT"},{"$f":"'SD DATA'!B6","v":"RJNA00000000004"},{"$f":"'SD DATA'!C6","v":"RAMSUKH PRAJAPAT"},{"$f":"'SD DATA'!D6","v":"M"},{"$f":"'SD DATA'!E6","v":"1978-04-08"},{"$f":"'SD DATA'!F6","v":"Teacher (III Gr.) Level 21"},{"$f":"'SD DATA'!G6","v":"English"},{"$f":"'SD DATA'!H6","v":"2016-05-19"},{"$f":"'SD DATA'!I6","v":"VP-ALNIYAWAS BLOCK- BHERUNDA TEH-RIYAN BARI"},{"$f":"'SD DATA'!J6","v":"XXXXXXXX3650"},{"$f":"'SD DATA'!K6","v":"XXXXP0000J"},{"$f":"'SD DATA'!L6","v":"XXXXXX0674"},{"$f":"'SD DATA'!M6","v":"O+"}]
[6,null,{"$f":"'SD DATA'!A7","v":"VIJAY KUMAR PRAJAPAT"},{"$f":"'SD DATA'!B7","v":"RJNA00000000005"},{"$f":"'SD DATA'!C7","v":"RAMSUKH PRAJAPAT"},{"$f":"'SD DATA'!D7","v":"M"},{"$f":"'SD DATA'!E7","v":"1978-04-09"},{"$f":"'SD DATA'!F7","v":"Teacher (III Gr.) Level 20"},{"$f":"'SD DATA'!G7","v":"English"},{"$f":"'SD DATA'!H7","v":"2016-05-20"},{"$f":"'SD DATA'!I7","v":"VP-ALNIYAWAS BLOCK- BHERUNDA TEH-RIYAN BARI"},{"$f":"'SD DATA'!J7","v":"XXXXXXXX3651"},{"$f":"'SD DATA'!K7","v":"XXXXP0000J"},{"$f":"'SD DATA'!L7","v":"XXXXXX0675"},{"$f":"'SD DATA'!M7","v":"O+"}]
[7,null,{"$f":"'SD DATA'!A8","v":"VIJAY KUMAR PRAJAPAT"},{"$f":"'SD DATA'!B8","v":"RJNA00000000006"},{"$f":"'SD DATA'!C8","v":"RAMSUKH PRAJAPAT"},{"$f":"'SD DATA'!D8","v":"M"},{"$f":"'SD DATA'!E8","v":"1978-04-10"},{"$f":"'SD DATA'!F8","v":"Teacher (III Gr.) Level 19"},{"$f":"'SD DATA'!G8","v":"English"},{"$f":"'SD DATA'!H8","v":"2016-05-21"},{"$f":"'SD DATA'!I8","v":"VP-ALNIYAWAS BLOCK- BHERUNDA TEH-RIYAN BARI"},{"$f":"'SD DATA'!J8","v":"XXXXXXXX3652"},{"$f":"'SD DATA'!K8","v":"XXXXP0000J"},{"$f":"'SD DATA'!L8","v":"XXXXXX0676"},{"$f":"'SD DATA'!M8","v":"O+"}]
[8,null,{"$f":"'SD DATA'!A9","v":"VIJAY KUMAR PRAJAPAT"},{"$f":"'SD DATA'!B9","v":"RJNA00000000007"},{"$f":"'SD DATA'!C9","v":"RAMSUKH PRAJAPAT"},{"$f":"'SD DATA'!D9","v":"M"},{"$f":"'SD DATA'!E9","v":"1978-04-11"},{"$f":"'SD DATA'!F9","v":"Teacher (III Gr.) Level 18"},{"$f":"'SD DATA'!G9","v":"English"},{"$f":"'SD DATA'!H9","v":"2016-05-22"},{"$f":"'SD DATA'!I9","v":"VP-ALNIYAWAS BLOCK- BHERUNDA TEH-RIYAN BARI"},{"$f":"'SD DATA'!J9","v":"XXXXXXXX3653"},{"$f":"'SD DATA'!K9","v":"XXXXP0000J"},{"$f":"'SD DATA'!L9","v":"XXXXXX0677"},{"$f":"'SD DATA'!M9","v":"O+"}]
[9,null,{"$f":"'SD DATA'!A10","v":"VIJAY KUMAR PRAJAPAT"},{"$f":"'SD DATA'!B10","v":"RJNA00000000008"},{"$f":"'SD DATA'!C10","v":"RAMSUKH PRAJAPAT"},{"$f":"'SD DATA'!D10","v":"M"},{"$f":"'SD DATA'!E10","v":"1978-04-12"},{"$f":"'SD DATA'!F10","v":"Teacher (III Gr.) Level 17"},{"$f":"'SD DATA'!G10","v":"English"},{"$f":"'SD DATA'!H10","v":"2016-05-23"},{"$f":"'SD DATA'!I10","v":"VP-ALNIYAWAS BLOCK- BHERUNDA TEH-RIYAN BARI"},{"$f":"'SD DATA'!J10","v":"XXXXXXXX3654"},{"$f":"'SD DATA'!K10","v":"XXXXP0000J"},{"$f":"'SD DATA'!L10","v":"XXXXXX0678"},{"$f":"'SD DATA'!M10","v":"O+"}]
[10,null,{"$f":"'SD DATA'!A11","v":"VIJAY KUMAR PRAJAPAT"},{"$f":"'SD DATA'!B11","v":"RJNA00000000009"},{"$f":"'SD DATA'!C11","v":"RAMSUKH PRAJAPAT"},{"$f":"'SD DATA'!D11","v":"M"},{"$f":"'SD DATA'!E11","v":"1978-04-13"},{"$f":"'SD DATA'!F11","v":"Teacher (III Gr.) Level 16"},{"$f":"'SD DATA'!G11","v":"English"},{"$f":"'SD DATA'!H11","v":"2016-05-24"},{"$f":"'SD DATA'!I11","v":"VP-ALNIYAWAS BLOCK- BHERUNDA TEH-RIYAN BARI"},{"$f":"'SD DATA'!J11","v":"XXXXXXXX3655"},{"$f":"'SD DATA'!K11","v":"XXXXP0000J"},{"$f":"'SD DATA'!L11","v":"XXXXXX0679"},{"$f":"'SD DATA'!M11","v":"O+"}]
[11,null,{"$f":"'SD DATA'!A12","v":"VIJAY KUMAR PRAJAPAT"},{"$f":"'SD DATA'!B12","v":"RJNA00000000010"},{"$f":"'SD DATA'!C12","v":"RAMSUKH PRAJAPAT"},{"$f":"'SD DATA'!D12","v":"M"},{"$f":"'SD DATA'!E12","v":"1978-04-14"},{"$f":"'SD DATA'!F12","v":"Teacher (III Gr.) Level 15"},{"$f":"'SD DATA'!G12","v":"English"},{"$f":"'SD DATA'!H12","v":"2016-05-25"},{"$f":"'SD DATA'!I12","v":"VP-ALNIYAWAS BLOCK- BHERUNDA TEH-RIYAN BARI"},{"$f":"'SD DATA'!J12","v":"XXXXXXXX3656"},{"$f":"'SD DATA'!K12","v":"XXXXP0000J"},{"$f":"'SD DATA'!L12","v":"XXXXXX0680"},{"$f":"'SD DATA'!M12","v":"O+"}]
[12,null,{"$f":"'SD DATA'!A13","v":"VIJAY KUMAR PRAJAPAT"},{"$f":"'SD DATA'!B13","v":"RJNA00000000011"},{"$f":"'SD DATA'!C13","v":"RAMSUKH PRAJAPAT"},{"$f":"'SD DATA'!D13","v":"M"},{"$f":"'SD DATA'!E13","v":"1978-04-15"},{"$f":"'SD DATA'!F13","v":"Teacher (III Gr.) Level 14"},{"$f":"'SD DATA'!G13","v":"English"},{"$f":"'SD DATA'!H13","v":"2016-05-26"},{"$f":"'SD DATA'!I13","v":"VP-ALNIYAWAS BLOCK- BHERUNDA TEH-RIYAN BARI"},{"$f":"'SD DATA'!J13","v":"XXXXXXXX3657"},{"$f":"'SD DATA'!K13","v":"XXXXP0000J"},{"$f":"'SD DATA'!L13","v":"XXXXXX0681"},{"$f":"'SD DATA'!M13","v":"O+"}]
[13,null,{"$f":"'SD DATA'!A14","v":"VIJAY KUMAR PRAJAPAT"},{"$f":"'SD DATA'!B14","v":"RJNA00000000012"},{"$f":"'SD DATA'!C14","v":"RAMSUKH PRAJAPAT"},{"$f":"'SD DATA'!D14","v":"M"},{"$f":"'SD DATA'!E14","v":"1978-04-16"},{"$f":"'SD DATA'!F14","v":"Teacher (III Gr.) Level 13"},{"$f":"'SD DATA'!G14","v":"English"},{"$f":"'SD DATA'!H14","v":"2016-05-27"},{"$f":"'SD DATA'!I14","v":"VP-ALNIYAWAS BLOCK- BHERUNDA TEH-RIYAN BARI"},{"$f":"'SD DATA'!J14","v":"XXXXXXXX3658"},{"$f":"'SD DATA'!K14","v":"XXXXP0000J"},{"$f":"'SD DATA'!L14","v":"XXXXXX0682"},{"$f":"'SD DATA'!M14","v":"O+"}]
[14,null,{"$f":"'SD DATA'!A15","v":"VIJAY KUMAR PRAJAPAT"},{"$f":"'SD DATA'!B15","v":"RJNA00000000013"},{"$f":"'SD DATA'!C15","v":"RAMSUKH PRAJAPAT"},{"$f":"'SD DATA'!D15","v":"M"},{"$f":"'SD DATA'!E15","v":"1978-04-17"},{"$f":"'SD DATA'!F15","v":"Teacher (III Gr.) Level 12"},{"$f":"'SD DATA'!G15","v":"English"},{"$f":"'SD DATA'!H15","v":"2016-05-28"},{"$f":"'SD DATA'!I15","v":"VP-ALNIYAWAS BLOCK- BHERUNDA TEH-RIYAN BARI"},{"$f":"'SD DATA'!J15","v":"XXXXXXXX3659"},{"$f":"'SD DATA'!K15","v":"XXXXP0000J"},{"$f":"'SD DATA'!L15","v":"XXXXXX0683"},{"$f":"'SD DATA'!M15","v":"O+"}]
[15,null,{"$f":"'SD DATA'!A16","v":"VIJAY KUMAR PRAJAPAT"},{"$f":"'SD DATA'!B16","v":"RJNA00000000014"},{"$f":"'SD DATA'!C16","v":"RAMSUKH PRAJAPAT"},{"$f":"'SD DATA'!D16","v":"M"},{"$f":"'SD DATA'!E16","v":"1978-04-18"},{"$f":"'SD DATA'!F16","v":"Teacher (III Gr.) Level 11"},{"$f":"'SD DATA'!G16","v":"English"},{"$f":"'SD DATA'!H16","v":"2016-05-29"},{"$f":"'SD DATA'!I16","v":"VP-ALNIYAWAS BLOCK- BHERUNDA TEH-RIYAN BARI"},{"$f":"'SD DATA'!J16","v":"XXXXXXXX3660"},{"$f":"'SD DATA'!K16","v":"XXXXP0000J"},{"$f":"'SD DATA'!L16","v":"XXXXXX0684"},{"$f":"'SD DATA'!M16","v":"O+"}]
[16,null,{"$f":"'SD DATA'!A17","v":"VIJAY KUMAR PRAJAPAT"},{"$f":"'SD DATA'!B17","v":"RJNA00000000015"},{"$f":"'SD DATA'!C17","v":"RAMSUKH PRAJAPAT"},{"$f":"'SD DATA'!D17","v":"M"},{"$f":"'SD DATA'!E17","v":"1978-04-19"},{"$f":"'SD DATA'!F17","v":"Teacher (III Gr.) Level 10"},{"$f":"'SD DATA'!G17","v":"English"},{"$f":"'SD DATA'!H17","v":"2016-05-30"},{"$f":"'SD DATA'!I17","v":"VP-ALNIYAWAS BLOCK- BHERUNDA TEH-RIYAN BARI"},{"$f":"'SD DATA'!J17","v":"XXXXXXXX3661"},{"$f":"'SD DATA'!K17","v":"XXXXP0000J"},{"$f":"'SD DATA'!L17","v":"XXXXXX0685"},{"$f":"'SD DATA'!M17","v":"O+"}]
[17,null,{"$f":"'SD DATA'!A18","v":"VIJAY KUMAR PRAJAPAT"},{"$f":"'SD DATA'!B18","v":"RJNA00000000016"},{"$f":"'SD DATA'!C18","v":"RAMSUKH PRAJAPAT"},{"$f":"'SD DATA'!D18","v":"M"},{"$f":"'SD DATA'!E18","v":"1978-04-20"},{"$f":"'SD DATA'!F18","v":"Teacher (III Gr.) Level 9"},{"$f":"'SD DATA'!G18","v":"English"},{"$f":"'SD DATA'!H18","v":"2016-05-31"},{"$f":"'SD DATA'!I18","v":"VP-ALNIYAWAS BLOCK- BHERUNDA TEH-RIYAN BARI"},{"$f":"'SD DATA'!J18","v":"XXXXXXXX3662"},{"$f":"'SD DATA'!K18","v":"XXXXP0000J"},{"$f":"'SD DATA'!L18","v":"XXXXXX0686"},{"$f":"'SD DATA'!M18","v":"O+"}]
[18,null,{"$f":"'SD DATA'!A19","v":"VIJAY KUMAR PRAJAPAT"},{"$f":"'SD DATA'!B19","v":"RJNA00000000017"},{"$f":"'SD DATA'!C19","v":"RAMSUKH PRAJAPAT"},{"$f":"'SD DATA'!D19","v":"M"},{"$f":"'SD DATA'!E19","v":"1978-04-21"},{"$f":"'SD DATA'!F19","v":"Teacher (III Gr.) Level 8"},{"$f":"'SD DATA'!G19","v":"English"},{"$f":"'SD DATA'!H19","v":"2016-06-01"},{"$f":"'SD DATA'!I19","v":"VP-ALNIYAWAS BLOCK- BHERUNDA TEH-RIYAN BARI"},{"$f":"'SD DATA'!J19","v":"XXXXXXXX3663"},{"$f":"'SD DATA'!K19","v":"XXXXP0000J"},{"$f":"'SD DATA'!L19","v":"XXXXXX0687"},{"$f":"'SD DATA'!M19","v":"O+"}]
[19,null,{"$f":"'SD DATA'!A20","v":"VIJAY KUMAR PRAJAPAT"},{"$f":"'SD DATA'!B20","v":"RJNA00000000018"},{"$f":"'SD DATA'!C20","v":"RAMSUKH PRAJAPAT"},{"$f":"'SD DATA'!D20","v":"M"},{"$f":"'SD DATA'!E20","v":"1978-04-22"},{"$f":"'SD DATA'!F20","v":"Teacher (III Gr.) Level 7"},{"$f":"'SD DATA'!G20","v":"English"},{"$f":"'SD DATA'!H20","v":"2016-06-02"},{"$f":"'SD DATA'!I20","v":"VP-ALNIYAWAS BLOCK- BHERUNDA TEH-RIYAN BARI"},{"$f":"'SD DATA'!J20","v":"XXXXXXXX3664"},{"$f":"'SD DATA'!K20","v":"XXXXP0000J"},{"$f":"'SD DATA'!L20","v":"XXXXXX0688"},{"$f":"'SD DATA'!M20","v":"O+"}]
[20,null,{"$f":"'SD DATA'!A21","v":"VIJAY KUMAR PRAJAPAT"},{"$f":"'SD DATA'!B21","v":"RJNA00000000019"},{"$f":"'SD DATA'!C21","v":"RAMSUKH PRAJAPAT"},{"$f":"'SD DATA'!D21","v":"M"},{"$f":"'SD DATA'!E21","v":"1978-04-23"},{"$f":"'SD DATA'!F21","v":"Teacher (III Gr.) Level 6"},{"$f":"'SD DATA'!G21","v":"English"},{"$f":"'SD DATA'!H21","v":"2016-06-03"},{"$f":"'SD DATA'!I21","v":"VP-ALNIYAWAS BLOCK- BHERUNDA TEH-RIYAN BARI"},{"$f":"'SD DATA'!J21","v":"XXXXXXXX3665"},{"$f":"'SD DATA'!K21","v":"XXXXP0000J"},{"$f":"'SD DATA'!L21","v":"XXXXXX0689"},{"$f":"'SD DATA'!M21","v":"O+"}]
[21,null,{"$f":"'SD DATA'!A22","v":"VIJAY KUMAR PRAJAPAT"},{"$f":"'SD DATA'!B22","v":"RJNA00000000020"},{"$f":"'SD DATA'!C22","v":"RAMSUKH PRAJAPAT"},{"$f":"'SD DATA'!D22","v":"M"},{"$f":"'SD DATA'!E22","v":"1978-04-24"},{"$f":"'SD DATA'!F22","v":"Teacher (III Gr.) Level 5"},{"$f":"'SD DATA'!G22","v":"English"},{"$f":"'SD DATA'!H22","v":"2016-06-04"},{"$f":"'SD DATA'!I22","v":"VP-ALNIYAWAS BLOCK- BHERUNDA TEH-RIYAN BARI"},{"$f":"'SD DATA'!J22","v":"XXXXXXXX3666"},{"$f":"'SD DATA'!K22","v":"XXXXP0000J"},{"$f":"'SD DATA'!L22","v":"XXXXXX0690"},{"$f":"'SD DATA'!M22","v":"O+"}]
[22,null,{"$f":"'SD DATA'!A23","v":"VIJAY KUMAR PRAJAPAT"},{"$f":"'SD DATA'!B23","v":"RJNA00000000021"},{"$f":"'SD DATA'!C23","v":"RAMSUKH PRAJAPAT"},{"$f":"'SD DATA'!D23","v":"M"},{"$f":"'SD DATA'!E23","v":"1978-04-25"},{"$f":"'SD DATA'!F23","v":"Teacher (III Gr.) Level 4"},{"$f":"'SD DATA'!G23","v":"English"},{"$f":"'SD DATA'!H23","v":"2016-06-05"},{"$f":"'SD DATA'!I23","v":"VP-ALNIYAWAS BLOCK- BHERUNDA TEH-RIYAN BARI"},{"$f":"'SD DATA'!J23","v":"XXXXXXXX3667"},{"$f":"'SD DATA'!K23","v":"XXXXP0000J"},{"$f":"'SD DATA'!L23","v":"XXXXXX0691"},{"$f":"'SD DATA'!M23","v":"O+"}]
[23,null,{"$f":"'SD DATA'!A24","v":"VIJAY KUMAR PRAJAPAT"},{"$f":"'SD DATA'!B24","v":"RJNA00000000022"},{"$f":"'SD DATA'!C24","v":"RAMSUKH PRAJAPAT"},{"$f":"'SD DATA'!D24","v":"M"},{"$f":"'SD DATA'!E24","v":"1978-04-26"},{"$f":"'SD DATA'!F24","v":"Teacher (III Gr.) Level 3"},{"$f":"'SD DATA'!G24","v":"English"},{"$f":"'SD DATA'!H24","v":"2016-06-06"},{"$f":"'SD DATA'!I24","v":"VP-ALNIYAWAS BLOCK- BHERUNDA TEH-RIYAN BARI"},{"$f":"'SD DATA'!J24","v":"XXXXXXXX3668"},{"$f":"'SD DATA'!K24","v":"XXXXP0000J"},{"$f":"'SD DATA'!L24","v":"XXXXXX0692"},{"$f":"'SD DATA'!M24","v":"O+"}]
[24,null,{"$f":"'SD DATA'!A25","v":"VIJAY KUMAR PRAJAPAT"},{"$f":"'SD DATA'!B25","v":"RJNA00000000023"},{"$f":"'SD DATA'!C25","v":"RAMSUKH PRAJAPAT"},{"$f":"'SD DATA'!D25","v":"M"},{"$f":"'SD DATA'!E25","v":"1978-04-27"},{"$f":"'SD DATA'!F25","v":"Teacher (III Gr.) Level 2"},{"$f":"'SD DATA'!G25","v":"English"},{"$f":"'SD DATA'!H25","v":"2016-06-07"},{"$f":"'SD DATA'!I25","v":"VP-ALNIYAWAS BLOCK- BHERUNDA TEH-RIYAN BARI"},{"$f":"'SD DATA'!J25","v":"XXXXXXXX3669"},{"$f":"'SD DATA'!K25","v":"XXXXP0000J"},{"$f":"'SD DATA'!L25","v":"XXXXXX0693"},{"$f":"'SD DATA'!M25","v":"O+"}]
[25,null,{"$f":"'SD DATA'!A26","v":"VIJAY KUMAR PRAJAPAT"},{"$f":"'SD DATA'!B26","v":"RJNA00000000024"},{"$f":"'SD DATA'!C26","v":"RAMSUKH PRAJAPAT"},{"$f":"'SD DATA'!D26","v":"M"},{"$f":"'SD DATA'!E26","v":"1978-04-28"},{"$f":"'SD DATA'!F26","v":"Teacher (III Gr.) Level 1"},{"$f":"'SD DATA'!G26","v":"English"},{"$f":"'SD DATA'!H26","v":"2016-06-08"},{"$f":"'SD DATA'!I26","v":"VP-ALNIYAWAS BLOCK- BHERUNDA TEH-RIYAN BARI"},{"$f":"'SD DATA'!J26","v":"XXXXXXXX3670"},{"$f":"'SD DATA'!K26","v":"XXXXP0000J"},{"$f":"'SD DATA'!L26","v":"XXXXXX0694"},{"$f":"'SD DATA'!M26","v":"O+"}]
[26,null,{"$f":"'SD DATA'!A27","v":"VIJAY KUMAR PRAJAPAT"},{"$f":"'SD DATA'!B27","v":"RJNA00000000025"},{"$f":"'SD DATA'!C27","v":"RAMSUKH PRAJAPAT"},{"$f":"'SD DATA'!D27","v":"M"},{"$f":"'SD DATA'!E27","v":"1978-04-29"},{"$f":"'SD DATA'!F27","v":"Teacher (III Gr.) Level 0"},{"$f":"'SD DATA'!G27","v":"English"},{"$f":"'SD DATA'!H27","v":"2016-06-09"},{"$f":"'SD DATA'!I27","v":"VP-ALNIYAWAS BLOCK- BHERUNDA TEH-RIYAN BARI"},{"$f":"'SD DATA'!J27","v":"XXXXXXXX3671"},{"$f":"'SD DATA'!K27","v":"XXXXP0000J"},{"$f":"'SD DATA'!L27","v":"XXXXXX0695"},{"$f":"'SD DATA'!M27","v":"O+"}]
[27,null,{"$f":"'SD DATA'!A28","v":"VIJAY KUMAR PRAJAPAT"},{"$f":"'SD DATA'!B28","v":"RJNA00000000026"},{"$f":"'SD DATA'!C28","v":"RAMSUKH PRAJAPAT"},{"$f":"'SD DATA'!D28","v":"M"},{"$f":"'SD DATA'!E28","v":"1978-04-30"},{"$f":"'SD DATA'!F28","v":"Teacher (III Gr.) Level 1"},{"$f":"'SD DATA'!G28","v":"English"},{"$f":"'SD DATA'!H28","v":"2016-06-10"},{"$f":"'SD DATA'!I28","v":"VP-ALNIYAWAS BLOCK- BHERUNDA TEH-RIYAN BARI"},{"$f":"'SD DATA'!J28","v":"XXXXXXXX3672"},{"$f":"'SD DATA'!K28","v":"XXXXP0000J"},{"$f":"'SD DATA'!L28","v":"XXXXXX0696"},{"$f":"'SD DATA'!M28","v":"O+"}]
[28,null,{"$f":"'SD DATA'!A29","v":"VIJAY KUMAR PRAJAPAT"},{"$f":"'SD DATA'!B29","v":"RJNA00000000027"},{"$f":"'SD DATA'!C29","v":"RAMSUKH PRAJAPAT"},{"$f":"'SD DATA'!D29","v":"M"},{"$f":"'SD DATA'!E29","v":"1978-05-01"},{"$f":"'SD DATA'!F29","v":"Teacher (III Gr.) Level 2"},{"$f":"'SD DATA'!G29","v":"English"},{"$f":"'SD DATA'!H29","v":"2016-06-11"},{"$f":"'SD DATA'!I29","v":"VP-ALNIYAWAS BLOCK- BHERUNDA TEH-RIYAN BARI"},{"$f":"'SD DATA'!J29","v":"XXXXXXXX3673"},{"$f":"'SD DATA'!K29","v":"XXXXP0000J"},{"$f":"'SD DATA'!L29","v":"XXXXXX0697"},{"$f":"'SD DATA'!M29","v":"O+"}]
[29,null,{"$f":"'SD DATA'!A30","v":0},{"$f":"'SD DATA'!B30","v":0},{"$f":"'SD DATA'!C30","v":0},{"$f":"'SD DATA'!D30","v":0},{"$f":"'SD DATA'!E30","v":"00:00:00"},{"$f":"'SD DATA'!F30","v":0},{"$f":"'SD DATA'!G30","v":0},{"$f":"'SD DATA'!H30","v":"00:00:00"},{"$f":"'SD DATA'!I30","v":0},{"$f":"'SD DATA'!J30","v":0},{"$f":"'SD DATA'!K30","v":0},{"$f":"'SD DATA'!L30","v":0},{"$f":"'SD DATA'!M30","v":0}]
[30,null,{"$f":"'SD DATA'!A31","v":0},{"$f":"'SD DATA'!B31","v":0},{"$f":"'SD DATA'!C31","v":0},{"$f":"'SD DATA'!D31","v":0},{"$f":"'SD DATA'!E31","v":"00:00:00"},{"$f":"'SD DATA'!F31","v":0},{"$f":"'SD DATA'!G31","v":0},{"$f":"'SD DATA'!H31","v":"00:00:00"},{"$f":"'SD DATA'!I31","v":0},{"$f":"'SD DATA'!J31","v":0},{"$f":"'SD DATA'!K31","v":0},{"$f":"'SD DATA'!L31","v":0},{"$f":"'SD DATA'!M31","v":0}]
[31,null,{"$f":"'SD DATA'!A32","v":0},{"$f":"'SD DATA'!B32","v":0},{"$f":"'SD DATA'!C32","v":0},{"$f":"'SD DATA'!D32","v":0},{"$f":"'SD DATA'!E32","v":"00:00:00"},{"$f":"'SD DATA'!F32","v":0},{"$f":"'SD DATA'!G32","v":0},{"$f":"'SD DATA'!H32","v":"00:00:00"},{"$f":"'SD DATA'!I32","v":0},{"$f":"'SD DATA'!J32","v":0},{"$f":"'SD DATA'!K32","v":0},{"$f":"'SD DATA'!L32","v":0},{"$f":"'SD DATA'!M32","v":0}]
[32,null,{"$f":"'SD DATA'!A33","v":0},{"$f":"'SD DATA'!B33","v":0},{"$f":"'SD DATA'!C33","v":0},{"$f":"'SD DATA'!D33","v":0},{"$f":"'SD DATA'!E33","v":"00:00:00"},{"$f":"'SD DATA'!F33","v":0},{"$f":"'SD DATA'!G33","v":0},{"$f":"'SD DATA'!H33","v":"00:00:00"},{"$f":"'SD DATA'!I33","v":0},{"$f":"'SD DATA'!J33","v":0},{"$f":"'SD DATA'!K33","v":0},{"$f":"'SD DATA'!L33","v":0},{"$f":"'SD DATA'!M33","v":0}]
[33,null,{"$f":"'SD DATA'!A34","v":0},{"$f":"'SD DATA'!B34","v":0},{"$f":"'SD DATA'!C34","v":0},{"$f":"'SD DATA'!D34","v":0},{"$f":"'SD DATA'!E34","v":"00:00:00"},{"$f":"'SD DATA'!F34","v":0},{"$f":"'SD DATA'!G34","v":0},{"$f":"'SD DATA'!H34","v":"00:00:00"},{"$f":"'SD DATA'!I34","v":0},{"$f":"'SD DATA'!J34","v":0},{"$f":"'SD DATA'!K34","v":0},{"$f":"'SD DATA'!L34","v":0},{"$f":"'SD DATA'!M34","v":0}]
[34,null,{"$f":"'SD DATA'!A35","v":0},{"$f":"'SD DATA'!B35","v":0},{"$f":"'SD DATA'!C35","v":0},{"$f":"'SD DATA'!D35","v":0},{"$f":"'SD DATA'!E35","v":"00:00:00"},{"$f":"'SD DATA'!F35","v":0},{"$f":"'SD DATA'!G35","v":0},{"$f":"'SD DATA'!H35","v":"00:00:00"},{"$f":"'SD DATA'!I35","v":0},{"$f":"'SD DATA'!J35","v":0},{"$f":"'SD DATA'!K35","v":0},{"$f":"'SD DATA'!L35","v":0},{"$f":"'SD DATA'!M35","v":0}]
[35,null,{"$f":"'SD DATA'!A36","v":0},{"$f":"'SD DATA'!B36","v":0},{"$f":"'SD DATA'!C36","v":0},{"$f":"'SD DATA'!D36","v":0},{"$f":"'SD DATA'!E36","v":"00:00:00"},{"$f":"'SD DATA'!F36","v":0},{"$f":"'SD DATA'!G36","v":0},{"$f":"'SD DATA'!H36","v":"00:00:00"},{"$f":"'SD DATA'!I36","v":0},{"$f":"'SD DATA'!J36","v":0},{"$f":"'SD DATA'!K36","v":0},{"$f":"'SD DATA'!L36","v":0},{"$f":"'SD DATA'!M36","v":0}]
[36,null,{"$f":"'SD DATA'!A37","v":0},{"$f":"'SD DATA'!B37","v":0},{"$f":"'SD DATA'!C37","v":0},{"$f":"'SD DATA'!D37","v":0},{"$f":"'SD DATA'!E37","v":"00:00:00"},{"$f":"'SD DATA'!F37","v":0},{"$f":"'SD DATA'!G37","v":0},{"$f":"'SD DATA'!H37","v":"00:00:00"},{"$f":"'SD DATA'!I37","v":0},{"$f":"'SD DATA'!J37","v":0},{"$f":"'SD DATA'!K37","v":0},{"$f":"'SD DATA'!L37","v":0},{"$f":"'SD DATA'!M37","v":0}]
[37,null,{"$f":"'SD DATA'!A38","v":0},{"$f":"'SD DATA'!B38","v":0},{"$f":"'SD DATA'!C38","v":0},{"$f":"'SD DATA'!D38","v":0},{"$f":"'SD DATA'!E38","v":"00:00:00"},{"$f":"'SD DATA'!F38","v":0},{"$f":"'SD DATA'!G38","v":0},{"$f":"'SD DATA'!H38","v":"00:00:00"},{"$f":"'SD DATA'!I38","v":0},{"$f":"'SD DATA'!J38","v":0},{"$f":"'SD DATA'!K38","v":0},{"$f":"'SD DATA'!L38","v":0},{"$f":"'SD DATA'!M38","v":0}]
[38,null,{"$f":"'SD DATA'!A39","v":0},{"$f":"'SD DATA'!B39","v":0},{"$f":"'SD DATA'!C39","v":0},{"$f":"'SD DATA'!D39","v":0},{"$f":"'SD DATA'!E39","v":"00:00:00"},{"$f":"'SD DATA'!F39","v":0},{"$f":"'SD DATA'!G39","v":0},{"$f":"'SD DATA'!H39","v":"00:00:00"},{"$f":"'SD DATA'!I39","v":0},{"$f":"'SD DATA'!J39","v":0},{"$f":"'SD DATA'!K39","v":0},{"$f":"'SD DATA'!L39","v":0},{"$f":"'SD DATA'!M39","v":0}]
[39,null,{"$f":"'SD DATA'!A40","v":0},{"$f":"'SD DATA'!B40","v":0},{"$f":"'SD DATA'!C40","v":0},{"$f":"'SD DATA'!D40","v":0},{"$f":"'SD DATA'!E40","v":"00:00:00"},{"$f":"'SD DATA'!F40","v":0},{"$f":"'SD DATA'!G40","v":0},{"$f":"'SD DATA'!H40","v":"00:00:00"},{"$f":"'SD DATA'!I40","v":0},{"$f":"'SD DATA'!J40","v":0},{"$f":"'SD DATA'!K40","v":0},{"$f":"'SD DATA'!L40","v":0},{"$f":"'SD DATA'!M40","v":0}]
[40,null,{"$f":"'SD DATA'!A41","v":0},{"$f":"'SD DATA'!B41","v":0},{"$f":"'SD DATA'!C41","v":0},{"$f":"'SD DATA'!D41","v":0},{"$f":"'SD DATA'!E41","v":"00:00:00"},{"$f":"'SD DATA'!F41","v":0},{"$f":"'SD DATA'!G41","v":0},{"$f":"'SD DATA'!H41","v":"00:00:00"},{"$f":"'SD DATA'!I41","v":0},{"$f":"'SD DATA'!J41","v":0},{"$f":"'SD DATA'!K41","v":0},{"$f":"'SD DATA'!L41","v":0},{"$f":"'SD DATA'!M41","v":0}]
[41,null,{"$f":"'SD DATA'!A42","v":0},{"$f":"'SD DATA'!B42","v":0},{"$f":"'SD DATA'!C42","v":0},{"$f":"'SD DATA'!D42","v":0},{"$f":"'SD DATA'!E42","v":"00:00:00"},{"$f":"'SD DATA'!F42","v":0},{"$f":"'SD DATA'!G42","v":0},{"$f":"'SD DATA'!H42","v":"00:00:00"},{"$f":"'SD DATA'!I42","v":0},{"$f":"'SD DATA'!J42","v":0},{"$f":"'SD DATA'!K42","v":0},{"$f":"'SD DATA'!L42","v":0},{"$f":"'SD DATA'!M42","v":0}]

{"sheet":"icard","index":3,"n_rows":34,"n_cols":17,"rows_kept":34,"merged":[[1,1,1,6],[1,8,1,13],[2,2,2,5],[2,9,2,12],[4,3,5,4],[4,10,5,11],[6,2,6,4],[6,5,13,6],[6,9,6,11],[6,12,13,13],[7,2,7,4],[7,9,7,11],[7,16,16,23],[8,2,8,4],[8,9,8,11],[9,2,9,4],[9,9,9,11],[10,2,10,4],[10,9,10,11],[11,2,13,4],[11,9,13,11],[12,1,13,1],[12,8,13,8],[14,2,14,3],[14,4,15,6],[14,9,14,10],[14,11,15,13],[15,2,15,3],[15,9,15,10],[19,1,19,6],[19,8,19,13],[20,2,20,5],[20,9,20,12],[22,3,23,4],[22,10,23,11],[24,2,24,4],[24,5,31,6],[24,9,24,11],[24,12,31,13],[25,2,25,4],[25,9,25,11],[26,2,26,4],[26,9,26,11],[27,2,27,4],[27,9,27,11],[28,2,28,4],[28,9,28,11],[29,2,31,4],[29,9,31,11],[30,1,31,1],[30,8,31,8],[32,2,32,3],[32,4,33,6],[32,9,32,10],[32,11,33,13],[33,2,33,3],[33,9,33,10]]}
[]
[null,{"$f":"info!G30","v":" jktdh; mPp ek/;fed fo|ky; vkyfu;kokl ftyk &ukXkkSj"},{"$nulls":6},{"$f":"B2","v":" jktdh; mPp ek/;fed fo|ky; vkyfu;kokl ftyk &ukXkkSj"}]
[null,null,"l= 2020&21",{"$nulls":6},"l= 2020&21"]
[]
[]
[null,"vuqdzekad",3,null,null,"CyM xzqi",{"$f":"VLOOKUP(C6,'Teacher Data'!$A$3:$O$33,15,0)","v":"O+"},null,"vuqdzekad",1,null,null,"CyM xzqi",{"$f":"VLOOKUP(J6,'Teacher Data'!$A$3:$O$33,15,0)","v":"O+"}]
[null,"deZpkjh vkbZMh",{"$f":"VLOOKUP(C$6,'Teacher Data'!A$1:O$33,4,0)","v":"RJNA00000000002"},{"$nulls":5},"deZpkjh vkbZMh",{"$f":"VLOOKUP($J$6,'Teacher Data'!$A$3:$O$33,4,0)","v":"RJNA00000000000"},null,null,{"$f":"IF(J6,manjeet)","v":{"$error":"#NAME?"}}]
[null,"uke dEkZpkjh",{"$f":"VLOOKUP(C$6,'Teacher Data'!A$1:O$33,3,0)","v":"VIJAY KUMAR PRAJAPAT"},{"$nulls":5},"uke dEkZpkjh",{"$f":"VLOOKUP($J$6,'Teacher Data'!$A$3:$O$33,3,0)","v":"VIJAY KUMAR PRAJAPAT"},{"$nulls":6},";g izksxzke fo|ky; ds v/;kidks ds igpku i= ds fy;s cuk;k x;k gSAtks izR;sd fo|ky; ds fy;s mi;ksxh lkfcr gksxk blh vk'kk ds lkFk vkidk Lusg ,ao I;kj feyrk jgS                                    vkidk fot; dqekj iztkir v/;kid jkmekfo vkyfu;kokl ftyk ukxkSj eksckbZy uEcj 9828120697"]
[null,"firk dk uke",{"$f":"VLOOKUP(C$6,'Teacher Data'!A$1:O$33,5,0)","v":"RAMSUKH PRAJAPAT"},{"$nulls":5},"firk dk uke",{"$f":"VLOOKUP($J$6,'Teacher Data'!$A$3:$O$33,5,0)","v":"RAMSUKH PRAJAPAT"}]
[null,"in",{"$f":"VLOOKUP(C$6,'Teacher Data'!A$1:O$33,8,0)","v":"Teacher (III Gr.) Level 23"},{"$nulls":5},"in",{"$f":"VLOOKUP($J$6,'Teacher Data'!$A$3:$O$33,8,0)","v":"Teacher (III Gr.) Level 25"}]
[null,"tUefnukad",{"$f":"VLOOKUP(C$6,'Teacher Data'!A$1:O$33,7,0)","v":"1978-04-06"},{"$nulls":5},"tUefnukad",{"$f":"VLOOKUP($J$6,'Teacher Data'!$A$3:$O$33,7,0)","v":"1978-04-04"}]
[null,"irk",{"$f":"VLOOKUP(C$6,'Teacher Data'!A$1:O$33,11,0)","v":"VP-ALNIYAWAS BLOCK- BHERUNDA TEH-RIYAN BARI"},{"$nulls":5},"irk",{"$f":"VLOOKUP($J$6,'Teacher Data'!$A$3:$O$33,11,0)","v":"VP-ALNIYAWAS BLOCK- BHERUNDA TEH-RIYAN BARI"}]
[]
[]
[null,"eksckbZy",{"$f":"VLOOKUP($C$6,'Teacher Data'!$A$3:$O$33,14,0)","v":"XXXXXX0672"},null,"laLFkk iz/kku",{"$nulls":3},"eksckbZy",{"$f":"VLOOKUP($J$6,'Teacher Data'!$A$3:$O$33,14,0)","v":"XXXXXX0670"},null,{"$f":"E15","v":"laLFkk iz/kku"}]
[null,"isu UkEcj",{"$f":"VLOOKUP($C$6,'Teacher Data'!$A$3:$O$33,13,0)","v":"XXXXP0000J"},{"$nulls":5},"isu UkEcj",{"$f":"VLOOKUP($J$6,'Teacher Data'!$A$3:$O$33,13,0)","v":"XXXXP0000J"}]
[]
[]
[]
[null,{"$f":"B2","v":" jktdh; mPp ek/;fed fo|ky; vkyfu;kokl ftyk &ukXkkSj"},{"$nulls":6},{"$f":"B2","v":" jktdh; mPp ek/;fed fo|ky; vkyfu;kokl ftyk &ukXkkSj"}]
[null,null,"l= 2020&21",{"$nulls":6},"l= 2020&21"]
[]
[]
[null,"vuqdzekad",1,null,null,"CyM xzqi",{"$f":"VLOOKUP(C24,'Teacher Data'!$A$3:$O$33,15,0)","v":"O+"},null,"vuqdzekad",1,null,null,"CyM xzqi",{"$f":"VLOOKUP(J24,'Teacher Data'!$A$3:$O$33,15,0)","v":"O+"}]
[null,"deZpkjh vkbZMh",{"$f":"VLOOKUP($C$24,'Teacher Data'!A$1:O$33,4,0)","v":"RJNA00000000000"},null,null,{"$f":"IF(C24,manjeet)","v":{"$error":"#NAME?"}},null,null,"deZpkjh vkbZMh",{"$f":"VLOOKUP(J24,'Teacher Data'!$A$3:$O$33,4,0)","v":"RJNA00000000000"},null,null,{"$f":"IF(J24,manjeet)","v":{"$error":"#NAME?"}}]
[null,"uke dEkZpkjh",{"$f":"VLOOKUP($C$24,'Teacher Data'!A$1:O$33,3,0)","v":"VIJAY KUMAR PRAJAPAT"},{"$nulls":5},"uke dEkZpkjh",{"$f":"VLOOKUP(J24,'Teacher Data'!$A$3:$O$33,3,0)","v":"VIJAY KUMAR PRAJAPAT"}]
[null,"firk dk uke",{"$f":"VLOOKUP($C$24,'Teacher Data'!A$1:O$33,5,0)","v":"RAMSUKH PRAJAPAT"},{"$nulls":5},"firk dk uke",{"$f":"VLOOKUP(J24,'Teacher Data'!$A$3:$O$33,5,0)","v":"RAMSUKH PRAJAPAT"}]
[null,"in",{"$f":"VLOOKUP($C$24,'Teacher Data'!A$1:O$33,8,0)","v":"Teacher (III Gr.) Level 25"},{"$nulls":5},"in",{"$f":"VLOOKUP(J24,'Teacher Data'!$A$3:$O$33,8,0)","v":"Teacher (III Gr.) Level 25"}]
[null,"tUefnukad",{"$f":"VLOOKUP($C$24,'Teacher Data'!A$1:O$33,7,0)","v":"1978-04-04"},{"$nulls":5},"tUefnukad",{"$f":"VLOOKUP(J24,'Teacher Data'!$A$3:$O$33,7,0)","v":"1978-04-04"}]
[null,"irk",{"$f":"VLOOKUP(C24,'Teacher Data'!A$1:O$33,11,0)","v":"VP-ALNIYAWAS BLOCK- BHERUNDA TEH-RIYAN BARI"},{"$nulls":5},"irk",{"$f":"VLOOKUP(J24,'Teacher Data'!$A$3:$O$33,11,0)","v":"VP-ALNIYAWAS BLOCK- BHERUNDA TEH-RIYAN BARI"}]
[]
[]
[null,"eksckbZy",{"$f":"VLOOKUP(C24,'Teacher Data'!$A$3:$O$33,14,0)","v":"XXXXXX0670"},null,{"$f":"E15","v":"laLFkk iz/kku"},{"$nulls":3},"eksckbZy",{"$f":"VLOOKUP(J24,'Teacher Data'!$A$3:$O$33,14,0)","v":"XXXXXX0670"},null,{"$f":"L15","v":"laLFkk iz/kku"}]
[null,"isu UkEcj",{"$f":"VLOOKUP(C24,'Teacher Data'!$A$3:$O$33,13,0)","v":"XXXXP0000J"},{"$nulls":5},"isu UkEcj",{"$f":"VLOOKUP(J24,'Teacher Data'!$A$3:$O$33,13,0)","v":"XXXXP0000J"}]