{"text_format":"3","workbook":"xlsx","n_sheets":6,"sheets":["INFO","MASTER","SITTING PLAN","SITTING ROOM","AC ROLL FOR BANK","Sheet1"],"not_rendered":{"images":3,"defined_names":6,"comments":2},"read":"whole","date_system":"1900"}

{"sheet":"INFO","index":0,"n_rows":30,"n_cols":25,"rows_kept":30,"merged":[[0,1,0,23],[0,24,0,28],[1,1,1,23],[1,24,7,28],[2,0,2,23],[3,1,3,23],[4,1,4,23],[5,1,5,23],[6,1,6,23],[7,1,7,23],[8,1,8,23],[9,1,9,23],[10,1,10,23],[11,1,11,23],[11,24,21,32],[12,1,12,23],[13,0,13,4],[13,5,13,9],[13,10,13,14],[13,15,13,20],[13,21,13,23],[14,1,14,23],[15,1,15,23],[16,1,16,23],[17,0,17,23],[18,1,18,23],[19,0,19,23],[20,1,20,23],[21,0,21,23],[22,1,22,23],[22,24,24,32],[23,0,23,23],[24,0,28,2],[24,3,24,6],[24,7,24,9],[24,10,24,15],[24,16,24,20],[25,3,28,23],[29,0,30,5],[29,6,30,23]]}
[null,"FULLY AUTOMATIC ALL EXAMS SITTING PLAN में आपका स्वागत है I",{"$nulls":22},"jk/kkLokeh "]
[null,"सभी गुरुजनों को SMART TEACHER बनाने के लिए समर्पित"]
["INSTRUCTIONS FOR FULLY AUTOMATIC SITTING PLAN"]
[1,"यह प्रोग्राम सभी प्रकार की परीक्षाओं हेतु बैठक व्यवस्था के लिए तैयार किया गया है "]
[2,"इस प्रोग्राम में आप mater data sheet में pink shell में entry करे I"]
[3,"sitting plan sheet में सर्वप्रथम विषय,परीक्षा कक्ष क्रमांक,विद्यालय का चयन,प्रत्येक कक्ष में पंक्तिवर विद्यार्थियों का चयन यानि grey shell में entry करे"]
[4,"sitting room sheet में केवल परीक्षा कक्ष का चुनाव करे ,एंव यदि पांचवी पंक्ति में विद्यार्थी एक ही विद्यालय के तो मैन्युअल बदले !"]
[5,"AC ROLL FOR BANK SHEET में परीक्षा में ड्यूटी में लगे कर्मचारियों का भुगतान पत्र बना सकते हें !"]
[6,"आशा है की यह प्रोग्राम आपके लिए उपयोगी साबित होगा इसी आशा के साथ मेरे नए प्रोग्राम EXCEL DICTIONARY का इंतजार करे-------------------"]
[7]
[8]
[9]
[10]
["घर पर रहे,मास्क का प्रयोग करे",{"$nulls":4},"nksLrks vf/kd tkudkjh gsrq esjk ;wV;wc psuy ns[ks vkSj ykbd vkSj lCldzkbc t#j djs rkfd vkus okyk izksxke vki rd igWqp ldsA ",{"$nulls":9},"https://youtu.be/3yHQVnwH1W0",{"$nulls":5},"Like subscribe t#j djs"]
[1,"OLD TAX REGIME  sheet  esa gkml yksu C;kt ,ao vU; vk; rFkk Chapter VI A Deduction dh jkf'k dk bUnzkt djs tks lsy vuykWd gSA"]
{"$rows_left_out":16}
{"sheet":"MASTER","index":1,"n_rows":74,"n_cols":22,"rows_kept":74,"merged":[[1,1,1,2],[1,3,1,10],[2,1,2,2],[2,3,2,6],[2,7,2,8],[2,9,2,10],[3,1,3,2],[3,3,3,6],[3,7,3,8],[3,9,3,10],[4,1,4,2],[4,3,4,6],[4,7,4,8],[4,9,4,10],[5,1,5,2],[5,3,5,6],[5,7,5,8],[5,9,5,10],[6,1,6,2],[6,3,6,5],[6,7,6,8],[6,9,6,10],[7,3,7,6],[7,8,7,9],[8,3,8,4],[8,8,8,9],[9,3,9,4],[9,8,9,9],[10,3,10,4],[10,8,10,9],[11,3,11,4],[11,8,11,9],[12,3,12,4],[12,8,12,9],[13,3,13,4],[13,8,13,9],[14,3,14,4],[14,8,14,9],[15,1,15,6],[15,8,15,9]]}
[]
[null,"परीक्षा केन्द्र का नाम",null,"jktdh; mPp ek/;fed fo|ky; vkyfu;kokl ftyk& ukXkkSj"]
[null,"केन्द्राध्यक्ष का नाम",null,"DINESH KUMAR OJHA",{"$nulls":3},"मोबाईल नम्बर",null,0]
[null,"उपकेन्द्राध्यक्ष का नाम",null,"VIJAY KUMAR PRAJAPAT",{"$nulls":3},"मोबाईल नम्बर",null,1,{"$nulls":11},"हिंदी"]
[null,"बोर्ड/स्थानीय परीक्षाप्रभारी का नाम",null,"RAMNIWAS",{"$nulls":3},"मोबाईल नम्बर",null,2,{"$nulls":7},"उच्च माध्यमिक परीक्षा",{"$nulls":3},"हिंदी अनिवार्य"]
[null,"बोर्ड परीक्षा केंद्र क्रमांक",null,119050,{"$nulls":3},"विषय",null,"राजनैतिक विज्ञान",{"$nulls":7},"माध्यमिक परीक्षा",{"$nulls":3},"हिंदी साहित्य"]
[null,"परीक्षा का प्रकार व वर्ष",null,"उच्च माध्यमिक परीक्षा",null,null,2021,"दिनांक",null,"2022-05-25",{"$nulls":7},"प्रारंभिक पूर्णता परीक्षा",{"$nulls":3},"ENGLISH"]
[null,"क्र-सं-","विद्यालय का कोड या नाम","विद्यालयवार अनुक्रमांक",{"$nulls":3},"योग","विद्यालय का बोर्ड क्रमांक",{"$nulls":12},"ENGLISH COMPULSARY"]
[null,1,"GSSS ALNIYAWAS1",100,null,"से",180,{"$f":"IF(O9>0,O9+1,0)","v":81},119050,{"$nulls":5},{"$f":"G9-D9","v":80},null,null,"स्थानीय परीक्षा",{"$nulls":3},"ENGLISH LITERATURE"]
[null,2,"GSSS KOD",200,null,"से",240,{"$f":"IF(O10>0,O10+1,0)","v":41},119051,{"$nulls":5},{"$f":"G10-D10","v":40},{"$nulls":6},"इतिहास"]
[null,3,"GSSS LADPURA",300,null,"से",330,{"$f":"IF(O11>0,O11+1,0)","v":31},119052,{"$nulls":5},30,null,null,"BOARD EXAM ",2021,null,null,"राजनैतिक विज्ञान"]
[null,4,"GSSS BIJATHAL",400,null,"से",435,{"$f":"IF(O12>0,O12+1,0)","v":36},119053,{"$nulls":5},35,null,null,"LOCAL EXAM",2022,null,null,"भूगोल"]
[null,5,"SHAKBHARI",500,null,"से",515,16,119054,{"$nulls":5},15,{"$nulls":3},2023,null,null,"अर्थशास्त्र"]
[null,6,null,0,null,"से",0,0,119055,{"$nulls":5},0,{"$nulls":3},2024,null,null,"संस्कृत"]
[null,7,null,0,null,"से",0,0,119056,{"$nulls":5},0,{"$nulls":3},2025,null,null,"भोतिक विज्ञानं"]
{"$rows_left_out":36}
{"sheet":"SITTING PLAN","index":2,"n_rows":88,"n_cols":27,"rows_kept":88,"merged":[[1,1,1,2],[1,3,1,10],[2,4,2,5],[2,8,2,9],[3,1,3,6],[3,8,3,9],[4,4,4,5],[4,6,4,10],[5,5,5,6],[6,5,6,6],[7,4,7,6],[8,1,12,1],[8,9,12,9],[8,10,12,10],[8,11,12,11],[13,1,17,1],[13,9,17,9],[13,10,17,10],[13,11,17,11],[18,1,22,1],[18,9,22,9],[18,10,22,10],[18,11,22,11],[23,1,27,1],[23,9,27,9],[23,10,27,10],[23,11,27,11],[28,1,32,1],[28,9,32,9],[28,10,32,10],[28,11,32,11],[33,1,37,1],[33,9,37,9],[33,10,37,10],[33,11,37,11],[38,1,42,1],[38,9,42,9],[38,10,42,10],[38,11,42,11],[43,1,47,1],[43,9,47,9],[43,10,47,10],[43,11,47,11],[48,1,52,1],[48,9,52,9],[48,10,52,10],[48,11,52,11],[53,1,57,1],[53,9,57,9],[53,10,57,10],[53,11,57,11],[58,1,62,1],[58,9,62,9],[58,10,62,10],[58,11,62,11],[63,1,67,1],[63,9,67,9],[63,10,67,10],[63,11,67,11],[68,1,72,1],[68,9,72,9],[68,10,72,10],[68,11,72,11],[73,1,77,1],[73,9,77,9],[73,10,77,10],[73,11,77,11],[78,1,82,1],[78,9,82,9],[78,10,82,10],[78,11,82,11],[83,1,87,1],[83,9,87,9],[83,10,87,10],[83,11,87,11]]}
[]
[null,{"$f":"MASTER!B2","v":"परीक्षा केन्द्र का नाम"},null,{"$f":"MASTER!D2","v":"jktdh; mPp ek/;fed fo|ky; vkyfu;kokl ftyk& ukXkkSj"}]
[{"$nulls":3},{"$f":"MASTER!D7","v":"उच्च माध्यमिक परीक्षा"},{"$f":"MASTER!G7","v":2021},{"$nulls":3},"कुल परीक्षार्थी",null,{"$f":"MASTER!H16","v":205}]
[null,"समेकित परीक्षा कक्षवार बैठक व्यवस्था चार्ट",{"$nulls":6},"कुल वीक्षक",null,{"$f":"SUM(L9:L83)","v":9}]
[null,"दिनांक",{"$f":"MASTER!J7","v":"2022-05-25"},null,"विषय",null,{"$f":"MASTER!J6","v":"राजनैतिक विज्ञान"}]
[null,"केन्द्राधीक्षक",1,"परीक्षा प्रभारी",1,"सुपर वाईजर",null,null,{"$f":"IF(K4<=6,1,IF(K4<=12,2,3))","v":2}]
[null,"उपकेन्द्राधीक्षक",1,"पेपर को ऑर्डिनेटर",1,"कुल वीक्षक",null,null,{"$f":"K4","v":9}]
[null,"परीक्षा कक्ष क्रमांक","विद्यालय का चुनाव यहाँ से करे","विद्यालय का नाम","विद्यालयवार अनुक्रमांक",null,null,"IF NSO","पंक्तिवार परीक्षार्थी की संख्या","कुल परीक्षार्थी की संख्या कक्षावार ","कुल परीक्षार्थी की संख्या ","वीक्षक संख्या",{"$nulls":3},"HALL 1",1,{"$f":"MASTER!C9","v":"GSSS ALNIYAWAS1"},{"$f":"MASTER!D9","v":100},{"$f":"MASTER!G9","v":180},{"$f":"MASTER!H9","v":81},null,"हिंदी"]
[null,"HALL 1",1,{"$f":"IF($C9=1,$R$8,IF($C9=2,$R$9,IF($C9=3,$R$10,IF($C9=4,$R$11,IF($C9=5,$R$12,IF($C9=6,$R$13,IF($C9=7,$R$14,\" \")))))))","v":"GSSS ALNIYAWAS1"},{"$f":"IF($D9=MASTER!$C$9,MASTER!$D$9,IF($D9=MASTER!$C$10,MASTER!$D$10,IF($D9=MASTER!$C$11,MASTER!$D$11,IF($D9=MASTER!$C$12,MASTER!$D$12,IF($D9=MASTER!$C$13,MASTER!$D$13,IF($D9=MASTER!$C$14,MASTER!$D$14,IF($D9=MASTER!$C$15,MASTER!$D$15,\" \")))))))","v":100},"से",{"$f":"IF(AA9=\" \",\" \",IF(AA9<MASTER!G9,AA9,MASTER!G9))","v":117},null,18,{"$f":"SUM(I9:I13)","v":45},{"$f":"SUM(J9:J13)","v":45},{"$f":"IF(J9=0,\" \",IF(J9<=30,1,IF(J9>30,2)))","v":2},{"$f":"IF($D9=\" \",\" \",IF($D9=$R8,$U8-$I9,IF($D9=$R9,$U9-$I9,IF($D9=$R10,$U10-$I9,IF($D9=$R11,$U11-$I9,IF($D9=$R12,$U12-$I9,IF($D9=$R13,$U13-$I9,IF($D9=$R14,$U14-$I9))))))))","v":63},null,null,"HALL 2",2,{"$f":"MASTER!C10","v":"GSSS KOD"},{"$f":"MASTER!D10","v":200},{"$f":"MASTER!G10","v":240},{"$f":"MASTER!H10","v":41},null,"हिंदी अनिवार्य",{"$f":"IF(Y9=\" \",\" \",(Y9-I9))","v":63},{"$f":"IF(D9=\" \",\" \",VLOOKUP(D9,MASTER!$C$9:$K$15,6,0))","v":81},null,{"$f":"IF(D9=\" \",\" \",E9+I9+H9-1)","v":117}]
[null,null,2,{"$f":"IF($C10=1,$R$8,IF($C10=2,$R$9,IF($C10=3,$R$10,IF($C10=4,$R$11,IF($C10=5,$R$12,IF($C10=6,$R$13,IF($C10=7,$R$14,\" \")))))))","v":"GSSS KOD"},{"$f":"IF($D10=MASTER!$C$9,MASTER!$D$9,IF($D10=MASTER!$C$10,MASTER!$D$10,IF($D10=MASTER!$C$11,MASTER!$D$11,IF($D10=MASTER!$C$12,MASTER!$D$12,IF($D10=MASTER!$C$13,MASTER!$D$13,IF($D10=MASTER!$C$14,MASTER!$D$14,IF($D10=MASTER!$C$15,MASTER!$D$15,\" \")))))))","v":200},"से",{"$f":"IF(AA10=\" \",\" \",IF(AA10<MASTER!G10,AA10,MASTER!G10))","v":208},null,9,{"$nulls":3},{"$f":"IF($D10=\" \",\" \",IF($D10=$R9,$U9-$I10,IF($D10=$R10,$U10-$I10,IF($D10=$R11,$U11-$I10,IF($D10=$R12,$U12-$I10,IF($D10=$R13,$U13-$I10,IF($D10=$R14,$U14-$I10,IF($D10=$R15,$U15-$I10))))))))","v":32},null,null,"HALL 3",3,{"$f":"MASTER!C11","v":"GSSS LADPURA"},{"$f":"MASTER!D11","v":300},{"$f":"MASTER!G11","v":330},{"$f":"MASTER!H11","v":31},null,"हिंदी साहित्य",{"$f":"IF(Y10=\" \",\" \",(Y10-I10))","v":32},{"$f":"IF(D10=\" \",\" \",VLOOKUP(D10,MASTER!$C$9:$K$15,6,0))","v":41},null,{"$f":"IF(D10=\" \",\" \",E10+I10+H10-1)","v":208}]
[null,null,3,"GSSS LADPURA",{"$f":"IF($D11=MASTER!$C$9,MASTER!$D$9,IF($D11=MASTER!$C$10,MASTER!$D$10,IF($D11=MASTER!$C$11,MASTER!$D$11,IF($D11=MASTER!$C$12,MASTER!$D$12,IF($D11=MASTER!$C$13,MASTER!$D$13,IF($D11=MASTER!$C$14,MASTER!$D$14,IF($D11=MASTER!$C$15,MASTER!$D$15,\" \")))))))","v":300},"से",{"$f":"IF(AA11=\" \",\" \",IF(AA11<MASTER!G11,AA11,MASTER!G11))","v":308},0,9,{"$nulls":3},22,null,null,"LAB ",4,{"$f":"MASTER!C12","v":"GSSS BIJATHAL"},{"$f":"MASTER!D12","v":400},{"$f":"MASTER!G12","v":435},{"$f":"MASTER!H12","v":36},null,"ENGLISH",22,{"$f":"IF(D11=\" \",\" \",VLOOKUP(D11,MASTER!$C$9:$K$15,6,0))","v":31},null,308]
[null,null,4,"GSSS BIJATHAL",{"$f":"IF($D12=MASTER!$C$9,MASTER!$D$9,IF($D12=MASTER!$C$10,MASTER!$D$10,IF($D12=MASTER!$C$11,MASTER!$D$11,IF($D12=MASTER!$C$12,MASTER!$D$12,IF($D12=MASTER!$C$13,MASTER!$D$13,IF($D12=MASTER!$C$14,MASTER!$D$14,IF($D12=MASTER!$C$15,MASTER!$D$15,\" \")))))))","v":400},"से",{"$f":"IF(AA12=\" \",\" \",IF(AA12<MASTER!G12,AA12,MASTER!G12))","v":408},null,9,{"$nulls":3},27,{"$nulls":3},5,{"$f":"MASTER!C13","v":"SHAKBHARI"},{"$f":"MASTER!D13","v":500},{"$f":"MASTER!G13","v":515},{"$f":"MASTER!H13","v":16},null,"ENGLISH COMPULSARY",27,{"$f":"IF(D12=\" \",\" \",VLOOKUP(D12,MASTER!$C$9:$K$15,6,0))","v":36},null,408]
[{"$nulls":3}," ",{"$f":"IF($D13=MASTER!$C$9,MASTER!$D$9,IF($D13=MASTER!$C$10,MASTER!$D$10,IF($D13=MASTER!$C$11,MASTER!$D$11,IF($D13=MASTER!$C$12,MASTER!$D$12,IF($D13=MASTER!$C$13,MASTER!$D$13,IF($D13=MASTER!$C$14,MASTER!$D$14,IF($D13=MASTER!$C$15,MASTER!$D$15,\" \")))))))","v":" "},"से",{"$f":"IF(AA13=\" \",\" \",IF(AA13<MASTER!G13,AA13,MASTER!G13))","v":" "},{"$nulls":5}," ",null,null,1,6,{"$f":"MASTER!C14","v":0},{"$f":"MASTER!D14","v":0},{"$f":"MASTER!G14","v":0},{"$f":"MASTER!H14","v":0},null,"ENGLISH LITERATURE"," ",{"$f":"IF(D13=\" \",\" \",VLOOKUP(D13,MASTER!$C$9:$K$15,6,0))","v":" "},null," "]
[null,"HALL 2",1,"GSSS ALNIYAWAS1",{"$f":"IF($D14=\" \",\" \",IF(D14=\"FALSE\",MATCH($R$8:$R$14,$S$8:$S$14),IF($D14=$D9,$G9+1,IF($D14=$D10,$G10+1,IF($D14=$D11,$G11+1,IF($D14=$D12,$G12+1,IF($D14=$D13,$G13+1,\" \")))))))","v":118},"से",{"$f":"IF(D14=\" \",\" \",E14+I14+H14-1)","v":135},null,18,{"$f":"SUM(I14:I18)","v":45},{"$f":"IF(J9=0,\" \",K9+J14)","v":90},{"$f":"IF(J14=0,\" \",IF(J14<=30,1,IF(J14>30,2)))","v":2},{"$f":"IF($D14=\" \",\" \",IF($D14=$D9,$M9-$I14,IF($D14=$D10,$M10-$I14,IF($D14=$D11,$M11-$I14,IF($D14=$D12,$M12-$I14,IF($D14=$D13,$M14-$I14))))))","v":45},null,null,2,null,{"$f":"MASTER!C15","v":0},{"$f":"MASTER!D15","v":0},{"$f":"MASTER!G15","v":0},{"$f":"MASTER!H15","v":0},null,"इतिहास",null,{"$f":"IF(D14=\" \",\" \",VLOOKUP(D14,MASTER!$C$9:$K$15,6,0))","v":81},null,135]
[null,null,2,"GSSS KOD",{"$f":"IF($D15=\" \",\" \",IF(D15=\"FALSE\",MATCH($R$8:$R$14,$S$8:$S$14),IF($D15=$D10,$G10+1,IF($D15=$D11,$G11+1,IF($D15=$D12,$G12+1,IF($D15=$D13,$G13+1,IF($D15=$D14,$G14+1,\" \")))))))","v":209},"से",{"$f":"IF(D15=\" \",\" \",E15+I15+H15-1)","v":217},null,9,{"$nulls":3},{"$f":"IF($D15=\" \",\" \",IF($D15=$D10,$M10-$I15,IF($D15=$D11,$M11-$I15,IF($D15=$D12,$M12-$I15,IF($D15=$D13,$M13-$I15,IF($D15=$D14,$M15-$I15))))))","v":23},null,null,3,7,{"$nulls":5},"राजनैतिक विज्ञान",null,{"$f":"IF(D15=\" \",\" \",VLOOKUP(D15,MASTER!$C$9:$K$15,6,0))","v":41},null,217]
{"$rows_left_out":74}
{"sheet":"SITTING ROOM","index":3,"n_rows":31,"n_cols":27,"rows_kept":31,"merged":[[1,1,1,3],[2,1,2,5],[3,1,3,2],[24,2,24,3],[30,3,30,4]]}
[]
[null,{"$f":"MASTER!D7","v":"उच्च माध्यमिक परीक्षा"},null,null,{"$f":"MASTER!G7","v":2021},{"$nulls":4},"HALL 1","RO"]
[null,"बैठक व्यवस्था",{"$nulls":7},"HALL 2"]
[null,{"$f":"'SITTING PLAN'!B8","v":"परीक्षा कक्ष क्रमांक"},null,3,{"$f":"MASTER!B6","v":"बोर्ड परीक्षा केंद्र क्रमांक"},{"$f":"MASTER!D6","v":119050},{"$nulls":3},"HALL 3",null,1,2,3,4,5,6,7,8,9,10,11,12,13,14,15,16]
[{"$nulls":9},"LAB ",null,{"$f":"'SITTING PLAN'!B9","v":"HALL 1"},{"$f":"'SITTING PLAN'!D9","v":"GSSS ALNIYAWAS1"},{"$f":"'SITTING PLAN'!D10","v":"GSSS KOD"},{"$f":"'SITTING PLAN'!D11","v":"GSSS LADPURA"},{"$f":"'SITTING PLAN'!D12","v":"GSSS BIJATHAL"},{"$f":"'SITTING PLAN'!D13","v":" "},{"$f":"'SITTING PLAN'!$E9","v":100},{"$f":"'SITTING PLAN'!$E10","v":200},{"$f":"'SITTING PLAN'!$E11","v":300},{"$f":"'SITTING PLAN'!$E12","v":400},{"$f":"'SITTING PLAN'!$E13","v":" "},{"$f":"'SITTING PLAN'!$I$9","v":18},{"$f":"'SITTING PLAN'!$I$10","v":9},{"$f":"'SITTING PLAN'!$I$11","v":9},{"$f":"'SITTING PLAN'!$I$12","v":9},{"$f":"'SITTING PLAN'!$I$13","v":0}]
[null,{"$f":"VLOOKUP($D$4,TIME1,2,0)","v":"GSSS ALNIYAWAS1"},{"$f":"VLOOKUP($D$4,TIME1,3,0)","v":"GSSS KOD"},{"$f":"VLOOKUP($D$4,TIME1,4,0)","v":"GSSS ALNIYAWAS1"},{"$f":"VLOOKUP($D$4,TIME1,5,0)","v":"SHAKBHARI"},{"$f":"VLOOKUP($D$4,TIME1,6,0)","v":" "},{"$nulls":3},1,null,{"$f":"'SITTING PLAN'!B14","v":"HALL 2"},{"$f":"'SITTING PLAN'!D14","v":"GSSS ALNIYAWAS1"},{"$f":"'SITTING PLAN'!D15","v":"GSSS KOD"},{"$f":"'SITTING PLAN'!D16","v":"GSSS LADPURA"},{"$f":"'SITTING PLAN'!D17","v":"GSSS BIJATHAL"},{"$f":"'SITTING PLAN'!D18","v":" "},{"$f":"'SITTING PLAN'!$E14","v":118},{"$f":"'SITTING PLAN'!$E15","v":209},{"$f":"'SITTING PLAN'!$E16","v":309},{"$f":"'SITTING PLAN'!$E17","v":409},{"$f":"'SITTING PLAN'!$E18","v":" "},{"$f":"'SITTING PLAN'!$I14","v":18},{"$f":"'SITTING PLAN'!$I15","v":9},{"$f":"'SITTING PLAN'!$I16","v":9},{"$f":"'SITTING PLAN'!$I17","v":9},{"$f":"'SITTING PLAN'!$I18","v":0}]
[null,{"$f":"VLOOKUP($D$4,$L$5:$W$21,7,0)","v":166},{"$f":"VLOOKUP($D$4,$L$5:$W$21,8,0)","v":239},{"$f":"VLOOKUP($D$4,$L$5:$W$21,9,0)","v":172},{"$f":"VLOOKUP($D$4,$L$5:$W$21,10,0)","v":509},109,{"$nulls":3},2,null,{"$f":"'SITTING PLAN'!B19","v":"HALL 3"},{"$f":"'SITTING PLAN'!$D19","v":"GSSS ALNIYAWAS1"},{"$f":"'SITTING PLAN'!$D20","v":"GSSS KOD"},{"$f":"'SITTING PLAN'!$D21","v":"GSSS LADPURA"},{"$f":"'SITTING PLAN'!$D22","v":"GSSS BIJATHAL"},{"$f":"'SITTING PLAN'!$D23","v":" "},{"$f":"'SITTING PLAN'!$E19","v":136},{"$f":"'SITTING PLAN'!$E20","v":218},{"$f":"'SITTING PLAN'!$E21","v":318},{"$f":"'SITTING PLAN'!$E22","v":418},{"$f":"'SITTING PLAN'!$E23","v":" "},{"$f":"'SITTING PLAN'!$I19","v":18},{"$f":"'SITTING PLAN'!$I20","v":9},{"$f":"'SITTING PLAN'!$I21","v":9},{"$f":"'SITTING PLAN'!$I22","v":9},{"$f":"'SITTING PLAN'!$I23","v":0}]
[null,{"$f":"IF(B7=\" \",\" \",IF(B7=$D$26,\" \",B7+1))","v":167},{"$f":"IF(C7=\" \",\" \",IF(C7=$D$27,\" \",C7+1))","v":240},{"$f":"IF(D7=\" \",\" \",IF(D7=$D$28,\" \",D7+1))","v":173},{"$f":"IF(E7=\" \",\" \",IF(E7=$D$29,\" \",E7+1))","v":510},{"$f":"IF(F7=\" \",\" \",IF(F7=$D$30,\" \",F7+1))","v":110},{"$nulls":3},3,null,{"$f":"'SITTING PLAN'!B24","v":1},{"$f":"'SITTING PLAN'!$D$24","v":"GSSS ALNIYAWAS1"},{"$f":"'SITTING PLAN'!$D$25","v":"GSSS KOD"},{"$f":"'SITTING PLAN'!$D$26","v":"GSSS LADPURA"},{"$f":"'SITTING PLAN'!$D$27","v":"GSSS BIJATHAL"},{"$f":"'SITTING PLAN'!$D$28","v":" "},{"$f":"'SITTING PLAN'!$E24","v":154},{"$f":"'SITTING PLAN'!$E25","v":227},{"$f":"'SITTING PLAN'!$E26","v":327},{"$f":"'SITTING PLAN'!$E27","v":427},{"$f":"'SITTING PLAN'!$E28","v":" "},{"$f":"'SITTING PLAN'!I24","v":6},{"$f":"'SITTING PLAN'!I25","v":6},{"$f":"'SITTING PLAN'!I26","v":4},{"$f":"'SITTING PLAN'!I27","v":6},{"$f":"'SITTING PLAN'!I28","v":0}]
[null,{"$f":"IF(B8=\" \",\" \",IF(B8=$D$26,\" \",B8+1))","v":168},{"$f":"IF(C8=\" \",\" \",IF(C8=$D$27,\" \",C8+1))","v":" "},{"$f":"IF(D8=\" \",\" \",IF(D8=$D$28,\" \",D8+1))","v":174},{"$f":"IF(E8=\" \",\" \",IF(E8=$D$29,\" \",E8+1))","v":511},{"$f":"IF(F8=\" \",\" \",F8+1)","v":111},{"$nulls":3},4,null,{"$f":"'SITTING PLAN'!B29","v":2},{"$f":"'SITTING PLAN'!$D$29","v":"GSSS ALNIYAWAS1"},{"$f":"'SITTING PLAN'!$D$30","v":"GSSS KOD"},{"$f":"'SITTING PLAN'!$D$31","v":"SHAKBHARI"},{"$f":"'SITTING PLAN'!$D$32","v":"GSSS BIJATHAL"},{"$f":"'SITTING PLAN'!$D$33","v":" "},{"$f":"'SITTING PLAN'!$E29","v":160},{"$f":"'SITTING PLAN'!$E30","v":233},{"$f":"'SITTING PLAN'!$E31","v":500},{"$f":"'SITTING PLAN'!$E32","v":433},{"$f":"'SITTING PLAN'!$E33","v":0},{"$f":"'SITTING PLAN'!I29","v":6},{"$f":"'SITTING PLAN'!I30","v":6},{"$f":"'SITTING PLAN'!I31","v":9},{"$f":"'SITTING PLAN'!I32","v":3},{"$f":"'SITTING PLAN'!I33","v":0}]
[null,169," ",175,512,112,{"$nulls":3},5,null,{"$f":"'SITTING PLAN'!B34","v":3},{"$f":"'SITTING PLAN'!$D$34","v":"GSSS ALNIYAWAS1"},{"$f":"'SITTING PLAN'!$D$35","v":"GSSS KOD"},{"$f":"'SITTING PLAN'!$D$36","v":"GSSS ALNIYAWAS1"},{"$f":"'SITTING PLAN'!$D$37","v":"SHAKBHARI"},{"$f":"'SITTING PLAN'!$D$38","v":" "},{"$f":"'SITTING PLAN'!$E34","v":166},{"$f":"'SITTING PLAN'!$E35","v":239},{"$f":"'SITTING PLAN'!$E36","v":172},{"$f":"'SITTING PLAN'!$E37","v":509},{"$f":"'SITTING PLAN'!$E38","v":" "},{"$f":"'SITTING PLAN'!I34","v":6},{"$f":"'SITTING PLAN'!I35","v":2},{"$f":"'SITTING PLAN'!I36","v":9},{"$f":"'SITTING PLAN'!I37","v":7},{"$f":"'SITTING PLAN'!I38","v":0}]
[null,170," ",176,513,113,{"$nulls":3},6,null,{"$f":"'SITTING PLAN'!B39","v":0},{"$f":"'SITTING PLAN'!$D$39","v":" "},{"$f":"'SITTING PLAN'!$D$40","v":" "},{"$f":"'SITTING PLAN'!$D$41","v":" "},{"$f":"'SITTING PLAN'!$D$42","v":" "},{"$f":"'SITTING PLAN'!$D$43","v":" "},{"$f":"'SITTING PLAN'!$E39","v":" "},{"$f":"'SITTING PLAN'!$E40","v":" "},{"$f":"'SITTING PLAN'!$E41","v":" "},{"$f":"'SITTING PLAN'!$E42","v":" "},{"$f":"'SITTING PLAN'!$E43","v":" "},{"$f":"'SITTING PLAN'!I39","v":0},{"$f":"'SITTING PLAN'!I40","v":0},{"$f":"'SITTING PLAN'!I41","v":0},{"$f":"'SITTING PLAN'!I42","v":0},{"$f":"'SITTING PLAN'!I43","v":0}]
[null,171," ",177,514,114,{"$nulls":3},7,null,{"$f":"'SITTING PLAN'!B44","v":0},{"$f":"'SITTING PLAN'!$D$44","v":" "},{"$f":"'SITTING PLAN'!$D$45","v":" "},{"$f":"'SITTING PLAN'!$D$46","v":" "},{"$f":"'SITTING PLAN'!$D$47","v":" "},{"$f":"'SITTING PLAN'!$D$48","v":" "},{"$f":"'SITTING PLAN'!$E44","v":" "},{"$f":"'SITTING PLAN'!$E45","v":" "},{"$f":"'SITTING PLAN'!$E46","v":" "},{"$f":"'SITTING PLAN'!$E47","v":" "},{"$f":"'SITTING PLAN'!$E48","v":" "},{"$f":"'SITTING PLAN'!I44","v":0},{"$f":"'SITTING PLAN'!I45","v":0},{"$f":"'SITTING PLAN'!I46","v":0},{"$f":"'SITTING PLAN'!I47","v":0},{"$f":"'SITTING PLAN'!I48","v":0}]
[null," "," ",178,515,115,{"$nulls":3},8,null,{"$f":"'SITTING PLAN'!B49","v":0},{"$f":"'SITTING PLAN'!$D$49","v":" "},{"$f":"'SITTING PLAN'!$D$50","v":" "},{"$f":"'SITTING PLAN'!$D$51","v":" "},{"$f":"'SITTING PLAN'!$D$52","v":" "},{"$f":"'SITTING PLAN'!$D$53","v":" "},{"$f":"'SITTING PLAN'!$E49","v":" "},{"$f":"'SITTING PLAN'!$E50","v":" "},{"$f":"'SITTING PLAN'!$E51","v":" "},{"$f":"'SITTING PLAN'!$E52","v":" "},{"$f":"'SITTING PLAN'!$E53","v":" "},{"$f":"'SITTING PLAN'!I49","v":0},{"$f":"'SITTING PLAN'!I50","v":0},{"$f":"'SITTING PLAN'!I51","v":0},{"$f":"'SITTING PLAN'!I52","v":0},{"$f":"'SITTING PLAN'!I53","v":0}]
[null," "," ",179," ",116,{"$nulls":3},9,null,{"$f":"'SITTING PLAN'!B54","v":0},{"$f":"'SITTING PLAN'!$D$54","v":" "},{"$f":"'SITTING PLAN'!$D$55","v":" "},{"$f":"'SITTING PLAN'!$D$56","v":" "},{"$f":"'SITTING PLAN'!$D$57","v":" "},{"$f":"'SITTING PLAN'!$D$58","v":" "},{"$f":"'SITTING PLAN'!$E54","v":" "},{"$f":"'SITTING PLAN'!$E55","v":" "},{"$f":"'SITTING PLAN'!$E56","v":" "},{"$f":"'SITTING PLAN'!$E57","v":" "},{"$f":"'SITTING PLAN'!$E58","v":" "},{"$f":"'SITTING PLAN'!I54","v":0},{"$f":"'SITTING PLAN'!I55","v":0},{"$f":"'SITTING PLAN'!I56","v":0},{"$f":"'SITTING PLAN'!I57","v":0},{"$f":"'SITTING PLAN'!I58","v":0}]
[null," "," ",180," ",117,{"$nulls":3},10,null,{"$f":"'SITTING PLAN'!B59","v":0},{"$f":"'SITTING PLAN'!$D$59","v":" "},{"$f":"'SITTING PLAN'!$D$60","v":" "},{"$f":"'SITTING PLAN'!$D$61","v":" "},{"$f":"'SITTING PLAN'!$D$62","v":" "},{"$f":"'SITTING PLAN'!$D$63","v":" "},{"$f":"'SITTING PLAN'!$E59","v":" "},{"$f":"'SITTING PLAN'!$E60","v":" "},{"$f":"'SITTING PLAN'!$E61","v":" "},{"$f":"'SITTING PLAN'!$E62","v":" "},{"$f":"'SITTING PLAN'!$E63","v":" "},{"$f":"'SITTING PLAN'!I59","v":0},{"$f":"'SITTING PLAN'!I60","v":0},{"$f":"'SITTING PLAN'!I61","v":0},{"$f":"'SITTING PLAN'!I62","v":0},{"$f":"'SITTING PLAN'!I63","v":0}]
{"$rows_left_out":17}
{"sheet":"AC ROLL FOR BANK","index":4,"n_rows":40,"n_cols":8,"rows_kept":40,"merged":[[1,1,1,2],[1,3,1,7],[2,5,2,6],[3,2,3,6],[38,5,38,6],[39,5,39,6]]}
[]
[null,{"$f":"MASTER!B2","v":"परीक्षा केन्द्र का नाम"},null,{"$f":"MASTER!D2","v":"jktdh; mPp ek/;fed fo|ky; vkyfu;kokl ftyk& ukXkkSj"}]
[null,null,{"$f":"MASTER!B7","v":"परीक्षा का प्रकार व वर्ष"},{"$f":"MASTER!D7","v":"उच्च माध्यमिक परीक्षा"},{"$f":"MASTER!G7","v":2021},{"$f":"MASTER!B6","v":"बोर्ड परीक्षा केंद्र क्रमांक"},null,{"$f":"MASTER!D6","v":119050}]
[null,null,"बोर्ड परीक्षा भुगतान प्रपत्र"]
[null,"S.NO.","NAME OF EMPLOYEE","BOARD DUTY","NAME OF BANK","IFSC  CODE","ACOUNT NO","AMOUNT"]
[null,1,"VIJAY KUMAR PRAJAPAT","CS","PNB","SBIN0031098",51062650196,3160]
[null,2,"VIJAY KUMAR PRAJAPAT","ACS","SBI RIYAN BARI","SBIN0031099",51062650196,720]
[null,3,"VIJAY KUMAR PRAJAPAT","INVIGILATOR","SBI SURAJGARH","SBIN0031100",51062650196,1760]
[null,4,"VIJAY KUMAR PRAJAPAT","INVIGILATOR","SBI MERTA ROAD","SBIN0031101",51062650196,990]
[null,5,"VIJAY KUMAR PRAJAPAT","INVIGILATOR","SBI MAKHUPURA AJMER","SBIN0031102",51062650196,970]
[null,6,"VIJAY KUMAR PRAJAPAT","INVIGILATOR","SBI LOHAKHAN AJMER","SBIN0031103",51062650196,450]
[null,7,"VIJAY KUMAR PRAJAPAT","INVIGILATOR","SBI VAISHALI NAGAR AJMER","SBIN0031104",51062650196,630]
[null,8,"VIJAY KUMAR PRAJAPAT","INVIGILATOR","SBI THANWLA","SBIN0031105",51062650196,900]
[null,9,"VIJAY KUMAR PRAJAPAT","EXAM INCHARGE","SBI RIYAN BARI","SBIN0031106",51062650196,7276]
[null,10,"VIJAY KUMAR PRAJAPAT","INVIGILATOR","SBI RIYAN BARI","SBIN0031107",51062650196,1080]
{"$rows_left_out":26}
{"sheet":"Sheet1","index":5,"n_rows":0,"n_cols":0,"rows_kept":0}