{"text_format":"3","workbook":"xlsx","n_sheets":6,"sheets":["INFO","MASTER","SITTING PLAN","SITTING ROOM","AC ROLL FOR BANK","Sheet1"],"not_rendered":{"images":3,"defined_names":6,"comments":2},"read":"whole","date_system":"1900"}

{"sheet":"INFO","index":0,"n_rows":30,"n_cols":25,"rows_kept":30,"merged":[[0,1,0,23],[0,24,0,28],[1,1,1,23],[1,24,7,28],[2,0,2,23],[3,1,3,23],[4,1,4,23],[5,1,5,23],[6,1,6,23],[7,1,7,23],[8,1,8,23],[9,1,9,23],[10,1,10,23],[11,1,11,23],[11,24,21,32],[12,1,12,23],[13,0,13,4],[13,5,13,9],[13,10,13,14],[13,15,13,20],[13,21,13,23],[14,1,14,23],[15,1,15,23],[16,1,16,23],[17,0,17,23],[18,1,18,23],[19,0,19,23],[20,1,20,23],[21,0,21,23],[22,1,22,23],[22,24,24,32],[23,0,23,23],[24,0,28,2],[24,3,24,6],[24,7,24,9],[24,10,24,15],[24,16,24,20],[25,3,28,23],[29,0,30,5],[29,6,30,23]]}
[null,"FULLY AUTOMATIC ALL EXAMS SITTING PLAN में आपका स्वागत है I",{"$nulls":22},"jk/kkLokeh "]
[null,"सभी गुरुजनों को SMART TEACHER बनाने के लिए समर्पित"]
["INSTRUCTIONS FOR FULLY AUTOMATIC SITTING PLAN"]
[1,"यह प्रोग्राम सभी प्रकार की परीक्षाओं हेतु बैठक व्यवस्था के लिए तैयार किया गया है "]
[2,"इस प्रोग्राम में आप mater data sheet में pink shell में entry करे I"]
[3,"sitting plan sheet में सर्वप्रथम विषय,परीक्षा कक्ष क्रमांक,विद्यालय का चयन,प्रत्येक कक्ष में पंक्तिवर विद्यार्थियों का चयन यानि grey shell में entry करे"]
[4,"sitting room sheet में केवल परीक्षा कक्ष का चुनाव करे ,एंव यदि पांचवी पंक्ति में विद्यार्थी एक ही विद्यालय के तो मैन्युअल बदले !"]
[5,"AC ROLL FOR BANK SHEET में परीक्षा में ड्यूटी में लगे कर्मचारियों का भुगतान पत्र बना सकते हें !"]
[6,"आशा है की यह प्रोग्राम आपके लिए उपयोगी साबित होगा इसी आशा के साथ मेरे नए प्रोग्राम EXCEL DICTIONARY का इंतजार करे-------------------"]
[7]
[8]
[9]
[10]
["घर पर रहे,मास्क का प्रयोग करे",{"$nulls":4},"nksLrks vf/kd tkudkjh gsrq esjk ;wV;wc psuy ns[ks vkSj ykbd vkSj lCldzkbc t#j djs rkfd vkus okyk izksxke vki rd igWqp ldsA ",{"$nulls":9},"https://youtu.be/3yHQVnwH1W0",{"$nulls":5},"Like subscribe t#j djs"]
[1,"OLD TAX REGIME  sheet  esa gkml yksu C;kt ,ao vU; vk; rFkk Chapter VI A Deduction dh jkf'k dk bUnzkt djs tks lsy vuykWd gSA"]
[2,"OLD TAX  REGIME sheet  esa dsoy vuykWd 'khV esa gh bUnzkt djs vU; osru ls dVus okyh jkf'k Lor vk tk,xh A"]
[3,"bl 'khV esa Refundable amount (+) esa gS rks vkidks jkf'k okil feysxh vU;Fkk vkidk VSDl cdk;k gSA "]
["INSTRUCTION FOR NEW TAX REGIME"]
[1,"NEW TAX REGIME  sheet  esa 70 izdkj dh dVksfr ls oafpr gksuk iMsXkk dsoy NPS  dh DVkSfr vf/kdre 50000 dh NwV ns; gS vU; lsy ykWd gSA"]
["INSTRUCTION FOR PAY SLIP SHEET"]
[1,"\"PAY SLIP  sheet\"  esa vki ftl ekg dh is Lyhi ysuh gks ml ekg dk p;u djs vki dh is Lyhi rS;kj gS ckdh  lsy ykWd gSA A4 page size ( margin full page)"]
["INSTRUCTION FOR PRINT"]
[1,"lHkh 'khV A4 page size ij Margin full page esa lsV fd;k gqvk gS vki fizV ys ldrs gsA 7pay matrix chart sheet legal page ls  print  fudky ldrs gSA"]
["bl odZcqd dks jktLFkku ds f'k{kk foHkkx ds deZpkfj;ksa dh lqfo/kk ds fy, rS;kj fd;k gqvk gS A blesa lHkh x.kuk ,ao ladyu dks iw.kZ lko/kkuh ds lkFk iz;ksx  fd;k gSa exj fdlh izdkj dh =qfV ,ao pwd ds fy;s rS;kjdRrkZ ftEesnkj ugha gksxkA vk;dj foHkkx ds vkns'kkuqlkj x.kuk ,ao fu;e gh ekU; gksxs A"]
["FOR MORE MY EXCEL SOFTWARE & EDU.NEWS ---",null,null,"FOR MORE MY EXCEL SOFTWARE & EDU.NEWS ---",{"$nulls":3},"https://shalasugam.com/vijay-kumar-excel-sheet-expert/",null,null,"https://www.ashwinisharma.com/p/vijay-kumar-excel-sheet-expert.html",{"$nulls":5},"https://rajsevak.com/vijay-kumar-prajapat-software/"]
[{"$nulls":3},"दोस्तों यह प्रोग्राम आपको कैसा लगा 1\nविजय कुमार प्रजापत अध्यापक राजकीय उच्च माध्यमिक विद्यालय आलनियावास तहसील &रियां बड़ी    जिला &नागौर\nआपका स्नेह मिलता रहे !\nइस प्रोग्राम को बनाने में काफी सावधानी बरती है फिर भी किसी प्रकार की समस्या एंव सुझाव हेतु मेरी इमेल आईडी पर सम्पर्क करे\nमेरे प्रेरणा स्रोत&1-श्री अश्विनी कुमार 2- श्री किशन लाल 3- श्री हीरालाल 4- श्री विष्णु शर्मा 5- श्री अभिषेक शर्मा और आप"]
[]
[]
[]
["Keep Your Face Always In Sunshine",{"$nulls":5},"gupskalani@gmail.com"]

{"sheet":"MASTER","index":1,"n_rows":74,"n_cols":22,"rows_kept":74,"merged":[[1,1,1,2],[1,3,1,10],[2,1,2,2],[2,3,2,6],[2,7,2,8],[2,9,2,10],[3,1,3,2],[3,3,3,6],[3,7,3,8],[3,9,3,10],[4,1,4,2],[4,3,4,6],[4,7,4,8],[4,9,4,10],[5,1,5,2],[5,3,5,6],[5,7,5,8],[5,9,5,10],[6,1,6,2],[6,3,6,5],[6,7,6,8],[6,9,6,10],[7,3,7,6],[7,8,7,9],[8,3,8,4],[8,8,8,9],[9,3,9,4],[9,8,9,9],[10,3,10,4],[10,8,10,9],[11,3,11,4],[11,8,11,9],[12,3,12,4],[12,8,12,9],[13,3,13,4],[13,8,13,9],[14,3,14,4],[14,8,14,9],[15,1,15,6],[15,8,15,9]]}
[]
[null,"परीक्षा केन्द्र का नाम",null,"jktdh; mPp ek/;fed fo|ky; vkyfu;kokl ftyk& ukXkkSj"]
[null,"केन्द्राध्यक्ष का नाम",null,"DINESH KUMAR OJHA",{"$nulls":3},"मोबाईल नम्बर",null,0]
[null,"उपकेन्द्राध्यक्ष का नाम",null,"VIJAY KUMAR PRAJAPAT",{"$nulls":3},"मोबाईल नम्बर",null,1,{"$nulls":11},"हिंदी"]
[null,"बोर्ड/स्थानीय परीक्षाप्रभारी का नाम",null,"RAMNIWAS",{"$nulls":3},"मोबाईल नम्बर",null,2,{"$nulls":7},"उच्च माध्यमिक परीक्षा",{"$nulls":3},"हिंदी अनिवार्य"]
[null,"बोर्ड परीक्षा केंद्र क्रमांक",null,119050,{"$nulls":3},"विषय",null,"राजनैतिक विज्ञान",{"$nulls":7},"माध्यमिक परीक्षा",{"$nulls":3},"हिंदी साहित्य"]
[null,"परीक्षा का प्रकार व वर्ष",null,"उच्च माध्यमिक परीक्षा",null,null,2021,"दिनांक",null,"2022-05-25",{"$nulls":7},"प्रारंभिक पूर्णता परीक्षा",{"$nulls":3},"ENGLISH"]
[null,"क्र-सं-","विद्यालय का कोड या नाम","विद्यालयवार अनुक्रमांक",{"$nulls":3},"योग","विद्यालय का बोर्ड क्रमांक",{"$nulls":12},"ENGLISH COMPULSARY"]
[null,1,"GSSS ALNIYAWAS1",100,null,"से",180,{"$f":"IF(O9>0,O9+1,0)","v":81},119050,{"$nulls":5},{"$f":"G9-D9","v":80},null,null,"स्थानीय परीक्षा",{"$nulls":3},"ENGLISH LITERATURE"]
[null,2,"GSSS KOD",200,null,"से",240,{"$f":"IF(O10>0,O10+1,0)","v":41},119051,{"$nulls":5},{"$f":"G10-D10","v":40},{"$nulls":6},"इतिहास"]
[null,3,"GSSS LADPURA",300,null,"से",330,{"$f":"IF(O11>0,O11+1,0)","v":31},119052,{"$nulls":5},30,null,null,"BOARD EXAM ",2021,null,null,"राजनैतिक विज्ञान"]
[null,4,"GSSS BIJATHAL",400,null,"से",435,{"$f":"IF(O12>0,O12+1,0)","v":36},119053,{"$nulls":5},35,null,null,"LOCAL EXAM",2022,null,null,"भूगोल"]
[null,5,"SHAKBHARI",500,null,"से",515,16,119054,{"$nulls":5},15,{"$nulls":3},2023,null,null,"अर्थशास्त्र"]
[null,6,null,0,null,"से",0,0,119055,{"$nulls":5},0,{"$nulls":3},2024,null,null,"संस्कृत"]
[null,7,null,0,null,"से",0,0,119056,{"$nulls":5},0,{"$nulls":3},2025,null,null,"भोतिक विज्ञानं"]
[null,"कुल परीक्षार्थी संख्या",{"$nulls":5},{"$f":"SUM(H9:H15)","v":205},{"$nulls":10},2026,null,null,"रसायन विज्ञानं"]
[{"$nulls":21},"जीव विज्ञान"]
[{"$nulls":21},"गणित"]
[{"$nulls":21},"सामाजिक विज्ञान"]
[{"$nulls":21},"पर्यावरण अध्ययन"]
[{"$nulls":21},"उर्दू"]
[{"$nulls":21},"गुजराती"]
[{"$nulls":21},"सिन्धी"]
[{"$nulls":21},"दर्शन शास्त्र"]
[{"$nulls":21},"व्यवसाय अध्ययन"]
[{"$nulls":21},"कृषि रसायन विज्ञानं"]
[{"$nulls":21},"मनोविज्ञान"]
[{"$nulls":21},"लेखाशास्त्र"]
[{"$nulls":21},"कृषि जीव विज्ञान"]
[{"$nulls":21},"भूविज्ञान"]
[{"$nulls":21},"पंजाबी साहित्य"]
[{"$nulls":21},"राजस्थानी साहित्य"]
[{"$nulls":21},"गृह विज्ञान"]
[{"$nulls":21},"लोक प्रशासन"]
[{"$nulls":21},"कंठ संगीत"]
[{"$nulls":21},"नृत्य कत्थक"]
[{"$nulls":21},"वाद्य संगीत"]
[{"$nulls":21},"सितार"]
[{"$nulls":21},"सरोद"]
[{"$nulls":21},"वायलिन"]
[{"$nulls":21},"बांसुरी"]
[{"$nulls":21},"गिटार"]
[{"$nulls":21},"सामान्य विज्ञान"]
[{"$nulls":21},"टंकण लिपि अंग्रेजी"]
[{"$nulls":21},"टंकण लिपि हिंदी"]
[{"$nulls":21},"सूचना प्रोद्योगिकीऔर प्रोग्रामिंग"]
[{"$nulls":21},"सोंदर्य एंव स्वास्थ्य"]
[{"$nulls":21},"सूचना प्रोद्योगिकी"]
{"$rows_empty":25}
[{"$nulls":9},{"$f":"SUM(J66:J73)","v":0}]

{"sheet":"SITTING PLAN","index":2,"n_rows":88,"n_cols":27,"rows_kept":88,"merged":[[1,1,1,2],[1,3,1,10],[2,4,2,5],[2,8,2,9],[3,1,3,6],[3,8,3,9],[4,4,4,5],[4,6,4,10],[5,5,5,6],[6,5,6,6],[7,4,7,6],[8,1,12,1],[8,9,12,9],[8,10,12,10],[8,11,12,11],[13,1,17,1],[13,9,17,9],[13,10,17,10],[13,11,17,11],[18,1,22,1],[18,9,22,9],[18,10,22,10],[18,11,22,11],[23,1,27,1],[23,9,27,9],[23,10,27,10],[23,11,27,11],[28,1,32,1],[28,9,32,9],[28,10,32,10],[28,11,32,11],[33,1,37,1],[33,9,37,9],[33,10,37,10],[33,11,37,11],[38,1,42,1],[38,9,42,9],[38,10,42,10],[38,11,42,11],[43,1,47,1],[43,9,47,9],[43,10,47,10],[43,11,47,11],[48,1,52,1],[48,9,52,9],[48,10,52,10],[48,11,52,11],[53,1,57,1],[53,9,57,9],[53,10,57,10],[53,11,57,11],[58,1,62,1],[58,9,62,9],[58,10,62,10],[58,11,62,11],[63,1,67,1],[63,9,67,9],[63,10,67,10],[63,11,67,11],[68,1,72,1],[68,9,72,9],[68,10,72,10],[68,11,72,11],[73,1,77,1],[73,9,77,9],[73,10,77,10],[73,11,77,11],[78,1,82,1],[78,9,82,9],[78,10,82,10],[78,11,82,11],[83,1,87,1],[83,9,87,9],[83,10,87,10],[83,11,87,11]]}
[]
[null,{"$f":"MASTER!B2","v":"परीक्षा केन्द्र का नाम"},null,{"$f":"MASTER!D2","v":"jktdh; mPp ek/;fed fo|ky; vkyfu;kokl ftyk& ukXkkSj"}]
[{"$nulls":3},{"$f":"MASTER!D7","v":"उच्च माध्यमिक परीक्षा"},{"$f":"MASTER!G7","v":2021},{"$nulls":3},"कुल परीक्षार्थी",null,{"$f":"MASTER!H16","v":205}]
[null,"समेकित परीक्षा कक्षवार बैठक व्यवस्था चार्ट",{"$nulls":6},"कुल वीक्षक",null,{"$f":"SUM(L9:L83)","v":9}]
[null,"दिनांक",{"$f":"MASTER!J7","v":"2022-05-25"},null,"विषय",null,{"$f":"MASTER!J6","v":"राजनैतिक विज्ञान"}]
[null,"केन्द्राधीक्षक",1,"परीक्षा प्रभारी",1,"सुपर वाईजर",null,null,{"$f":"IF(K4<=6,1,IF(K4<=12,2,3))","v":2}]
[null,"उपकेन्द्राधीक्षक",1,"पेपर को ऑर्डिनेटर",1,"कुल वीक्षक",null,null,{"$f":"K4","v":9}]
[null,"परीक्षा कक्ष क्रमांक","विद्यालय का चुनाव यहाँ से करे","विद्यालय का नाम","विद्यालयवार अनुक्रमांक",null,null,"IF NSO","पंक्तिवार परीक्षार्थी की संख्या","कुल परीक्षार्थी की संख्या कक्षावार ","कुल परीक्षार्थी की संख्या ","वीक्षक संख्या",{"$nulls":3},"HALL 1",1,{"$f":"MASTER!C9","v":"GSSS ALNIYAWAS1"},{"$f":"MASTER!D9","v":100},{"$f":"MASTER!G9","v":180},{"$f":"MASTER!H9","v":81},null,"हिंदी"]
[null,"HALL 1",1,{"$f":"IF($C9=1,$R$8,IF($C9=2,$R$9,IF($C9=3,$R$10,IF($C9=4,$R$11,IF($C9=5,$R$12,IF($C9=6,$R$13,IF($C9=7,$R$14,\" \")))))))","v":"GSSS ALNIYAWAS1"},{"$f":"IF($D9=MASTER!$C$9,MASTER!$D$9,IF($D9=MASTER!$C$10,MASTER!$D$10,IF($D9=MASTER!$C$11,MASTER!$D$11,IF($D9=MASTER!$C$12,MASTER!$D$12,IF($D9=MASTER!$C$13,MASTER!$D$13,IF($D9=MASTER!$C$14,MASTER!$D$14,IF($D9=MASTER!$C$15,MASTER!$D$15,\" \")))))))","v":100},"से",{"$f":"IF(AA9=\" \",\" \",IF(AA9<MASTER!G9,AA9,MASTER!G9))","v":117},null,18,{"$f":"SUM(I9:I13)","v":45},{"$f":"SUM(J9:J13)","v":45},{"$f":"IF(J9=0,\" \",IF(J9<=30,1,IF(J9>30,2)))","v":2},{"$f":"IF($D9=\" \",\" \",IF($D9=$R8,$U8-$I9,IF($D9=$R9,$U9-$I9,IF($D9=$R10,$U10-$I9,IF($D9=$R11,$U11-$I9,IF($D9=$R12,$U12-$I9,IF($D9=$R13,$U13-$I9,IF($D9=$R14,$U14-$I9))))))))","v":63},null,null,"HALL 2",2,{"$f":"MASTER!C10","v":"GSSS KOD"},{"$f":"MASTER!D10","v":200},{"$f":"MASTER!G10","v":240},{"$f":"MASTER!H10","v":41},null,"हिंदी अनिवार्य",{"$f":"IF(Y9=\" \",\" \",(Y9-I9))","v":63},{"$f":"IF(D9=\" \",\" \",VLOOKUP(D9,MASTER!$C$9:$K$15,6,0))","v":81},null,{"$f":"IF(D9=\" \",\" \",E9+I9+H9-1)","v":117}]
[null,null,2,{"$f":"IF($C10=1,$R$8,IF($C10=2,$R$9,IF($C10=3,$R$10,IF($C10=4,$R$11,IF($C10=5,$R$12,IF($C10=6,$R$13,IF($C10=7,$R$14,\" \")))))))","v":"GSSS KOD"},{"$f":"IF($D10=MASTER!$C$9,MASTER!$D$9,IF($D10=MASTER!$C$10,MASTER!$D$10,IF($D10=MASTER!$C$11,MASTER!$D$11,IF($D10=MASTER!$C$12,MASTER!$D$12,IF($D10=MASTER!$C$13,MASTER!$D$13,IF($D10=MASTER!$C$14,MASTER!$D$14,IF($D10=MASTER!$C$15,MASTER!$D$15,\" \")))))))","v":200},"से",{"$f":"IF(AA10=\" \",\" \",IF(AA10<MASTER!G10,AA10,MASTER!G10))","v":208},null,9,{"$nulls":3},{"$f":"IF($D10=\" \",\" \",IF($D10=$R9,$U9-$I10,IF($D10=$R10,$U10-$I10,IF($D10=$R11,$U11-$I10,IF($D10=$R12,$U12-$I10,IF($D10=$R13,$U13-$I10,IF($D10=$R14,$U14-$I10,IF($D10=$R15,$U15-$I10))))))))","v":32},null,null,"HALL 3",3,{"$f":"MASTER!C11","v":"GSSS LADPURA"},{"$f":"MASTER!D11","v":300},{"$f":"MASTER!G11","v":330},{"$f":"MASTER!H11","v":31},null,"हिंदी साहित्य",{"$f":"IF(Y10=\" \",\" \",(Y10-I10))","v":32},{"$f":"IF(D10=\" \",\" \",VLOOKUP(D10,MASTER!$C$9:$K$15,6,0))","v":41},null,{"$f":"IF(D10=\" \",\" \",E10+I10+H10-1)","v":208}]
[null,null,3,"GSSS LADPURA",{"$f":"IF($D11=MASTER!$C$9,MASTER!$D$9,IF($D11=MASTER!$C$10,MASTER!$D$10,IF($D11=MASTER!$C$11,MASTER!$D$11,IF($D11=MASTER!$C$12,MASTER!$D$12,IF($D11=MASTER!$C$13,MASTER!$D$13,IF($D11=MASTER!$C$14,MASTER!$D$14,IF($D11=MASTER!$C$15,MASTER!$D$15,\" \")))))))","v":300},"से",{"$f":"IF(AA11=\" \",\" \",IF(AA11<MASTER!G11,AA11,MASTER!G11))","v":308},0,9,{"$nulls":3},22,null,null,"LAB ",4,{"$f":"MASTER!C12","v":"GSSS BIJATHAL"},{"$f":"MASTER!D12","v":400},{"$f":"MASTER!G12","v":435},{"$f":"MASTER!H12","v":36},null,"ENGLISH",22,{"$f":"IF(D11=\" \",\" \",VLOOKUP(D11,MASTER!$C$9:$K$15,6,0))","v":31},null,308]
[null,null,4,"GSSS BIJATHAL",{"$f":"IF($D12=MASTER!$C$9,MASTER!$D$9,IF($D12=MASTER!$C$10,MASTER!$D$10,IF($D12=MASTER!$C$11,MASTER!$D$11,IF($D12=MASTER!$C$12,MASTER!$D$12,IF($D12=MASTER!$C$13,MASTER!$D$13,IF($D12=MASTER!$C$14,MASTER!$D$14,IF($D12=MASTER!$C$15,MASTER!$D$15,\" \")))))))","v":400},"से",{"$f":"IF(AA12=\" \",\" \",IF(AA12<MASTER!G12,AA12,MASTER!G12))","v":408},null,9,{"$nulls":3},27,{"$nulls":3},5,{"$f":"MASTER!C13","v":"SHAKBHARI"},{"$f":"MASTER!D13","v":500},{"$f":"MASTER!G13","v":515},{"$f":"MASTER!H13","v":16},null,"ENGLISH COMPULSARY",27,{"$f":"IF(D12=\" \",\" \",VLOOKUP(D12,MASTER!$C$9:$K$15,6,0))","v":36},null,408]
[{"$nulls":3}," ",{"$f":"IF($D13=MASTER!$C$9,MASTER!$D$9,IF($D13=MASTER!$C$10,MASTER!$D$10,IF($D13=MASTER!$C$11,MASTER!$D$11,IF($D13=MASTER!$C$12,MASTER!$D$12,IF($D13=MASTER!$C$13,MASTER!$D$13,IF($D13=MASTER!$C$14,MASTER!$D$14,IF($D13=MASTER!$C$15,MASTER!$D$15,\" \")))))))","v":" "},"से",{"$f":"IF(AA13=\" \",\" \",IF(AA13<MASTER!G13,AA13,MASTER!G13))","v":" "},{"$nulls":5}," ",null,null,1,6,{"$f":"MASTER!C14","v":0},{"$f":"MASTER!D14","v":0},{"$f":"MASTER!G14","v":0},{"$f":"MASTER!H14","v":0},null,"ENGLISH LITERATURE"," ",{"$f":"IF(D13=\" \",\" \",VLOOKUP(D13,MASTER!$C$9:$K$15,6,0))","v":" "},null," "]
[null,"HALL 2",1,"GSSS ALNIYAWAS1",{"$f":"IF($D14=\" \",\" \",IF(D14=\"FALSE\",MATCH($R$8:$R$14,$S$8:$S$14),IF($D14=$D9,$G9+1,IF($D14=$D10,$G10+1,IF($D14=$D11,$G11+1,IF($D14=$D12,$G12+1,IF($D14=$D13,$G13+1,\" \")))))))","v":118},"से",{"$f":"IF(D14=\" \",\" \",E14+I14+H14-1)","v":135},null,18,{"$f":"SUM(I14:I18)","v":45},{"$f":"IF(J9=0,\" \",K9+J14)","v":90},{"$f":"IF(J14=0,\" \",IF(J14<=30,1,IF(J14>30,2)))","v":2},{"$f":"IF($D14=\" \",\" \",IF($D14=$D9,$M9-$I14,IF($D14=$D10,$M10-$I14,IF($D14=$D11,$M11-$I14,IF($D14=$D12,$M12-$I14,IF($D14=$D13,$M14-$I14))))))","v":45},null,null,2,null,{"$f":"MASTER!C15","v":0},{"$f":"MASTER!D15","v":0},{"$f":"MASTER!G15","v":0},{"$f":"MASTER!H15","v":0},null,"इतिहास",null,{"$f":"IF(D14=\" \",\" \",VLOOKUP(D14,MASTER!$C$9:$K$15,6,0))","v":81},null,135]
[null,null,2,"GSSS KOD",{"$f":"IF($D15=\" \",\" \",IF(D15=\"FALSE\",MATCH($R$8:$R$14,$S$8:$S$14),IF($D15=$D10,$G10+1,IF($D15=$D11,$G11+1,IF($D15=$D12,$G12+1,IF($D15=$D13,$G13+1,IF($D15=$D14,$G14+1,\" \")))))))","v":209},"से",{"$f":"IF(D15=\" \",\" \",E15+I15+H15-1)","v":217},null,9,{"$nulls":3},{"$f":"IF($D15=\" \",\" \",IF($D15=$D10,$M10-$I15,IF($D15=$D11,$M11-$I15,IF($D15=$D12,$M12-$I15,IF($D15=$D13,$M13-$I15,IF($D15=$D14,$M15-$I15))))))","v":23},null,null,3,7,{"$nulls":5},"राजनैतिक विज्ञान",null,{"$f":"IF(D15=\" \",\" \",VLOOKUP(D15,MASTER!$C$9:$K$15,6,0))","v":41},null,217]
[null,null,3,"GSSS LADPURA",309,"से",317,0,9,{"$nulls":3},13,null,null,4,8,{"$nulls":5},"भूगोल",null,{"$f":"IF(D16=\" \",\" \",VLOOKUP(D16,MASTER!$C$9:$K$15,6,0))","v":31},null,317]
[null,null,4,"GSSS BIJATHAL",409,"से",417,null,9,{"$nulls":3},18,null,null,5,9,{"$nulls":5},"अर्थशास्त्र",null,{"$f":"IF(D17=\" \",\" \",VLOOKUP(D17,MASTER!$C$9:$K$15,6,0))","v":36},null,417]
[{"$nulls":3}," "," ","से"," ",{"$nulls":5}," ",null,null,6,10,{"$nulls":7},{"$f":"IF(D18=\" \",\" \",VLOOKUP(D18,MASTER!$C$9:$K$15,6,0))","v":" "},null," "]
[null,"HALL 3",1,"GSSS ALNIYAWAS1",{"$f":"IF($D19=\" \",\" \",IF($D19=$D14,$G14+1,IF($D19=$D15,$G15+1,IF($D19=$D16,$G16+1,IF($D19=$D17,$G17+1,IF($D19=$D18,$G18+1,\" \"))))))","v":136},"से",153,null,18,{"$f":"SUM(I19:I23)","v":45},{"$f":"IF(J14=0,\" \",K14+J19)","v":135},{"$f":"IF(J19=0,\" \",IF(J19<=30,1,IF(J19>30,2)))","v":2},{"$f":"IF($D19=\" \",\" \",IF($D19=$D14,$M14-$I19,IF($D19=$D15,$M15-$I19,IF($D19=$D16,$M16-$I19,IF($D19=$D17,$M17-$I19,IF($D19=$D18,$M19-$I19))))))","v":27},null,null,7,11,{"$nulls":7},{"$f":"IF(D19=\" \",\" \",VLOOKUP(D19,MASTER!$C$9:$K$15,6,0))","v":81},null,153]
[null,null,2,"GSSS KOD",218,"से",226,null,9,{"$nulls":3},14,null,null,8,12,{"$nulls":7},{"$f":"IF(D20=\" \",\" \",VLOOKUP(D20,MASTER!$C$9:$K$15,6,0))","v":41},null,226]
[null,null,3,"GSSS LADPURA",318,"से",326,null,9,{"$nulls":3},4,null,null,9,13,{"$nulls":7},{"$f":"IF(D21=\" \",\" \",VLOOKUP(D21,MASTER!$C$9:$K$15,6,0))","v":31},null,326]
[null,null,4,"GSSS BIJATHAL",418,"से",426,null,9,{"$nulls":3},9,null,null,10,14,{"$nulls":7},{"$f":"IF(D22=\" \",\" \",VLOOKUP(D22,MASTER!$C$9:$K$15,6,0))","v":36},null,426]
[{"$nulls":3}," "," ","से"," ",{"$nulls":5}," ",null,null,11,15,{"$nulls":7},{"$f":"IF(D23=\" \",\" \",VLOOKUP(D23,MASTER!$C$9:$K$15,6,0))","v":" "},null," "]
[null,1,1,"GSSS ALNIYAWAS1",154,"से",159,null,6,{"$f":"SUM(I24:I28)","v":22},{"$f":"IF(J19=0,\" \",K19+J24)","v":157},{"$f":"IF(J24=0,\" \",IF(J24<=30,1,IF(J24>30,2)))","v":1},21,null,null,12,16,{"$nulls":7},{"$f":"IF(D24=\" \",\" \",VLOOKUP(D24,MASTER!$C$9:$K$15,6,0))","v":81},null,159]
[null,null,2,"GSSS KOD",227,"से",232,null,6,{"$nulls":3},8,null,null,13,17,{"$nulls":7},{"$f":"IF(D25=\" \",\" \",VLOOKUP(D25,MASTER!$C$9:$K$15,6,0))","v":41},null,232]
[null,null,3,"GSSS LADPURA",327,"से",330,null,4,{"$nulls":3},0,null,null,14,18,{"$nulls":7},{"$f":"IF(D26=\" \",\" \",VLOOKUP(D26,MASTER!$C$9:$K$15,6,0))","v":31},null,330]
[null,null,4,"GSSS BIJATHAL",427,"से",432,null,6,{"$nulls":3},3,null,null,15,19,{"$nulls":7},{"$f":"IF(D27=\" \",\" \",VLOOKUP(D27,MASTER!$C$9:$K$15,6,0))","v":36},null,432]
[{"$nulls":3}," "," ","से"," ",{"$nulls":5}," ",null,null,16,20,{"$nulls":7},{"$f":"IF(D28=\" \",\" \",VLOOKUP(D28,MASTER!$C$9:$K$15,6,0))","v":" "},null," "]
[null,2,1,"GSSS ALNIYAWAS1",160,"से",165,null,6,{"$f":"SUM(I29:I33)","v":24},{"$f":"IF(J24=0,\" \",K24+J29)","v":181},{"$f":"IF(J29=0,\" \",IF(J29<=30,1,IF(J29>30,2)))","v":1},15,null,null,17,21,{"$nulls":7},{"$f":"IF(D29=\" \",\" \",VLOOKUP(D29,MASTER!$C$9:$K$15,6,0))","v":81},null,165]
[null,null,2,"GSSS KOD",233,"से",238,null,6,{"$nulls":3},2,null,null,18,22,{"$nulls":7},{"$f":"IF(D30=\" \",\" \",VLOOKUP(D30,MASTER!$C$9:$K$15,6,0))","v":41},null,238]
[null,null,5,"SHAKBHARI",500,"से",508,null,9,{"$nulls":3},false,null,null,19,23,{"$nulls":7},{"$f":"IF(D31=\" \",\" \",VLOOKUP(D31,MASTER!$C$9:$K$15,6,0))","v":16},null,508]
[null,null,4,"GSSS BIJATHAL",433,"से",435,null,3,{"$nulls":3},0,{"$nulls":3},24,{"$nulls":7},{"$f":"IF(D32=\" \",\" \",VLOOKUP(D32,MASTER!$C$9:$K$15,6,0))","v":36},null,435]
[{"$nulls":3}," ",null,"से"," ",{"$nulls":5},5,{"$nulls":11},{"$f":"IF(D33=\" \",\" \",VLOOKUP(D33,MASTER!$C$9:$K$15,6,0))","v":" "},null," "]
[null,3,1,"GSSS ALNIYAWAS1",166,"से",171,null,6,24,{"$f":"IF(J29=0,\" \",K29+J34)","v":205},{"$f":"IF(J34=0,\" \",IF(J34<=30,1,IF(J34>30,2)))","v":1},9,{"$nulls":11},{"$f":"IF(D34=\" \",\" \",VLOOKUP(D34,MASTER!$C$9:$K$15,6,0))","v":81},null,171]
[null,null,2,"GSSS KOD",239,"से",240,null,2,{"$nulls":3},0,{"$nulls":11},{"$f":"IF(D35=\" \",\" \",VLOOKUP(D35,MASTER!$C$9:$K$15,6,0))","v":41},null,240]
[null,null,1,"GSSS ALNIYAWAS1",172,"से",180,null,9,{"$nulls":3},0,{"$nulls":11},{"$f":"IF(D36=\" \",\" \",VLOOKUP(D36,MASTER!$C$9:$K$15,6,0))","v":81},null,180]
[null,null,5,"SHAKBHARI",509,"से",515,null,7,{"$nulls":3},false,{"$nulls":11},{"$f":"IF(D37=\" \",\" \",VLOOKUP(D37,MASTER!$C$9:$K$15,6,0))","v":16},null,515]
[{"$nulls":3}," "," ","से"," ",{"$nulls":5}," ",{"$nulls":11},{"$f":"IF(D38=\" \",\" \",VLOOKUP(D38,MASTER!$C$9:$K$15,6,0))","v":" "},null," "]
[{"$nulls":3}," "," ","से"," ",null,null,{"$f":"SUM(I39:I43)","v":0},{"$f":"IF(J39=0,\" \",K34+J39)","v":" "},{"$f":"IF(J39=0,\" \",IF(J39<=30,1,IF(J39>30,2)))","v":" "}," ",{"$nulls":11},{"$f":"IF(D39=\" \",\" \",VLOOKUP(D39,MASTER!$C$9:$K$15,6,0))","v":" "},null," "]
[{"$nulls":3}," "," ","से"," ",{"$nulls":5}," ",{"$nulls":11},{"$f":"IF(D40=\" \",\" \",VLOOKUP(D40,MASTER!$C$9:$K$15,6,0))","v":" "},null," "]
[{"$nulls":3}," "," ","से"," ",{"$nulls":5}," ",{"$nulls":11},{"$f":"IF(D41=\" \",\" \",VLOOKUP(D41,MASTER!$C$9:$K$15,6,0))","v":" "},null," "]
[{"$nulls":3}," "," ","से"," ",{"$nulls":5}," ",{"$nulls":11},{"$f":"IF(D42=\" \",\" \",VLOOKUP(D42,MASTER!$C$9:$K$15,6,0))","v":" "},null," "]
[{"$nulls":3}," "," ","से"," ",{"$nulls":5}," ",{"$nulls":11},{"$f":"IF(D43=\" \",\" \",VLOOKUP(D43,MASTER!$C$9:$K$15,6,0))","v":" "},null," "]
[{"$nulls":3}," "," ","से"," ",null,null,{"$f":"SUM(I44:I48)","v":0},{"$f":"IF(J44=0,\" \",K39+J44)","v":" "},{"$f":"IF(J44=0,\" \",IF(J44<=30,1,IF(J44>30,2)))","v":" "}," ",{"$nulls":11},{"$f":"IF(D44=\" \",\" \",VLOOKUP(D44,MASTER!$C$9:$K$15,6,0))","v":" "},null," "]
[{"$nulls":3}," "," ","से"," ",{"$nulls":5}," ",{"$nulls":11},{"$f":"IF(D45=\" \",\" \",VLOOKUP(D45,MASTER!$C$9:$K$15,6,0))","v":" "},null," "]
[{"$nulls":3}," "," ","से"," ",{"$nulls":5}," ",{"$nulls":11},{"$f":"IF(D46=\" \",\" \",VLOOKUP(D46,MASTER!$C$9:$K$15,6,0))","v":" "},null," "]
[{"$nulls":3}," "," ","से"," ",{"$nulls":5}," ",{"$nulls":11},{"$f":"IF(D47=\" \",\" \",VLOOKUP(D47,MASTER!$C$9:$K$15,6,0))","v":" "},null," "]
[{"$nulls":3}," "," ","से"," ",{"$nulls":5}," ",{"$nulls":11},{"$f":"IF(D48=\" \",\" \",VLOOKUP(D48,MASTER!$C$9:$K$15,6,0))","v":" "},null," "]
[{"$nulls":3}," "," ","से"," ",null,null,{"$f":"SUM(I49:I53)","v":0},{"$f":"IF(J49=0,\" \",K44+J49)","v":" "},{"$f":"IF(J49=0,\" \",IF(J49<=30,1,IF(J49>30,2)))","v":" "}," ",{"$nulls":11},{"$f":"IF(D49=\" \",\" \",VLOOKUP(D49,MASTER!$C$9:$K$15,6,0))","v":" "},null," "]
[{"$nulls":3}," "," ","से"," ",{"$nulls":5}," ",{"$nulls":11},{"$f":"IF(D50=\" \",\" \",VLOOKUP(D50,MASTER!$C$9:$K$15,6,0))","v":" "},null," "]
[{"$nulls":3}," "," ","से"," ",{"$nulls":5}," ",{"$nulls":11},{"$f":"IF(D51=\" \",\" \",VLOOKUP(D51,MASTER!$C$9:$K$15,6,0))","v":" "},null," "]
[{"$nulls":3}," "," ","से"," ",{"$nulls":5},41,{"$nulls":11},{"$f":"IF(D52=\" \",\" \",VLOOKUP(D52,MASTER!$C$9:$K$15,6,0))","v":" "},null," "]
[{"$nulls":3}," "," ","से"," ",{"$nulls":5}," ",{"$nulls":11},{"$f":"IF(D53=\" \",\" \",VLOOKUP(D53,MASTER!$C$9:$K$15,6,0))","v":" "},null," "]
[{"$nulls":3}," "," ","से"," ",null,null,{"$f":"SUM(I54:I58)","v":0},{"$f":"IF(J54=0,\" \",K49+J54)","v":" "},{"$f":"IF(J54=0,\" \",IF(J54<=30,1,IF(J54>30,2)))","v":" "},32,{"$nulls":11},{"$f":"IF(D54=\" \",\" \",VLOOKUP(D54,MASTER!$C$9:$K$15,6,0))","v":" "},null," "]
[{"$nulls":3}," "," ","से"," ",{"$nulls":5},23,{"$nulls":11},{"$f":"IF(D55=\" \",\" \",VLOOKUP(D55,MASTER!$C$9:$K$15,6,0))","v":" "},null," "]
[{"$nulls":3}," "," ","से"," ",{"$nulls":5},14,{"$nulls":11},{"$f":"IF(D56=\" \",\" \",VLOOKUP(D56,MASTER!$C$9:$K$15,6,0))","v":" "},null," "]
[{"$nulls":3}," "," ","से"," ",{"$nulls":5},5,{"$nulls":11},{"$f":"IF(D57=\" \",\" \",VLOOKUP(D57,MASTER!$C$9:$K$15,6,0))","v":" "},null," "]
[{"$nulls":3}," "," ","से"," ",{"$nulls":5}," ",{"$nulls":11},{"$f":"IF(D58=\" \",\" \",VLOOKUP(D58,MASTER!$C$9:$K$15,6,0))","v":" "},null," "]
[{"$nulls":3}," "," ","से"," ",null,null,{"$f":"SUM(I59:I63)","v":0},{"$f":"IF(J59=0,\" \",K54+J59)","v":" "},{"$f":"IF(J59=0,\" \",IF(J59<=30,1,IF(J59>30,2)))","v":" "}," ",{"$nulls":11},{"$f":"IF(D59=\" \",\" \",VLOOKUP(D59,MASTER!$C$9:$K$15,6,0))","v":" "},null," "]
[{"$nulls":3}," "," ","से"," ",{"$nulls":5}," ",{"$nulls":11},{"$f":"IF(D60=\" \",\" \",VLOOKUP(D60,MASTER!$C$9:$K$15,6,0))","v":" "},null," "]
[{"$nulls":3}," "," ","से"," ",{"$nulls":5}," ",{"$nulls":11},{"$f":"IF(D61=\" \",\" \",VLOOKUP(D61,MASTER!$C$9:$K$15,6,0))","v":" "},null," "]
[{"$nulls":3}," "," ","से"," ",{"$nulls":5}," ",{"$nulls":11},{"$f":"IF(D62=\" \",\" \",VLOOKUP(D62,MASTER!$C$9:$K$15,6,0))","v":" "},null," "]
[{"$nulls":3}," "," ","से"," ",{"$nulls":5}," ",{"$nulls":11},{"$f":"IF(D63=\" \",\" \",VLOOKUP(D63,MASTER!$C$9:$K$15,6,0))","v":" "},null," "]
[{"$nulls":3}," "," ","से"," ",null,null,{"$f":"SUM(I64:I68)","v":0},{"$f":"IF(J64=0,\" \",K59+J64)","v":" "},{"$f":"IF(J64=0,\" \",IF(J64<=30,1,IF(J64>30,2)))","v":" "}," ",{"$nulls":11},{"$f":"IF(D64=\" \",\" \",VLOOKUP(D64,MASTER!$C$9:$K$15,6,0))","v":" "},null," "]
[{"$nulls":3}," "," ","से"," ",{"$nulls":5}," ",{"$nulls":11},{"$f":"IF(D65=\" \",\" \",VLOOKUP(D65,MASTER!$C$9:$K$15,6,0))","v":" "},null," "]
[{"$nulls":3}," "," ","से"," ",{"$nulls":5}," ",{"$nulls":11},{"$f":"IF(D66=\" \",\" \",VLOOKUP(D66,MASTER!$C$9:$K$15,6,0))","v":" "},null," "]
[{"$nulls":3}," "," ","से"," ",{"$nulls":5}," ",{"$nulls":11},{"$f":"IF(D67=\" \",\" \",VLOOKUP(D67,MASTER!$C$9:$K$15,6,0))","v":" "},null," "]
[{"$nulls":3}," "," ","से"," ",{"$nulls":5}," ",{"$nulls":11},{"$f":"IF(D68=\" \",\" \",VLOOKUP(D68,MASTER!$C$9:$K$15,6,0))","v":" "},null," "]
[{"$nulls":3}," "," ","से"," ",null,null,{"$f":"SUM(I69:I73)","v":0},{"$f":"IF(J69=0,\" \",K64+J69)","v":" "},{"$f":"IF(J69=0,\" \",IF(J69<=30,1,IF(J69>30,2)))","v":" "}," ",{"$nulls":11},{"$f":"IF(D69=\" \",\" \",VLOOKUP(D69,MASTER!$C$9:$K$15,6,0))","v":" "},null," "]
[{"$nulls":3}," "," ","से"," ",{"$nulls":5}," ",{"$nulls":11},{"$f":"IF(D70=\" \",\" \",VLOOKUP(D70,MASTER!$C$9:$K$15,6,0))","v":" "},null," "]
[{"$nulls":3}," "," ","से"," ",{"$nulls":5}," ",{"$nulls":11},{"$f":"IF(D71=\" \",\" \",VLOOKUP(D71,MASTER!$C$9:$K$15,6,0))","v":" "},null," "]
[{"$nulls":3}," "," ","से"," ",{"$nulls":5}," ",{"$nulls":11},{"$f":"IF(D72=\" \",\" \",VLOOKUP(D72,MASTER!$C$9:$K$15,6,0))","v":" "},null," "]
[{"$nulls":3}," "," ","से"," ",{"$nulls":5}," ",{"$nulls":11},{"$f":"IF(D73=\" \",\" \",VLOOKUP(D73,MASTER!$C$9:$K$15,6,0))","v":" "},null," "]
[{"$nulls":3},{"$f":"IF($C74=1,$R$8,IF($C74=2,$R$9,IF($C74=3,$R$10,IF($C74=4,$R$11,IF($C74=5,$R$12,IF($C74=6,$R$13,IF($C74=7,$R$14,\" \")))))))","v":" "}," ","से"," ",null,null,{"$f":"SUM(I74:I78)","v":0},{"$f":"IF(J74=0,\" \",K69+J74)","v":" "},{"$f":"IF(J74=0,\" \",IF(J74<=30,1,IF(J74>30,2)))","v":" "}," ",{"$nulls":11},{"$f":"IF(D74=\" \",\" \",VLOOKUP(D74,MASTER!$C$9:$K$15,6,0))","v":" "},null,{"$f":"IF(D74=\" \",\" \",E74+I74+H74-1)","v":" "}]
[{"$nulls":3}," "," ","से"," ",{"$nulls":5}," ",{"$nulls":11},{"$f":"IF(D75=\" \",\" \",VLOOKUP(D75,MASTER!$C$9:$K$15,6,0))","v":" "},null," "]
[{"$nulls":3}," "," ","से"," ",{"$nulls":5}," ",{"$nulls":11},{"$f":"IF(D76=\" \",\" \",VLOOKUP(D76,MASTER!$C$9:$K$15,6,0))","v":" "},null," "]
[{"$nulls":3}," "," ","से"," ",{"$nulls":5}," ",{"$nulls":11},{"$f":"IF(D77=\" \",\" \",VLOOKUP(D77,MASTER!$C$9:$K$15,6,0))","v":" "},null," "]
[{"$nulls":3}," "," ","से"," ",{"$nulls":5}," ",{"$nulls":11},{"$f":"IF(D78=\" \",\" \",VLOOKUP(D78,MASTER!$C$9:$K$15,6,0))","v":" "},null," "]
[{"$nulls":3}," "," ","से",{"$f":"IF(D79=\" \",\" \",E79+I79+H79-1)","v":" "},null,null,{"$f":"SUM(I79:I83)","v":0},{"$f":"IF(J79=0,\" \",K74+J79)","v":" "},{"$f":"IF(J79=0,\" \",IF(J79<=30,1,IF(J79>30,2)))","v":" "},{"$f":"IF($D79=\" \",\" \",IF($D79=$D74,$M74-$I79,IF($D79=$D75,$M75-$I79,IF($D79=$D76,$M76-$I79,IF($D79=$D77,$M77-$I79,IF($D79=$D78,$M79-$I79))))))","v":" "},{"$nulls":11},{"$f":"IF(D79=\" \",\" \",VLOOKUP(D79,MASTER!$C$9:$K$15,6,0))","v":" "},null," "]
[{"$nulls":3}," "," ","से"," ",{"$nulls":5}," ",{"$nulls":11},{"$f":"IF(D80=\" \",\" \",VLOOKUP(D80,MASTER!$C$9:$K$15,6,0))","v":" "},null," "]
[{"$nulls":3}," "," ","से"," ",{"$nulls":5}," ",{"$nulls":11},{"$f":"IF(D81=\" \",\" \",VLOOKUP(D81,MASTER!$C$9:$K$15,6,0))","v":" "},null," "]
[{"$nulls":3}," "," ","से"," ",{"$nulls":5}," ",{"$nulls":11},{"$f":"IF(D82=\" \",\" \",VLOOKUP(D82,MASTER!$C$9:$K$15,6,0))","v":" "},null," "]
[{"$nulls":3}," "," ","से"," ",{"$nulls":5}," ",{"$nulls":11},{"$f":"IF(D83=\" \",\" \",VLOOKUP(D83,MASTER!$C$9:$K$15,6,0))","v":" "},null," "]
[null,13,null," "," ","से",{"$f":"IF(D84=\" \",\" \",E84+I84+H84-1)","v":" "},null,null,{"$f":"SUM(I84:I88)","v":0},{"$f":"IF(J84=0,\" \",K79+J84)","v":" "},{"$f":"IF(J84=0,\" \",IF(J84<=30,1,IF(J84>30,2)))","v":" "}]
[{"$nulls":3}," ",{"$f":"IF($D85=\" \",\" \",IF($D85=$D80,$G80+1,IF($D85=$D81,$G81+1,IF($D85=$D82,$G82+1,IF($D85=$D83,$G83+1,IF($D85=$D84,$G84+1,\" \"))))))","v":" "},"से"," "]
[{"$nulls":3}," "," ","से"," "]
[{"$nulls":3}," "," ","से"," "]
[{"$nulls":3}," "," ","से"," "]

{"sheet":"SITTING ROOM","index":3,"n_rows":31,"n_cols":27,"rows_kept":31,"merged":[[1,1,1,3],[2,1,2,5],[3,1,3,2],[24,2,24,3],[30,3,30,4]]}
[]
[null,{"$f":"MASTER!D7","v":"उच्च माध्यमिक परीक्षा"},null,null,{"$f":"MASTER!G7","v":2021},{"$nulls":4},"HALL 1","RO"]
[null,"बैठक व्यवस्था",{"$nulls":7},"HALL 2"]
[null,{"$f":"'SITTING PLAN'!B8","v":"परीक्षा कक्ष क्रमांक"},null,3,{"$f":"MASTER!B6","v":"बोर्ड परीक्षा केंद्र क्रमांक"},{"$f":"MASTER!D6","v":119050},{"$nulls":3},"HALL 3",null,1,2,3,4,5,6,7,8,9,10,11,12,13,14,15,16]
[{"$nulls":9},"LAB ",null,{"$f":"'SITTING PLAN'!B9","v":"HALL 1"},{"$f":"'SITTING PLAN'!D9","v":"GSSS ALNIYAWAS1"},{"$f":"'SITTING PLAN'!D10","v":"GSSS KOD"},{"$f":"'SITTING PLAN'!D11","v":"GSSS LADPURA"},{"$f":"'SITTING PLAN'!D12","v":"GSSS BIJATHAL"},{"$f":"'SITTING PLAN'!D13","v":" "},{"$f":"'SITTING PLAN'!$E9","v":100},{"$f":"'SITTING PLAN'!$E10","v":200},{"$f":"'SITTING PLAN'!$E11","v":300},{"$f":"'SITTING PLAN'!$E12","v":400},{"$f":"'SITTING PLAN'!$E13","v":" "},{"$f":"'SITTING PLAN'!$I$9","v":18},{"$f":"'SITTING PLAN'!$I$10","v":9},{"$f":"'SITTING PLAN'!$I$11","v":9},{"$f":"'SITTING PLAN'!$I$12","v":9},{"$f":"'SITTING PLAN'!$I$13","v":0}]
[null,{"$f":"VLOOKUP($D$4,TIME1,2,0)","v":"GSSS ALNIYAWAS1"},{"$f":"VLOOKUP($D$4,TIME1,3,0)","v":"GSSS KOD"},{"$f":"VLOOKUP($D$4,TIME1,4,0)","v":"GSSS ALNIYAWAS1"},{"$f":"VLOOKUP($D$4,TIME1,5,0)","v":"SHAKBHARI"},{"$f":"VLOOKUP($D$4,TIME1,6,0)","v":" "},{"$nulls":3},1,null,{"$f":"'SITTING PLAN'!B14","v":"HALL 2"},{"$f":"'SITTING PLAN'!D14","v":"GSSS ALNIYAWAS1"},{"$f":"'SITTING PLAN'!D15","v":"GSSS KOD"},{"$f":"'SITTING PLAN'!D16","v":"GSSS LADPURA"},{"$f":"'SITTING PLAN'!D17","v":"GSSS BIJATHAL"},{"$f":"'SITTING PLAN'!D18","v":" "},{"$f":"'SITTING PLAN'!$E14","v":118},{"$f":"'SITTING PLAN'!$E15","v":209},{"$f":"'SITTING PLAN'!$E16","v":309},{"$f":"'SITTING PLAN'!$E17","v":409},{"$f":"'SITTING PLAN'!$E18","v":" "},{"$f":"'SITTING PLAN'!$I14","v":18},{"$f":"'SITTING PLAN'!$I15","v":9},{"$f":"'SITTING PLAN'!$I16","v":9},{"$f":"'SITTING PLAN'!$I17","v":9},{"$f":"'SITTING PLAN'!$I18","v":0}]
[null,{"$f":"VLOOKUP($D$4,$L$5:$W$21,7,0)","v":166},{"$f":"VLOOKUP($D$4,$L$5:$W$21,8,0)","v":239},{"$f":"VLOOKUP($D$4,$L$5:$W$21,9,0)","v":172},{"$f":"VLOOKUP($D$4,$L$5:$W$21,10,0)","v":509},109,{"$nulls":3},2,null,{"$f":"'SITTING PLAN'!B19","v":"HALL 3"},{"$f":"'SITTING PLAN'!$D19","v":"GSSS ALNIYAWAS1"},{"$f":"'SITTING PLAN'!$D20","v":"GSSS KOD"},{"$f":"'SITTING PLAN'!$D21","v":"GSSS LADPURA"},{"$f":"'SITTING PLAN'!$D22","v":"GSSS BIJATHAL"},{"$f":"'SITTING PLAN'!$D23","v":" "},{"$f":"'SITTING PLAN'!$E19","v":136},{"$f":"'SITTING PLAN'!$E20","v":218},{"$f":"'SITTING PLAN'!$E21","v":318},{"$f":"'SITTING PLAN'!$E22","v":418},{"$f":"'SITTING PLAN'!$E23","v":" "},{"$f":"'SITTING PLAN'!$I19","v":18},{"$f":"'SITTING PLAN'!$I20","v":9},{"$f":"'SITTING PLAN'!$I21","v":9},{"$f":"'SITTING PLAN'!$I22","v":9},{"$f":"'SITTING PLAN'!$I23","v":0}]
[null,{"$f":"IF(B7=\" \",\" \",IF(B7=$D$26,\" \",B7+1))","v":167},{"$f":"IF(C7=\" \",\" \",IF(C7=$D$27,\" \",C7+1))","v":240},{"$f":"IF(D7=\" \",\" \",IF(D7=$D$28,\" \",D7+1))","v":173},{"$f":"IF(E7=\" \",\" \",IF(E7=$D$29,\" \",E7+1))","v":510},{"$f":"IF(F7=\" \",\" \",IF(F7=$D$30,\" \",F7+1))","v":110},{"$nulls":3},3,null,{"$f":"'SITTING PLAN'!B24","v":1},{"$f":"'SITTING PLAN'!$D$24","v":"GSSS ALNIYAWAS1"},{"$f":"'SITTING PLAN'!$D$25","v":"GSSS KOD"},{"$f":"'SITTING PLAN'!$D$26","v":"GSSS LADPURA"},{"$f":"'SITTING PLAN'!$D$27","v":"GSSS BIJATHAL"},{"$f":"'SITTING PLAN'!$D$28","v":" "},{"$f":"'SITTING PLAN'!$E24","v":154},{"$f":"'SITTING PLAN'!$E25","v":227},{"$f":"'SITTING PLAN'!$E26","v":327},{"$f":"'SITTING PLAN'!$E27","v":427},{"$f":"'SITTING PLAN'!$E28","v":" "},{"$f":"'SITTING PLAN'!I24","v":6},{"$f":"'SITTING PLAN'!I25","v":6},{"$f":"'SITTING PLAN'!I26","v":4},{"$f":"'SITTING PLAN'!I27","v":6},{"$f":"'SITTING PLAN'!I28","v":0}]
[null,{"$f":"IF(B8=\" \",\" \",IF(B8=$D$26,\" \",B8+1))","v":168},{"$f":"IF(C8=\" \",\" \",IF(C8=$D$27,\" \",C8+1))","v":" "},{"$f":"IF(D8=\" \",\" \",IF(D8=$D$28,\" \",D8+1))","v":174},{"$f":"IF(E8=\" \",\" \",IF(E8=$D$29,\" \",E8+1))","v":511},{"$f":"IF(F8=\" \",\" \",F8+1)","v":111},{"$nulls":3},4,null,{"$f":"'SITTING PLAN'!B29","v":2},{"$f":"'SITTING PLAN'!$D$29","v":"GSSS ALNIYAWAS1"},{"$f":"'SITTING PLAN'!$D$30","v":"GSSS KOD"},{"$f":"'SITTING PLAN'!$D$31","v":"SHAKBHARI"},{"$f":"'SITTING PLAN'!$D$32","v":"GSSS BIJATHAL"},{"$f":"'SITTING PLAN'!$D$33","v":" "},{"$f":"'SITTING PLAN'!$E29","v":160},{"$f":"'SITTING PLAN'!$E30","v":233},{"$f":"'SITTING PLAN'!$E31","v":500},{"$f":"'SITTING PLAN'!$E32","v":433},{"$f":"'SITTING PLAN'!$E33","v":0},{"$f":"'SITTING PLAN'!I29","v":6},{"$f":"'SITTING PLAN'!I30","v":6},{"$f":"'SITTING PLAN'!I31","v":9},{"$f":"'SITTING PLAN'!I32","v":3},{"$f":"'SITTING PLAN'!I33","v":0}]
[null,169," ",175,512,112,{"$nulls":3},5,null,{"$f":"'SITTING PLAN'!B34","v":3},{"$f":"'SITTING PLAN'!$D$34","v":"GSSS ALNIYAWAS1"},{"$f":"'SITTING PLAN'!$D$35","v":"GSSS KOD"},{"$f":"'SITTING PLAN'!$D$36","v":"GSSS ALNIYAWAS1"},{"$f":"'SITTING PLAN'!$D$37","v":"SHAKBHARI"},{"$f":"'SITTING PLAN'!$D$38","v":" "},{"$f":"'SITTING PLAN'!$E34","v":166},{"$f":"'SITTING PLAN'!$E35","v":239},{"$f":"'SITTING PLAN'!$E36","v":172},{"$f":"'SITTING PLAN'!$E37","v":509},{"$f":"'SITTING PLAN'!$E38","v":" "},{"$f":"'SITTING PLAN'!I34","v":6},{"$f":"'SITTING PLAN'!I35","v":2},{"$f":"'SITTING PLAN'!I36","v":9},{"$f":"'SITTING PLAN'!I37","v":7},{"$f":"'SITTING PLAN'!I38","v":0}]
[null,170," ",176,513,113,{"$nulls":3},6,null,{"$f":"'SITTING PLAN'!B39","v":0},{"$f":"'SITTING PLAN'!$D$39","v":" "},{"$f":"'SITTING PLAN'!$D$40","v":" "},{"$f":"'SITTING PLAN'!$D$41","v":" "},{"$f":"'SITTING PLAN'!$D$42","v":" "},{"$f":"'SITTING PLAN'!$D$43","v":" "},{"$f":"'SITTING PLAN'!$E39","v":" "},{"$f":"'SITTING PLAN'!$E40","v":" "},{"$f":"'SITTING PLAN'!$E41","v":" "},{"$f":"'SITTING PLAN'!$E42","v":" "},{"$f":"'SITTING PLAN'!$E43","v":" "},{"$f":"'SITTING PLAN'!I39","v":0},{"$f":"'SITTING PLAN'!I40","v":0},{"$f":"'SITTING PLAN'!I41","v":0},{"$f":"'SITTING PLAN'!I42","v":0},{"$f":"'SITTING PLAN'!I43","v":0}]
[null,171," ",177,514,114,{"$nulls":3},7,null,{"$f":"'SITTING PLAN'!B44","v":0},{"$f":"'SITTING PLAN'!$D$44","v":" "},{"$f":"'SITTING PLAN'!$D$45","v":" "},{"$f":"'SITTING PLAN'!$D$46","v":" "},{"$f":"'SITTING PLAN'!$D$47","v":" "},{"$f":"'SITTING PLAN'!$D$48","v":" "},{"$f":"'SITTING PLAN'!$E44","v":" "},{"$f":"'SITTING PLAN'!$E45","v":" "},{"$f":"'SITTING PLAN'!$E46","v":" "},{"$f":"'SITTING PLAN'!$E47","v":" "},{"$f":"'SITTING PLAN'!$E48","v":" "},{"$f":"'SITTING PLAN'!I44","v":0},{"$f":"'SITTING PLAN'!I45","v":0},{"$f":"'SITTING PLAN'!I46","v":0},{"$f":"'SITTING PLAN'!I47","v":0},{"$f":"'SITTING PLAN'!I48","v":0}]
[null," "," ",178,515,115,{"$nulls":3},8,null,{"$f":"'SITTING PLAN'!B49","v":0},{"$f":"'SITTING PLAN'!$D$49","v":" "},{"$f":"'SITTING PLAN'!$D$50","v":" "},{"$f":"'SITTING PLAN'!$D$51","v":" "},{"$f":"'SITTING PLAN'!$D$52","v":" "},{"$f":"'SITTING PLAN'!$D$53","v":" "},{"$f":"'SITTING PLAN'!$E49","v":" "},{"$f":"'SITTING PLAN'!$E50","v":" "},{"$f":"'SITTING PLAN'!$E51","v":" "},{"$f":"'SITTING PLAN'!$E52","v":" "},{"$f":"'SITTING PLAN'!$E53","v":" "},{"$f":"'SITTING PLAN'!I49","v":0},{"$f":"'SITTING PLAN'!I50","v":0},{"$f":"'SITTING PLAN'!I51","v":0},{"$f":"'SITTING PLAN'!I52","v":0},{"$f":"'SITTING PLAN'!I53","v":0}]
[null," "," ",179," ",116,{"$nulls":3},9,null,{"$f":"'SITTING PLAN'!B54","v":0},{"$f":"'SITTING PLAN'!$D$54","v":" "},{"$f":"'SITTING PLAN'!$D$55","v":" "},{"$f":"'SITTING PLAN'!$D$56","v":" "},{"$f":"'SITTING PLAN'!$D$57","v":" "},{"$f":"'SITTING PLAN'!$D$58","v":" "},{"$f":"'SITTING PLAN'!$E54","v":" "},{"$f":"'SITTING PLAN'!$E55","v":" "},{"$f":"'SITTING PLAN'!$E56","v":" "},{"$f":"'SITTING PLAN'!$E57","v":" "},{"$f":"'SITTING PLAN'!$E58","v":" "},{"$f":"'SITTING PLAN'!I54","v":0},{"$f":"'SITTING PLAN'!I55","v":0},{"$f":"'SITTING PLAN'!I56","v":0},{"$f":"'SITTING PLAN'!I57","v":0},{"$f":"'SITTING PLAN'!I58","v":0}]
[null," "," ",180," ",117,{"$nulls":3},10,null,{"$f":"'SITTING PLAN'!B59","v":0},{"$f":"'SITTING PLAN'!$D$59","v":" "},{"$f":"'SITTING PLAN'!$D$60","v":" "},{"$f":"'SITTING PLAN'!$D$61","v":" "},{"$f":"'SITTING PLAN'!$D$62","v":" "},{"$f":"'SITTING PLAN'!$D$63","v":" "},{"$f":"'SITTING PLAN'!$E59","v":" "},{"$f":"'SITTING PLAN'!$E60","v":" "},{"$f":"'SITTING PLAN'!$E61","v":" "},{"$f":"'SITTING PLAN'!$E62","v":" "},{"$f":"'SITTING PLAN'!$E63","v":" "},{"$f":"'SITTING PLAN'!I59","v":0},{"$f":"'SITTING PLAN'!I60","v":0},{"$f":"'SITTING PLAN'!I61","v":0},{"$f":"'SITTING PLAN'!I62","v":0},{"$f":"'SITTING PLAN'!I63","v":0}]
[null,null," "," "," ",{"$nulls":4},11,null,{"$f":"'SITTING PLAN'!B64","v":0},{"$f":"'SITTING PLAN'!$D$64","v":" "},{"$f":"'SITTING PLAN'!$D$65","v":" "},{"$f":"'SITTING PLAN'!$D$66","v":" "},{"$f":"'SITTING PLAN'!$D$67","v":" "},{"$f":"'SITTING PLAN'!$D$68","v":" "},{"$f":"'SITTING PLAN'!$E64","v":" "},{"$f":"'SITTING PLAN'!$E65","v":" "},{"$f":"'SITTING PLAN'!$E66","v":" "},{"$f":"'SITTING PLAN'!$E67","v":" "},{"$f":"'SITTING PLAN'!$E68","v":" "},{"$f":"'SITTING PLAN'!I64","v":0},{"$f":"'SITTING PLAN'!I65","v":0},{"$f":"'SITTING PLAN'!I66","v":0},{"$f":"'SITTING PLAN'!I67","v":0},{"$f":"'SITTING PLAN'!I68","v":0}]
[null,null," "," "," ",{"$nulls":4},12,null,{"$f":"'SITTING PLAN'!B69","v":0},{"$f":"'SITTING PLAN'!$D$69","v":" "},{"$f":"'SITTING PLAN'!$D$70","v":" "},{"$f":"'SITTING PLAN'!$D$71","v":" "},{"$f":"'SITTING PLAN'!$D$72","v":" "},{"$f":"'SITTING PLAN'!$D$73","v":" "},{"$f":"'SITTING PLAN'!$E69","v":" "},{"$f":"'SITTING PLAN'!$E70","v":" "},{"$f":"'SITTING PLAN'!$E71","v":" "},{"$f":"'SITTING PLAN'!$E72","v":" "},{"$f":"'SITTING PLAN'!$E73","v":" "},{"$f":"'SITTING PLAN'!I69","v":0},{"$f":"'SITTING PLAN'!I70","v":0},{"$f":"'SITTING PLAN'!I71","v":0},{"$f":"'SITTING PLAN'!I72","v":0},{"$f":"'SITTING PLAN'!I73","v":0}]
[{"$nulls":9},13,null,{"$f":"'SITTING PLAN'!B74","v":0},{"$f":"'SITTING PLAN'!$D$74","v":" "},{"$f":"'SITTING PLAN'!$D$75","v":" "},{"$f":"'SITTING PLAN'!$D$76","v":" "},{"$f":"'SITTING PLAN'!$D$77","v":" "},{"$f":"'SITTING PLAN'!$D$78","v":" "},{"$f":"'SITTING PLAN'!$E74","v":" "},{"$f":"'SITTING PLAN'!$E75","v":" "},{"$f":"'SITTING PLAN'!$E76","v":" "},{"$f":"'SITTING PLAN'!$E77","v":" "},{"$f":"'SITTING PLAN'!$E78","v":" "},{"$f":"'SITTING PLAN'!I74","v":0},{"$f":"'SITTING PLAN'!I75","v":0},{"$f":"'SITTING PLAN'!I76","v":0},{"$f":"'SITTING PLAN'!I77","v":0},{"$f":"'SITTING PLAN'!I78","v":0}]
[{"$nulls":9},14,null,{"$f":"'SITTING PLAN'!B79","v":0},{"$f":"'SITTING PLAN'!$D$79","v":" "},{"$f":"'SITTING PLAN'!$D$80","v":" "},{"$f":"'SITTING PLAN'!$D$81","v":" "},{"$f":"'SITTING PLAN'!$D$82","v":" "},{"$f":"'SITTING PLAN'!$D$83","v":" "},{"$f":"'SITTING PLAN'!$E79","v":" "},{"$f":"'SITTING PLAN'!$E80","v":" "},{"$f":"'SITTING PLAN'!$E81","v":" "},{"$f":"'SITTING PLAN'!$E82","v":" "},{"$f":"'SITTING PLAN'!$E83","v":" "},{"$f":"'SITTING PLAN'!I79","v":0},{"$f":"'SITTING PLAN'!I80","v":0},{"$f":"'SITTING PLAN'!I81","v":0},{"$f":"'SITTING PLAN'!I82","v":0},{"$f":"'SITTING PLAN'!I83","v":0}]
[{"$nulls":9},15,null,15]
[{"$nulls":9},16]
[{"$nulls":9},17]
[{"$nulls":9},18]
[{"$nulls":9},19]
[null,"NAME OF SCHOOL","ROLL NO ",null,"NSO","TOTAL",{"$nulls":3},20]
[null,{"$f":"B6","v":"GSSS ALNIYAWAS1"},{"$f":"VLOOKUP($D$4,$L$5:$W$21,7,0)","v":166},{"$f":"IF(C26=\" \",\" \",C26+F26)-1","v":171},0,{"$f":"VLOOKUP($D$4,TIME1,12,0)","v":6}]
[null,{"$f":"C6","v":"GSSS KOD"},{"$f":"VLOOKUP($D$4,$L$5:$W$21,8,0)","v":239},{"$f":"IF(C27=\" \",\" \",C27+F27)-1","v":240},0,{"$f":"VLOOKUP($D$4,TIME1,13,0)","v":2}]
[null,{"$f":"D6","v":"GSSS ALNIYAWAS1"},{"$f":"VLOOKUP($D$4,$L$5:$W$21,9,0)","v":172},180,0,{"$f":"VLOOKUP($D$4,TIME1,14,0)","v":9}]
[null,{"$f":"E6","v":"SHAKBHARI"},{"$f":"VLOOKUP($D$4,$L$5:$W$21,10,0)","v":509},515,0,{"$f":"VLOOKUP($D$4,TIME1,15,0)","v":7}]
[null,{"$f":"F6","v":" "},{"$f":"VLOOKUP($D$4,$L$5:$W$21,11,0)","v":" "},null,0,{"$f":"VLOOKUP($D$4,TIME1,16,0)","v":0}]
[{"$nulls":3},"TOTAL STUDENTS",null,{"$f":"SUM(F26:F30)","v":24}]

{"sheet":"AC ROLL FOR BANK","index":4,"n_rows":40,"n_cols":8,"rows_kept":40,"merged":[[1,1,1,2],[1,3,1,7],[2,5,2,6],[3,2,3,6],[38,5,38,6],[39,5,39,6]]}
[]
[null,{"$f":"MASTER!B2","v":"परीक्षा केन्द्र का नाम"},null,{"$f":"MASTER!D2","v":"jktdh; mPp ek/;fed fo|ky; vkyfu;kokl ftyk& ukXkkSj"}]
[null,null,{"$f":"MASTER!B7","v":"परीक्षा का प्रकार व वर्ष"},{"$f":"MASTER!D7","v":"उच्च माध्यमिक परीक्षा"},{"$f":"MASTER!G7","v":2021},{"$f":"MASTER!B6","v":"बोर्ड परीक्षा केंद्र क्रमांक"},null,{"$f":"MASTER!D6","v":119050}]
[null,null,"बोर्ड परीक्षा भुगतान प्रपत्र"]
[null,"S.NO.","NAME OF EMPLOYEE","BOARD DUTY","NAME OF BANK","IFSC  CODE","ACOUNT NO","AMOUNT"]
[null,1,"VIJAY KUMAR PRAJAPAT","CS","PNB","SBIN0031098",51062650196,3160]
[null,2,"VIJAY KUMAR PRAJAPAT","ACS","SBI RIYAN BARI","SBIN0031099",51062650196,720]
[null,3,"VIJAY KUMAR PRAJAPAT","INVIGILATOR","SBI SURAJGARH","SBIN0031100",51062650196,1760]
[null,4,"VIJAY KUMAR PRAJAPAT","INVIGILATOR","SBI MERTA ROAD","SBIN0031101",51062650196,990]
[null,5,"VIJAY KUMAR PRAJAPAT","INVIGILATOR","SBI MAKHUPURA AJMER","SBIN0031102",51062650196,970]
[null,6,"VIJAY KUMAR PRAJAPAT","INVIGILATOR","SBI LOHAKHAN AJMER","SBIN0031103",51062650196,450]
[null,7,"VIJAY KUMAR PRAJAPAT","INVIGILATOR","SBI VAISHALI NAGAR AJMER","SBIN0031104",51062650196,630]
[null,8,"VIJAY KUMAR PRAJAPAT","INVIGILATOR","SBI THANWLA","SBIN0031105",51062650196,900]
[null,9,"VIJAY KUMAR PRAJAPAT","EXAM INCHARGE","SBI RIYAN BARI","SBIN0031106",51062650196,7276]
[null,10,"VIJAY KUMAR PRAJAPAT","INVIGILATOR","SBI RIYAN BARI","SBIN0031107",51062650196,1080]
[null,11,"VIJAY KUMAR PRAJAPAT","INVIGILATOR","SBI RIYAN BARI","SBIN0031108",51062650196,720]
[null,12,"VIJAY KUMAR PRAJAPAT","INVIGILATOR","SBI RIYAN BARI","SBIN0031109",51062650196,720]
[null,13,"VIJAY KUMAR PRAJAPAT","INVIGILATOR","SBI RIYAN BARI","SBIN0031110",51062650196,540]
[null,14,"VIJAY KUMAR PRAJAPAT","INVIGILATOR","SBI THANWLA","SBIN0031111",51062650196,90]
[null,15,"VIJAY KUMAR PRAJAPAT","INVIGILATOR","SBI THANWLA","SBIN0031112",51062650196,180]
[null,16,"VIJAY KUMAR PRAJAPAT","INVIGILATOR","SBI RIYAN BARI","SBIN0031113",51062650196,90]
[null,17,"VIJAY KUMAR PRAJAPAT","INVIGILATOR","SBI MERTA ROAD","SBIN0031114",51062650196,1080]
[null,18,"VIJAY KUMAR PRAJAPAT","INVIGILATOR","SBI MAYAPURA KOTA","SBIN0031115",51062650196,720]
[null,19,"VIJAY KUMAR PRAJAPAT","INVIGILATOR","SBI HINDOLI BUNDI","SBIN0031116",51062650196,900]
[null,20,"VIJAY KUMAR PRAJAPAT","INVIGILATOR","SBI RIYAN BARI","SBIN0031117",51062650196,90]
[null,21,"VIJAY KUMAR PRAJAPAT","INVIGILATOR","SBI MERTA CITY","SBIN0031118",51062650196,270]
[null,22,"VIJAY KUMAR PRAJAPAT","INVIGILATOR","SBI THANWLA","SBIN0031119",51062650196,500]
[null,23,"VIJAY KUMAR PRAJAPAT","INVIGILATOR","SBI PUSHKAR","SBIN0031120",51062650196,630]
[null,24,"VIJAY KUMAR PRAJAPAT","INVIGILATOR","SBI RIYAN BARI","SBIN0031121",51062650196,360]
[null,25,"VIJAY KUMAR PRAJAPAT","INVIGILATOR","SBI MERTA CITY","SBIN0031122",51062650196,180]
[null,26,"VIJAY KUMAR PRAJAPAT","INVIGILATOR","SBI MERTA CITY","SBIN0031123",51062650196,180]
[null,27,"VIJAY KUMAR PRAJAPAT",null,null,"SBIN0031124",51062650196,500]
[null,28,"VIJAY KUMAR PRAJAPAT","PEON","SBI PISANGAN","SBIN0031125",51062650196,3460]
[null,29,"VIJAY KUMAR PRAJAPAT","AAO","SBI MAIN BRANCH AJMER","SBIN0031126",51062650196,910]
[null,30,"VIJAY KUMAR PRAJAPAT","SR.ASSISTANT","SBI PISANGAN","SBIN0031127",51062650196,920]
[{"$nulls":6},"TOTAL",{"$f":"SUBTOTAL(109,[AMOUNT])","v":30976}]
[]
[]
[null,null,"हस्ताक्षर",null,null,"हस्ताक्षर"]
[null,null,"परीक्षा प्रभारी",null,null,"केन्द्राधीक्षक/प्रधानाचार्य"]

{"sheet":"Sheet1","index":5,"n_rows":0,"n_cols":0,"rows_kept":0}