{"text_format":"3","workbook":"xlsx","n_sheets":9,"sheets":["INTRO","Data Entry","TA inner","TA outer","master","लघु यात्रा बिल(1) ","लघु यात्रा बिल  (2)","लघु यात्रा बिल  (3)","लघु यात्रा बिल  (4)"],"not_rendered":{"images":2,"external_links":1,"defined_names":8,"comments":2},"read":"whole","date_system":"1900"}

{"sheet":"INTRO","index":0,"n_rows":26,"n_cols":3,"rows_kept":26,"merged":[[0,0,25,0],[0,1,0,3],[1,1,1,2],[1,3,26,3],[2,1,2,2],[4,1,4,2],[20,2,24,2],[26,0,26,2]]}
[]
[null,"TA BILL EXCEL UTILITY  "]
[null,"HOW TO USE   "]
[null,null,"राज्य कार्मिकों के यात्रा भत्ता बिल बनाने   बाबत इस UTILITY का प्रयोग किया जा सकता है । कार्मिक द्वारा कार्यालय कार्य से की गई लघु यात्राओं का यात्रा भत्ता बिल और स्थानांतरण यात्रा भत्ता बिल बनाने   बाबत इस UTILITY का प्रयोग किया जा सकता है  किसी प्रकार की तकनीकी कमी पाए जाने पर नीचे दिये गए EMAIL द्वारा अवगत कराने का श्रम करावे।(PLEASE USE LATEST VERSION OF THAT IS  OFFICE 2010 AND ABOVE FOR BEST RESULT)"]
[null,"   1. Install Krutidev 010 Hindi font in your computer for view "]
[null,"1. Data Sheet :-","इस शीट में कार्मिक के नाम ,पद ,मुख्यालय ,श्रेणी ,मूल वेतन इत्यादि के यात्राओं की  व दिनांक   की एंट्री करनी है। यदि स्थानातरण पर यात्रा भत्ता बिल बनाना है तो row 8 मे YES का चयन करें।यात्रा प्रारम्भ समाप्ती के समय की एंट्री 24 hours फ़ारमैट मे करे जो स्वतः ही 12 hours फ़ारमैट मे बदल जाएगी।"]
[null,1,"यदि सार्वजनिक परिवहन के साधन से यात्रा की है तो वास्तविक किराया भरे ।यदि स्वयं के वाहन से यात्रा की है तो यात्रा के प्रकार कॉलम मे ड्रॉपडाउन से यात्रा प्रकार का चयन करें नियमानुसार देय किराया कार्मिक की श्रेणी व वाहन के प्रकार के अनुसार स्वतः गणना होगी। "]
[null,2,"ड्यूटी और गंतव्य स्थान के लिए कोड -जयपुर=A, जोधपुर , अजमेर ,कोटा,बीकानेर,उदयपुर =B, अन्य स्थान =C का चयन करें।"]
[null,3,"विश्राम भत्ता और बोर्डिंग लॉजिंग के लिए  राज्य की राजधानी =A,अन्य स्थान =B कोड का चयन करें।"]
[null,4,"बोर्डिंग लॉजिंग दर की गणना Automatic के लिए सेल V12 मे Automatic का चयन या mannual दर भरने के लिए Mannual ड्रॉपडाउन से चयन करें।"]
{"$rows_left_out":17}
{"sheet":"Data Entry","index":1,"n_rows":22,"n_cols":35,"rows_kept":22,"merged":[[4,1,4,2],[4,3,4,5],[4,6,4,7],[4,8,4,11],[4,12,4,14],[4,15,4,19],[5,1,5,2],[5,3,5,5],[5,9,5,11],[5,13,5,14],[5,15,5,22],[6,1,6,2],[6,3,6,5],[6,7,6,10],[6,11,6,12],[6,13,6,23],[7,3,7,9],[7,10,7,11],[7,12,7,17],[8,1,8,7],[8,8,11,8],[8,9,9,11],[8,12,8,14],[8,15,8,17],[8,18,8,19],[8,20,9,21],[8,22,11,22],[8,23,11,23],[9,1,9,4],[9,5,9,7],[9,12,9,13],[9,15,9,16],[9,19,11,19],[10,1,11,1],[10,2,11,2],[10,3,11,3],[10,4,11,4],[10,5,11,5],[10,6,11,6],[10,7,11,7],[10,9,11,9],[10,10,11,10],[10,11,11,11],[10,12,10,13],[10,15,10,16],[11,12,11,13],[11,15,11,16],[12,1,13,1],[12,12,13,14],[12,15,13,17],[12,18,13,18],[12,19,13,19],[12,20,13,20],[12,21,13,21],[12,22,13,22],[12,23,13,23],[14,1,15,1],[14,12,15,14],[14,15,15,17],[14,18,15,18],[14,19,15,19],[14,20,15,20],[14,21,15,21],[14,22,15,22],[14,23,15,23],[16,1,17,1],[16,12,17,14],[16,15,17,17],[16,18,17,18],[16,19,17,19],[16,20,17,20],[16,21,17,21],[16,22,17,22],[16,23,17,23],[18,1,19,1],[18,12,19,14],[18,15,19,17],[18,18,19,18],[18,19,19,19],[18,20,19,20],[18,21,19,21],[18,22,19,22],[18,23,19,23],[20,1,21,1],[20,12,21,14],[20,15,21,17],[20,18,21,18],[20,19,21,19],[20,20,21,20],[20,21,21,21],[20,22,21,22],[20,23,21,23],[22,12,22,14]]}
[]
[]
[]
[]
[null,"uke",null,"galjkt tks'kh ",null,null,"cSad [kkrk la[;k &",null,"01234567891011",{"$nulls":3},"osrueku",null,null,"lkroka osrueku"]
[null,"in","in","iz/kkukpk;Z",null,null,"Js.kh   ","ख","ekg","ekpZ",null,null,"o\"kZ",2021,null,"osru :i;s ¼fo'ks\"k osru dks NksM+ dj½ csfld",{"$nulls":7},78000]
[null,"ftyk","ftyk","Jhxaxkuxj",null,null,"eq[;ky;","13 Mhvks,y",{"$nulls":3},"inLFkkiu ",null,"jktdh; mPp ek/;fed fo|ky; 13Mhvks,y Jhxaxkuxj "]
[{"$nulls":3},"यदि स्थानांतरण पर यात्रा भत्ता बिल बनाया जा रहा है तो \"YES\" अन्यथा \"NO\" का चयन करें ",{"$nulls":6},"YES",{"$nulls":21},"बस ",1,"x"]
[null,";k=k ,oa foJke dk fooj.k",{"$nulls":6},";k=k dk izdkj","ok;q ;ku] jsy] cl] ;k=k ds fy, ehy HkRrk",null,null,"M;wVh LFkku",null,null,"xarO; LFkku",null,null,"foJke HkRrk",null,"cksfMZax ,oa ykWftax",null,"okLrfod vU; O;; ",";k=k dk iz;kstu o vkns'k Øekad",{"$nulls":8},"रेल ",2,"x"]
[null,"izLFkku",{"$nulls":3},"vkxeu",{"$nulls":6},"t;iqj",null,"A","t;iqj",null,"A","xarO; LFkku dksM","fnu",{"$nulls":12},"वायुयान",3,"x"]
{"$rows_left_out":13}
{"sheet":"TA inner","index":2,"n_rows":30,"n_cols":29,"rows_kept":30,"merged":[[1,1,1,24],[2,2,2,11],[2,12,2,15],[2,16,2,21],[2,23,2,24],[3,2,3,9],[3,13,3,15],[3,18,3,22],[3,23,3,24],[4,2,4,5],[4,7,4,11],[4,12,4,15],[4,16,4,24],[5,1,5,8],[5,9,7,9],[5,10,7,10],[5,11,5,13],[5,14,7,17],[5,18,6,20],[5,21,7,21],[5,22,7,22],[5,23,7,23],[5,24,7,24],[6,1,6,4],[6,5,6,8],[6,11,7,11],[6,12,7,12],[6,13,7,13],[7,3,7,4],[7,7,7,8],[8,0,9,0],[8,3,8,4],[8,7,8,8],[8,14,8,17],[8,23,9,23],[8,24,9,24],[9,3,9,4],[9,7,9,8],[9,14,9,17],[10,0,11,0],[10,3,10,4],[10,7,10,8],[10,14,10,17],[10,23,11,23],[10,24,11,24],[11,3,11,4],[11,7,11,8],[11,14,11,17],[12,0,13,0],[12,3,12,4],[12,7,12,8],[12,14,12,17],[12,23,13,23],[12,24,13,24],[13,3,13,4],[13,7,13,8],[13,14,13,17],[14,0,15,0],[14,3,14,4],[14,7,14,8],[14,14,14,17],[14,23,15,23],[14,24,15,24],[15,3,15,4],[15,7,15,8],[15,14,15,17],[16,0,17,0],[16,3,16,4],[16,7,16,8],[16,14,16,17],[16,23,17,23],[16,24,17,24],[17,3,17,4],[17,7,17,8],[17,14,17,17],[18,1,18,9],[18,14,18,17],[19,1,19,12],[19,13,19,16],[19,17,19,23],[20,1,20,20],[20,21,20,23],[21,1,21,20],[21,21,21,23],[22,1,22,20],[22,21,22,23],[23,1,23,18],[24,1,24,18],[25,1,25,16],[25,17,25,21],[26,1,26,12],[26,13,26,21],[26,22,26,24],[27,1,27,2],[27,3,27,4],[27,7,27,8],[27,10,27,12],[27,13,28,17],[27,18,27,20],[27,22,27,23],[28,1,28,2],[28,3,28,8],[28,10,28,12],[28,18,28,20],[28,22,29,24],[29,1,29,2],[29,3,29,8],[29,10,29,12],[29,13,29,17],[29,18,29,21]]}
[]
[null,";k=k HkRrk fcy"]
[null,"uke",{"$f":"'Data Entry'!D5","v":"galjkt tks'kh "},{"$nulls":9},"cSad [kkrk la[;k &",{"$nulls":3},{"$f":"'Data Entry'!I5","v":"01234567891011"},{"$nulls":5},"osrueku",{"$f":"'Data Entry'!P5","v":"lkroka osrueku"}]
[null,"in",{"$f":"'Data Entry'!D6","v":"iz/kkukpk;Z"},{"$nulls":7},"Js.kh   ",{"$f":"'Data Entry'!H6","v":"ख"},"ekg",{"$f":"'Data Entry'!J6","v":"ekpZ"},null,null,"o\"kZ",{"$f":"'Data Entry'!N6","v":2021},"osru :i;s ¼fo'ks\"k osru dks NksM+ dj½ csfld",{"$nulls":4},{"$f":"'Data Entry'!X6","v":78000},{"$nulls":3},"प्रातः"]
[null,"ftyk",{"$f":"'Data Entry'!D7","v":"Jhxaxkuxj"},{"$nulls":3},"eq[;ky;",{"$f":"'Data Entry'!H7","v":"13 Mhvks,y"},{"$nulls":4},"inLFkkiu ",{"$nulls":3},{"$f":"'Data Entry'!N7","v":"jktdh; mPp ek/;fed fo|ky; 13Mhvks,y Jhxaxkuxj "},{"$nulls":10},"सायं"]
[null,";k=k ,oa foJke dk fooj.k",{"$nulls":7},";k=k dk izdkj","rkaxk @ VSDlh pktZ","ok;q ;ku] jsy] cl] ;k=k ds fy, ehy HkRrk",null,null,"xarO; 'kgj dks lysDV djsa",{"$nulls":3},"foJke dk HkRrk",null,null,"okLrfod vU; O;; @ LVs vekmaV","dqy ;ksx",";k=k dk iz;kstu o vkns'k Øekad","Remark"]
[null,"izLFkku",{"$nulls":3},"vkxeu",{"$nulls":5},"Js.kh fVdV la[;k","nwjh  fd-eh-","fdjk;k"]
[null,"LFkku","fnukad","le;",null,"LFkku","fnukad","le;",{"$nulls":10},"fnu","nj","jkf'k"]
[1,{"$f":"IF('Data Entry'!C13=\"\",\"\",'Data Entry'!C13)","v":"13Mhvks,y"},{"$f":"IF('Data Entry'!D13=\"\",\"\",'Data Entry'!D13)","v":"2020-10-12"},{"$f":"IF('Data Entry'!E13=\"\",\"\",'Data Entry'!E13)","v":"09:00:00"},null,{"$f":"IF('Data Entry'!F13=\"\",\"\",'Data Entry'!F13)","v":"?kM+lkuk"},{"$f":"IF('Data Entry'!G13=\"\",\"\",'Data Entry'!G13)","v":"2020-10-12"},{"$f":"IF('Data Entry'!H13=\"\",\"\",'Data Entry'!H13)","v":"10:00:00"},null,{"$f":"IF('Data Entry'!I13=\"\",\"\",'Data Entry'!I13)","v":"बस "},{"$f":"master!H18","v":120},{"$f":"IF('Data Entry'!J13=\"\",\"\",'Data Entry'!J13)","v":1},{"$f":"IF('Data Entry'!K13=\"\",\"\",'Data Entry'!K13)","v":45},{"$f":"master!E18","v":45},{"$f":"IF(F9=\"\",\"\",IF('Data Entry'!S13=\"A\",master!$O$15,master!$O$16))","v":"अन्य स्थान "},{"$nulls":5},{"$f":"S9*T9","v":0},null,{"$f":"SUM(K9,N9,U9,V9)","v":165},{"$f":"IF('Data Entry'!X13=\"\",\"\",'Data Entry'!X13)","v":""}]
[null,{"$f":"IF('Data Entry'!C14=\"\",\"\",'Data Entry'!C14)","v":"?kM+lkuk"},{"$f":"IF('Data Entry'!D14=\"\",\"\",'Data Entry'!D14)","v":"2020-10-13"},{"$f":"IF('Data Entry'!E14=\"\",\"\",'Data Entry'!E14)","v":"10:00:00"},null,{"$f":"IF('Data Entry'!F14=\"\",\"\",'Data Entry'!F14)","v":"13Mhvks,y"},{"$f":"IF('Data Entry'!G14=\"\",\"\",'Data Entry'!G14)","v":"2020-10-12"},{"$f":"IF('Data Entry'!H14=\"\",\"\",'Data Entry'!H14)","v":"11:00:00"},null,{"$f":"IF('Data Entry'!I14=\"\",\"\",'Data Entry'!I14)","v":"रेल "},{"$f":"master!H19","v":120},{"$f":"IF('Data Entry'!J14=\"\",\"\",'Data Entry'!J14)","v":1},{"$f":"IF('Data Entry'!K14=\"\",\"\",'Data Entry'!K14)","v":45},{"$f":"master!E19","v":45},{"$f":"IF(B10=\"\",\"\",IF('Data Entry'!S14=\"A\",master!$O$15,master!$O$16))","v":"अन्य स्थान "},{"$nulls":3},{"$f":"master!J19","v":1.7},{"$f":"master!K19","v":500},{"$f":"S10*T10","v":850},{"$f":"master!W19","v":0},{"$f":"SUM(K10,N10,U10,V10)","v":1015}]
{"$rows_left_out":21}
{"sheet":"TA outer","index":3,"n_rows":28,"n_cols":23,"rows_kept":28,"merged":[[1,1,1,5],[1,6,1,9],[1,10,27,10],[1,11,27,11],[1,12,27,12],[1,13,27,13],[1,14,1,15],[1,16,1,19],[1,20,1,22],[2,4,4,4],[2,5,4,5],[2,6,2,9],[2,14,2,15],[2,16,2,19],[2,20,2,22],[3,1,3,3],[3,6,3,9],[3,16,3,19],[3,20,3,21],[4,1,4,3],[4,6,4,9],[4,16,4,19],[4,20,4,21],[5,1,5,3],[5,6,5,9],[5,14,5,15],[5,16,5,19],[6,1,6,3],[6,6,6,7],[6,8,6,9],[6,14,6,22],[7,1,7,4],[7,6,7,9],[7,14,7,22],[8,1,8,9],[8,14,8,22],[9,4,9,9],[9,14,9,22],[10,1,10,9],[10,14,10,22],[11,1,11,9],[11,14,11,22],[12,2,12,3],[12,4,12,6],[12,7,12,9],[12,14,12,22],[13,1,13,9],[13,14,13,22],[14,1,14,9],[14,14,14,22],[15,5,15,7],[15,8,15,9],[15,14,15,22],[16,1,16,9],[16,14,16,22],[17,1,17,9],[17,14,17,22],[18,1,18,6],[18,7,18,9],[18,14,18,22],[19,1,19,6],[19,8,19,9],[19,14,19,16],[19,17,19,22],[20,1,20,5],[20,7,20,9],[20,14,26,16],[20,17,20,22],[21,1,21,9],[21,18,21,22],[22,1,22,2],[22,3,22,5],[22,6,22,9],[22,17,22,22],[23,4,23,5],[23,6,23,9],[23,18,23,22],[24,1,24,2],[24,3,25,5],[24,17,24,22],[25,1,25,2],[25,7,25,9],[25,17,25,18],[25,19,25,22],[26,1,26,2],[26,3,26,5],[26,6,26,9],[26,17,26,22],[27,1,27,2],[27,3,27,5],[27,6,27,7],[27,8,27,9],[27,14,27,16],[27,17,27,19],[27,20,27,22]]}
[]
[null,"fofu;kstu",{"$nulls":4},"dk;kZy; v/;{k }kjk izek.k i=",{"$nulls":7},"GA 95",null,"jktLFkku ljdkj"]
[null,"1- o\"kZ ",null,"ds fy, ",null,null,"1- fooj.k izkIr fd;kA",{"$nulls":9},";k=k HkRrk fcy"]
[null,"  fofu;kstu",{"$nulls":4},"2- izekf.kr fd;k tkrk gS fd bl fcy esa  ",{"$nulls":7},"fcyuEcj","_______",{"$nulls":4},"ckmpj la[;k",null,"______"]
[null,"2- bl fcydh jkf'k dks  ",{"$nulls":4},"  'kkfey  dh xbZ  jkf'k  bl fnukad ls iwoZ ",{"$nulls":7},"fnukad","_______",{"$nulls":4},"Hkqqxrku dh frfFk",null,"_______"]
[null,"  'kkfey djrs gq, O;;",null,null,"------","------","  vkgfjr ugha dh xbZ gSA",{"$nulls":9},";k=k HkRrk fcy cukus gsrq vuqns'k"]
[null,"3- 'ks\"k",null,null,{"$f":"IF(OR(E3=0,E5=0),\"\",E3-E5)","v":""},{"$f":"IF(OR(F3=0,F5=0),\"\",F3-F5)","v":""},null,null,"dk;kZy;k/;{k",{"$nulls":5},"1- bl izi= dk mi;ksx lHkh deZpkfj;ks ds¼jktif=r rFkk vjktif=r½ds ekeyks es fd;k tkosxkA"]
[{"$nulls":14},"2- fofHkUu izdkj dh ;k=kvks ¼;Fkk&jsy`cl ok;q;ku }kjk bR;kfn ½,oeafoJeks dks i`Fkd ls "]
[null,"izfr gLrk{kj",{"$nulls":12},"  fn[kyk;k tkuk pkfg, dk;ZLFky ls ,;j iksVZ @jsYosLVs'ku@cl LVs.M rd i~gq¡pus ;k "]
[null,"#i;s","_______","¼'kCnksa esa½","-------------------------------------------------------------------------------------------------------------",{"$nulls":9},"  blds foijhr ;k=k ds fy, HkRrk ,d gh iafDr es fn[yk;k tkuk pkfg,A"]
{"$rows_left_out":19}
{"sheet":"master","index":4,"n_rows":30,"n_cols":23,"rows_kept":30,"hidden":true,"merged":[[2,0,2,16],[3,0,5,0],[3,1,5,1],[3,2,5,2],[3,3,5,3],[3,4,3,7],[3,8,3,10],[3,11,3,12],[3,13,3,14],[3,15,3,16],[4,4,4,7],[4,8,4,10],[4,11,5,11],[4,12,5,12],[4,13,5,13],[4,14,5,14],[4,15,5,15],[4,16,5,16],[12,0,12,16],[13,15,13,17],[13,18,14,20],[13,21,16,21],[13,22,16,22],[14,15,14,16],[15,3,15,4],[15,5,15,7],[15,18,16,18],[15,20,16,20],[17,0,18,0],[19,0,20,0],[21,0,22,0],[23,0,24,0],[25,0,26,0],[27,0,28,0],[29,0,30,0]]}
[]
[]
["uohu ;k=k HkRrk ,oa nSfud HkRrs dh lkj.kh izHkkoh fnuakd 06-12-2017 7oka osru izkjfEHkd njsa"]
["Js.kh","वेतनमान 2017 में ewy osru","jsy ls ;k=k ","lM+d ;k=k","lM+d ;k=k HkRrk",{"$nulls":3},"lM+d ;k=k HkRrk",null,null,"nSfud HkRrk",null,"cksfMZax ,oa ykftx",null,"LFkkukUrj.k"]
[{"$nulls":4},"Lo;a ds okgu ls fof’k\"V nj ¼izfr fd-eh-½",{"$nulls":3},"M;wVh LFkku ls jsYos LVs'ku]cl LVS.M] gokbZ vMMk rd",null,null,"leLr jkT;@dsUnz'kkflr izns'kksa dh  jkt/kkfu;ksa esa nSfud HkRrk","vU; leLr LFkkuksa ij nSfud HkRrk","leLr jkT;@dsUnz'kkflr izns'kksa dh  jkt/kkfu;ksa esa nSfud HkRrk","vU; leLr LFkkuksa ij nSfud HkRrk",",deq’r jkf’k","yxst HkkM+k izfr fd-eh-"]
[{"$nulls":4},"Loa; dh dkj ls","LdwVj@ eksVj lkbZdy@ eksisM","vU; okgu tSls fjD'kk]rkaxk]eksVj fjD'kk","iSny","fjD’kk@rkaxk@vkVks fjD’kk t;iqj","dksVk@ tks/kiqj@ chdkusj@ mn;iqj","vU; LFkku"]
[1,2,3,4,5,6,7,8,9,10,11,12,13,14,15,16,17]
[" क","95000 ,oa vf/kd","dksbZ Hkh Vªsu dksbZ Hkh ,lh Dykl",",lh MhyDl@lseh MhyDl vij Dykl",9,3,6,null,150,100,60,800,600,3000,2000,10000,30]
["ख","49000&95000","dqlhZ;ku ,lh ,lh&kkk",",lh MhyDl@lseh MhyDl vij Dykl",9,3,6,null,150,100,60,700,500,2500,1800,8000,30]
["ग","39000&49000","f}rh; Lyhij",",lh MhyDl@lseh fMyDl vij Dykl",null,3,6,2,150,100,60,600,400,2000,1500,6000,18]
{"$rows_left_out":21}
{"sheet":"लघु यात्रा बिल(1) ","index":5,"n_rows":36,"n_cols":22,"rows_kept":36,"merged":[[1,1,1,8],[2,2,2,3],[2,5,2,6],[2,7,2,8],[3,2,3,3],[3,5,3,6],[3,7,4,8],[4,2,4,6],[5,1,6,1],[5,2,5,3],[5,4,6,4],[5,5,6,5],[5,6,6,6],[5,7,6,7],[5,8,6,8],[29,1,29,5],[29,7,29,8],[31,1,31,3],[38,6,38,7]]}
[]
[null,"y?kq ;k=k fcy"]
[null,"uke",null,null,"Js.kh","ख",null,"fcy dk en"]
[null,"in",null,null,"ewy osru",75700]
[null,"dk;kZy;"]
[null,"fnukad","LFkkuksa dk fooj.k ftuds e/; LFkkuh; y?kq ;k=k dh xbZ",null,";k=k dk iz;kstu","Lo;a dk okgu dk izdkj","yxHkx nwjh fdeh esa","nj jkf'k izfr fdeh","jkf'k"]
[null,null,"izLFkku","vkxeu",{"$nulls":16},"कार",1]
[null,"2019-04-24","13Mhvks,y","6Mhvks,y"," 'kkyk lEcyu","मोटर साइकिल ,स्कूटर,मोपेड़ ",8,{"$f":"IF(OR(B8=\"\",C8=\"\",D8=\"\"),\"\",IF($F$3=\"\",\"श्रेणी चुने \",IF(K8=1,VLOOKUP($F$3,ta_master,5,0),IF(K8=2,VLOOKUP($F$3,ta_master,6,0),IF(K8=3,VLOOKUP($F$3,ta_master,7,0),IF(K8=4,VLOOKUP($F$3,ta_master,8,0),\"वाहन प्रकार चुनें\"))))))","v":3},{"$f":"IFERROR(G8*H8,\"\")","v":{"v":24,"d":"₹24.00"}},null,{"$f":"IF(F8=\"\",\"\",VLOOKUP(F8,$U$7:$V$10,2,0))","v":2},{"$nulls":9},"मोटर साइकिल ,स्कूटर,मोपेड़ ",2]
[null,"2019-04-24",{"$f":"D8","v":"6Mhvks,y"},{"$f":"C8","v":"13Mhvks,y"}," 'kkyk lEcyu","कार",8,9,{"$f":"IFERROR(G9*H9,\"\")","v":{"v":72,"d":"₹72.00"}},null,{"$f":"IF(F9=\"\",\"\",VLOOKUP(F9,$U$7:$V$10,2,0))","v":1},{"$nulls":9},"रिक्शा तांगा,मोटर रिक्शा ",3]
[{"$nulls":7},"","",null,"",{"$nulls":9},"साइकिल/पैदल ",4]
{"$rows_left_out":27}
{"sheet":"लघु यात्रा बिल  (2)","index":6,"n_rows":36,"n_cols":22,"rows_kept":36,"merged":[[1,1,1,8],[2,2,2,3],[2,5,2,6],[2,7,2,8],[3,2,3,3],[3,5,3,6],[3,7,4,8],[4,2,4,6],[5,1,6,1],[5,2,5,3],[5,4,6,4],[5,5,6,5],[5,6,6,6],[5,7,6,7],[5,8,6,8],[29,1,29,5],[29,7,29,8],[31,1,31,3]]}
[]
[null,"y?kq ;k=k fcy"]
[null,"uke",{"$f":"'Data Entry'!D5","v":"galjkt tks'kh "},null,"Js.kh","ख",null,"fcy dk en"]
[null,"in",{"$f":"'Data Entry'!D6","v":"iz/kkukpk;Z"},null,"ewy osru",75700]
[null,"dk;kZy;",{"$f":"'Data Entry'!N7","v":"jktdh; mPp ek/;fed fo|ky; 13Mhvks,y Jhxaxkuxj "}]
[null,"fnukad","LFkkuksa dk fooj.k ftuds e/; LFkkuh; y?kq ;k=k dh xbZ",null,";k=k dk iz;kstu","Lo;a dk okgu dk izdkj","yxHkx nwjh fdeh esa","nj jkf'k izfr fdeh","jkf'k"]
[null,null,"izLFkku","vkxeu",{"$nulls":16},"कार",1]
[null,"2019-04-24","13Mhvks,y","6Mhvks,y"," 'kkyk lEcyu","मोटर साइकिल ,स्कूटर,मोपेड़ ",8,{"$f":"IF(OR(B8=\"\",C8=\"\",D8=\"\"),\"\",IF($F$3=\"\",\"श्रेणी चुने \",IF(K8=1,VLOOKUP($F$3,ta_master,5,0),IF(K8=2,VLOOKUP($F$3,ta_master,6,0),IF(K8=3,VLOOKUP($F$3,ta_master,7,0),IF(K8=4,VLOOKUP($F$3,ta_master,8,0),\"वाहन प्रकार चुनें\"))))))","v":3},{"$f":"IFERROR(G8*H8,\"\")","v":{"v":24,"d":"₹24.00"}},null,{"$f":"IF(F8=\"\",\"\",VLOOKUP(F8,$U$7:$V$10,2,0))","v":2},{"$nulls":9},"मोटर साइकिल ,स्कूटर,मोपेड़ ",2]
[null,"2019-04-24",{"$f":"D8","v":"6Mhvks,y"},{"$f":"C8","v":"13Mhvks,y"}," 'kkyk lEcyu","कार",8,9,{"$f":"IFERROR(G9*H9,\"\")","v":{"v":72,"d":"₹72.00"}},null,{"$f":"IF(F9=\"\",\"\",VLOOKUP(F9,$U$7:$V$10,2,0))","v":1},{"$nulls":9},"रिक्शा तांगा,मोटर रिक्शा ",3]
[{"$nulls":7},"","",null,"",{"$nulls":9},"साइकिल/पैदल ",4]
{"$rows_left_out":27}
{"sheet":"लघु यात्रा बिल  (3)","index":7,"n_rows":36,"n_cols":22,"rows_kept":36,"merged":[[1,1,1,8],[2,2,2,3],[2,5,2,6],[2,7,2,8],[3,2,3,3],[3,5,3,6],[3,7,4,8],[4,2,4,6],[5,1,6,1],[5,2,5,3],[5,4,6,4],[5,5,6,5],[5,6,6,6],[5,7,6,7],[5,8,6,8],[29,1,29,5],[29,7,29,8],[31,1,31,3]]}
[]
[null,"y?kq ;k=k fcy"]
[null,"uke",{"$f":"'Data Entry'!D5","v":"galjkt tks'kh "},null,"Js.kh","ख",null,"fcy dk en"]
[null,"in",{"$f":"'Data Entry'!D6","v":"iz/kkukpk;Z"},null,"ewy osru",75700]
[null,"dk;kZy;",{"$f":"'Data Entry'!N7","v":"jktdh; mPp ek/;fed fo|ky; 13Mhvks,y Jhxaxkuxj "}]
[null,"fnukad","LFkkuksa dk fooj.k ftuds e/; LFkkuh; y?kq ;k=k dh xbZ",null,";k=k dk iz;kstu","Lo;a dk okgu dk izdkj","yxHkx nwjh fdeh esa","nj jkf'k izfr fdeh","jkf'k"]
[null,null,"izLFkku","vkxeu",{"$nulls":16},"कार",1]
[null,"2019-04-24","13Mhvks,y","6Mhvks,y"," 'kkyk lEcyu","मोटर साइकिल ,स्कूटर,मोपेड़ ",8,{"$f":"IF(OR(B8=\"\",C8=\"\",D8=\"\"),\"\",IF($F$3=\"\",\"श्रेणी चुने \",IF(K8=1,VLOOKUP($F$3,ta_master,5,0),IF(K8=2,VLOOKUP($F$3,ta_master,6,0),IF(K8=3,VLOOKUP($F$3,ta_master,7,0),IF(K8=4,VLOOKUP($F$3,ta_master,8,0),\"वाहन प्रकार चुनें\"))))))","v":3},{"$f":"IFERROR(G8*H8,\"\")","v":{"v":24,"d":"₹24.00"}},null,{"$f":"IF(F8=\"\",\"\",VLOOKUP(F8,$U$7:$V$10,2,0))","v":2},{"$nulls":9},"मोटर साइकिल ,स्कूटर,मोपेड़ ",2]
[null,"2019-04-24",{"$f":"D8","v":"6Mhvks,y"},{"$f":"C8","v":"13Mhvks,y"}," 'kkyk lEcyu","कार",8,9,{"$f":"IFERROR(G9*H9,\"\")","v":{"v":72,"d":"₹72.00"}},null,{"$f":"IF(F9=\"\",\"\",VLOOKUP(F9,$U$7:$V$10,2,0))","v":1},{"$nulls":9},"रिक्शा तांगा,मोटर रिक्शा ",3]
[{"$nulls":7},"","",null,"",{"$nulls":9},"साइकिल/पैदल ",4]
{"$rows_left_out":27}
{"sheet":"लघु यात्रा बिल  (4)","index":8,"n_rows":36,"n_cols":22,"rows_kept":36,"merged":[[1,1,1,8],[2,2,2,3],[2,5,2,6],[2,7,2,8],[3,2,3,3],[3,5,3,6],[3,7,4,8],[4,2,4,6],[5,1,6,1],[5,2,5,3],[5,4,6,4],[5,5,6,5],[5,6,6,6],[5,7,6,7],[5,8,6,8],[29,1,29,5],[29,7,29,8],[31,1,31,3]]}
[]
[null,"y?kq ;k=k fcy"]
[null,"uke",null,null,"Js.kh","ख",null,"fcy dk en"]
[null,"in",{"$f":"'Data Entry'!D6","v":"iz/kkukpk;Z"},null,"ewy osru",75700]
[null,"dk;kZy;",{"$f":"'Data Entry'!N7","v":"jktdh; mPp ek/;fed fo|ky; 13Mhvks,y Jhxaxkuxj "}]
[null,"fnukad","LFkkuksa dk fooj.k ftuds e/; LFkkuh; y?kq ;k=k dh xbZ",null,";k=k dk iz;kstu","Lo;a dk okgu dk izdkj","yxHkx nwjh fdeh esa","nj jkf'k izfr fdeh","jkf'k"]
[null,null,"izLFkku","vkxeu",{"$nulls":16},"कार",1]
[null,"2019-04-24","13Mhvks,y","6Mhvks,y"," 'kkyk lEcyu","मोटर साइकिल ,स्कूटर,मोपेड़ ",10,{"$f":"IF(OR(B8=\"\",C8=\"\",D8=\"\"),\"\",IF($F$3=\"\",\"श्रेणी चुने \",IF(K8=1,VLOOKUP($F$3,ta_master,5,0),IF(K8=2,VLOOKUP($F$3,ta_master,6,0),IF(K8=3,VLOOKUP($F$3,ta_master,7,0),IF(K8=4,VLOOKUP($F$3,ta_master,8,0),\"वाहन प्रकार चुनें\"))))))","v":3},{"$f":"IFERROR(G8*H8,\"\")","v":{"v":30,"d":"₹30.00"}},null,{"$f":"IF(F8=\"\",\"\",VLOOKUP(F8,$U$7:$V$10,2,0))","v":2},{"$nulls":9},"मोटर साइकिल ,स्कूटर,मोपेड़ ",2]
[{"$nulls":5},"कार",8,"",{"$f":"IFERROR(G9*H9,\"\")","v":""},null,{"$f":"IF(F9=\"\",\"\",VLOOKUP(F9,$U$7:$V$10,2,0))","v":1},{"$nulls":9},"रिक्शा तांगा,मोटर रिक्शा ",3]
[{"$nulls":7},"","",null,"",{"$nulls":9},"साइकिल/पैदल ",4]
{"$rows_left_out":26}