{"text_format":"3","workbook":"xlsx","n_sheets":9,"sheets":["INTRO","Data Entry","TA inner","TA outer","master","लघु यात्रा बिल(1) ","लघु यात्रा बिल  (2)","लघु यात्रा बिल  (3)","लघु यात्रा बिल  (4)"],"not_rendered":{"images":2,"external_links":1,"defined_names":8,"comments":2},"read":"whole","date_system":"1900"}

{"sheet":"INTRO","index":0,"n_rows":26,"n_cols":3,"rows_kept":26,"merged":[[0,0,25,0],[0,1,0,3],[1,1,1,2],[1,3,26,3],[2,1,2,2],[4,1,4,2],[20,2,24,2],[26,0,26,2]]}
[]
[null,"TA BILL EXCEL UTILITY  "]
[null,"HOW TO USE   "]
[null,null,"राज्य कार्मिकों के यात्रा भत्ता बिल बनाने   बाबत इस UTILITY का प्रयोग किया जा सकता है । कार्मिक द्वारा कार्यालय कार्य से की गई लघु यात्राओं का यात्रा भत्ता बिल और स्थानांतरण यात्रा भत्ता बिल बनाने   बाबत इस UTILITY का प्रयोग किया जा सकता है  किसी प्रकार की तकनीकी कमी पाए जाने पर नीचे दिये गए EMAIL द्वारा अवगत कराने का श्रम करावे।(PLEASE USE LATEST VERSION OF THAT IS  OFFICE 2010 AND ABOVE FOR BEST RESULT)"]
[null,"   1. Install Krutidev 010 Hindi font in your computer for view "]
[null,"1. Data Sheet :-","इस शीट में कार्मिक के नाम ,पद ,मुख्यालय ,श्रेणी ,मूल वेतन इत्यादि के यात्राओं की  व दिनांक   की एंट्री करनी है। यदि स्थानातरण पर यात्रा भत्ता बिल बनाना है तो row 8 मे YES का चयन करें।यात्रा प्रारम्भ समाप्ती के समय की एंट्री 24 hours फ़ारमैट मे करे जो स्वतः ही 12 hours फ़ारमैट मे बदल जाएगी।"]
[null,1,"यदि सार्वजनिक परिवहन के साधन से यात्रा की है तो वास्तविक किराया भरे ।यदि स्वयं के वाहन से यात्रा की है तो यात्रा के प्रकार कॉलम मे ड्रॉपडाउन से यात्रा प्रकार का चयन करें नियमानुसार देय किराया कार्मिक की श्रेणी व वाहन के प्रकार के अनुसार स्वतः गणना होगी। "]
[null,2,"ड्यूटी और गंतव्य स्थान के लिए कोड -जयपुर=A, जोधपुर , अजमेर ,कोटा,बीकानेर,उदयपुर =B, अन्य स्थान =C का चयन करें।"]
[null,3,"विश्राम भत्ता और बोर्डिंग लॉजिंग के लिए  राज्य की राजधानी =A,अन्य स्थान =B कोड का चयन करें।"]
[null,4,"बोर्डिंग लॉजिंग दर की गणना Automatic के लिए सेल V12 मे Automatic का चयन या mannual दर भरने के लिए Mannual ड्रॉपडाउन से चयन करें।"]
[null,5,"अन्य कोई वास्तविक व्यय देय हो तो W कॉलम मे भरे ।"]
[null,6,"विश्राम भत्ता की गणना के लिए मुख्यालय से अनुपस्थिति 6 घंटे से तक 0 एवं 6 घंटे से अधिक से 12 घंटे तक 70%(0.7) और 12 घंटे से अधिक के लिए पूरे दिन की गणना के लिए अंकित करे ।"]
[]
[null,"2.TA inner SHEET","यह AUTOGENERATED है और प्रिंट लेना है।"]
[null,"4 outer ","outer शीट का प्रिंट TA Bill के पीछे लेना है ।"]
[null,"3 लघु यात्रा बिल ","इस शीट में कार्मिक द्वारा कार्यालय कार्य से की गई लघु यात्राओं  की एंट्री करनी है। CRC GRANT में देय TA ग्रांट के तहत यात्रा भत्ता बिल इन शीट से बनाया जा सकता है ।सुविधा हेतु चार शीट दी गई है।"]
[]
[null,"Disclaimer: -","All care has been taken to keep the information upto date and correct and is for educational purpose only. You are encouraged to consult your Accountant or Advisor before taking any decesion based on this calculator"]
[]
[null,null,"                                  सुधार हेतु सुझाव  आमंत्रित  है "]
[]
[]
[]
[]
[]
[null,null,"                                         joshihansraj72@gmail.com"]

{"sheet":"Data Entry","index":1,"n_rows":22,"n_cols":35,"rows_kept":22,"merged":[[4,1,4,2],[4,3,4,5],[4,6,4,7],[4,8,4,11],[4,12,4,14],[4,15,4,19],[5,1,5,2],[5,3,5,5],[5,9,5,11],[5,13,5,14],[5,15,5,22],[6,1,6,2],[6,3,6,5],[6,7,6,10],[6,11,6,12],[6,13,6,23],[7,3,7,9],[7,10,7,11],[7,12,7,17],[8,1,8,7],[8,8,11,8],[8,9,9,11],[8,12,8,14],[8,15,8,17],[8,18,8,19],[8,20,9,21],[8,22,11,22],[8,23,11,23],[9,1,9,4],[9,5,9,7],[9,12,9,13],[9,15,9,16],[9,19,11,19],[10,1,11,1],[10,2,11,2],[10,3,11,3],[10,4,11,4],[10,5,11,5],[10,6,11,6],[10,7,11,7],[10,9,11,9],[10,10,11,10],[10,11,11,11],[10,12,10,13],[10,15,10,16],[11,12,11,13],[11,15,11,16],[12,1,13,1],[12,12,13,14],[12,15,13,17],[12,18,13,18],[12,19,13,19],[12,20,13,20],[12,21,13,21],[12,22,13,22],[12,23,13,23],[14,1,15,1],[14,12,15,14],[14,15,15,17],[14,18,15,18],[14,19,15,19],[14,20,15,20],[14,21,15,21],[14,22,15,22],[14,23,15,23],[16,1,17,1],[16,12,17,14],[16,15,17,17],[16,18,17,18],[16,19,17,19],[16,20,17,20],[16,21,17,21],[16,22,17,22],[16,23,17,23],[18,1,19,1],[18,12,19,14],[18,15,19,17],[18,18,19,18],[18,19,19,19],[18,20,19,20],[18,21,19,21],[18,22,19,22],[18,23,19,23],[20,1,21,1],[20,12,21,14],[20,15,21,17],[20,18,21,18],[20,19,21,19],[20,20,21,20],[20,21,21,21],[20,22,21,22],[20,23,21,23],[22,12,22,14]]}
[]
[]
[]
[]
[null,"uke",null,"galjkt tks'kh ",null,null,"cSad [kkrk la[;k &",null,"01234567891011",{"$nulls":3},"osrueku",null,null,"lkroka osrueku"]
[null,"in","in","iz/kkukpk;Z",null,null,"Js.kh   ","ख","ekg","ekpZ",null,null,"o\"kZ",2021,null,"osru :i;s ¼fo'ks\"k osru dks NksM+ dj½ csfld",{"$nulls":7},78000]
[null,"ftyk","ftyk","Jhxaxkuxj",null,null,"eq[;ky;","13 Mhvks,y",{"$nulls":3},"inLFkkiu ",null,"jktdh; mPp ek/;fed fo|ky; 13Mhvks,y Jhxaxkuxj "]
[{"$nulls":3},"यदि स्थानांतरण पर यात्रा भत्ता बिल बनाया जा रहा है तो \"YES\" अन्यथा \"NO\" का चयन करें ",{"$nulls":6},"YES",{"$nulls":21},"बस ",1,"x"]
[null,";k=k ,oa foJke dk fooj.k",{"$nulls":6},";k=k dk izdkj","ok;q ;ku] jsy] cl] ;k=k ds fy, ehy HkRrk",null,null,"M;wVh LFkku",null,null,"xarO; LFkku",null,null,"foJke HkRrk",null,"cksfMZax ,oa ykWftax",null,"okLrfod vU; O;; ",";k=k dk iz;kstu o vkns'k Øekad",{"$nulls":8},"रेल ",2,"x"]
[null,"izLFkku",{"$nulls":3},"vkxeu",{"$nulls":6},"t;iqj",null,"A","t;iqj",null,"A","xarO; LFkku dksM","fnu",{"$nulls":12},"वायुयान",3,"x"]
[null,"SN","LFkku","fnukad","le;","LFkku","fnukad","le;",null,"Js.kh fVdV la[;k","nwjh  fd-eh-","fdjk;k","tks/kiqj]vtesj] dksVk]chdkusj]mn;iqj",null,"B","tks/kiqj]vtesj] dksVk]chdkusj]mn;iqj",null,"B","राज्य/UT की राजधानी -\"A\"",null,"fnu","nj",{"$nulls":10},"स्वयं का वाहन(कार)",4,"y"]
[{"$nulls":12},"vU; LFkku",null,"C","vU; LFkku",null,"C","अन्य स्थान -\"B\"",null,null,"Automatic",{"$nulls":10},"स्वयं का वाहन(मोटर साइकिल ,स्कूटर,मोपेड़ )",5,"y"]
[null,1,"13Mhvks,y","2020-10-12","09:00:00","?kM+lkuk","2020-10-12","10:00:00","बस ",1,45,45,"C",null,null,"C",null,null,"B",1.7,{"$nulls":12},"रिक्शा तांगा,मोटर रिक्शा ",6,"y"]
[null,null,{"$f":"IF(F13=\"\",\"\",F13)","v":"?kM+lkuk"},"2020-10-13","10:00:00",{"$f":"C13","v":"13Mhvks,y"},"2020-10-12","11:00:00","रेल ",1,45,45,{"$nulls":20},"साइकिल/पैदल ",7,"y"]
[null,2,"13Mhvks,y","2020-10-12","06:00:00","lwjrx<","2020-10-12","10:00:00","बस ",1,150,150,"C",null,null,"C",null,null,"B",1.7,{"$nulls":12},"सरकारी वाहन ",8,"z"]
[null,null,{"$f":"IF(F15=\"\",\"\",F15)","v":"lwjrx<"},"2020-10-12","18:00:00",{"$f":"C15","v":"13Mhvks,y"},"2020-10-12","22:00:00","बस ",1,100,150]
[null,3,"13Mhvks,y","2020-12-15","10:00:00","?kM+lkuk","2020-12-15",11,"स्वयं का वाहन(कार)",1,45,null,"C",null,null,"C",null,null,"B",3]
[null,null,{"$f":"IF(F17=\"\",\"\",F17)","v":"?kM+lkuk"},"2020-12-15","18:00:00",{"$f":"C17","v":"13Mhvks,y"},"2020-12-15","20:00:00","स्वयं का वाहन(कार)",1,45]
[null,4,{"$nulls":10},"B",null,null,"C",null,null,"B",3]
[null,null,{"$f":"IF(F19=\"\",\"\",F19)","v":""}]
[null,5,{"$nulls":10},"C",null,null,"A",null,null,"A",5]
[null,null,{"$f":"IF(F21=\"\",\"\",F21)","v":""}]

{"sheet":"TA inner","index":2,"n_rows":30,"n_cols":29,"rows_kept":30,"merged":[[1,1,1,24],[2,2,2,11],[2,12,2,15],[2,16,2,21],[2,23,2,24],[3,2,3,9],[3,13,3,15],[3,18,3,22],[3,23,3,24],[4,2,4,5],[4,7,4,11],[4,12,4,15],[4,16,4,24],[5,1,5,8],[5,9,7,9],[5,10,7,10],[5,11,5,13],[5,14,7,17],[5,18,6,20],[5,21,7,21],[5,22,7,22],[5,23,7,23],[5,24,7,24],[6,1,6,4],[6,5,6,8],[6,11,7,11],[6,12,7,12],[6,13,7,13],[7,3,7,4],[7,7,7,8],[8,0,9,0],[8,3,8,4],[8,7,8,8],[8,14,8,17],[8,23,9,23],[8,24,9,24],[9,3,9,4],[9,7,9,8],[9,14,9,17],[10,0,11,0],[10,3,10,4],[10,7,10,8],[10,14,10,17],[10,23,11,23],[10,24,11,24],[11,3,11,4],[11,7,11,8],[11,14,11,17],[12,0,13,0],[12,3,12,4],[12,7,12,8],[12,14,12,17],[12,23,13,23],[12,24,13,24],[13,3,13,4],[13,7,13,8],[13,14,13,17],[14,0,15,0],[14,3,14,4],[14,7,14,8],[14,14,14,17],[14,23,15,23],[14,24,15,24],[15,3,15,4],[15,7,15,8],[15,14,15,17],[16,0,17,0],[16,3,16,4],[16,7,16,8],[16,14,16,17],[16,23,17,23],[16,24,17,24],[17,3,17,4],[17,7,17,8],[17,14,17,17],[18,1,18,9],[18,14,18,17],[19,1,19,12],[19,13,19,16],[19,17,19,23],[20,1,20,20],[20,21,20,23],[21,1,21,20],[21,21,21,23],[22,1,22,20],[22,21,22,23],[23,1,23,18],[24,1,24,18],[25,1,25,16],[25,17,25,21],[26,1,26,12],[26,13,26,21],[26,22,26,24],[27,1,27,2],[27,3,27,4],[27,7,27,8],[27,10,27,12],[27,13,28,17],[27,18,27,20],[27,22,27,23],[28,1,28,2],[28,3,28,8],[28,10,28,12],[28,18,28,20],[28,22,29,24],[29,1,29,2],[29,3,29,8],[29,10,29,12],[29,13,29,17],[29,18,29,21]]}
[]
[null,";k=k HkRrk fcy"]
[null,"uke",{"$f":"'Data Entry'!D5","v":"galjkt tks'kh "},{"$nulls":9},"cSad [kkrk la[;k &",{"$nulls":3},{"$f":"'Data Entry'!I5","v":"01234567891011"},{"$nulls":5},"osrueku",{"$f":"'Data Entry'!P5","v":"lkroka osrueku"}]
[null,"in",{"$f":"'Data Entry'!D6","v":"iz/kkukpk;Z"},{"$nulls":7},"Js.kh   ",{"$f":"'Data Entry'!H6","v":"ख"},"ekg",{"$f":"'Data Entry'!J6","v":"ekpZ"},null,null,"o\"kZ",{"$f":"'Data Entry'!N6","v":2021},"osru :i;s ¼fo'ks\"k osru dks NksM+ dj½ csfld",{"$nulls":4},{"$f":"'Data Entry'!X6","v":78000},{"$nulls":3},"प्रातः"]
[null,"ftyk",{"$f":"'Data Entry'!D7","v":"Jhxaxkuxj"},{"$nulls":3},"eq[;ky;",{"$f":"'Data Entry'!H7","v":"13 Mhvks,y"},{"$nulls":4},"inLFkkiu ",{"$nulls":3},{"$f":"'Data Entry'!N7","v":"jktdh; mPp ek/;fed fo|ky; 13Mhvks,y Jhxaxkuxj "},{"$nulls":10},"सायं"]
[null,";k=k ,oa foJke dk fooj.k",{"$nulls":7},";k=k dk izdkj","rkaxk @ VSDlh pktZ","ok;q ;ku] jsy] cl] ;k=k ds fy, ehy HkRrk",null,null,"xarO; 'kgj dks lysDV djsa",{"$nulls":3},"foJke dk HkRrk",null,null,"okLrfod vU; O;; @ LVs vekmaV","dqy ;ksx",";k=k dk iz;kstu o vkns'k Øekad","Remark"]
[null,"izLFkku",{"$nulls":3},"vkxeu",{"$nulls":5},"Js.kh fVdV la[;k","nwjh  fd-eh-","fdjk;k"]
[null,"LFkku","fnukad","le;",null,"LFkku","fnukad","le;",{"$nulls":10},"fnu","nj","jkf'k"]
[1,{"$f":"IF('Data Entry'!C13=\"\",\"\",'Data Entry'!C13)","v":"13Mhvks,y"},{"$f":"IF('Data Entry'!D13=\"\",\"\",'Data Entry'!D13)","v":"2020-10-12"},{"$f":"IF('Data Entry'!E13=\"\",\"\",'Data Entry'!E13)","v":"09:00:00"},null,{"$f":"IF('Data Entry'!F13=\"\",\"\",'Data Entry'!F13)","v":"?kM+lkuk"},{"$f":"IF('Data Entry'!G13=\"\",\"\",'Data Entry'!G13)","v":"2020-10-12"},{"$f":"IF('Data Entry'!H13=\"\",\"\",'Data Entry'!H13)","v":"10:00:00"},null,{"$f":"IF('Data Entry'!I13=\"\",\"\",'Data Entry'!I13)","v":"बस "},{"$f":"master!H18","v":120},{"$f":"IF('Data Entry'!J13=\"\",\"\",'Data Entry'!J13)","v":1},{"$f":"IF('Data Entry'!K13=\"\",\"\",'Data Entry'!K13)","v":45},{"$f":"master!E18","v":45},{"$f":"IF(F9=\"\",\"\",IF('Data Entry'!S13=\"A\",master!$O$15,master!$O$16))","v":"अन्य स्थान "},{"$nulls":5},{"$f":"S9*T9","v":0},null,{"$f":"SUM(K9,N9,U9,V9)","v":165},{"$f":"IF('Data Entry'!X13=\"\",\"\",'Data Entry'!X13)","v":""}]
[null,{"$f":"IF('Data Entry'!C14=\"\",\"\",'Data Entry'!C14)","v":"?kM+lkuk"},{"$f":"IF('Data Entry'!D14=\"\",\"\",'Data Entry'!D14)","v":"2020-10-13"},{"$f":"IF('Data Entry'!E14=\"\",\"\",'Data Entry'!E14)","v":"10:00:00"},null,{"$f":"IF('Data Entry'!F14=\"\",\"\",'Data Entry'!F14)","v":"13Mhvks,y"},{"$f":"IF('Data Entry'!G14=\"\",\"\",'Data Entry'!G14)","v":"2020-10-12"},{"$f":"IF('Data Entry'!H14=\"\",\"\",'Data Entry'!H14)","v":"11:00:00"},null,{"$f":"IF('Data Entry'!I14=\"\",\"\",'Data Entry'!I14)","v":"रेल "},{"$f":"master!H19","v":120},{"$f":"IF('Data Entry'!J14=\"\",\"\",'Data Entry'!J14)","v":1},{"$f":"IF('Data Entry'!K14=\"\",\"\",'Data Entry'!K14)","v":45},{"$f":"master!E19","v":45},{"$f":"IF(B10=\"\",\"\",IF('Data Entry'!S14=\"A\",master!$O$15,master!$O$16))","v":"अन्य स्थान "},{"$nulls":3},{"$f":"master!J19","v":1.7},{"$f":"master!K19","v":500},{"$f":"S10*T10","v":850},{"$f":"master!W19","v":0},{"$f":"SUM(K10,N10,U10,V10)","v":1015}]
[2,{"$f":"IF('Data Entry'!C15=\"\",\"\",'Data Entry'!C15)","v":"13Mhvks,y"},{"$f":"IF('Data Entry'!D15=\"\",\"\",'Data Entry'!D15)","v":"2020-10-12"},{"$f":"IF('Data Entry'!E15=\"\",\"\",'Data Entry'!E15)","v":"06:00:00"},null,{"$f":"IF('Data Entry'!F15=\"\",\"\",'Data Entry'!F15)","v":"lwjrx<"},{"$f":"IF('Data Entry'!G15=\"\",\"\",'Data Entry'!G15)","v":"2020-10-12"},{"$f":"IF('Data Entry'!H15=\"\",\"\",'Data Entry'!H15)","v":"10:00:00"},null,{"$f":"IF('Data Entry'!I15=\"\",\"\",'Data Entry'!I15)","v":"बस "},{"$f":"master!H20","v":120},{"$f":"IF('Data Entry'!J15=\"\",\"\",'Data Entry'!J15)","v":1},{"$f":"IF('Data Entry'!K15=\"\",\"\",'Data Entry'!K15)","v":150},{"$f":"master!E20","v":150},{"$f":"IF(F11=\"\",\"\",IF('Data Entry'!S15=\"A\",master!$O$15,master!$O$16))","v":"अन्य स्थान "},{"$nulls":4},{"$f":"master!K20","v":0},0,null,270,{"$f":"IF('Data Entry'!X15=\"\",\"\",'Data Entry'!X15)","v":""}]
[null,{"$f":"IF('Data Entry'!C16=\"\",\"\",'Data Entry'!C16)","v":"lwjrx<"},{"$f":"IF('Data Entry'!D16=\"\",\"\",'Data Entry'!D16)","v":"2020-10-12"},{"$f":"IF('Data Entry'!E16=\"\",\"\",'Data Entry'!E16)","v":"18:00:00"},null,{"$f":"IF('Data Entry'!F16=\"\",\"\",'Data Entry'!F16)","v":"13Mhvks,y"},{"$f":"IF('Data Entry'!G16=\"\",\"\",'Data Entry'!G16)","v":"2020-10-12"},{"$f":"IF('Data Entry'!H16=\"\",\"\",'Data Entry'!H16)","v":"22:00:00"},null,{"$f":"IF('Data Entry'!I16=\"\",\"\",'Data Entry'!I16)","v":"बस "},{"$f":"master!H21","v":120},{"$f":"IF('Data Entry'!J16=\"\",\"\",'Data Entry'!J16)","v":1},{"$f":"IF('Data Entry'!K16=\"\",\"\",'Data Entry'!K16)","v":100},{"$f":"master!E21","v":150},{"$f":"IF(B12=\"\",\"\",IF('Data Entry'!S16=\"A\",master!$O$15,master!$O$16))","v":"अन्य स्थान "},{"$nulls":3},{"$f":"master!J21","v":1.7},{"$f":"master!K21","v":500},850,{"$f":"master!W21","v":0},1120]
[3,{"$f":"IF('Data Entry'!C17=\"\",\"\",'Data Entry'!C17)","v":"13Mhvks,y"},{"$f":"IF('Data Entry'!D17=\"\",\"\",'Data Entry'!D17)","v":"2020-12-15"},{"$f":"IF('Data Entry'!E17=\"\",\"\",'Data Entry'!E17)","v":"10:00:00"},null,{"$f":"IF('Data Entry'!F17=\"\",\"\",'Data Entry'!F17)","v":"?kM+lkuk"},{"$f":"IF('Data Entry'!G17=\"\",\"\",'Data Entry'!G17)","v":"2020-12-15"},{"$f":"IF('Data Entry'!H17=\"\",\"\",'Data Entry'!H17)","v":11},null,{"$f":"IF('Data Entry'!I17=\"\",\"\",'Data Entry'!I17)","v":"स्वयं का वाहन(कार)"},{"$f":"master!H22","v":0},{"$f":"IF('Data Entry'!J17=\"\",\"\",'Data Entry'!J17)","v":1},{"$f":"IF('Data Entry'!K17=\"\",\"\",'Data Entry'!K17)","v":45},{"$f":"master!E22","v":405},{"$f":"IF(F13=\"\",\"\",IF('Data Entry'!S17=\"A\",master!$O$15,master!$O$16))","v":"अन्य स्थान "},{"$nulls":4},{"$f":"master!K22","v":0},0,null,405,{"$f":"IF('Data Entry'!X17=\"\",\"\",'Data Entry'!X17)","v":""}]
[null,{"$f":"IF('Data Entry'!C18=\"\",\"\",'Data Entry'!C18)","v":"?kM+lkuk"},{"$f":"IF('Data Entry'!D18=\"\",\"\",'Data Entry'!D18)","v":"2020-12-15"},{"$f":"IF('Data Entry'!E18=\"\",\"\",'Data Entry'!E18)","v":"18:00:00"},null,{"$f":"IF('Data Entry'!F18=\"\",\"\",'Data Entry'!F18)","v":"13Mhvks,y"},{"$f":"IF('Data Entry'!G18=\"\",\"\",'Data Entry'!G18)","v":"2020-12-15"},{"$f":"IF('Data Entry'!H18=\"\",\"\",'Data Entry'!H18)","v":"20:00:00"},null,{"$f":"IF('Data Entry'!I18=\"\",\"\",'Data Entry'!I18)","v":"स्वयं का वाहन(कार)"},{"$f":"master!H23","v":0},{"$f":"IF('Data Entry'!J18=\"\",\"\",'Data Entry'!J18)","v":1},{"$f":"IF('Data Entry'!K18=\"\",\"\",'Data Entry'!K18)","v":45},{"$f":"master!E23","v":405},{"$f":"IF(B14=\"\",\"\",IF('Data Entry'!S18=\"A\",master!$O$15,master!$O$16))","v":"अन्य स्थान "},{"$nulls":3},{"$f":"master!J23","v":3},{"$f":"master!K23","v":500},1500,{"$f":"master!W23","v":0},1905]
[4,{"$f":"IF('Data Entry'!C19=\"\",\"\",'Data Entry'!C19)","v":""},{"$f":"IF('Data Entry'!D19=\"\",\"\",'Data Entry'!D19)","v":""},{"$f":"IF('Data Entry'!E19=\"\",\"\",'Data Entry'!E19)","v":""},null,{"$f":"IF('Data Entry'!F19=\"\",\"\",'Data Entry'!F19)","v":""},{"$f":"IF('Data Entry'!G19=\"\",\"\",'Data Entry'!G19)","v":""},{"$f":"IF('Data Entry'!H19=\"\",\"\",'Data Entry'!H19)","v":""},null,{"$f":"IF('Data Entry'!I19=\"\",\"\",'Data Entry'!I19)","v":""},{"$f":"master!H24","v":0},{"$f":"IF('Data Entry'!J19=\"\",\"\",'Data Entry'!J19)","v":""},{"$f":"IF('Data Entry'!K19=\"\",\"\",'Data Entry'!K19)","v":""},{"$f":"master!E24","v":0},{"$f":"IF(F15=\"\",\"\",IF('Data Entry'!S19=\"A\",master!$O$15,master!$O$16))","v":""},{"$nulls":4},{"$f":"master!K24","v":0},0,null,0,{"$f":"IF('Data Entry'!X19=\"\",\"\",'Data Entry'!X19)","v":""},{"$nulls":4},{"$f":"IF(J15=\"vuqcaf/kr okgu\",\"---\",\"\")","v":""}]
[null,{"$f":"IF('Data Entry'!C20=\"\",\"\",'Data Entry'!C20)","v":""},{"$f":"IF('Data Entry'!D20=\"\",\"\",'Data Entry'!D20)","v":""},{"$f":"IF('Data Entry'!E20=\"\",\"\",'Data Entry'!E20)","v":""},null,{"$f":"IF('Data Entry'!F20=\"\",\"\",'Data Entry'!F20)","v":""},{"$f":"IF('Data Entry'!G20=\"\",\"\",'Data Entry'!G20)","v":""},{"$f":"IF('Data Entry'!H20=\"\",\"\",'Data Entry'!H20)","v":""},null,{"$f":"IF('Data Entry'!I20=\"\",\"\",'Data Entry'!I20)","v":""},{"$f":"master!H25","v":0},{"$f":"IF('Data Entry'!J20=\"\",\"\",'Data Entry'!J20)","v":""},{"$f":"IF('Data Entry'!K20=\"\",\"\",'Data Entry'!K20)","v":""},{"$f":"master!E25","v":0},{"$f":"IF(B16=\"\",\"\",IF('Data Entry'!S20=\"A\",master!$O$15,master!$O$16))","v":""},{"$nulls":3},{"$f":"master!J25","v":0},{"$f":"master!K25","v":0},0,{"$f":"master!W25","v":0},0]
[5,{"$f":"IF('Data Entry'!C21=\"\",\"\",'Data Entry'!C21)","v":""},{"$f":"IF('Data Entry'!D21=\"\",\"\",'Data Entry'!D21)","v":""},{"$f":"IF('Data Entry'!E21=\"\",\"\",'Data Entry'!E21)","v":""},null,{"$f":"IF('Data Entry'!F21=\"\",\"\",'Data Entry'!F21)","v":""},{"$f":"IF('Data Entry'!G21=\"\",\"\",'Data Entry'!G21)","v":""},{"$f":"IF('Data Entry'!H21=\"\",\"\",'Data Entry'!H21)","v":""},null,{"$f":"IF('Data Entry'!I21=\"\",\"\",'Data Entry'!I21)","v":""},{"$f":"master!H26","v":0},{"$f":"IF('Data Entry'!J21=\"\",\"\",'Data Entry'!J21)","v":""},{"$f":"IF('Data Entry'!K21=\"\",\"\",'Data Entry'!K21)","v":""},{"$f":"master!E26","v":0},{"$f":"IF(F17=\"\",\"\",IF('Data Entry'!S21=\"A\",master!$O$15,master!$O$16))","v":""},{"$nulls":4},{"$f":"master!K26","v":0},{"$f":"S17*T17","v":0},null,{"$f":"SUM(K17,N17,U17,V17)","v":0},{"$f":"IF('Data Entry'!X21=\"\",\"\",'Data Entry'!X21)","v":""}]
[null,{"$f":"IF('Data Entry'!C22=\"\",\"\",'Data Entry'!C22)","v":""},{"$f":"IF('Data Entry'!D22=\"\",\"\",'Data Entry'!D22)","v":""},{"$f":"IF('Data Entry'!E22=\"\",\"\",'Data Entry'!E22)","v":""},null,{"$f":"IF('Data Entry'!F22=\"\",\"\",'Data Entry'!F22)","v":""},{"$f":"IF('Data Entry'!G22=\"\",\"\",'Data Entry'!G22)","v":""},{"$f":"IF('Data Entry'!H22=\"\",\"\",'Data Entry'!H22)","v":""},null,{"$f":"IF('Data Entry'!I22=\"\",\"\",'Data Entry'!I22)","v":""},{"$f":"master!H27","v":0},{"$f":"IF('Data Entry'!J22=\"\",\"\",'Data Entry'!J22)","v":""},{"$f":"IF('Data Entry'!K22=\"\",\"\",'Data Entry'!K22)","v":""},{"$f":"master!E27","v":0},{"$f":"IF(B18=\"\",\"\",IF('Data Entry'!S22=\"A\",master!$O$15,master!$O$16))","v":""},{"$nulls":3},{"$f":"master!J27","v":0},{"$f":"master!K27","v":0},0,{"$f":"master!W27","v":0},0]
[null,";ksx",{"$nulls":8},{"$f":"SUM(K9:K18)","v":480},null,null,{"$f":"SUM(N9:N18)","v":1200},{"$nulls":6},{"$f":"SUM(U9:U18)","v":3200},null,{"$f":"ROUND(SUM(W9:W18),0)","v":4880}]
[{"$nulls":13},"jkf'k 'kCnksa esa #i;s    ",{"$nulls":3},{"$f":"[1]!SpellNumber(W19)","v":"Rupees Four Thousand Eight Hundred Eighty Only "},{"$nulls":6},"ek="]
[null,"ljdkjh deZpkjh }kjk izek.k i="]
[null,"1-  izekf.kr fd;k tkrk gSs fd mDr ;k=k eSus oLrqr% dh gS rFkk iwoZ esa eSus bl fcy dk Hkqxrku izkIr ugha fd;k gSA"]
[null,"2-  izekf.kr fd;k tkrk gs fd jfookjksa ;k vU; vodk'k ds fnuksa ] ftuds fy, eSus foJke HkRrs dk nkok fd;k gS] eSa okLrfod #i ls f'kfoj esa FkkA"]
[null,"3-   izekf.kr fd;k tkrk gSa fd eq>s jktdh; ;k LFkkuh; fudk; dh vksj ls dksbZ fu%'kqYd lokjh ugh nh xbZ gSaA"]
[null,"4-   izekf.kr fd;k tkrk gSa fd bl fcy esa nkokd`r jkf'k jktLFkku ;k=k HkÙkk fu;e &1971 ds izko/kkuksa ds vuqlkj gSaA"]
[{"$nulls":17},"gLrk{kj dkfeZd"]
[null,"& LFkkukUrj.k ij ;k=k HkRrk nkoksa ds fy, tksfM+, &",{"$nulls":11},"& ?kVkb, &",{"$nulls":8}," 'kq) jkf'k] tks Hkqxrku ;ksX; gSA"]
[null,"1- oS;fDrd lkeku dk",null,100,null,"fdyksehVj ds fy,",{"$f":"master!Q16","v":{"v":30,"d":"₹ 30.00"}},"dh nj ls",null,"#",{"$f":"D28*G28","v":3000},null,null,"1- ;k=k HkRrk vfxze ] ;fn  vkgjfr fd;k gks ",{"$nulls":7},"#",{"$f":"IFERROR(SUM(K28+K29+K30+W19)-S28,\"\")","v":15880},null,{"$f":"IF(W28=\"\",\"\",IF(W28=0,\"\",\"/- Rs.\"))","v":"/- Rs."}]
[null,"2- okgu",{"$nulls":7},"#",{"$nulls":12},"izfr gLrk{kj fu;U=.k vf/kdkjh"]
[null,"3- ,d eq'r vuqnku",{"$nulls":7},"#",{"$f":"master!R15","v":8000},null,null,"2- vkgjfr fd;k gks fcy la[;k o fnukad"]

{"sheet":"TA outer","index":3,"n_rows":28,"n_cols":23,"rows_kept":28,"merged":[[1,1,1,5],[1,6,1,9],[1,10,27,10],[1,11,27,11],[1,12,27,12],[1,13,27,13],[1,14,1,15],[1,16,1,19],[1,20,1,22],[2,4,4,4],[2,5,4,5],[2,6,2,9],[2,14,2,15],[2,16,2,19],[2,20,2,22],[3,1,3,3],[3,6,3,9],[3,16,3,19],[3,20,3,21],[4,1,4,3],[4,6,4,9],[4,16,4,19],[4,20,4,21],[5,1,5,3],[5,6,5,9],[5,14,5,15],[5,16,5,19],[6,1,6,3],[6,6,6,7],[6,8,6,9],[6,14,6,22],[7,1,7,4],[7,6,7,9],[7,14,7,22],[8,1,8,9],[8,14,8,22],[9,4,9,9],[9,14,9,22],[10,1,10,9],[10,14,10,22],[11,1,11,9],[11,14,11,22],[12,2,12,3],[12,4,12,6],[12,7,12,9],[12,14,12,22],[13,1,13,9],[13,14,13,22],[14,1,14,9],[14,14,14,22],[15,5,15,7],[15,8,15,9],[15,14,15,22],[16,1,16,9],[16,14,16,22],[17,1,17,9],[17,14,17,22],[18,1,18,6],[18,7,18,9],[18,14,18,22],[19,1,19,6],[19,8,19,9],[19,14,19,16],[19,17,19,22],[20,1,20,5],[20,7,20,9],[20,14,26,16],[20,17,20,22],[21,1,21,9],[21,18,21,22],[22,1,22,2],[22,3,22,5],[22,6,22,9],[22,17,22,22],[23,4,23,5],[23,6,23,9],[23,18,23,22],[24,1,24,2],[24,3,25,5],[24,17,24,22],[25,1,25,2],[25,7,25,9],[25,17,25,18],[25,19,25,22],[26,1,26,2],[26,3,26,5],[26,6,26,9],[26,17,26,22],[27,1,27,2],[27,3,27,5],[27,6,27,7],[27,8,27,9],[27,14,27,16],[27,17,27,19],[27,20,27,22]]}
[]
[null,"fofu;kstu",{"$nulls":4},"dk;kZy; v/;{k }kjk izek.k i=",{"$nulls":7},"GA 95",null,"jktLFkku ljdkj"]
[null,"1- o\"kZ ",null,"ds fy, ",null,null,"1- fooj.k izkIr fd;kA",{"$nulls":9},";k=k HkRrk fcy"]
[null,"  fofu;kstu",{"$nulls":4},"2- izekf.kr fd;k tkrk gS fd bl fcy esa  ",{"$nulls":7},"fcyuEcj","_______",{"$nulls":4},"ckmpj la[;k",null,"______"]
[null,"2- bl fcydh jkf'k dks  ",{"$nulls":4},"  'kkfey  dh xbZ  jkf'k  bl fnukad ls iwoZ ",{"$nulls":7},"fnukad","_______",{"$nulls":4},"Hkqqxrku dh frfFk",null,"_______"]
[null,"  'kkfey djrs gq, O;;",null,null,"------","------","  vkgfjr ugha dh xbZ gSA",{"$nulls":9},";k=k HkRrk fcy cukus gsrq vuqns'k"]
[null,"3- 'ks\"k",null,null,{"$f":"IF(OR(E3=0,E5=0),\"\",E3-E5)","v":""},{"$f":"IF(OR(F3=0,F5=0),\"\",F3-F5)","v":""},null,null,"dk;kZy;k/;{k",{"$nulls":5},"1- bl izi= dk mi;ksx lHkh deZpkfj;ks ds¼jktif=r rFkk vjktif=r½ds ekeyks es fd;k tkosxkA"]
[{"$nulls":14},"2- fofHkUu izdkj dh ;k=kvks ¼;Fkk&jsy`cl ok;q;ku }kjk bR;kfn ½,oeafoJeks dks i`Fkd ls "]
[null,"izfr gLrk{kj",{"$nulls":12},"  fn[kyk;k tkuk pkfg, dk;ZLFky ls ,;j iksVZ @jsYosLVs'ku@cl LVs.M rd i~gq¡pus ;k "]
[null,"#i;s","_______","¼'kCnksa esa½","-------------------------------------------------------------------------------------------------------------",{"$nulls":9},"  blds foijhr ;k=k ds fy, HkRrk ,d gh iafDr es fn[yk;k tkuk pkfg,A"]
[null,"ds fy; ikfjr fd;k x;kA ",{"$nulls":12},"3- lk{; nsus gsrq dh xbZ ;k=k ds ekeys es ml U;k;ky; ;k izkf/kdkjh +}kjk fn;k x;k mifLFkfr "]
[{"$nulls":14},"  izek.k i=  layXu djuk pkfg, ftlus ljdkjh deZpkjh dks cqyk;k gSA"]
[null,"fnukad","____________",null,"laf{kIr oxhZdj.k",null,null,"fu;a=.k vf/kdkjh",{"$nulls":6},"4- izFke Jsa.kh ds jsYos fVfdV dh la[;k dk mYys[k dhft;sA cl }kjk ;k=k ds ekeys es ;g "]
[null,"dks\"kkxkj dk;kZy; ds mi;ksx gsrq",{"$nulls":12},"  vafdr dhft, ;g ;k=k lk/kkj.k @Mkd@Mh&yDl@lseh Mh&yDlcl }kjk dh xbZ gSA"]
[null,"cSad@dks\"kkxkj",{"$nulls":12},"5- vH;qfDr ds dkWye es fuEu dk mYys[k dhft,s%&"]
[null,"d`Ik;k","#i;s","_______","¼'kCnkas easa½ ","-------------------------------------------",null,null,"dk Hkqxrku djsaA",{"$nulls":5},"1- LFkkukUrj.k ij ;k=k HkRrk ds ekeys es ifjokj ds lnL;ks dk uke ]lEcU/k ],oa vk;qA"]
[{"$nulls":14},"2- ;fn foJke ds nkSjku fu%'kqYd vkokl ,oa Hkkstu iznku fd;k x;k gks rks og rF;A"]
[{"$nulls":14},"3- vU; dksbZ rF; ;k lwpuk ftldk jktLFkku ;k=k HkRRkk fu;eks rFkk fu;e7¼4½ds vUrZxr "]
[{"$nulls":7},"dks\"kkxkj vf/kdkjh",{"$nulls":6},"  nkos ij egRoiw.kZ izHkko iM+rk gkSA","   egRoiw.kZ izHkko iMrk gks !"]
[null,"tk¡p dh",{"$nulls":5},"fnukad","_______",{"$nulls":5},"ys[kk 'kh\"kZd",null,null,"egkys[kkiky dk;kZy; ds mi;ksx ds gsrq"]
[null,"ys[kkdkj",{"$nulls":4},"ftyk ","_______"]
[{"$nulls":17}," #i;s","-----------------------------------------------------------------------------------------"]
[null,"izzzkIrdrkZ dh jlhn",null,"i`\"Bkadu",null,null,"   cSad@ukWu cSad dks\"kkxkj ds fy,",{"$nulls":10},"ds fy, Lohd`rA"]
[null,"fnukad ","_______","d`i;k Jh ","----------------------------------",{"$nulls":12}," #i;s","------------------------------------------------------------------------------------------"]
[null,"dks Hkqxrku izkIr   ",null,"dks  ftuds uewuss ds gLrk{kj uhps izekf.kr fd;s gS]  Hkqxrku djsaA",null,null," fnukad ","_______","#i;s","_______",{"$nulls":7},"ds fy, vkifRr dh xbZA"]
[null,"fd;kA ",{"$nulls":4}," 'kCnksa esa","-----------------------------------------------",{"$nulls":9}," vkifRr dk dkj.k",null,"----------------------------------------------------------------------"]
[{"$nulls":6},"dk Hkqxrku fd;k x;kA",{"$nulls":10},"------------------------------------------------------------------------------------------------------------"]
[null,"gLrk{kj",null,"gLrk{kj",null,null,"cSad dh eksgj",null,"izcU/kd@dks\"kk/;{k",{"$nulls":5},"  vads{kd",null,null,"v/kh{kd",null,null,"jktif=r vf/kdkjh"]

{"sheet":"master","index":4,"n_rows":30,"n_cols":23,"rows_kept":30,"hidden":true,"merged":[[2,0,2,16],[3,0,5,0],[3,1,5,1],[3,2,5,2],[3,3,5,3],[3,4,3,7],[3,8,3,10],[3,11,3,12],[3,13,3,14],[3,15,3,16],[4,4,4,7],[4,8,4,10],[4,11,5,11],[4,12,5,12],[4,13,5,13],[4,14,5,14],[4,15,5,15],[4,16,5,16],[12,0,12,16],[13,15,13,17],[13,18,14,20],[13,21,16,21],[13,22,16,22],[14,15,14,16],[15,3,15,4],[15,5,15,7],[15,18,16,18],[15,20,16,20],[17,0,18,0],[19,0,20,0],[21,0,22,0],[23,0,24,0],[25,0,26,0],[27,0,28,0],[29,0,30,0]]}
[]
[]
["uohu ;k=k HkRrk ,oa nSfud HkRrs dh lkj.kh izHkkoh fnuakd 06-12-2017 7oka osru izkjfEHkd njsa"]
["Js.kh","वेतनमान 2017 में ewy osru","jsy ls ;k=k ","lM+d ;k=k","lM+d ;k=k HkRrk",{"$nulls":3},"lM+d ;k=k HkRrk",null,null,"nSfud HkRrk",null,"cksfMZax ,oa ykftx",null,"LFkkukUrj.k"]
[{"$nulls":4},"Lo;a ds okgu ls fof’k\"V nj ¼izfr fd-eh-½",{"$nulls":3},"M;wVh LFkku ls jsYos LVs'ku]cl LVS.M] gokbZ vMMk rd",null,null,"leLr jkT;@dsUnz'kkflr izns'kksa dh  jkt/kkfu;ksa esa nSfud HkRrk","vU; leLr LFkkuksa ij nSfud HkRrk","leLr jkT;@dsUnz'kkflr izns'kksa dh  jkt/kkfu;ksa esa nSfud HkRrk","vU; leLr LFkkuksa ij nSfud HkRrk",",deq’r jkf’k","yxst HkkM+k izfr fd-eh-"]
[{"$nulls":4},"Loa; dh dkj ls","LdwVj@ eksVj lkbZdy@ eksisM","vU; okgu tSls fjD'kk]rkaxk]eksVj fjD'kk","iSny","fjD’kk@rkaxk@vkVks fjD’kk t;iqj","dksVk@ tks/kiqj@ chdkusj@ mn;iqj","vU; LFkku"]
[1,2,3,4,5,6,7,8,9,10,11,12,13,14,15,16,17]
[" क","95000 ,oa vf/kd","dksbZ Hkh Vªsu dksbZ Hkh ,lh Dykl",",lh MhyDl@lseh MhyDl vij Dykl",9,3,6,null,150,100,60,800,600,3000,2000,10000,30]
["ख","49000&95000","dqlhZ;ku ,lh ,lh&kkk",",lh MhyDl@lseh MhyDl vij Dykl",9,3,6,null,150,100,60,700,500,2500,1800,8000,30]
["ग","39000&49000","f}rh; Lyhij",",lh MhyDl@lseh fMyDl vij Dykl",null,3,6,2,150,100,60,600,400,2000,1500,6000,18]
["घ","26000&39000","f}rh; Lyhij",",lh MhyDl@lseh MhyDl vij Dykl",null,3,6,2,150,100,60,550,350,1500,1000,5000,14]
["ड़","0&26000","f}rh; Lyhij",",lh fMyDl@lseh fMyDl vij Dykl",null,3,6,2,150,100,60,350,250,1000,700,3500,12]
["uksV % 15$ fd0eh0 ij gh fojke HkRrk ns; gksxkA 6 ?k.Vs rd fojke HkRrk ‘kwU; jgsxkA 6 ls 12 ?k.Vs rd 50 izfr’kr rFkk 12 ?k.Vs ls vf/kd ;k=k ij gh iw.kZ fojke HkRrk ns; gksxkA"]
[{"$nulls":15},"LFkkukUrj.k ;k=k HkRrk",null,null,"cksfMZax ,oa ykWftax",null,null,"vU; okLrfod O;;",";ksx"]
[{"$nulls":14},"राज्य/UT की राजधानी",",deq’r jkf’k",null,{"$f":"IF('Data Entry'!K8=\"YES\",VLOOKUP($K$16,ta_master,16,0),\"\")","v":8000}]
[{"$nulls":3},"fdjk;k",null,"rkaxk HkRrk",null,null,"foJke HkRrk","Js.kh",{"$f":"'TA inner'!L4","v":"ख"},{"$nulls":3},"अन्य स्थान ","yxst HkkM+k nj",{"$f":"IF('Data Entry'!K8=\"YES\",VLOOKUP($K$16,ta_master,17,0),\"\")","v":30},{"$f":"D18*Q16","v":1350},"fnu","nj","jkf'k"]
[null,"izLFkku","vkxeu","nwjh","fdjk;k","M;wVh","xarO;",";ksx","dksM","fnu","nj","jkf'k",null,null,";k=k izdkj","dksM","dksM","nj",null,"Automatic"]
[1,{"$f":"IF(OR('Data Entry'!C13=\"\",'Data Entry'!D13=\"\",'Data Entry'!E13=\"\"),\"\",'Data Entry'!C13)","v":"13Mhvks,y"},{"$f":"IF(OR('Data Entry'!F13=\"\",'Data Entry'!G13=\"\",'Data Entry'!H13=\"\"),\"\",'Data Entry'!F13)","v":"?kM+lkuk"},{"$f":"'Data Entry'!K13","v":45},{"$f":"IFERROR(ROUND(IF(Q18=\"z\",0,IF('Data Entry'!L13=\"\",master!D18*master!R18,'Data Entry'!L13)),0),\"\")","v":45},{"$f":"IF('Data Entry'!C13=\"\",0,IF(AND('Data Entry'!$M13=\"A\",Q18=\"x\"),150,IF(AND('Data Entry'!$M13=\"B\",Q18=\"x\"),100,IF(AND('Data Entry'!M13=\"C\",Q18=\"x\"),60,0))))","v":60},{"$f":"IF('Data Entry'!F13=\"\",0,IF(AND('Data Entry'!$P13=\"A\",Q18=\"x\"),150,IF(AND('Data Entry'!$P13=\"B\",Q18=\"x\"),100,IF(AND('Data Entry'!P13=\"C\",Q18=\"x\"),60,0))))","v":60},{"$f":"SUM(F18:G18)","v":120},{"$nulls":6},{"$f":"'Data Entry'!I13","v":"बस "},{"$f":"IFERROR(VLOOKUP('Data Entry'!$I13,'Data Entry'!$AG$8:$AH$15,2,0),\"\")","v":1},{"$f":"IFERROR(VLOOKUP('Data Entry'!$I13,'Data Entry'!$AG$8:$AI$15,3,0),\"\")","v":"x"},{"$f":"IF($P18=4,VLOOKUP($K$16,ta_master,5,0),IF($P18=5,VLOOKUP($K$16,ta_master,6,0),IF($P18=6,VLOOKUP($K$16,ta_master,7,0),IF($P18=7,VLOOKUP($K$16,ta_master,8,0),0))))","v":0}]
[null,{"$f":"IF(OR('Data Entry'!C14=\"\",'Data Entry'!D14=\"\",'Data Entry'!E14=\"\"),\"\",'Data Entry'!C14)","v":"?kM+lkuk"},{"$f":"IF(OR('Data Entry'!F14=\"\",'Data Entry'!G14=\"\",'Data Entry'!H14=\"\"),\"\",'Data Entry'!F14)","v":"13Mhvks,y"},{"$f":"'Data Entry'!K14","v":45},{"$f":"IFERROR(ROUND(IF(Q19=\"z\",0,IF('Data Entry'!L14=\"\",master!D19*master!R19,'Data Entry'!L14)),0),\"\")","v":45},{"$f":"IF('Data Entry'!C14=\"\",0,IF(AND('Data Entry'!$M13=\"A\",Q19=\"x\"),150,IF(AND('Data Entry'!$M13=\"B\",Q19=\"x\"),100,IF(AND('Data Entry'!M13=\"C\",Q19=\"x\"),60,0))))","v":60},{"$f":"IF('Data Entry'!F14=\"\",0,IF(AND('Data Entry'!$P13=\"A\",Q19=\"x\"),150,IF(AND('Data Entry'!$P13=\"B\",Q19=\"x\"),100,IF(AND('Data Entry'!P13=\"C\",Q19=\"x\"),60,0))))","v":60},{"$f":"SUM(F19:G19)","v":120},{"$f":"'Data Entry'!S13","v":"B"},{"$f":"IF(OR(B18=\"\",B19=\"\",C19=\"\",'Data Entry'!T13<0.7),0,'Data Entry'!T13)","v":1.7},{"$f":"IF(J19>0,IF(I19=\"A\",VLOOKUP($K$16,ta_master,12,0),IF(I19=\"B\",(VLOOKUP($K$16,ta_master,13,0)),0)),0)","v":500},{"$f":"J19*K19","v":850},null,null,{"$f":"'Data Entry'!I14","v":"रेल "},{"$f":"IFERROR(VLOOKUP('Data Entry'!$I14,'Data Entry'!$AG$8:$AH$15,2,0),\"\")","v":2},{"$f":"IFERROR(VLOOKUP('Data Entry'!$I14,'Data Entry'!$AG$8:$AI$15,3,0),\"\")","v":"x"},0,{"$f":"'Data Entry'!U13","v":0},{"$f":"IF('Data Entry'!$V$12=master!$T$17,IF(I19=\"A\",VLOOKUP(master!$K$16,ta_master,14,0),VLOOKUP(master!$K$16,ta_master,15,0)),'Data Entry'!V13)","v":1800},{"$f":"ROUND(S19*T19,0)","v":0},{"$f":"'Data Entry'!W13","v":0},{"$f":"U19+V19","v":0}]
[2,{"$f":"IF(OR('Data Entry'!C15=\"\",'Data Entry'!D15=\"\",'Data Entry'!E15=\"\"),\"\",'Data Entry'!C15)","v":"13Mhvks,y"},{"$f":"IF(OR('Data Entry'!F15=\"\",'Data Entry'!G15=\"\",'Data Entry'!H15=\"\"),\"\",'Data Entry'!F15)","v":"lwjrx<"},{"$f":"'Data Entry'!K15","v":150},{"$f":"IFERROR(ROUND(IF(Q20=\"z\",0,IF('Data Entry'!L15=\"\",master!D20*master!R20,'Data Entry'!L15)),0),\"\")","v":150},{"$f":"IF('Data Entry'!C15=\"\",0,IF(AND('Data Entry'!$M15=\"A\",Q20=\"x\"),150,IF(AND('Data Entry'!$M15=\"B\",Q20=\"x\"),100,IF(AND('Data Entry'!M15=\"C\",Q20=\"x\"),60,0))))","v":60},{"$f":"IF('Data Entry'!F15=\"\",0,IF(AND('Data Entry'!$P15=\"A\",Q20=\"x\"),150,IF(AND('Data Entry'!$P15=\"B\",Q20=\"x\"),100,IF(AND('Data Entry'!P15=\"C\",Q20=\"x\"),60,0))))","v":60},{"$f":"SUM(F20:G20)","v":120},{"$nulls":6},{"$f":"'Data Entry'!I15","v":"बस "},{"$f":"IFERROR(VLOOKUP('Data Entry'!$I15,'Data Entry'!$AG$8:$AH$15,2,0),\"\")","v":1},{"$f":"IFERROR(VLOOKUP('Data Entry'!$I15,'Data Entry'!$AG$8:$AI$15,3,0),\"\")","v":"x"},0]
[null,{"$f":"IF(OR('Data Entry'!C16=\"\",'Data Entry'!D16=\"\",'Data Entry'!E16=\"\"),\"\",'Data Entry'!C16)","v":"lwjrx<"},{"$f":"IF(OR('Data Entry'!F16=\"\",'Data Entry'!G16=\"\",'Data Entry'!H16=\"\"),\"\",'Data Entry'!F16)","v":"13Mhvks,y"},{"$f":"'Data Entry'!K16","v":100},{"$f":"IFERROR(ROUND(IF(Q21=\"z\",0,IF('Data Entry'!L16=\"\",master!D21*master!R21,'Data Entry'!L16)),0),\"\")","v":150},{"$f":"IF('Data Entry'!C16=\"\",0,IF(AND('Data Entry'!$M15=\"A\",Q21=\"x\"),150,IF(AND('Data Entry'!$M15=\"B\",Q21=\"x\"),100,IF(AND('Data Entry'!M15=\"C\",Q21=\"x\"),60,0))))","v":60},{"$f":"IF('Data Entry'!F16=\"\",0,IF(AND('Data Entry'!$P15=\"A\",Q21=\"x\"),150,IF(AND('Data Entry'!$P15=\"B\",Q21=\"x\"),100,IF(AND('Data Entry'!P15=\"C\",Q21=\"x\"),60,0))))","v":60},{"$f":"SUM(F21:G21)","v":120},{"$f":"'Data Entry'!S15","v":"B"},{"$f":"IF(OR(B20=\"\",B21=\"\",C21=\"\",'Data Entry'!T15<0.7),0,'Data Entry'!T15)","v":1.7},{"$f":"IF(J21>0,IF(I21=\"A\",VLOOKUP($K$16,ta_master,12,0),IF(I21=\"B\",(VLOOKUP($K$16,ta_master,13,0)),0)),0)","v":500},{"$f":"J21*K21","v":850},null,null,{"$f":"'Data Entry'!I16","v":"बस "},{"$f":"IFERROR(VLOOKUP('Data Entry'!$I16,'Data Entry'!$AG$8:$AH$15,2,0),\"\")","v":1},{"$f":"IFERROR(VLOOKUP('Data Entry'!$I16,'Data Entry'!$AG$8:$AI$15,3,0),\"\")","v":"x"},0,{"$f":"'Data Entry'!U15","v":0},{"$f":"IF('Data Entry'!$V$12=master!$T$17,IF(I21=\"A\",VLOOKUP(master!$K$16,ta_master,14,0),VLOOKUP(master!$K$16,ta_master,15,0)),'Data Entry'!V15)","v":1800},{"$f":"ROUND(S21*T21,0)","v":0},{"$f":"'Data Entry'!W15","v":0},{"$f":"U21+V21","v":0}]
[3,{"$f":"IF(OR('Data Entry'!C17=\"\",'Data Entry'!D17=\"\",'Data Entry'!E17=\"\"),\"\",'Data Entry'!C17)","v":"13Mhvks,y"},{"$f":"IF(OR('Data Entry'!F17=\"\",'Data Entry'!G17=\"\",'Data Entry'!H17=\"\"),\"\",'Data Entry'!F17)","v":"?kM+lkuk"},{"$f":"'Data Entry'!K17","v":45},{"$f":"IFERROR(ROUND(IF(Q22=\"z\",0,IF('Data Entry'!L17=\"\",master!D22*master!R22,'Data Entry'!L17)),0),\"\")","v":405},{"$f":"IF('Data Entry'!C17=\"\",0,IF(AND('Data Entry'!$M17=\"A\",Q22=\"x\"),150,IF(AND('Data Entry'!$M17=\"B\",Q22=\"x\"),100,IF(AND('Data Entry'!M17=\"C\",Q22=\"x\"),60,0))))","v":0},{"$f":"IF('Data Entry'!F17=\"\",0,IF(AND('Data Entry'!$P17=\"A\",Q22=\"x\"),150,IF(AND('Data Entry'!$P17=\"B\",Q22=\"x\"),100,IF(AND('Data Entry'!P17=\"C\",Q22=\"x\"),60,0))))","v":0},{"$f":"SUM(F22:G22)","v":0},{"$nulls":6},{"$f":"'Data Entry'!I17","v":"स्वयं का वाहन(कार)"},{"$f":"IFERROR(VLOOKUP('Data Entry'!$I17,'Data Entry'!$AG$8:$AH$15,2,0),\"\")","v":4},{"$f":"IFERROR(VLOOKUP('Data Entry'!$I17,'Data Entry'!$AG$8:$AI$15,3,0),\"\")","v":"y"},9]
[null,{"$f":"IF(OR('Data Entry'!C18=\"\",'Data Entry'!D18=\"\",'Data Entry'!E18=\"\"),\"\",'Data Entry'!C18)","v":"?kM+lkuk"},{"$f":"IF(OR('Data Entry'!F18=\"\",'Data Entry'!G18=\"\",'Data Entry'!H18=\"\"),\"\",'Data Entry'!F18)","v":"13Mhvks,y"},{"$f":"'Data Entry'!K18","v":45},{"$f":"IFERROR(ROUND(IF(Q23=\"z\",0,IF('Data Entry'!L18=\"\",master!D23*master!R23,'Data Entry'!L18)),0),\"\")","v":405},{"$f":"IF('Data Entry'!C18=\"\",0,IF(AND('Data Entry'!$M17=\"A\",Q23=\"x\"),150,IF(AND('Data Entry'!$M17=\"B\",Q23=\"x\"),100,IF(AND('Data Entry'!M17=\"C\",Q23=\"x\"),60,0))))","v":0},{"$f":"IF('Data Entry'!F18=\"\",0,IF(AND('Data Entry'!$P17=\"A\",Q23=\"x\"),150,IF(AND('Data Entry'!$P17=\"B\",Q23=\"x\"),100,IF(AND('Data Entry'!P17=\"C\",Q23=\"x\"),60,0))))","v":0},0,{"$f":"'Data Entry'!S17","v":"B"},{"$f":"IF(OR(B22=\"\",B23=\"\",C23=\"\",'Data Entry'!T17<0.7),0,'Data Entry'!T17)","v":3},{"$f":"IF(J23>0,IF(I23=\"A\",VLOOKUP($K$16,ta_master,12,0),IF(I23=\"B\",(VLOOKUP($K$16,ta_master,13,0)),0)),0)","v":500},{"$f":"J23*K23","v":1500},null,null,{"$f":"'Data Entry'!I18","v":"स्वयं का वाहन(कार)"},{"$f":"IFERROR(VLOOKUP('Data Entry'!$I18,'Data Entry'!$AG$8:$AH$15,2,0),\"\")","v":4},{"$f":"IFERROR(VLOOKUP('Data Entry'!$I18,'Data Entry'!$AG$8:$AI$15,3,0),\"\")","v":"y"},9,{"$f":"'Data Entry'!U17","v":0},{"$f":"IF('Data Entry'!$V$12=master!$T$17,IF(I23=\"A\",VLOOKUP(master!$K$16,ta_master,14,0),VLOOKUP(master!$K$16,ta_master,15,0)),'Data Entry'!V17)","v":1800},{"$f":"ROUND(S23*T23,0)","v":0},{"$f":"'Data Entry'!W17","v":0},{"$f":"U23+V23","v":0}]
[4,{"$f":"IF(OR('Data Entry'!C19=\"\",'Data Entry'!D19=\"\",'Data Entry'!E19=\"\"),\"\",'Data Entry'!C19)","v":""},{"$f":"IF(OR('Data Entry'!F19=\"\",'Data Entry'!G19=\"\",'Data Entry'!H19=\"\"),\"\",'Data Entry'!F19)","v":""},{"$f":"'Data Entry'!K19","v":0},{"$f":"IFERROR(ROUND(IF(Q24=\"z\",0,IF('Data Entry'!L19=\"\",master!D24*master!R24,'Data Entry'!L19)),0),\"\")","v":0},{"$f":"IF('Data Entry'!C19=\"\",0,IF(AND('Data Entry'!$M19=\"A\",Q24=\"x\"),150,IF(AND('Data Entry'!$M19=\"B\",Q24=\"x\"),100,IF(AND('Data Entry'!M19=\"C\",Q24=\"x\"),60,0))))","v":0},{"$f":"IF('Data Entry'!F19=\"\",0,IF(AND('Data Entry'!$P19=\"A\",Q24=\"x\"),150,IF(AND('Data Entry'!$P19=\"B\",Q24=\"x\"),100,IF(AND('Data Entry'!P19=\"C\",Q24=\"x\"),60,0))))","v":0},0,{"$nulls":6},{"$f":"'Data Entry'!I19","v":0},{"$f":"IFERROR(VLOOKUP('Data Entry'!$I19,'Data Entry'!$AG$8:$AH$15,2,0),\"\")","v":""},{"$f":"IFERROR(VLOOKUP('Data Entry'!$I19,'Data Entry'!$AG$8:$AI$15,3,0),\"\")","v":""},0]
[null,{"$f":"IF(OR('Data Entry'!C20=\"\",'Data Entry'!D20=\"\",'Data Entry'!E20=\"\"),\"\",'Data Entry'!C20)","v":""},{"$f":"IF(OR('Data Entry'!F20=\"\",'Data Entry'!G20=\"\",'Data Entry'!H20=\"\"),\"\",'Data Entry'!F20)","v":""},{"$f":"'Data Entry'!K20","v":0},{"$f":"IFERROR(ROUND(IF(Q25=\"z\",0,IF('Data Entry'!L20=\"\",master!D25*master!R25,'Data Entry'!L20)),0),\"\")","v":0},{"$f":"IF('Data Entry'!C20=\"\",0,IF(AND('Data Entry'!$M19=\"A\",Q25=\"x\"),150,IF(AND('Data Entry'!$M19=\"B\",Q25=\"x\"),100,IF(AND('Data Entry'!M19=\"C\",Q25=\"x\"),60,0))))","v":0},{"$f":"IF('Data Entry'!F20=\"\",0,IF(AND('Data Entry'!$P19=\"A\",Q25=\"x\"),150,IF(AND('Data Entry'!$P19=\"B\",Q25=\"x\"),100,IF(AND('Data Entry'!P19=\"C\",Q25=\"x\"),60,0))))","v":0},0,{"$f":"'Data Entry'!S19","v":"B"},{"$f":"IF(OR(B24=\"\",B25=\"\",C25=\"\",'Data Entry'!T19<0.7),0,'Data Entry'!T19)","v":0},{"$f":"IF(J25>0,IF(I25=\"A\",VLOOKUP($K$16,ta_master,12,0),IF(I25=\"B\",(VLOOKUP($K$16,ta_master,13,0)),0)),0)","v":0},{"$f":"J25*K25","v":0},null,null,{"$f":"'Data Entry'!I20","v":0},{"$f":"IFERROR(VLOOKUP('Data Entry'!$I20,'Data Entry'!$AG$8:$AH$15,2,0),\"\")","v":""},{"$f":"IFERROR(VLOOKUP('Data Entry'!$I20,'Data Entry'!$AG$8:$AI$15,3,0),\"\")","v":""},0,{"$f":"'Data Entry'!U19","v":0},{"$f":"IF('Data Entry'!$V$12=master!$T$17,IF(I25=\"A\",VLOOKUP(master!$K$16,ta_master,14,0),VLOOKUP(master!$K$16,ta_master,15,0)),'Data Entry'!V19)","v":1800},{"$f":"ROUND(S25*T25,0)","v":0},{"$f":"'Data Entry'!W19","v":0},{"$f":"U25+V25","v":0}]
[5,{"$f":"IF(OR('Data Entry'!C21=\"\",'Data Entry'!D21=\"\",'Data Entry'!E21=\"\"),\"\",'Data Entry'!C21)","v":""},{"$f":"IF(OR('Data Entry'!F21=\"\",'Data Entry'!G21=\"\",'Data Entry'!H21=\"\"),\"\",'Data Entry'!F21)","v":""},{"$f":"'Data Entry'!K21","v":0},{"$f":"IFERROR(ROUND(IF(Q26=\"z\",0,IF('Data Entry'!L21=\"\",master!D26*master!R26,'Data Entry'!L21)),0),\"\")","v":0},{"$f":"IF('Data Entry'!C21=\"\",0,IF(AND('Data Entry'!$M21=\"A\",Q26=\"x\"),150,IF(AND('Data Entry'!$M21=\"B\",Q26=\"x\"),100,IF(AND('Data Entry'!M21=\"C\",Q26=\"x\"),60,0))))","v":0},{"$f":"IF('Data Entry'!F21=\"\",0,IF(AND('Data Entry'!$P21=\"A\",Q26=\"x\"),150,IF(AND('Data Entry'!$P21=\"B\",Q26=\"x\"),100,IF(AND('Data Entry'!P21=\"C\",Q26=\"x\"),60,0))))","v":0},0,{"$nulls":6},{"$f":"'Data Entry'!I21","v":0},{"$f":"IFERROR(VLOOKUP('Data Entry'!$I21,'Data Entry'!$AG$8:$AH$15,2,0),\"\")","v":""},{"$f":"IFERROR(VLOOKUP('Data Entry'!$I21,'Data Entry'!$AG$8:$AI$15,3,0),\"\")","v":""},0]
[null,{"$f":"IF(OR('Data Entry'!C22=\"\",'Data Entry'!D22=\"\",'Data Entry'!E22=\"\"),\"\",'Data Entry'!C22)","v":""},{"$f":"IF(OR('Data Entry'!F22=\"\",'Data Entry'!G22=\"\",'Data Entry'!H22=\"\"),\"\",'Data Entry'!F22)","v":""},{"$f":"'Data Entry'!K22","v":0},{"$f":"IFERROR(ROUND(IF(Q27=\"z\",0,IF('Data Entry'!L22=\"\",master!D27*master!R27,'Data Entry'!L22)),0),\"\")","v":0},{"$f":"IF('Data Entry'!C22=\"\",0,IF(AND('Data Entry'!$M21=\"A\",Q27=\"x\"),150,IF(AND('Data Entry'!$M21=\"B\",Q27=\"x\"),100,IF(AND('Data Entry'!M21=\"C\",Q27=\"x\"),60,0))))","v":0},{"$f":"IF('Data Entry'!F22=\"\",0,IF(AND('Data Entry'!$P21=\"A\",Q27=\"x\"),150,IF(AND('Data Entry'!$P21=\"B\",Q27=\"x\"),100,IF(AND('Data Entry'!P21=\"C\",Q27=\"x\"),60,0))))","v":0},0,{"$f":"'Data Entry'!S21","v":"A"},{"$f":"IF(OR(B26=\"\",B27=\"\",C27=\"\",'Data Entry'!T21<0.7),0,'Data Entry'!T21)","v":0},{"$f":"IF(J27>0,IF(I27=\"A\",VLOOKUP($K$16,ta_master,12,0),IF(I27=\"B\",(VLOOKUP($K$16,ta_master,13,0)),0)),0)","v":0},{"$f":"J27*K27","v":0},null,null,{"$f":"'Data Entry'!I22","v":0},{"$f":"IFERROR(VLOOKUP('Data Entry'!$I22,'Data Entry'!$AG$8:$AH$15,2,0),\"\")","v":""},{"$f":"IFERROR(VLOOKUP('Data Entry'!$I22,'Data Entry'!$AG$8:$AI$15,3,0),\"\")","v":""},0,{"$f":"'Data Entry'!U21","v":0},{"$f":"IF('Data Entry'!$V$12=master!$T$17,IF(I27=\"A\",VLOOKUP(master!$K$16,ta_master,14,0),VLOOKUP(master!$K$16,ta_master,15,0)),'Data Entry'!V21)","v":2500},{"$f":"ROUND(S27*T27,0)","v":0},{"$f":"'Data Entry'!W21","v":0},{"$f":"U27+V27","v":0}]
[6]
[]
[7]

{"sheet":"लघु यात्रा बिल(1) ","index":5,"n_rows":36,"n_cols":22,"rows_kept":36,"merged":[[1,1,1,8],[2,2,2,3],[2,5,2,6],[2,7,2,8],[3,2,3,3],[3,5,3,6],[3,7,4,8],[4,2,4,6],[5,1,6,1],[5,2,5,3],[5,4,6,4],[5,5,6,5],[5,6,6,6],[5,7,6,7],[5,8,6,8],[29,1,29,5],[29,7,29,8],[31,1,31,3],[38,6,38,7]]}
[]
[null,"y?kq ;k=k fcy"]
[null,"uke",null,null,"Js.kh","ख",null,"fcy dk en"]
[null,"in",null,null,"ewy osru",75700]
[null,"dk;kZy;"]
[null,"fnukad","LFkkuksa dk fooj.k ftuds e/; LFkkuh; y?kq ;k=k dh xbZ",null,";k=k dk iz;kstu","Lo;a dk okgu dk izdkj","yxHkx nwjh fdeh esa","nj jkf'k izfr fdeh","jkf'k"]
[null,null,"izLFkku","vkxeu",{"$nulls":16},"कार",1]
[null,"2019-04-24","13Mhvks,y","6Mhvks,y"," 'kkyk lEcyu","मोटर साइकिल ,स्कूटर,मोपेड़ ",8,{"$f":"IF(OR(B8=\"\",C8=\"\",D8=\"\"),\"\",IF($F$3=\"\",\"श्रेणी चुने \",IF(K8=1,VLOOKUP($F$3,ta_master,5,0),IF(K8=2,VLOOKUP($F$3,ta_master,6,0),IF(K8=3,VLOOKUP($F$3,ta_master,7,0),IF(K8=4,VLOOKUP($F$3,ta_master,8,0),\"वाहन प्रकार चुनें\"))))))","v":3},{"$f":"IFERROR(G8*H8,\"\")","v":{"v":24,"d":"₹24.00"}},null,{"$f":"IF(F8=\"\",\"\",VLOOKUP(F8,$U$7:$V$10,2,0))","v":2},{"$nulls":9},"मोटर साइकिल ,स्कूटर,मोपेड़ ",2]
[null,"2019-04-24",{"$f":"D8","v":"6Mhvks,y"},{"$f":"C8","v":"13Mhvks,y"}," 'kkyk lEcyu","कार",8,9,{"$f":"IFERROR(G9*H9,\"\")","v":{"v":72,"d":"₹72.00"}},null,{"$f":"IF(F9=\"\",\"\",VLOOKUP(F9,$U$7:$V$10,2,0))","v":1},{"$nulls":9},"रिक्शा तांगा,मोटर रिक्शा ",3]
[{"$nulls":7},"","",null,"",{"$nulls":9},"साइकिल/पैदल ",4]
[{"$nulls":7},"","",null,""]
[{"$nulls":7},"","",null,""]
[{"$nulls":7},"","",null,""]
[{"$nulls":7},"","",null,""]
[{"$nulls":7},"","",null,""]
[{"$nulls":7},"","",null,""]
[{"$nulls":7},"","",null,""]
[{"$nulls":7},"","",null,""]
[{"$nulls":7},"","",null,""]
[{"$nulls":7},"","",null,""]
[{"$nulls":7},"","",null,""]
[{"$nulls":7},"","",null,""]
[{"$nulls":7},"","",null,""]
[{"$nulls":7},"","",null,""]
[{"$nulls":7},"","",null,""]
[{"$nulls":7},"","",null,""]
[{"$nulls":7},"","",null,""]
[{"$nulls":6},4,"","",null,""]
[{"$nulls":7},"","",null,""]
[null,";ksx",{"$nulls":4},{"$f":"SUM(G8:G29)&\" Km\"","v":"20 Km"},{"$f":"ROUND(SUM(I8:I29),0)","v":{"v":96,"d":"₹ 96.00"}}]
[{"$nulls":5},{"$f":"[1]!SpellNumber(H30)","v":"Rupees NinetySix Only "}]
[null,"izekf.kr fd;k tkrk gS fd eSus",{"$nulls":3},"}kjk",null,"fdeh ;k=k "]
[null,"tSlk dh mYysf[kr gS M;wVh LFkku ls dk;kZy; ds dk;Z ls okLro esa dh gSA"]
[{"$nulls":6},"dkfeZd ds gLrk{kj"]
[null,null,"fu;U=.k vf/kdkjh }kjk izekf.kr"]
[{"$nulls":4},"inuke ,oa eksgj"]

{"sheet":"लघु यात्रा बिल  (2)","index":6,"n_rows":36,"n_cols":22,"rows_kept":36,"merged":[[1,1,1,8],[2,2,2,3],[2,5,2,6],[2,7,2,8],[3,2,3,3],[3,5,3,6],[3,7,4,8],[4,2,4,6],[5,1,6,1],[5,2,5,3],[5,4,6,4],[5,5,6,5],[5,6,6,6],[5,7,6,7],[5,8,6,8],[29,1,29,5],[29,7,29,8],[31,1,31,3]]}
[]
[null,"y?kq ;k=k fcy"]
[null,"uke",{"$f":"'Data Entry'!D5","v":"galjkt tks'kh "},null,"Js.kh","ख",null,"fcy dk en"]
[null,"in",{"$f":"'Data Entry'!D6","v":"iz/kkukpk;Z"},null,"ewy osru",75700]
[null,"dk;kZy;",{"$f":"'Data Entry'!N7","v":"jktdh; mPp ek/;fed fo|ky; 13Mhvks,y Jhxaxkuxj "}]
[null,"fnukad","LFkkuksa dk fooj.k ftuds e/; LFkkuh; y?kq ;k=k dh xbZ",null,";k=k dk iz;kstu","Lo;a dk okgu dk izdkj","yxHkx nwjh fdeh esa","nj jkf'k izfr fdeh","jkf'k"]
[null,null,"izLFkku","vkxeu",{"$nulls":16},"कार",1]
[null,"2019-04-24","13Mhvks,y","6Mhvks,y"," 'kkyk lEcyu","मोटर साइकिल ,स्कूटर,मोपेड़ ",8,{"$f":"IF(OR(B8=\"\",C8=\"\",D8=\"\"),\"\",IF($F$3=\"\",\"श्रेणी चुने \",IF(K8=1,VLOOKUP($F$3,ta_master,5,0),IF(K8=2,VLOOKUP($F$3,ta_master,6,0),IF(K8=3,VLOOKUP($F$3,ta_master,7,0),IF(K8=4,VLOOKUP($F$3,ta_master,8,0),\"वाहन प्रकार चुनें\"))))))","v":3},{"$f":"IFERROR(G8*H8,\"\")","v":{"v":24,"d":"₹24.00"}},null,{"$f":"IF(F8=\"\",\"\",VLOOKUP(F8,$U$7:$V$10,2,0))","v":2},{"$nulls":9},"मोटर साइकिल ,स्कूटर,मोपेड़ ",2]
[null,"2019-04-24",{"$f":"D8","v":"6Mhvks,y"},{"$f":"C8","v":"13Mhvks,y"}," 'kkyk lEcyu","कार",8,9,{"$f":"IFERROR(G9*H9,\"\")","v":{"v":72,"d":"₹72.00"}},null,{"$f":"IF(F9=\"\",\"\",VLOOKUP(F9,$U$7:$V$10,2,0))","v":1},{"$nulls":9},"रिक्शा तांगा,मोटर रिक्शा ",3]
[{"$nulls":7},"","",null,"",{"$nulls":9},"साइकिल/पैदल ",4]
[{"$nulls":7},"","",null,""]
[{"$nulls":7},"","",null,""]
[{"$nulls":7},"","",null,""]
[{"$nulls":7},"","",null,""]
[{"$nulls":7},"","",null,""]
[{"$nulls":7},"","",null,""]
[{"$nulls":7},"","",null,""]
[{"$nulls":7},"","",null,""]
[{"$nulls":7},"","",null,""]
[{"$nulls":7},"","",null,""]
[{"$nulls":7},"","",null,""]
[{"$nulls":7},"","",null,""]
[{"$nulls":7},"","",null,""]
[{"$nulls":7},"","",null,""]
[{"$nulls":7},"","",null,""]
[{"$nulls":7},"","",null,""]
[{"$nulls":7},"","",null,""]
[{"$nulls":7},"","",null,""]
[{"$nulls":7},"","",null,""]
[null,";ksx",{"$nulls":4},{"$f":"SUM(G8:G29)&\" Km\"","v":"16 Km"},{"$f":"ROUND(SUM(I8:I29),0)","v":{"v":96,"d":"₹ 96.00"}}]
[{"$nulls":5},{"$f":"[1]!SpellNumber(H30)","v":"Rupees NinetySix Only "}]
[null,"izekf.kr fd;k tkrk gS fd eSus",{"$nulls":3},"}kjk",null,"fdeh ;k=k "]
[null,"tSlk dh mYysf[kr gS M;wVh LFkku ls dk;kZy; ds dk;Z ls okLro esa dh gSA"]
[{"$nulls":6},"dkfeZd ds gLrk{kj"]
[null,null,"fu;U=.k vf/kdkjh }kjk izekf.kr"]
[{"$nulls":4},"inuke ,oa eksgj"]

{"sheet":"लघु यात्रा बिल  (3)","index":7,"n_rows":36,"n_cols":22,"rows_kept":36,"merged":[[1,1,1,8],[2,2,2,3],[2,5,2,6],[2,7,2,8],[3,2,3,3],[3,5,3,6],[3,7,4,8],[4,2,4,6],[5,1,6,1],[5,2,5,3],[5,4,6,4],[5,5,6,5],[5,6,6,6],[5,7,6,7],[5,8,6,8],[29,1,29,5],[29,7,29,8],[31,1,31,3]]}
[]
[null,"y?kq ;k=k fcy"]
[null,"uke",{"$f":"'Data Entry'!D5","v":"galjkt tks'kh "},null,"Js.kh","ख",null,"fcy dk en"]
[null,"in",{"$f":"'Data Entry'!D6","v":"iz/kkukpk;Z"},null,"ewy osru",75700]
[null,"dk;kZy;",{"$f":"'Data Entry'!N7","v":"jktdh; mPp ek/;fed fo|ky; 13Mhvks,y Jhxaxkuxj "}]
[null,"fnukad","LFkkuksa dk fooj.k ftuds e/; LFkkuh; y?kq ;k=k dh xbZ",null,";k=k dk iz;kstu","Lo;a dk okgu dk izdkj","yxHkx nwjh fdeh esa","nj jkf'k izfr fdeh","jkf'k"]
[null,null,"izLFkku","vkxeu",{"$nulls":16},"कार",1]
[null,"2019-04-24","13Mhvks,y","6Mhvks,y"," 'kkyk lEcyu","मोटर साइकिल ,स्कूटर,मोपेड़ ",8,{"$f":"IF(OR(B8=\"\",C8=\"\",D8=\"\"),\"\",IF($F$3=\"\",\"श्रेणी चुने \",IF(K8=1,VLOOKUP($F$3,ta_master,5,0),IF(K8=2,VLOOKUP($F$3,ta_master,6,0),IF(K8=3,VLOOKUP($F$3,ta_master,7,0),IF(K8=4,VLOOKUP($F$3,ta_master,8,0),\"वाहन प्रकार चुनें\"))))))","v":3},{"$f":"IFERROR(G8*H8,\"\")","v":{"v":24,"d":"₹24.00"}},null,{"$f":"IF(F8=\"\",\"\",VLOOKUP(F8,$U$7:$V$10,2,0))","v":2},{"$nulls":9},"मोटर साइकिल ,स्कूटर,मोपेड़ ",2]
[null,"2019-04-24",{"$f":"D8","v":"6Mhvks,y"},{"$f":"C8","v":"13Mhvks,y"}," 'kkyk lEcyu","कार",8,9,{"$f":"IFERROR(G9*H9,\"\")","v":{"v":72,"d":"₹72.00"}},null,{"$f":"IF(F9=\"\",\"\",VLOOKUP(F9,$U$7:$V$10,2,0))","v":1},{"$nulls":9},"रिक्शा तांगा,मोटर रिक्शा ",3]
[{"$nulls":7},"","",null,"",{"$nulls":9},"साइकिल/पैदल ",4]
[{"$nulls":7},"","",null,""]
[{"$nulls":7},"","",null,""]
[{"$nulls":7},"","",null,""]
[{"$nulls":7},"","",null,""]
[{"$nulls":7},"","",null,""]
[{"$nulls":7},"","",null,""]
[{"$nulls":7},"","",null,""]
[{"$nulls":7},"","",null,""]
[{"$nulls":7},"","",null,""]
[{"$nulls":7},"","",null,""]
[{"$nulls":7},"","",null,""]
[{"$nulls":7},"","",null,""]
[{"$nulls":7},"","",null,""]
[{"$nulls":7},"","",null,""]
[{"$nulls":7},"","",null,""]
[{"$nulls":7},"","",null,""]
[{"$nulls":7},"","",null,""]
[{"$nulls":7},"","",null,""]
[{"$nulls":7},"","",null,""]
[null,";ksx",{"$nulls":4},{"$f":"SUM(G8:G29)&\" Km\"","v":"16 Km"},{"$f":"ROUND(SUM(I8:I29),0)","v":{"v":96,"d":"₹ 96.00"}}]
[{"$nulls":5},{"$f":"[1]!SpellNumber(H30)","v":"Rupees NinetySix Only "}]
[null,"izekf.kr fd;k tkrk gS fd eSus",{"$nulls":3},"}kjk",null,"fdeh ;k=k "]
[null,"tSlk dh mYysf[kr gS M;wVh LFkku ls dk;kZy; ds dk;Z ls okLro esa dh gSA"]
[{"$nulls":6},"dkfeZd ds gLrk{kj"]
[null,null,"fu;U=.k vf/kdkjh }kjk izekf.kr"]
[{"$nulls":4},"inuke ,oa eksgj"]

{"sheet":"लघु यात्रा बिल  (4)","index":8,"n_rows":36,"n_cols":22,"rows_kept":36,"merged":[[1,1,1,8],[2,2,2,3],[2,5,2,6],[2,7,2,8],[3,2,3,3],[3,5,3,6],[3,7,4,8],[4,2,4,6],[5,1,6,1],[5,2,5,3],[5,4,6,4],[5,5,6,5],[5,6,6,6],[5,7,6,7],[5,8,6,8],[29,1,29,5],[29,7,29,8],[31,1,31,3]]}
[]
[null,"y?kq ;k=k fcy"]
[null,"uke",null,null,"Js.kh","ख",null,"fcy dk en"]
[null,"in",{"$f":"'Data Entry'!D6","v":"iz/kkukpk;Z"},null,"ewy osru",75700]
[null,"dk;kZy;",{"$f":"'Data Entry'!N7","v":"jktdh; mPp ek/;fed fo|ky; 13Mhvks,y Jhxaxkuxj "}]
[null,"fnukad","LFkkuksa dk fooj.k ftuds e/; LFkkuh; y?kq ;k=k dh xbZ",null,";k=k dk iz;kstu","Lo;a dk okgu dk izdkj","yxHkx nwjh fdeh esa","nj jkf'k izfr fdeh","jkf'k"]
[null,null,"izLFkku","vkxeu",{"$nulls":16},"कार",1]
[null,"2019-04-24","13Mhvks,y","6Mhvks,y"," 'kkyk lEcyu","मोटर साइकिल ,स्कूटर,मोपेड़ ",10,{"$f":"IF(OR(B8=\"\",C8=\"\",D8=\"\"),\"\",IF($F$3=\"\",\"श्रेणी चुने \",IF(K8=1,VLOOKUP($F$3,ta_master,5,0),IF(K8=2,VLOOKUP($F$3,ta_master,6,0),IF(K8=3,VLOOKUP($F$3,ta_master,7,0),IF(K8=4,VLOOKUP($F$3,ta_master,8,0),\"वाहन प्रकार चुनें\"))))))","v":3},{"$f":"IFERROR(G8*H8,\"\")","v":{"v":30,"d":"₹30.00"}},null,{"$f":"IF(F8=\"\",\"\",VLOOKUP(F8,$U$7:$V$10,2,0))","v":2},{"$nulls":9},"मोटर साइकिल ,स्कूटर,मोपेड़ ",2]
[{"$nulls":5},"कार",8,"",{"$f":"IFERROR(G9*H9,\"\")","v":""},null,{"$f":"IF(F9=\"\",\"\",VLOOKUP(F9,$U$7:$V$10,2,0))","v":1},{"$nulls":9},"रिक्शा तांगा,मोटर रिक्शा ",3]
[{"$nulls":7},"","",null,"",{"$nulls":9},"साइकिल/पैदल ",4]
[{"$nulls":7},"","",null,""]
[{"$nulls":7},"","",null,""]
[{"$nulls":7},"","",null,""]
[{"$nulls":7},"","",null,""]
[{"$nulls":7},"","",null,""]
[{"$nulls":7},"","",null,""]
[{"$nulls":7},"","",null,""]
[{"$nulls":7},"","",null,""]
[{"$nulls":7},"","",null,""]
[{"$nulls":7},"","",null,""]
[{"$nulls":7},"","",null,""]
[{"$nulls":7},"","",null,""]
[{"$nulls":7},"","",null,""]
[{"$nulls":7},"","",null,""]
[{"$nulls":7},"","",null,""]
[{"$nulls":7},"","",null,""]
[{"$nulls":7},"","",null,""]
[{"$nulls":6},4,"","",null,""]
[{"$nulls":7},"","",null,""]
[null,";ksx",{"$nulls":4},{"$f":"SUM(G8:G29)&\" Km\"","v":"22 Km"},{"$f":"ROUND(SUM(I8:I29),0)","v":{"v":30,"d":"₹ 30.00"}}]
[{"$nulls":5},{"$f":"[1]!SpellNumber(H30)","v":"Rupees Thirty Only "}]
[null,"izekf.kr fd;k tkrk gS fd eSus",{"$nulls":3},"}kjk",null,"fdeh ;k=k "]
[null,"tSlk dh mYysf[kr gS M;wVh LFkku ls dk;kZy; ds dk;Z ls okLro esa dh gSA"]
[{"$nulls":6},"dkfeZd ds gLrk{kj"]
[null,null,"fu;U=.k vf/kdkjh }kjk izekf.kr"]
[{"$nulls":4},"inuke ,oa eksgj"]