{"text_format":"3","workbook":"xlsx","n_sheets":4,"sheets":["INTRO","Master","अनुमोदन","समायोजन"],"not_rendered":{"images":2,"defined_names":9},"read":"whole","date_system":"1900"}

{"sheet":"INTRO","index":0,"n_rows":17,"n_cols":3,"rows_kept":17,"merged":[[0,0,16,0],[0,1,0,3],[1,1,1,2],[1,3,17,3],[2,1,2,2],[4,1,4,2],[11,2,15,2],[17,0,17,2]]}
[]
[null,"CSG /CRC GRANT समायोजन EXCEL UTILITY "]
[null,"HOW TO USE   "]
[null,null,"विद्यालय में प्राप्त CSG/CRC ग्रांट की राशि में से सत्र पर्यन्त BOYS FUND या विकास कोष में से खर्च राशि के वाउचर के समायोजन   बाबत इस UTILITY का प्रयोग किया जा सकता है ।  किसी प्रकार की तकनीकी कमी पाए जाने पर नीचे दिये गए EMAIL द्वारा अवगत कराने का श्रम करावे।(PLEASE USE LATEST VERSION OF THAT IS  OFFICE 2010 AND ABOVE FOR BEST RESULT)"]
[null,"   1. Install Devlys 010 Hindi font in your computer for view "]
[null,"1. Master Sheet :-","इस शीट में सत्र पर्यन्त BOYS FUND या विकास कोष में से खर्च राशि के वाउचर की एंट्री करनी है।"]
[null,"2. अनुमोदन  SHEET","यह AUTOGENERATED है केवल जिस ग्रांट के समायोजन का प्रस्ताव और अनुमोदन लेना है को  DROPDOWN से चयन करना है।"]
[null,"3. समायोजन  sheet","यह AUTOGENERATED है केवल जिस मद (खाते) में समायोजन करना  है को  DROPDOWN से चयन करना है।"]
[null,"Disclaimer: -","All care has been taken to keep the information upto date and correct and is for educational purpose only. You are encouraged to consult your Accountant or Advisor before taking any decesion based on this calculator"]
[]
[null,null,"                                  सुधार हेतु सुझाव  आमंत्रित  है "]
[]
[]
[]
[]
[]
[null,null,"                                         joshihansraj72@gmail.com"]

{"sheet":"Master","index":1,"n_rows":33,"n_cols":12,"rows_kept":33,"merged":[[1,2,1,9],[2,2,2,8],[3,2,3,9],[32,2,32,6]]}
[]
[null,null,"dk;kZy; fo|ky; fodkl ,oa izcU/ku lfefr jkmekfo 13Mhvks,y Jhxaxkuxj"]
[null,null,"ekLVj MsVk Hkqxrku lek;kstu "]
[null,null,"Nk= dks\"k @fodkl dks\"k esa ls o\"kZ 2020&21 esa Hkqxrku okmpj fooj.k"]
[null,"helper","dzl","okmpj la[;k o fnukad","en ftlesa ls iwoZ esa [kpZ fd;k x;k","fcy dzekad@fnukad","fcy fooj.k","lek;kstu gsrq ikfjr jkf'k","fo0fo0","xzkUV ftlesa ls lek;kstu djuk gS"]
[null,{"$f":"IF(J6=\"\",\"\",J6&\"_\"&COUNTIF($J$6:J6,J6))","v":"CRC_1"},1,"16/31-07-2020","Vikash Kosh","607/30-06-2020","ABC1",{"v":2650,"d":"₹ 2,650.00"},null,"CRC",null,"en ftlesa ls Hkqxrku fd;k x;k"]
[null,{"$f":"IF(J7=\"\",\"\",J7&\"_\"&COUNTIF($J$6:J7,J7))","v":"CSG_1"},2,"37/08-10-2020","Vikash Kosh","2020-08-01","ABC2",{"v":6618,"d":"₹ 6,618.00"},"fctyh fcy vxLr 20","CSG",null,"Boys Fund"]
[null,{"$f":"IF(J8=\"\",\"\",J8&\"_\"&COUNTIF($J$6:J8,J8))","v":"CSG_2"},3,"50/8-10-2020","Boys Fund","687/4-10-2020","ABC3",{"v":580,"d":"₹ 580.00"},"LVs'kujh","CSG",null,"Vikash Kosh"]
[null,{"$f":"IF(J9=\"\",\"\",J9&\"_\"&COUNTIF($J$6:J9,J9))","v":"CSG_3"},4,"56/16-10-2020","Vikash Kosh","2020-10-01","ABC4",{"v":4931,"d":"₹ 4,931.00"},"fctyh fcy vDVw 20","CSG"]
[null,{"$f":"IF(J10=\"\",\"\",J10&\"_\"&COUNTIF($J$6:J10,J10))","v":"CRC_2"},5,"58/28-10-2020","Vikash Kosh","359/26-10-2020","ABC5",{"v":550,"d":"₹ 550.00"},null,"CRC"]
[null,{"$f":"IF(J11=\"\",\"\",J11&\"_\"&COUNTIF($J$6:J11,J11))","v":"CRC_3"},8,"29/31-07-2020","Vikash Kosh","1172/24-06-2020","ABC6",{"v":2820,"d":"₹ 2,820.00"},"LVs'kujh","CRC"]
[null,{"$f":"IF(J12=\"\",\"\",J12&\"_\"&COUNTIF($J$6:J12,J12))","v":"CRC_4"},9,"35/31-07-2020","Boys Fund","NA","ABC7",{"v":700,"d":"₹ 700.00"},"VSDlh HkkM+k","CRC"]
[null,{"$f":"IF(J13=\"\",\"\",J13&\"_\"&COUNTIF($J$6:J13,J13))","v":""},6]
[null,{"$f":"IF(J14=\"\",\"\",J14&\"_\"&COUNTIF($J$6:J14,J14))","v":""},12]
[null,{"$f":"IF(J15=\"\",\"\",J15&\"_\"&COUNTIF($J$6:J15,J15))","v":""},13]
[null,{"$f":"IF(J16=\"\",\"\",J16&\"_\"&COUNTIF($J$6:J16,J16))","v":""},14]
[null,{"$f":"IF(J17=\"\",\"\",J17&\"_\"&COUNTIF($J$6:J17,J17))","v":""},15]
[null,{"$f":"IF(J18=\"\",\"\",J18&\"_\"&COUNTIF($J$6:J18,J18))","v":""},16]
[null,{"$f":"IF(J19=\"\",\"\",J19&\"_\"&COUNTIF($J$6:J19,J19))","v":""},17]
[null,{"$f":"IF(J20=\"\",\"\",J20&\"_\"&COUNTIF($J$6:J20,J20))","v":""},18]
{"$rows_left_out":14}
{"sheet":"अनुमोदन","index":2,"n_rows":41,"n_cols":9,"rows_kept":41,"merged":[[1,2,1,8],[2,2,2,8],[3,2,3,8],[4,3,4,5],[38,7,38,8],[39,7,39,8],[40,7,40,8]]}
[]
[null,null,{"$f":"Master!C2","v":"dk;kZy; fo|ky; fodkl ,oa izcU/ku lfefr jkmekfo 13Mhvks,y Jhxaxkuxj"}]
[null,null,"Hkqxrku lek;kstu vuqeksnu"]
[null,null,"lelk }kjk ------------- en esa l= 2020&21 ds fy, izkIr --------------------------------- jkf'k esa ls fuEukuqlkj enksa esa fd;s x, [kpZ ds okmpjksa ds lek;kstu gsrq Lohd`fr iznku djus dk izLrko ikfjr rFkk vuqeksfnr fd;k tkrk gSA"]
[{"$nulls":3},"xzkUV ftlesa ls leka;ksftr djuk gS",null,null,"CRC","(2020-21)"]
[null,"helper","dzl","okmpj la[;k o fnukad","en ftlesa ls iwoZ esa [kpZ fd;k x;k","fcy dzekad@fnukad","fcy fooj.k","lek;kstu gsrq ikfjr jkf'k","fo0fo0"]
[null,{"$f":"E7&\"_\"&COUNTIF($E7:E$8,E7)","v":"Vikash Kosh_2"},1,{"$f":"IFERROR(IF(OR(Master!$D6=\"\",Master!$E6=\"\"),\"\",VLOOKUP($G$5&\"_\"&$C7,crc_master,3,0)),\"\")","v":"16/31-07-2020"},{"$f":"IFERROR(IF(OR(Master!$D6=\"\",Master!$E6=\"\"),\"\",VLOOKUP($G$5&\"_\"&$C7,crc_master,4,0)),\"\")","v":"Vikash Kosh"},{"$f":"IFERROR(IF(OR(Master!$D6=\"\",Master!$E6=\"\"),\"\",VLOOKUP($G$5&\"_\"&$C7,crc_master,5,0)),\"\")","v":"607/30-06-2020"},{"$f":"IFERROR(IF(OR(Master!$D6=\"\",Master!$E6=\"\"),\"\",VLOOKUP($G$5&\"_\"&$C7,crc_master,6,0)),\"\")","v":"ABC1"},{"$f":"IFERROR(IF(OR(Master!$D6=\"\",Master!$E6=\"\"),\"\",VLOOKUP($G$5&\"_\"&$C7,crc_master,7,0)),\"\")","v":2650},{"$f":"IFERROR(IF(OR(Master!$D6=\"\",Master!$E6=\"\"),\"\",VLOOKUP($G$5&\"_\"&$C7,crc_master,8,0)),\"\")","v":0}]
[null,{"$f":"E8&\"_\"&COUNTIF($E$8:E8,E8)","v":"Vikash Kosh_1"},2,{"$f":"IFERROR(IF(OR(Master!$D7=\"\",Master!$E7=\"\"),\"\",VLOOKUP($G$5&\"_\"&$C8,crc_master,3,0)),\"\")","v":"58/28-10-2020"},{"$f":"IFERROR(IF(OR(Master!$D7=\"\",Master!$E7=\"\"),\"\",VLOOKUP($G$5&\"_\"&$C8,crc_master,4,0)),\"\")","v":"Vikash Kosh"},{"$f":"IFERROR(IF(OR(Master!$D7=\"\",Master!$E7=\"\"),\"\",VLOOKUP($G$5&\"_\"&$C8,crc_master,5,0)),\"\")","v":"359/26-10-2020"},{"$f":"IFERROR(IF(OR(Master!$D7=\"\",Master!$E7=\"\"),\"\",VLOOKUP($G$5&\"_\"&$C8,crc_master,6,0)),\"\")","v":"ABC5"},{"$f":"IFERROR(IF(OR(Master!$D7=\"\",Master!$E7=\"\"),\"\",VLOOKUP($G$5&\"_\"&$C8,crc_master,7,0)),\"\")","v":550},{"$f":"IFERROR(IF(OR(Master!$D7=\"\",Master!$E7=\"\"),\"\",VLOOKUP($G$5&\"_\"&$C8,crc_master,8,0)),\"\")","v":0}]
[null,{"$f":"E9&\"_\"&COUNTIF($E$8:E9,E9)","v":"Vikash Kosh_2"},3,{"$f":"IFERROR(IF(OR(Master!$D8=\"\",Master!$E8=\"\"),\"\",VLOOKUP($G$5&\"_\"&$C9,crc_master,3,0)),\"\")","v":"29/31-07-2020"},{"$f":"IFERROR(IF(OR(Master!$D8=\"\",Master!$E8=\"\"),\"\",VLOOKUP($G$5&\"_\"&$C9,crc_master,4,0)),\"\")","v":"Vikash Kosh"},{"$f":"IFERROR(IF(OR(Master!$D8=\"\",Master!$E8=\"\"),\"\",VLOOKUP($G$5&\"_\"&$C9,crc_master,5,0)),\"\")","v":"1172/24-06-2020"},{"$f":"IFERROR(IF(OR(Master!$D8=\"\",Master!$E8=\"\"),\"\",VLOOKUP($G$5&\"_\"&$C9,crc_master,6,0)),\"\")","v":"ABC6"},{"$f":"IFERROR(IF(OR(Master!$D8=\"\",Master!$E8=\"\"),\"\",VLOOKUP($G$5&\"_\"&$C9,crc_master,7,0)),\"\")","v":2820},{"$f":"IFERROR(IF(OR(Master!$D8=\"\",Master!$E8=\"\"),\"\",VLOOKUP($G$5&\"_\"&$C9,crc_master,8,0)),\"\")","v":"LVs'kujh"}]
[null,{"$f":"E10&\"_\"&COUNTIF($E$8:E10,E10)","v":"Boys Fund_1"},4,{"$f":"IFERROR(IF(OR(Master!$D9=\"\",Master!$E9=\"\"),\"\",VLOOKUP($G$5&\"_\"&$C10,crc_master,3,0)),\"\")","v":"35/31-07-2020"},{"$f":"IFERROR(IF(OR(Master!$D9=\"\",Master!$E9=\"\"),\"\",VLOOKUP($G$5&\"_\"&$C10,crc_master,4,0)),\"\")","v":"Boys Fund"},{"$f":"IFERROR(IF(OR(Master!$D9=\"\",Master!$E9=\"\"),\"\",VLOOKUP($G$5&\"_\"&$C10,crc_master,5,0)),\"\")","v":"NA"},{"$f":"IFERROR(IF(OR(Master!$D9=\"\",Master!$E9=\"\"),\"\",VLOOKUP($G$5&\"_\"&$C10,crc_master,6,0)),\"\")","v":"ABC7"},{"$f":"IFERROR(IF(OR(Master!$D9=\"\",Master!$E9=\"\"),\"\",VLOOKUP($G$5&\"_\"&$C10,crc_master,7,0)),\"\")","v":700},{"$f":"IFERROR(IF(OR(Master!$D9=\"\",Master!$E9=\"\"),\"\",VLOOKUP($G$5&\"_\"&$C10,crc_master,8,0)),\"\")","v":"VSDlh HkkM+k"}]
[null,{"$f":"E11&\"_\"&COUNTIF($E$8:E11,E11)","v":"_1"},5,{"$f":"IFERROR(IF(OR(Master!$D10=\"\",Master!$E10=\"\"),\"\",VLOOKUP($G$5&\"_\"&$C11,crc_master,3,0)),\"\")","v":""},{"$f":"IFERROR(IF(OR(Master!$D10=\"\",Master!$E10=\"\"),\"\",VLOOKUP($G$5&\"_\"&$C11,crc_master,4,0)),\"\")","v":""},{"$f":"IFERROR(IF(OR(Master!$D10=\"\",Master!$E10=\"\"),\"\",VLOOKUP($G$5&\"_\"&$C11,crc_master,5,0)),\"\")","v":""},{"$f":"IFERROR(IF(OR(Master!$D10=\"\",Master!$E10=\"\"),\"\",VLOOKUP($G$5&\"_\"&$C11,crc_master,6,0)),\"\")","v":""},{"$f":"IFERROR(IF(OR(Master!$D10=\"\",Master!$E10=\"\"),\"\",VLOOKUP($G$5&\"_\"&$C11,crc_master,7,0)),\"\")","v":""},{"$f":"IFERROR(IF(OR(Master!$D10=\"\",Master!$E10=\"\"),\"\",VLOOKUP($G$5&\"_\"&$C11,crc_master,8,0)),\"\")","v":""}]
[null,{"$f":"E12&\"_\"&COUNTIF($E$8:E12,E12)","v":"_2"},6,{"$f":"IFERROR(IF(OR(Master!$D11=\"\",Master!$E11=\"\"),\"\",VLOOKUP($G$5&\"_\"&$C12,crc_master,3,0)),\"\")","v":""},{"$f":"IFERROR(IF(OR(Master!$D11=\"\",Master!$E11=\"\"),\"\",VLOOKUP($G$5&\"_\"&$C12,crc_master,4,0)),\"\")","v":""},{"$f":"IFERROR(IF(OR(Master!$D11=\"\",Master!$E11=\"\"),\"\",VLOOKUP($G$5&\"_\"&$C12,crc_master,5,0)),\"\")","v":""},{"$f":"IFERROR(IF(OR(Master!$D11=\"\",Master!$E11=\"\"),\"\",VLOOKUP($G$5&\"_\"&$C12,crc_master,6,0)),\"\")","v":""},{"$f":"IFERROR(IF(OR(Master!$D11=\"\",Master!$E11=\"\"),\"\",VLOOKUP($G$5&\"_\"&$C12,crc_master,7,0)),\"\")","v":""},{"$f":"IFERROR(IF(OR(Master!$D11=\"\",Master!$E11=\"\"),\"\",VLOOKUP($G$5&\"_\"&$C12,crc_master,8,0)),\"\")","v":""}]
[null,{"$f":"E13&\"_\"&COUNTIF($E$8:E13,E13)","v":"_3"},7,{"$f":"IFERROR(IF(OR(Master!$D12=\"\",Master!$E12=\"\"),\"\",VLOOKUP($G$5&\"_\"&$C13,crc_master,3,0)),\"\")","v":""},{"$f":"IFERROR(IF(OR(Master!$D12=\"\",Master!$E12=\"\"),\"\",VLOOKUP($G$5&\"_\"&$C13,crc_master,4,0)),\"\")","v":""},{"$f":"IFERROR(IF(OR(Master!$D12=\"\",Master!$E12=\"\"),\"\",VLOOKUP($G$5&\"_\"&$C13,crc_master,5,0)),\"\")","v":""},{"$f":"IFERROR(IF(OR(Master!$D12=\"\",Master!$E12=\"\"),\"\",VLOOKUP($G$5&\"_\"&$C13,crc_master,6,0)),\"\")","v":""},{"$f":"IFERROR(IF(OR(Master!$D12=\"\",Master!$E12=\"\"),\"\",VLOOKUP($G$5&\"_\"&$C13,crc_master,7,0)),\"\")","v":""},{"$f":"IFERROR(IF(OR(Master!$D12=\"\",Master!$E12=\"\"),\"\",VLOOKUP($G$5&\"_\"&$C13,crc_master,8,0)),\"\")","v":""}]
[null,{"$f":"E14&\"_\"&COUNTIF($E$8:E14,E14)","v":"_4"},8,{"$f":"IFERROR(IF(OR(Master!$D13=\"\",Master!$E13=\"\"),\"\",VLOOKUP($G$5&\"_\"&$C14,crc_master,3,0)),\"\")","v":""},{"$f":"IFERROR(IF(OR(Master!$D13=\"\",Master!$E13=\"\"),\"\",VLOOKUP($G$5&\"_\"&$C14,crc_master,4,0)),\"\")","v":""},{"$f":"IFERROR(IF(OR(Master!$D13=\"\",Master!$E13=\"\"),\"\",VLOOKUP($G$5&\"_\"&$C14,crc_master,5,0)),\"\")","v":""},{"$f":"IFERROR(IF(OR(Master!$D13=\"\",Master!$E13=\"\"),\"\",VLOOKUP($G$5&\"_\"&$C14,crc_master,6,0)),\"\")","v":""},{"$f":"IFERROR(IF(OR(Master!$D13=\"\",Master!$E13=\"\"),\"\",VLOOKUP($G$5&\"_\"&$C14,crc_master,7,0)),\"\")","v":""},{"$f":"IFERROR(IF(OR(Master!$D13=\"\",Master!$E13=\"\"),\"\",VLOOKUP($G$5&\"_\"&$C14,crc_master,8,0)),\"\")","v":""}]
[null,{"$f":"E15&\"_\"&COUNTIF($E$8:E15,E15)","v":"_5"},9,{"$f":"IFERROR(IF(OR(Master!$D14=\"\",Master!$E14=\"\"),\"\",VLOOKUP($G$5&\"_\"&$C15,crc_master,3,0)),\"\")","v":""},{"$f":"IFERROR(IF(OR(Master!$D14=\"\",Master!$E14=\"\"),\"\",VLOOKUP($G$5&\"_\"&$C15,crc_master,4,0)),\"\")","v":""},{"$f":"IFERROR(IF(OR(Master!$D14=\"\",Master!$E14=\"\"),\"\",VLOOKUP($G$5&\"_\"&$C15,crc_master,5,0)),\"\")","v":""},{"$f":"IFERROR(IF(OR(Master!$D14=\"\",Master!$E14=\"\"),\"\",VLOOKUP($G$5&\"_\"&$C15,crc_master,6,0)),\"\")","v":""},{"$f":"IFERROR(IF(OR(Master!$D14=\"\",Master!$E14=\"\"),\"\",VLOOKUP($G$5&\"_\"&$C15,crc_master,7,0)),\"\")","v":""},{"$f":"IFERROR(IF(OR(Master!$D14=\"\",Master!$E14=\"\"),\"\",VLOOKUP($G$5&\"_\"&$C15,crc_master,8,0)),\"\")","v":""}]
[null,{"$f":"E16&\"_\"&COUNTIF($E$8:E16,E16)","v":"_6"},10,{"$f":"IFERROR(IF(OR(Master!$D15=\"\",Master!$E15=\"\"),\"\",VLOOKUP($G$5&\"_\"&$C16,crc_master,3,0)),\"\")","v":""},{"$f":"IFERROR(IF(OR(Master!$D15=\"\",Master!$E15=\"\"),\"\",VLOOKUP($G$5&\"_\"&$C16,crc_master,4,0)),\"\")","v":""},{"$f":"IFERROR(IF(OR(Master!$D15=\"\",Master!$E15=\"\"),\"\",VLOOKUP($G$5&\"_\"&$C16,crc_master,5,0)),\"\")","v":""},{"$f":"IFERROR(IF(OR(Master!$D15=\"\",Master!$E15=\"\"),\"\",VLOOKUP($G$5&\"_\"&$C16,crc_master,6,0)),\"\")","v":""},{"$f":"IFERROR(IF(OR(Master!$D15=\"\",Master!$E15=\"\"),\"\",VLOOKUP($G$5&\"_\"&$C16,crc_master,7,0)),\"\")","v":""},{"$f":"IFERROR(IF(OR(Master!$D15=\"\",Master!$E15=\"\"),\"\",VLOOKUP($G$5&\"_\"&$C16,crc_master,8,0)),\"\")","v":""}]
[null,{"$f":"E17&\"_\"&COUNTIF($E$8:E17,E17)","v":"_7"},11,{"$f":"IFERROR(IF(OR(Master!$D16=\"\",Master!$E16=\"\"),\"\",VLOOKUP($G$5&\"_\"&$C17,crc_master,3,0)),\"\")","v":""},{"$f":"IFERROR(IF(OR(Master!$D16=\"\",Master!$E16=\"\"),\"\",VLOOKUP($G$5&\"_\"&$C17,crc_master,4,0)),\"\")","v":""},{"$f":"IFERROR(IF(OR(Master!$D16=\"\",Master!$E16=\"\"),\"\",VLOOKUP($G$5&\"_\"&$C17,crc_master,5,0)),\"\")","v":""},{"$f":"IFERROR(IF(OR(Master!$D16=\"\",Master!$E16=\"\"),\"\",VLOOKUP($G$5&\"_\"&$C17,crc_master,6,0)),\"\")","v":""},{"$f":"IFERROR(IF(OR(Master!$D16=\"\",Master!$E16=\"\"),\"\",VLOOKUP($G$5&\"_\"&$C17,crc_master,7,0)),\"\")","v":""},{"$f":"IFERROR(IF(OR(Master!$D16=\"\",Master!$E16=\"\"),\"\",VLOOKUP($G$5&\"_\"&$C17,crc_master,8,0)),\"\")","v":""}]
[null,{"$f":"E18&\"_\"&COUNTIF($E$8:E18,E18)","v":"_8"},12,{"$f":"IFERROR(IF(OR(Master!$D17=\"\",Master!$E17=\"\"),\"\",VLOOKUP($G$5&\"_\"&$C18,crc_master,3,0)),\"\")","v":""},{"$f":"IFERROR(IF(OR(Master!$D17=\"\",Master!$E17=\"\"),\"\",VLOOKUP($G$5&\"_\"&$C18,crc_master,4,0)),\"\")","v":""},{"$f":"IFERROR(IF(OR(Master!$D17=\"\",Master!$E17=\"\"),\"\",VLOOKUP($G$5&\"_\"&$C18,crc_master,5,0)),\"\")","v":""},{"$f":"IFERROR(IF(OR(Master!$D17=\"\",Master!$E17=\"\"),\"\",VLOOKUP($G$5&\"_\"&$C18,crc_master,6,0)),\"\")","v":""},{"$f":"IFERROR(IF(OR(Master!$D17=\"\",Master!$E17=\"\"),\"\",VLOOKUP($G$5&\"_\"&$C18,crc_master,7,0)),\"\")","v":""},{"$f":"IFERROR(IF(OR(Master!$D17=\"\",Master!$E17=\"\"),\"\",VLOOKUP($G$5&\"_\"&$C18,crc_master,8,0)),\"\")","v":""}]
[null,{"$f":"E19&\"_\"&COUNTIF($E$8:E19,E19)","v":"_9"},13,{"$f":"IFERROR(IF(OR(Master!$D18=\"\",Master!$E18=\"\"),\"\",VLOOKUP($G$5&\"_\"&$C19,crc_master,3,0)),\"\")","v":""},{"$f":"IFERROR(IF(OR(Master!$D18=\"\",Master!$E18=\"\"),\"\",VLOOKUP($G$5&\"_\"&$C19,crc_master,4,0)),\"\")","v":""},{"$f":"IFERROR(IF(OR(Master!$D18=\"\",Master!$E18=\"\"),\"\",VLOOKUP($G$5&\"_\"&$C19,crc_master,5,0)),\"\")","v":""},{"$f":"IFERROR(IF(OR(Master!$D18=\"\",Master!$E18=\"\"),\"\",VLOOKUP($G$5&\"_\"&$C19,crc_master,6,0)),\"\")","v":""},{"$f":"IFERROR(IF(OR(Master!$D18=\"\",Master!$E18=\"\"),\"\",VLOOKUP($G$5&\"_\"&$C19,crc_master,7,0)),\"\")","v":""},{"$f":"IFERROR(IF(OR(Master!$D18=\"\",Master!$E18=\"\"),\"\",VLOOKUP($G$5&\"_\"&$C19,crc_master,8,0)),\"\")","v":""}]
[null,{"$f":"E20&\"_\"&COUNTIF($E$8:E20,E20)","v":"_10"},14,{"$f":"IFERROR(IF(OR(Master!$D19=\"\",Master!$E19=\"\"),\"\",VLOOKUP($G$5&\"_\"&$C20,crc_master,3,0)),\"\")","v":""},{"$f":"IFERROR(IF(OR(Master!$D19=\"\",Master!$E19=\"\"),\"\",VLOOKUP($G$5&\"_\"&$C20,crc_master,4,0)),\"\")","v":""},{"$f":"IFERROR(IF(OR(Master!$D19=\"\",Master!$E19=\"\"),\"\",VLOOKUP($G$5&\"_\"&$C20,crc_master,5,0)),\"\")","v":""},{"$f":"IFERROR(IF(OR(Master!$D19=\"\",Master!$E19=\"\"),\"\",VLOOKUP($G$5&\"_\"&$C20,crc_master,6,0)),\"\")","v":""},{"$f":"IFERROR(IF(OR(Master!$D19=\"\",Master!$E19=\"\"),\"\",VLOOKUP($G$5&\"_\"&$C20,crc_master,7,0)),\"\")","v":""},{"$f":"IFERROR(IF(OR(Master!$D19=\"\",Master!$E19=\"\"),\"\",VLOOKUP($G$5&\"_\"&$C20,crc_master,8,0)),\"\")","v":""}]
{"$rows_left_out":22}
{"sheet":"समायोजन","index":3,"n_rows":41,"n_cols":8,"rows_kept":41,"merged":[[0,1,0,7],[1,1,1,7],[2,1,2,7],[3,2,3,3],[38,6,38,7],[39,6,39,7],[40,6,40,7]]}
[null,{"$f":"Master!C2","v":"dk;kZy; fo|ky; fodkl ,oa izcU/ku lfefr jkmekfo 13Mhvks,y Jhxaxkuxj"}]
[null,"Hkqxrku lek;kstu"]
[null,"fo|ky; fodkl ,oa izcU/ku lfefr dh cSBd fnukad ---------------------- esa ikfjr ,oa vuqeksfnr izLrko dh vuqikyuk esa v/kksfyf[kr en ds okmpjksa dk lek;kstu en esa fd;s tkus fd Lohd`fr ,rn~ }kjk iznku dh tkrh gSA"]
[null,null,{"$f":"अनुमोदन!G5&\" GRANT में से  \"","v":"CRC GRANT में से  "},null,"Vikash Kosh","में समायोजित"]
["helper","dzl","okmpj la[;k o fnukad","en ftlesa ls iwoZ esa [kpZ fd;k x;k","fcy dzekad@fnukad","fcy fooj.k","lek;kstu gsrq ikfjr jkf'k","fo0fo0"]
[1,{"$f":"IF(C6=\"\",\"\",1)","v":1},{"$f":"IFERROR(VLOOKUP(_xlnm.Criteria&\"_\"&$A6,CRC,3,0),\"\")","v":"58/28-10-2020"},{"$f":"IFERROR(VLOOKUP(_xlnm.Criteria&\"_\"&$A6,CRC,4,0),\"\")","v":"Vikash Kosh"},{"$f":"IFERROR(VLOOKUP(_xlnm.Criteria&\"_\"&$A6,CRC,5,0),\"\")","v":"359/26-10-2020"},{"$f":"IFERROR(VLOOKUP(_xlnm.Criteria&\"_\"&$A6,CRC,6,0),\"\")","v":"ABC5"},{"$f":"IFERROR(VLOOKUP(_xlnm.Criteria&\"_\"&$A6,CRC,7,0),\"\")","v":{"v":550,"d":"₹ 550.00"}},{"$f":"IFERROR(IF(अनुमोदन!I7=\"\",\"\",VLOOKUP(_xlnm.Criteria&\"_\"&$A6,CRC,8,0)),\"\")","v":0}]
[2,{"$f":"IF(C7=\"\",\"\",B6+1)","v":2},"16/31-07-2020","Vikash Kosh","607/30-06-2020","ABC1",{"v":2650,"d":"₹ 2,650.00"},{"$f":"IFERROR(IF(अनुमोदन!I8=\"\",\"\",VLOOKUP(_xlnm.Criteria&\"_\"&$A7,CRC,8,0)),\"\")","v":0}]
[3,{"$f":"IF(C8=\"\",\"\",B7+1)","v":""},"","","","","",{"$f":"IFERROR(IF(अनुमोदन!I9=\"\",\"\",VLOOKUP(_xlnm.Criteria&\"_\"&$A8,CRC,8,0)),\"\")","v":""}]
[4,"","","","","","",{"$f":"IFERROR(IF(अनुमोदन!I10=\"\",\"\",VLOOKUP(_xlnm.Criteria&\"_\"&$A9,CRC,8,0)),\"\")","v":""}]
[5,"","","","","","",{"$f":"IFERROR(IF(अनुमोदन!I11=\"\",\"\",VLOOKUP(_xlnm.Criteria&\"_\"&$A10,CRC,8,0)),\"\")","v":""}]
[6,"","","","","","",{"$f":"IFERROR(IF(अनुमोदन!I12=\"\",\"\",VLOOKUP(_xlnm.Criteria&\"_\"&$A11,CRC,8,0)),\"\")","v":""}]
[7,"","","","","","",{"$f":"IFERROR(IF(अनुमोदन!I13=\"\",\"\",VLOOKUP(_xlnm.Criteria&\"_\"&$A12,CRC,8,0)),\"\")","v":""}]
[8,"","","","","","",{"$f":"IFERROR(IF(अनुमोदन!I14=\"\",\"\",VLOOKUP(_xlnm.Criteria&\"_\"&$A13,CRC,8,0)),\"\")","v":""}]
[9,"","","","","","",{"$f":"IFERROR(IF(अनुमोदन!I15=\"\",\"\",VLOOKUP(_xlnm.Criteria&\"_\"&$A14,CRC,8,0)),\"\")","v":""}]
[10,"","","","","","",{"$f":"IFERROR(IF(अनुमोदन!I16=\"\",\"\",VLOOKUP(_xlnm.Criteria&\"_\"&$A15,CRC,8,0)),\"\")","v":""}]
[11,"","","","","","",{"$f":"IFERROR(IF(अनुमोदन!I17=\"\",\"\",VLOOKUP(_xlnm.Criteria&\"_\"&$A16,CRC,8,0)),\"\")","v":""}]
[12,"","","","","","",{"$f":"IFERROR(IF(अनुमोदन!I18=\"\",\"\",VLOOKUP(_xlnm.Criteria&\"_\"&$A17,CRC,8,0)),\"\")","v":""}]
[13,"","","","","","",{"$f":"IFERROR(IF(अनुमोदन!I19=\"\",\"\",VLOOKUP(_xlnm.Criteria&\"_\"&$A18,CRC,8,0)),\"\")","v":""}]
[14,"","","","","","",{"$f":"IFERROR(IF(अनुमोदन!I20=\"\",\"\",VLOOKUP(_xlnm.Criteria&\"_\"&$A19,CRC,8,0)),\"\")","v":""}]
[15,"","","","","","",{"$f":"IFERROR(IF(अनुमोदन!I21=\"\",\"\",VLOOKUP(_xlnm.Criteria&\"_\"&$A20,CRC,8,0)),\"\")","v":""}]
{"$rows_left_out":21}