{"text_format":"3","workbook":"xlsx","n_sheets":11,"sheets":["How to Use","MASTER DATA","Prarmbhik Shesh","Att. Dairy","PS Balance Sheet","UPS balance Sheet","Dak","UC Food","New UC Dak","Stock","Bill generate"],"not_rendered":{"images":6,"defined_names":41,"comments":2},"read":"whole","date_system":"1900"}

{"sheet":"How to Use","index":0,"n_rows":24,"n_cols":3,"rows_kept":24}
[]
[]
[null,null,"पोषाहार से सम्बंधित तैयार किये जाने वाले सभी प्रकार के प्रपत्र के एक्सेल शीट के संबंध में जानकारी "]
[null,null,"सर्व प्रथम आप मास्टर शीट पर जो सफ़ेद कलर की जो सेल है , उसमे आवश्यकतानुसार डाटा एंट्री फिल करे I सामान्य जानकारी के साथ नामांकन व अन्य भौतिक प्रगति रिपोर्ट और कुक कम हेल्पर की डिटेल फिल करे I  कन्वर्जन राशि भी फिल करें I"]
[null,null,"दूसरी नंबर पर जो शीट है प्रारंभिक शेष - इसमे आप पिछले माह का अंतिम शेष बचा हुआ है , वह चालू माह का प्रारंभिक शेष है , उसकी एंट्री अनलॉक सेल में करें I"]
[null,null,"तीसरे नंबर पर शीट  attendence Diary है , इसके अन्तरगत बाकि सब ऑटो जनरेट है केवल नामांकित व लाभान्वित विद्यार्थियों की सूचना भरनी है , दिनांक और वार सब स्वतः आ जायेंगे I"]
[null,null,"बाद में प्राथमिक कक्षा और उच्च प्राथमिक कक्षा की अलग अलग बैलेंस शीट है I इस शीट में सभी एंट्रिया स्वतः आयेगी I केवल जी पोषाहार सप्लायर व अन्यत्र से प्राप्त खाद्यान्न की जानकारी जरुरत होने पर फिल करांनी है I"]
[null,null,"बाकि शेष शीट्स केवल रिपोर्ट्स है , जो स्वतः तैयार होगी , उक्त डाक आगे ऑफिस में भेजने व कार्यालय में संधारण करने में काम आयेगी I"]
[null,null,"अंत में स्टॉक रजिस्टर व बिल जनरेट शीट भी स्वतः जनरेट हो जायेगी I आप अपने स्टॉक और bill का मिलान करके कैशबुक की एंट्री आसानी से कर पाएंगे  तथा अपना पोषाहार का रिकॉर्ड अच्छे से मेन्टेन कर सकते है I"]
[null,null,"वैसे इस शीट को बड़ी सावधानी से बनाई गई हैI फिर भी त्रुटि के लिए निर्माणकर्ता ज़िमेदार नहीं होगा I अतः डाक के अंतिम रूप से तैयार होने पर अपने स्तर पर एक बार जरुर चेक कर लेवे I"]
[]
[]
[null,null,"Password Of MDM Sheet  :-             MDM#2022"]
[]
[null,null,"प्रोग्राम निर्माणकर्ता"]
[null,null,"हीरालाल जाट "]
[null,null,"वरिष्ठ अध्यापक , महात्मा गाँधी राजकीय विद्यालय बर , पाली "]
[null,null,"स्थाई पता :- चंडावल नगर , तह. - सोजत , जिला - पाली "]
[null,null,"https://youtube.com/c/Heeralaljat"]
[]
[]
[null,null,"सम्पूर्ण जानकारी के लिए विडियो लिंक"]
[]
[null,null,"https://youtu.be/Ep7yiDA2qr4"]

{"sheet":"MASTER DATA","index":1,"n_rows":42,"n_cols":87,"rows_kept":42,"merged":[[0,1,0,16],[2,2,2,9],[3,2,3,3],[3,9,3,11],[4,2,4,3],[4,14,5,16],[5,2,5,3],[5,18,5,23],[6,2,6,3],[6,4,8,4],[6,21,6,23],[7,2,7,3],[7,5,7,6],[7,7,7,8],[7,9,7,10],[7,11,7,12],[7,13,7,15],[8,2,8,3],[9,2,9,3],[10,2,10,3],[11,2,11,3],[12,2,12,3],[13,2,13,3],[14,2,14,3],[15,2,15,3],[16,2,16,3],[17,2,17,3],[18,2,18,3],[19,2,19,3],[22,1,22,4],[22,5,22,12],[22,13,22,15],[23,5,23,6],[23,7,23,8],[23,9,23,10],[23,11,23,12],[23,13,24,13],[23,14,24,14],[23,15,24,15],[24,1,24,4],[25,1,25,2],[25,3,25,4],[26,1,26,2],[26,4,26,7],[26,8,26,9],[26,10,26,14],[27,4,27,5],[27,8,27,11],[28,2,28,3],[28,4,28,5],[28,6,28,8],[29,2,29,3],[29,4,29,5],[29,6,29,8],[29,10,29,12],[29,13,29,16],[30,2,30,3],[30,4,30,5],[30,6,30,8],[33,4,33,6],[33,7,33,10],[33,12,33,14],[33,15,33,16],[34,2,34,3],[34,4,34,6],[34,12,34,14],[34,15,34,16],[35,2,35,3],[35,4,35,6],[35,12,35,14],[35,15,35,16],[36,2,36,3],[36,4,36,6],[36,12,36,14],[36,15,36,16],[37,2,37,3],[37,4,37,6],[37,12,37,14],[37,15,37,16]]}
[]
[]
[null,"fo|ky; dk uke","egkRek xka/kh jktdh; fo|ky; ¼vaxzsth ek/;e½ cj ] ikyh"]
[null,"School Name :- ","MGGS Bar",null,"l=~ %&",2022,"&",2023,"ekg %&",{"$f":"IFERROR(IF(AC5=\"\",\"\",AC5),\"\")","v":"tqykbZ&2022"},{"$nulls":44},1,2,3,4,5,6,7,8,9,10,11,12,13,14,15,16,17,18,19,20,21,22,23,24,25,26,27,28,29,30,31,32,33]
[null,"ikbZbZvks@uksMy Ldwy dk uke %&","jkmekfo cj",{"$nulls":11},"ije~ iwT; xq:nso oklqnso th egkjkt dks ueu",{"$nulls":13},{"$f":"IF(AND(C20=\"\"),\"\",IF(AND(C20=AE8),AF8,IF(AND(C20=AE9),AF9,IF(AND(C20=AE10),AF10,IF(AND(C20=AE11),AF11,IF(AND(C20=AE12),AF12,IF(AND(C20=AE13),AF13,IF(AND(C20=AE14),AF14,IF(AND(C20=AE15),AF15,IF(AND(C20=AE16),AF16,IF(AND(C20=AE17),AF17,IF(AND(C20=AE18),AF18,IF(AND(C20=AE19),AF19,\"\")))))))))))))","v":"tqykbZ&2022"}]
[null,"laLFkk iz/kku dk uke %&","m\"kk ify;k",{"$nulls":15},"HEERALAL JAT",{"$nulls":33},"DIST.",null,"AJMER","ALWAR","BANSWARA","BARAN","BARMER","BHARATPUR","BHILWARA","BIKANER","BUNDI","CHITTORGARH","CHURU","DAUSA","DHOLPUR","DUNGARPUR","HANUMANGARH","JAIPUR","JAISALMER","JALORE","JHALAWAR","JHUNJHUNU","JODHPUR","KARAULI","KOTA","NAGOUR","PALI","PRATAPGARH","RAJSAMAND","SAWAI MADHOPUR","SIKAR","SIROHI","SRI GANGANAGAR","TONK","UDAIPUR"]
[null,"iks\"kkgkj izHkkjh %&","vfHkeU;q flag",null,"d{kk",{"$nulls":47},"AJMER",1,"AJMER GRAMEEN","BANSUR","ANANDPURI","ANTA","AADEL","BAYANA","ASIND","BIKANER","BUNDI","BADI SADRI","BIDASAR","BANDIKUI","BARI","AASPUR","BHADRA","AAMER","BHANIYANA","AAHORE","AKLERA","ALSISAR","BALESAR","HINDAUN","ITAWA","DEEDWANA","BALI","ARNOD","AMET","BAMANWAS","DATARAMGARH","ABU ROAD","ANOOPGARH","DEOLI","BADGAON"]
[null,"laLFkk iz/kku eks-u- %&",9929247227,null,null,"SC",null,"ST",null,"OBC",null,"GEN",null,"TOTAL",{"$nulls":12},"April","vizsy","April",{"$f":"F4","v":2022},{"$f":"CONCATENATE(AC8,\"-\",AD8)","v":"April-2022"},{"$f":"CONCATENATE(AB8,\"&\",AD8)","v":"vizsy&2022"},null,null,"Government",null,"Rural",{"$nulls":15},"ALWAR",2,"ARAIN","BEHRORE","ARTHUNA","ATRU","BAITU","BHUSAWAR","BANERA","BAJJU","HINDOLI","BHANDESAR","CHURU ","BASWA","BASEDI","BICHHIWADA","HANUMANGARH","AANDHI","FATEHGARH","BAGODA","BAKANI","BUHANA","AAU","KARAULI","KHAIRABAD","BHAIRUNDA","DESURI","CHOTI SADARI","BHIM","BONLI","AJITGARH","PINDWARA","GHARSANA","MALPURA","BHINDAR"]
[null,"iks\"kkgkj izHkkjh eks-u- %&",9929247228,null,null,"B","G","B","G","B","G","B","G","B","G","T",{"$nulls":10},"May","ebZ","May",{"$f":"AD8","v":2022},{"$f":"CONCATENATE(AC9,\"-\",AD9)","v":"May-2022"},{"$f":"CONCATENATE(AB9,\"&\",AD9)","v":"ebZ&2022"},null,null,"Local Body",null,"Urban",{"$nulls":15},"BANSWARA",3,"BHINAI","GOVINDGARH","BAGIDORA","BARAN","BALOTRA","DEEG","BADNOR","KHAJUWALA","KESHORAIPATAN","BENGU","RAJGARH","BAIJUPADA","DHOLPUR","CHIKHALI","NOHAR ","BASSI","MOHANGARH","BHINMAL","BHAWANIMANDI","CHIRAWA","BAORI","MANDRAIL","LADPURA","DEGANA","JAITARAN","DALOT","DEOGARH","CHOUTHAKA BARWARA ","DHOND","REODAR","PADAMPUR","NIWAI","FALASIA"]
[null,"DISE Code",8200303101,null,"izFke",2,5,5,4,3,6,5,6,{"$f":"F10+H10+J10+L10","v":15},{"$f":"G10+I10+K10+M10","v":21},{"$f":"N10+O10","v":36},{"$nulls":10},"June","twu","June",{"$f":"AD9","v":2022},"June-2022","twu&2022",null,null,"EGS/AIE Centers",null,"Rural cum Urban",{"$nulls":15},"BARAN",4,"JAWAJA","KATHUMAR","BANSWARA","CHHABRA","BARMER","KAMAN","BIJOLIYA","KOLAYAT","NAINWA","BHAINSROADGARH","RATANGARH","DAUSA","RAJAKHERA","DOWRA","PILIBANGA","CHAKSU","NACHNA","CHITALWANA","DAG","JHUNJHUNU","BAP","MASALPUR","SANGOD","JAYAL","MARWAR JUNCTION","DHARIAWAD","DELWADA","GANGAPUR CITY","FATEHPUR","SHIVGANJ","RAISINGHNAGAR","PIPALU","GIRWA"]
[null,"M.D.M. Code",1009,null,"f}rh;",12,11,10,9,8,10,8,7,{"$f":"F11+H11+J11+L11","v":38},{"$f":"G11+I11+K11+M11","v":37},{"$f":"N11+O11","v":75},{"$nulls":10},"July","tqykbZ","July",2022,"July-2022","tqykbZ&2022",null,null,"NCLP",{"$nulls":17},"BARMER",5,"KEKARI","KISHANGARH BAS","CHOTISARVAN","CHHIPABAROD","BARMER GRAMIN","KUMHER","HURDA","LUNKARANSAR","TALERA","BHOPAL SAGAR","SARDARSHAHAR","LALSOT","SAIPAU","DUNGARPUR","RAWATSAR","DUDU","JAISALMER","JALORE","JHALARAPATAN","KHETRI","BAPINI","NADOTI","SULTANPUR","KHINVSAR","PALI","DHAMOTTAR","KHAMNOR","KHANDAR","KHANDELA","SIROHI","SARDULSHAHAR","TODARAISINGH","GOGUNDA"]
[null,"Village/ward","BAR",null,"r`rh;",8,9,2,8,23,20,11,4,44,41,85,{"$nulls":10},"August","vxLr","August",2022,"August-2022","vxLr&2022",null,null,"Madarsa/ Maqtab",{"$nulls":17},"BHARATPUR",6,"KISHANGARH","KOTKASIM","GANGARTALAI","KISHANGANJ","CHOHTAN","NADBAI","JAHAJPUR","NOKHA",null,"CHITTORGARH","SUJANGARH","LAWAN","SARAMATHURA","GALIAKOT","SANGRIYA","GOVINDGARH","SAM","JASWANTPURA","KHANPUR","MANDAWA","BHOPALGARH","SAPOTRA",null,"KUCHAMAN CITY","RAIPUR","PIPALKHOONT","KUMBHALGARH","MALARNA DUNGAR ","LAXMANGARH",null,"SRI GANGANAGAR","TONK","JAISAMAND"]
[null,"xzke iapk;r dk uke %&","cj",null,"prqFkZ",8,9,7,6,7,8,9,5,31,28,59,{"$nulls":10},"September","flrEcj","September",2022,"September-2022","flrEcj&2022",{"$nulls":20},"BHILWARA",7,"MASUDA","LAKSHMANGARH","GARHI","MANGROL","DHANAU","NAGAR","KOTRI","PANCHOO",null,"DUNGLA","TARANAGAR","MAHWA",null,"JONTHARI","TIBBI","JALSU","SANKARA","RANIWARA","MANOHARTHANA","NAWALGARH","BILARA","SHRIMAHAVEERJI",null,"LADNUN","RANI","PRATAPGARH","RAJSAMAND","SAWAI MADHOPUR","NEEM KA THANA",null,"SHRIKARANPUR","UNIARA","JHADOL"]
[null,"CykWd@lfefr %&","jk;iqj",null,"iape~",3,6,9,4,3,2,1,6,16,18,34,{"$nulls":10},"October","vDVqcj","October",2022,"October-2022","vDVqcj&2022",{"$nulls":20},"BIKANER",8,"PISANGAN","MALAKHERA","GHATOLE","SHAHBAD","DHORIMANA","PAHADI","KAREDA","PUNGAL",null,"GANGRAR",null,"NANGAL RAJAWATAN",null,"SAABLA",null,"JAMWARAMGARH",null,"SANCHORE","PIDAWA","PILANI","CHAMU","TODABHIM",null,"MAKRANA","ROHAT","SUHAGPURA","RELMAGRA",null,"NECHHWA",null,"SURATGARH",null,"JHALARA"]
[null,"school Type :-","Government",null,";ksx",{"$f":"SUM(F10:F14)","v":33},{"$f":"SUM(G10:G14)","v":40},33,31,44,46,34,28,144,145,289,{"$nulls":10},"November","uoEcj","November",2022,"November-2022","uoEcj&2022",{"$nulls":20},"BUNDI",9,"SARWAD","MUNDAWAR","KUSHALGARH",null,"GADRAROAD","ROOPWAS","MANDAL","SHRI DUNGARGARH",null,"KAPASAN",null,"RAMGARH PACHWARA",null,"SANGWARA",null,"JHOTWARA",null,"SHARNAU",null,"SINGHANA","DECHU",null,null,"MERTA CITY","SOJAT",{"$nulls":3},"PALSANA",null,"VIJAYNAGAR",null,"KHAIRWARA"]
[null,"{ks= %&","Rural",null,"\"k\"Ve~",4,5,6,7,8,9,8,9,{"$f":"F16+H16+J16+L16","v":26},{"$f":"G16+I16+K16+M16","v":30},{"$f":"N16+O16","v":56},{"$nulls":10},"December","fnlEcj","December",2022,"December-2022","fnlEcj&2022",{"$nulls":20},"CHITTORGARH",10,"SAWAR","NEEMRANA","SAJJANGARH",null,"GIDA","SEWAR","MANDALGARH",null,null,"NIMBAHERA",null,"SIKRAI",null,"SIMALWARA",null,"JOBNER",null,"SAYLA",null,"SURAJGARH","DHAWA",null,null,"MOLASAR","SUMERPUR",{"$nulls":3},"PATAN",{"$nulls":3},"KOTRA"]
[null,"State :-","Rajasthan",null,"lIre~",15,14,13,12,11,10,11,10,50,46,96,{"$nulls":10},"January","tuojh ","January",{"$f":"H4","v":2023},"January-2023","tuojh &2023",{"$nulls":20},"CHURU",11,"SRINAGAR","RAINI","TALWARA",null,"GUDHAMALANI","UCHCHAIN","RAIPUR",null,null,"RASHMI",null,"SIKANDARA",{"$nulls":3},"KOTPUTALI",{"$nulls":3},"UDAIPURWATI","GHANTIYALI",null,null,"MUNDWA",{"$nulls":4},"PIPARALI",{"$nulls":3},"KURABAD"]
[null,"District :-","PALI",null,"v\"Ve~",9,8,5,14,3,3,3,10,20,35,55,{"$nulls":10},"Febuary","Qjojh","February",{"$f":"AD17","v":2023},"February-2023","Qjojh&2023",{"$nulls":20},"DAUSA",12,null,"RAJGARH",null,null,"KALYANPUR","WEIR","SAHADA",{"$nulls":8},"KOTKHAVDA",{"$nulls":4},"KERU",null,null,"NAGOUR",{"$nulls":4},"SHRIMADOPUR",{"$nulls":3},"LASADIA"]
[null,"Block :-","RAIPUR",null,";ksx",{"$f":"SUM(F16:F18)","v":28},{"$f":"SUM(G16:G18)","v":27},24,33,22,22,22,29,96,111,207,{"$nulls":10},"March","ekpZ","March",2023,"March-2023","ekpZ&2023",{"$nulls":20},"DHOLPUR",13,null,"RAMGARH",null,null,"PATODI",null,"SHAHPURA",{"$nulls":8},"KISHANGARH RENWAL",{"$nulls":4},"LOHAWAT",null,null,"NAWAN",{"$nulls":8},"MAOLI"]
[null,"Month :-","July-2022",null,"Ekgk;ksx",{"$f":"SUM(F15+F19)","v":61},{"$f":"SUM(G15+G19)","v":67},57,64,66,68,56,57,240,256,496,{"$nulls":36},"DUNGARPUR",14,null,"THANAGAZI",null,null,"PAYALAKALAN",null,"SUWANA",{"$nulls":8},"MOJMABAD",{"$nulls":4},"LUNI",null,null,"PARBATSAR",{"$nulls":8},"NAYAGAON"]
[{"$nulls":52},"HANUMANGARH",15,null,"TIZARA",null,null,"PHAGLIYA",{"$nulls":10},"MADHORAJPURA",{"$nulls":4},"MANDORE",null,null,"RIYAN BADI",{"$nulls":8},"RISHABHDEV"]
[{"$nulls":52},"JAIPUR",16,null,"UMRAIN",null,null,"RAMSAR",{"$nulls":10},"PAWTA",{"$nulls":4},"OSIAN",{"$nulls":11},"SALUMBAR"]
[null,"fujh{k.k dk fooj.k la[;k",{"$nulls":3},"fdpu 'ksM dh fLFkfr",{"$nulls":7},"is;ty lqfo/kk ¼gs.MiEi½",{"$nulls":38},"JAISALMER",17,{"$nulls":4},"SAMDARI",{"$nulls":10},"PHAGI",{"$nulls":4},"PHALODI",{"$nulls":11},"SARADA"]
[null,"tuizfrfuf/k }kjk ",null,"vf/kdkfj;ksa }kjk",null,"Mh-ih-bZ-ih- }kjk",null,",l-th-vkj-okbZ }kjk",null,"vkn'kZ jlksbZ?kj",null,",e-Mh-,e- ;kstuk }kjk",null,"pkyw","[kjkc","udkjk",{"$nulls":36},"JALORE",18,{"$nulls":4},"SEDHWA",{"$nulls":10},"SAMBHARLAKE",{"$nulls":4},"PIPADSHAHAR",{"$nulls":11},"SAYARA"]
[null," 'kkSpky; gS ;k ugh",{"$nulls":3},"iw.kZ","viw.kZ","iw.kZ","viw.kZ","iw.kZ","viw.kZ","iw.kZ","viw.kZ",{"$nulls":39},"JHALAWAR",19,{"$nulls":4},"SHIV",{"$nulls":10},"SANGANER",{"$nulls":4},"SHEKHALA",{"$nulls":11},"SEMARI"]
[null,"Nk=",null,"Nk=k",{"$nulls":48},"JHUNJHUNU",20,{"$nulls":4},"SINDHARI",{"$nulls":10},"SHAHPURA",{"$nulls":4},"SHERGARH",{"$nulls":11},"VALLABHNAGAR"]
[null,"vk;ksftr cSBd ,l-,elh- ¼fnuakd ½",null,"2022-03-08","[kk|kUu lqjf{kr j[kus ds crZu  la[;k",{"$nulls":3},5,null,"ekg ds vUr rd dqy [kkyh cksfj;kW dh la[;k",{"$nulls":4},2,{"$nulls":36},"JODHPUR",21,{"$nulls":4},"SIWANA",{"$nulls":10},"TUNGA",{"$nulls":4},"TINWARI"]
[null,"rjktq gS ;k ugh",null,null,"jsEi gS ugh",{"$nulls":3},"pkj fnokjh gS ;k ugh",{"$nulls":22},true,true,true,true,true,true,true,true,true,true,true,{"$nulls":10},"KARAULI",22,{"$nulls":15},"VIRATNAGAR"]
[null,null," dUotZu dh nj izfr Nk= ",null,"Bank Name :-",null,"SBI BAR",{"$nulls":45},"KOTA"]
[null,"çkFkfed d{kk,a ¼ 1 ls 5 ½",4.97,null,"IFSC Code :-",null,"SBIN0033382",{"$nulls":3},"You Tube Video Link :-",null,null,"https://youtu.be/Ep7yiDA2qr4",{"$nulls":11},30,69.25,{"$f":"Z30*AA30","v":2077.5},{"$nulls":3},false,true,false,true,false,false,true,false,{"$nulls":13},"NAGOUR",null,{"$f":"COUNTA(BC7:BC29)","v":11},{"$f":"COUNTA(BD7:BD29)+BC30","v":27},{"$f":"COUNTA(BE7:BE29)+BD30","v":38},46,67,79,93,102,107,118,125,136,142,152,159,181,188,198,206,217,238,246,251,266,276,284,292,299,311,316,325,332,352]
[null,"mPp çkFkfed d{kk,a ¼ 6 ls 8 ½",7.45,null,"A/C. No. :-",null,51022334455,{"$nulls":18},30,67.25,{"$f":"Z31*AA31","v":2017.5},{"$nulls":3},false,true,true,false,false,true,true,false,{"$nulls":13},"PALI"]
[{"$nulls":25},10,118.25,1182.5,{"$nulls":3},false,false,false,false,false,false,false,false,{"$nulls":13},"PRATAPGARH"]
[{"$nulls":25},30,156.25,4687.5,{"$nulls":3},false,false,false,false,false,false,true,false,{"$nulls":13},"RAJSAMAND"]
[null,"S.No.","Name",null,"       Gender",null,null,"Category",{"$nulls":4},"Mode of Payment",null,null,"Amount Received During the Month",{"$nulls":9},30,212.5,6375,{"$nulls":24},"SAWAI_MADHOPUR"]
[null,1,"Dhagalai Devi",{"$nulls":12},1320,{"$nulls":11},0,{"$nulls":24},"SIKAR"]
[null,2,"Geeta Devi",{"$nulls":12},1320,{"$nulls":9},30,113.5,3405,{"$nulls":3},false,false,false,false,true,false,true,false,true,false,false,{"$nulls":10},"SIROHI"]
[null,3,{"$nulls":25},{"$f":"SUM(AB30:AB34)-AB36","v":12935},{"$nulls":3},true,false,true,false,true,false,{"$nulls":15},"SRI_GANGANAGAR"]
[null,4,{"$nulls":31},true,true,{"$nulls":17},"TONK"]
[{"$nulls":52},"UDAIPUR"]
[{"$nulls":31},true,false]
[{"$nulls":31},false,false]
[{"$nulls":31},false,true]

{"sheet":"Prarmbhik Shesh","index":2,"n_rows":18,"n_cols":6,"rows_kept":18,"merged":[[0,2,0,7],[1,2,1,6],[2,2,2,6],[3,0,5,0],[3,1,5,2],[3,3,5,4],[3,5,5,6],[6,0,7,0],[6,1,7,1],[6,3,6,4],[6,5,6,6],[7,3,7,4],[7,5,7,6],[8,0,12,0],[8,1,12,1],[8,3,8,4],[8,5,8,6],[9,3,9,4],[9,5,9,6],[10,3,10,4],[10,5,10,6],[11,3,11,4],[11,5,11,6],[12,3,12,4],[12,5,12,6],[13,0,17,0],[13,1,17,1],[13,3,13,4],[13,5,13,6],[14,3,14,4],[14,5,14,6],[15,3,15,4],[15,5,15,6],[16,3,16,4],[16,5,16,6],[17,3,17,4],[17,5,17,6]]}
[]
[]
[]
["Sr. No.","Detail",null,"Class 1 to 5",null,"Class 6 to 8"]
[]
[]
[1,"izkjfEHkd 'ks\"k [kk|kUu ¼fdyksaxzke esa½","xsgqa",{"v":300,"d":"300.000"},null,{"v":250,"d":"250.000"}]
[null,null,"pkoy",{"v":200,"d":"200.000"},null,{"v":150,"d":"150.000"}]
[2,"dqfdax dUotZu foÙrh; fLFkfr ¼:i;ksa esa½","izkjfEHkd 'ks\"k",{"v":10000,"d":"10000.00"},null,{"v":15000,"d":"15000.00"}]
[null,null,"bl ekg esa izkIRk jkf'k",{"v":0,"d":"0.00"},null,{"v":0,"d":"0.00"}]
[null,null,"dqy jkf'k",{"$f":"D9+D10","v":{"v":10000,"d":"10000.00"}},null,{"$f":"F9+F10","v":{"v":15000,"d":"15000.00"}}]
[null,null,"O;; jkf'k",{"$f":"'PS Balance Sheet'!W37","v":2445.24},null,{"$f":"'UPS balance Sheet'!W37","v":2898.05}]
[null,null,"'ks\"k jkf'k",{"$f":"D11-D12","v":7554.76},null,{"$f":"F11-F12","v":12101.95}]
[3,"dqd&de gsYij foÙrh; fLFkfr ¼:i;ksa esa½","izkjfEHkd 'ks\"k",2000,null,2000]
[null,null,"bl ekg esa izkIRk jkf'k",6000,null,6000]
[null,null,"dqy jkf'k",{"$f":"D14+D15","v":8000},null,{"$f":"F14+F15","v":8000}]
[null,null,"O;; jkf'k"]
[null,null,"'ks\"k jkf'k",{"$f":"D16-D17","v":8000},null,{"$f":"F16-F17","v":8000}]

{"sheet":"Att. Dairy","index":3,"n_rows":42,"n_cols":31,"rows_kept":42,"merged":[[0,0,0,9],[0,10,0,11],[0,12,0,14],[1,0,4,0],[1,1,2,1],[1,2,4,2],[1,3,2,3],[1,4,1,9],[1,10,1,16],[2,4,2,6],[2,7,2,9],[2,10,2,12],[2,13,2,15],[2,16,3,16],[38,3,39,8],[38,10,39,10],[38,13,39,13]]}
["fo|ky; ds ykHkkfUor fo|kfFkZ;ksa dh fnukadokj lwpuk jftLV~zj ¼mifLFkfr jftLVj½",{"$nulls":9},"ekg %&",null,{"$f":"IF('MASTER DATA'!C20=\"\",\"\",'MASTER DATA'!C20)","v":"July-2022"}]
["Ø- l-","frfFk",";fn ehuw ds vuqlkj [kk|kUu miyC/k u gks rks tks Hkh [kk|kUu miyC/k  gks] mls Mkmu fyLV esa ls lysDV djsaA vU;Fkk dkWye [kkyh j[ksaA","d{kk  F","fnukadokj dqy ukekadu",{"$nulls":5},"iks\"kkgkj ls ykHkkfUor",{"$nulls":16},{"$f":"IF('MASTER DATA'!C20=\"\",\"\",'MASTER DATA'!C20)","v":"July-2022"},{"$f":"DATEVALUE(\"1\"&AB2)","v":"2022-07-01"},null,{"$f":"EOMONTH(AC2,0)","v":"2022-07-31"}]
[{"$nulls":4},"Class  1 to 5  ",null,null,"Class  6  to  8   ",null,null,"1 to 5",null,null,"6 to 8",null,null,"G. Total"]
[null,"H",null,"ukekadu F","B","G","T","B","G","T","B","G","T","B","G","T"]
[{"$nulls":3},"okj  H",{"$f":"'MASTER DATA'!N15","v":144},{"$f":"'MASTER DATA'!O15","v":145},{"$f":"E5+F5","v":289},{"$f":"'MASTER DATA'!N19","v":96},{"$f":"'MASTER DATA'!O19","v":111},{"$f":"H5+I5","v":207},{"$f":"'MASTER DATA'!N15","v":144},{"$f":"'MASTER DATA'!O15","v":145},{"$f":"SUM(K5+L5)","v":289},{"$f":"'MASTER DATA'!N19","v":96},{"$f":"'MASTER DATA'!O19","v":111},{"$f":"SUM(N5+O5)","v":207},{"$f":"M5+P5","v":496}]
[1,{"$f":"IFERROR(AC2,\"\")","v":"2022-07-01"},null,{"$f":"IF(T6=1,\"Sunday\",IF(T6=2,\"Monday\",IF(T6=3,\"Tuesday\",IF(T6=4,\"Wednesday\",IF(T6=5,\"Thursday\",IF(T6=6,\"Friday\",IF(T6=7,\"Saturday\",\" \")))))))","v":"Friday"},123,124,{"$f":"IF(AND(E6=\"\",F6=\"\"),\"\",SUM(E6,F6))","v":247},90,110,{"$f":"IF(AND(H6=\"\",I6=\"\"),\"\",SUM(H6,I6))","v":200},123,123,{"$f":"IF(AND(K6=\"\",L6=\"\"),\"\",SUM(K6,L6))","v":246},90,109,{"$f":"IF(AND(N6=\"\",O6=\"\"),\"\",SUM(N6,O6))","v":199},{"$f":"IF(AND(M6=\"\",P6=\"\"),\"\",SUM(M6,P6))","v":445},null,null,{"$f":"IF(AND(B6=\"\"),\"\",SUM(U6))","v":6},{"$f":"IFERROR(WEEKDAY(B6),\"\")","v":6}]
[2,{"$f":"IF(B6=\"\",\"\",IF(B6<$AE$2,B6+1,\"\"))","v":"2022-07-02"},null,{"$f":"IF(T7=1,\"Sunday\",IF(T7=2,\"Monday\",IF(T7=3,\"Tuesday\",IF(T7=4,\"Wednesday\",IF(T7=5,\"Thursday\",IF(T7=6,\"Friday\",IF(T7=7,\"Saturday\",\" \")))))))","v":"Saturday"},123,123,{"$f":"IF(AND(E7=\"\",F7=\"\"),\"\",SUM(E7,F7))","v":246},90,100,{"$f":"IF(AND(H7=\"\",I7=\"\"),\"\",SUM(H7,I7))","v":190},123,123,{"$f":"IF(AND(K7=\"\",L7=\"\"),\"\",SUM(K7,L7))","v":246},90,100,{"$f":"IF(AND(N7=\"\",O7=\"\"),\"\",SUM(N7,O7))","v":190},{"$f":"IF(AND(M7=\"\",P7=\"\"),\"\",SUM(M7,P7))","v":436},null,null,{"$f":"IF(AND(B7=\"\"),\"\",SUM(U7))","v":7},{"$f":"IFERROR(WEEKDAY(B7),\"\")","v":7},"JAN",{"$nulls":5},"2022-01-01"]
[3,{"$f":"IF(B7=\"\",\"\",IF(B7<$AE$2,B7+1,\"\"))","v":"2022-07-03"},null,{"$f":"IF(T8=1,\"Sunday\",IF(T8=2,\"Monday\",IF(T8=3,\"Tuesday\",IF(T8=4,\"Wednesday\",IF(T8=5,\"Thursday\",IF(T8=6,\"Friday\",IF(T8=7,\"Saturday\",\" \")))))))","v":"Sunday"},null,null,"",null,null,"",null,null,"",null,null,"","",null,null,1,1,"FEB",{"$nulls":5},"2022-02-01"]
[4,"2022-07-04",null,"Monday",null,null,"",null,null,"",null,null,"",null,null,"","",null,null,2,2,"MAR",null,"Sunday",{"$nulls":3},"2022-03-01"]
[5,"2022-07-05",null,"Tuesday",null,null,"",null,null,"",null,null,{"$f":"IF(AND(K10=\"\",L10=\"\"),\"\",SUM(K10,L10))","v":""},null,null,"","",null,null,3,3,"APR",null,"Monday",{"$nulls":3},"2022-04-01"]
[6,"2022-07-06",null,{"$f":"IF(T11=1,\"Sunday\",IF(T11=2,\"Monday\",IF(T11=3,\"Tuesday\",IF(T11=4,\"Wednesday\",IF(T11=5,\"Thursday\",IF(T11=6,\"Friday\",IF(T11=7,\"Saturday\",\" \")))))))","v":"Wednesday"},null,null,"",null,null,"",null,null,"",null,null,"","",null,null,4,4,"MAY",null,"Tuesday",{"$nulls":3},"2022-05-01"]
[7,"2022-07-07",null,{"$f":"IF(T12=1,\"Sunday\",IF(T12=2,\"Monday\",IF(T12=3,\"Tuesday\",IF(T12=4,\"Wednesday\",IF(T12=5,\"Thursday\",IF(T12=6,\"Friday\",IF(T12=7,\"Saturday\",\" \")))))))","v":"Thursday"},null,null,"",null,null,"",null,null,"",null,null,"","",null,null,5,5,"JUN",null,"Wednesday",{"$nulls":3},"2022-06-01"]
[8,"2022-07-08",null,"Friday",null,null,"",null,null,"",null,null,"",null,null,"","",null,null,6,6,"JUL",null,"Thursday",{"$nulls":3},"2022-07-01"]
[9,"2022-07-09",null,"Saturday",null,null,"",null,null,"",null,null,"",null,null,"",{"$f":"IF(AND(M14=\"\",P14=\"\"),\"\",SUM(M14,P14))","v":""},null,null,7,7,"AUG",null,"Friday",{"$nulls":3},"2022-08-01"]
[10,"2022-07-10",null,{"$f":"IF(T15=1,\"Sunday\",IF(T15=2,\"Monday\",IF(T15=3,\"Tuesday\",IF(T15=4,\"Wednesday\",IF(T15=5,\"Thursday\",IF(T15=6,\"Friday\",IF(T15=7,\"Saturday\",\" \")))))))","v":"Sunday"},null,null,"",null,null,"",null,null,"",null,null,"","",null,null,1,1,"SEP",null,"Saturday",{"$nulls":3},"2022-09-01"]
[11,"2022-07-11",null,"Monday",null,null,"",null,null,"",null,null,"",null,null,"","",null,null,2,2,"OCT",{"$nulls":5},"2022-10-01"]
[12,"2022-07-12",null,"Tuesday",null,null,"",null,null,"",null,null,"",null,null,"","",null,null,3,3,"NOV",{"$nulls":5},"2022-11-01"]
[13,"2022-07-13",null,"Wednesday",null,null,"",null,null,"",null,null,"",null,null,"","",null,null,4,4,"DEC",{"$nulls":5},"2022-12-01"]
[14,"2022-07-14",null,"Thursday",null,null,"",null,null,"",null,null,"",null,null,"","",null,null,5,5,{"$nulls":6},"2023-01-01"]
[15,"2022-07-15",null,"Friday",null,null,"",null,null,"",null,null,"",null,null,"","",null,null,6,6,null,null,"Wheat",{"$nulls":3},"2023-02-01"]
[16,"2022-07-16",null,"Saturday",null,null,"",null,null,"",null,null,"",null,null,"","",null,null,7,7,null,null,"Rice"]
[17,"2022-07-17",null,"Sunday",null,null,"",null,null,"",null,null,"",null,null,"","",null,null,1,1]
[18,"2022-07-18",null,"Monday",null,null,"",null,null,"",null,null,"",null,null,"","",null,null,2,2]
[19,"2022-07-19",null,"Tuesday",null,null,"",null,null,"",null,null,"",null,null,"","",null,null,3,3]
[20,"2022-07-20",null,"Wednesday",null,null,"",null,null,"",null,null,"",null,null,"","",null,null,4,4]
[21,"2022-07-21",null,"Thursday",null,null,"",null,null,"",null,null,"",null,null,"","",null,null,5,5]
[22,"2022-07-22",null,"Friday",null,null,"",null,null,"",null,null,"",null,null,"","",null,null,6,6]
[23,"2022-07-23",null,"Saturday",null,null,"",null,null,"",null,null,"",null,null,"","",null,null,7,7]
[24,"2022-07-24",null,"Sunday",null,null,"",null,null,"",null,null,"",null,null,"","",null,null,1,1]
[25,"2022-07-25",null,"Monday",null,null,"",null,null,"",null,null,"",null,null,"","",null,null,2,2]
[26,"2022-07-26",null,"Tuesday",null,null,"",null,null,"",null,null,"",null,null,"","",null,null,3,3]
[27,"2022-07-27",null,"Wednesday",null,null,"",null,null,"",null,null,"",null,null,"","",null,null,4,4]
[28,"2022-07-28",null,"Thursday",null,null,"",null,null,"",null,null,"",null,null,"","",null,null,5,5]
[29,"2022-07-29",null,"Friday",null,null,"",null,null,"",null,null,"",null,null,"","",null,null,6,6]
[30,"2022-07-30",null,"Saturday",null,null,"",null,null,"",null,null,"",null,null,"","",null,null,7,7]
[31,"2022-07-31",null,{"$f":"IF(T36=1,\"Sunday\",IF(T36=2,\"Monday\",IF(T36=3,\"Tuesday\",IF(T36=4,\"Wednesday\",IF(T36=5,\"Thursday\",IF(T36=6,\"Friday\",IF(T36=7,\"Saturday\",\" \")))))))","v":"Sunday"},null,null,"",null,null,"",null,null,"",null,null,"","",null,null,1,1]
[null,null,"Total ",null,{"$f":"SUM(E6:E36)","v":246},{"$f":"SUM(F6:F36)","v":247},493,180,210,390,246,246,492,180,209,389,881]
[{"$nulls":10},"PS",null,null,"UPS"]
[{"$nulls":3},"iks\"kkgkj ls ykHkkfUor fnuksa dh la[;k &",{"$nulls":6},{"$f":"COUNTA(M6:M36)-COUNTIF(M6:M36,\"0\")-COUNTIF(M6:M36,\"blank\")-COUNTIF(M6:M36,\"\")","v":2},null,null,{"$f":"COUNTA(P6:P36)-COUNTIF(P6:P36,\"0\")-COUNTIF(P6:P36,\"blank\")-COUNTIF(P6:P36,\"\")","v":2}]
[{"$nulls":16},{"$f":"COUNTA(Q6:Q36)-COUNTIF(Q6:Q36,\"0\")-COUNTIF(Q6:Q36,\"blank\")-COUNTIF(Q6:Q36,\"\")","v":2}]
[]
[{"$nulls":10},{"$f":"COUNTA(G6:G36)-COUNTIF(G6:G36,\"0\")-COUNTIF(G6:G36,\"blank\")-COUNTIF(G6:G36,\"\")","v":2},null,null,{"$f":"COUNTA(J6:J36)-COUNTIF(J6:J36,\"0\")-COUNTIF(J6:J36,\"blank\")-COUNTIF(J6:J36,\"\")","v":2}]

{"sheet":"PS Balance Sheet","index":4,"n_rows":48,"n_cols":119,"rows_kept":48,"merged":[[0,1,0,3],[0,4,0,10],[0,15,0,17],[1,1,4,1],[1,2,3,3],[1,4,3,5],[1,6,2,7],[1,8,2,9],[1,10,3,11],[1,12,3,14],[1,15,3,17],[1,18,3,19],[1,20,3,21],[1,22,4,22],[1,23,4,23],[1,96,4,96],[1,97,3,98],[1,99,3,100],[1,101,3,102],[1,103,3,104],[1,105,3,106],[1,107,3,109],[1,110,3,112],[1,113,3,114],[1,115,3,116],[1,117,4,117],[1,118,4,118],[3,6,3,7],[3,8,3,9],[36,2,36,3],[36,97,36,98],[42,18,42,19],[43,18,43,19],[44,18,44,19],[45,18,45,19]]}
[null,"Presented By:-",null,null,"Mr. HeeraLaL Jat Sojat (PALI)   ",{"$nulls":10},{"$f":"CONCATENATE('MASTER DATA'!I4, 'MASTER DATA'!J4)","v":"ekg %&tqykbZ&2022"},{"$nulls":10},{"$f":"'MASTER DATA'!C30","v":4.97},null,{"$f":"AC7=IF(AND('MASTER DATA'!C18=\"Rural\"),'MASTER DATA'!I31,'MASTER DATA'!I30)","v":true}]
[null,"fnukad","çkjfEHkd [kk|ku o  nky  dh  ek=k fdyks xzke esa ",null,"forj.k drkZ ls çkIr [kk|ku fdyks xzke esa",null,"vU;= lzksr ls m/kkj  fy;k@fn;k¼fdxzk½",null,"vU; fo|ky; ls m/kkj fy;k@fn;k¼fdxzk½",null,"dqy [kk|ku ",null,"  dqy ukekadu d{kk 1 ls 5",null,null,"dqy ykHkkfUor Nk=@Nk=k      \n d{kk 1 ls 5",null,null,"ekg esa mi;ksx fy;k x;k izfrfnu [kk|ku",null," 'ks\"k [kk|ku ",null,"ekg esa izfrfnu dUotZu ij O;; jkf'k","feuw ds vuqlkj Hkkstu",{"$nulls":72},"fnukad","çkjfEHkd [kk|ku dh  ek=k fdyks xzke esa ",null,"forj.k drkZ ls çkIr [kk|ku fdyks xzke esa",null,"vU;= lzksr ls m/kkj  fy;k@fn;k¼fdxzk½",null,"vU;= fo|ky; ls m/kkj  fy;k@fn;k¼fdxzk½",null,"dqy [kk|ku ",null,"dqy ukekadu \nd{kk 1 ls 5",null,null,"dqy ykHkkfUor Nk=@Nk=k       \nd{kk 1 ls 5",null,null,"ekg esa mi;ksx fy;k x;k izfrfnu [kk|ku",null," 'ks\"k [kk|ku",null,"ekg esa izfrfnu dUotZu ij O;; jkf'k","feuw ds vuqlkj Hkkstu"]
[]
[{"$nulls":6},"m/kkj nsus ij¼&½fpUg yxk,",null,"m/kkj nsus ij¼&½fpUg yxk,"]
["Sr.",null,"xsagw","pkoy","xsagw","pkoy","xsagw","pkoy","xsagw","pkoy","xsagw","pkoy","Nk=","Nk=k","dqy","Nk=","Nk=k","dqy","xsagw","pkoy","xsagw","pkoy",{"$nulls":9},"Wheat/Rice",{"$nulls":17},"Wheat/Rice","Wheat/Rice",{"$nulls":46},"xsagw","pkoy","xsagw","pkoy","xsagw","pkoy","xsagw","pkoy","xsagw","pkoy","Nk=","Nk=k",";ksx","Nk=","Nk=k",";ksx","xsagw","pkoy","xsagw","pkoy"]
[1,{"$f":"IF(AND('Att. Dairy'!B6=\"\"),\"\",'Att. Dairy'!B6)","v":"2022-07-01"},{"$f":"'Prarmbhik Shesh'!D7","v":{"v":300,"d":"300.000"}},{"$f":"'Prarmbhik Shesh'!D8","v":{"v":200,"d":"200.000"}},{"$nulls":6},{"$f":"IFERROR(IF(AND(C6=\"\"),\"\",SUM(C6,E6,G6,I6)),\"\")","v":{"v":300,"d":"300.000"}},{"$f":"IFERROR(IF(AND(D6=\"\"),\"\",SUM(D6,F6,H6,J6)),\"\")","v":{"v":200,"d":"200.000"}},{"$f":"IF(OR('Att. Dairy'!E6=\"\",R6=0,R6=\"\"),\"\",'Att. Dairy'!E6)","v":123},{"$f":"IF(OR('Att. Dairy'!F6=\"\",R6=0,R6=\"\"),\"\",'Att. Dairy'!F6)","v":124},{"$f":"SUM(M6,N6)","v":247},{"$f":"IF(AND('Att. Dairy'!K6=\"\"),\"\",'Att. Dairy'!K6)","v":123},{"$f":"IF(AND('Att. Dairy'!L6=\"\"),\"\",'Att. Dairy'!L6)","v":123},{"$f":"SUM(P6,Q6)","v":246},{"$f":"IF(AND(R6=\"\"),0,IF(AND(AY6=\"w\"),R6*100/1000,0))","v":{"v":24.6,"d":"24.600"}},{"$f":"IF(AND(R6=\"\"),0,IF(AND(AY6=\"R\"),R6*100/1000,0))","v":{"v":0,"d":"0.000"}},{"$f":"SUM(K6-S6)","v":{"v":275.4,"d":"275.400"}},{"$f":"(L6-T6)","v":{"v":200,"d":"200.000"}},{"$f":"IFERROR(IF(AND('Att. Dairy'!B6=\"\"),\"\",IF(AND(X6=\"vodk'k\"),\"\",IF(AND(R6=\"\"),\"\",R6*$AA$1))),\"\")","v":1222.62},{"$f":"IF(AND('Att. Dairy'!B6=\"\"),\"\",IF(AND(P6=\"\"),\"\",AH6))","v":"nkyjksVh"},{"$nulls":6},{"$f":"IF(AND('Att. Dairy'!C6=\"\"),\"\",'Att. Dairy'!C6)","v":""},{"$f":"IF(AND(AE6=\"\"),\"\",IF(AE6=\"Rice\",\"R\",IF(AE6=\"Wheat\",\"W\")))","v":""},{"$f":"IF(AND('Att. Dairy'!D6=\"\"),\"\",'Att. Dairy'!D6)","v":"Friday"},{"$f":"IF(OR(AG6=0,AG6=\"\"),\"\",IF(AG6=\"tuesday\",\"nkypkoy\",IF(AG6=\"thursday\",\"f[kpM+h\",IF(OR(AG6=\"monday\",AG6=\"saturday\"),\"lCthjksVh\",IF(OR(AG6=\"wednesday\",AG6=\"friday\"),\"nkyjksVh\",\"vodk'k\")))))","v":"nkyjksVh"},{"$nulls":15},{"$f":"IF(OR(AG6=0,AG6=\"\"),\"\",IF(AG6=\"tuesday\",\"R\",IF(AG6=\"thursday\",\"R\",IF(OR(AG6=\"monday\",AG6=\"saturday\"),\"W\",IF(OR(AG6=\"wednesday\",AG6=\"friday\"),\"W\")))))","v":"W"},{"$f":"IF(AND(AE6=\"\"),AX6,AF6)","v":"W"},{"$nulls":45},{"$f":"IF(AND(B6=\"\"),\"\",B6)","v":"2022-07-01"},{"$f":"IF(OR(C6=\"\",C6=0),\"\",C6)","v":{"v":300,"d":"300.00"}},{"$f":"IF(OR(D6=\"\",D6=0),\"\",D6)","v":{"v":200,"d":"200.00"}},"","",{"$f":"IF(OR(G6=\"\",G6=0),\"\",G6)","v":""},{"$f":"IF(OR(H6=\"\",H6=0),\"\",H6)","v":""},{"$f":"IF(OR(I6=\"\",I6=0),\"\",I6)","v":""},{"$f":"IF(OR(J6=\"\",J6=0),\"\",J6)","v":""},{"$f":"IF(OR(K6=\"\",K6=0,DI7=\"\"),\"\",K6)","v":{"v":300,"d":"300.00"}},{"$f":"IF(OR(L6=\"\",L6=0,DI7=\"\"),\"\",L6)","v":{"v":200,"d":"200.00"}},{"$f":"IF(OR(M6=\"\",M6=0),\"\",M6)","v":123},{"$f":"IF(OR(N6=\"\",N6=0),\"\",N6)","v":124},247,123,123,246,{"$f":"IF(OR(S6=\"\",S6=0),\"\",S6)","v":{"v":24.6,"d":"25"}},{"$f":"IF(OR(T6=\"\",T6=0),\"\",T6)","v":""},{"$f":"IF(OR(U6=\"\",U6=0,DI7=\"\"),\"\",U6)","v":{"v":275.4,"d":"275.400"}},{"$f":"IF(OR(V6=\"\",V6=0,DI7=\"\"),\"\",V6)","v":{"v":200,"d":"200.000"}},{"$f":"IF(OR(W6=\"\",W6=0),\"\",W6)","v":{"v":1222.62,"d":"1223"}},{"$f":"IF(OR(X6=\"\",X6=0),\"\",X6)","v":"nkyjksVh"}]
[2,{"$f":"IF(AND('Att. Dairy'!B7=\"\"),\"\",'Att. Dairy'!B7)","v":"2022-07-02"},{"$f":"IFERROR(IF(AND(U6=\"\"),\"\",U6),\"\")","v":{"v":275.4,"d":"275.400"}},{"$f":"IFERROR(IF(AND(V6=\"\"),\"\",V6),\"\")","v":{"v":200,"d":"200.000"}},{"$nulls":6},{"$f":"IFERROR(IF(AND(C7=\"\"),\"\",SUM(C7,E7,G7,I7)),\"\")","v":{"v":275.4,"d":"275.400"}},{"$f":"IFERROR(IF(AND(D7=\"\"),\"\",SUM(D7,F7,H7,J7)),\"\")","v":{"v":200,"d":"200.000"}},{"$f":"IF(OR('Att. Dairy'!E7=\"\",R7=0,R7=\"\"),\"\",'Att. Dairy'!E7)","v":123},{"$f":"IF(OR('Att. Dairy'!F7=\"\",R7=0,R7=\"\"),\"\",'Att. Dairy'!F7)","v":123},{"$f":"SUM(M7,N7)","v":246},{"$f":"IF(AND('Att. Dairy'!K7=\"\"),\"\",'Att. Dairy'!K7)","v":123},{"$f":"IF(AND('Att. Dairy'!L7=\"\"),\"\",'Att. Dairy'!L7)","v":123},{"$f":"SUM(P7,Q7)","v":246},{"$f":"IF(AND(R7=\"\"),0,IF(AND(AY7=\"w\"),R7*100/1000,0))","v":{"v":24.6,"d":"24.600"}},{"$f":"IF(AND(R7=\"\"),0,IF(AND(AY7=\"R\"),R7*100/1000,0))","v":{"v":0,"d":"0.000"}},{"$f":"SUM(K7-S7)","v":{"v":250.79999999999998,"d":"250.800"}},{"$f":"(L7-T7)","v":{"v":200,"d":"200.000"}},{"$f":"IFERROR(IF(AND('Att. Dairy'!B7=\"\"),\"\",IF(AND(X7=\"vodk'k\"),\"\",IF(AND(R7=\"\"),\"\",R7*$AA$1))),\"\")","v":1222.62},{"$f":"IF(AND('Att. Dairy'!B7=\"\"),\"\",IF(AND(P7=\"\"),\"\",AH7))","v":"lCthjksVh"},{"$nulls":6},{"$f":"IF(AND('Att. Dairy'!C7=\"\"),\"\",'Att. Dairy'!C7)","v":""},{"$f":"IF(AND(AE7=\"\"),\"\",IF(AE7=\"Rice\",\"R\",IF(AE7=\"Wheat\",\"W\")))","v":""},{"$f":"IF(AND('Att. Dairy'!D7=\"\"),\"\",'Att. Dairy'!D7)","v":"Saturday"},{"$f":"IF(OR(AG7=0,AG7=\"\"),\"\",IF(AG7=\"tuesday\",\"nkypkoy\",IF(AG7=\"thursday\",\"f[kpM+h\",IF(OR(AG7=\"monday\",AG7=\"saturday\"),\"lCthjksVh\",IF(OR(AG7=\"wednesday\",AG7=\"friday\"),\"nkyjksVh\",\"vodk'k\")))))","v":"lCthjksVh"},{"$nulls":15},{"$f":"IF(OR(AG7=0,AG7=\"\"),\"\",IF(AG7=\"tuesday\",\"R\",IF(AG7=\"thursday\",\"R\",IF(OR(AG7=\"monday\",AG7=\"saturday\"),\"W\",IF(OR(AG7=\"wednesday\",AG7=\"friday\"),\"W\")))))","v":"W"},"W",{"$nulls":45},{"$f":"IF(AND(B7=\"\"),\"\",B7)","v":"2022-07-02"},{"$f":"IF(OR(C7=\"\",C7=0,DI7=\"\"),\"\",C7)","v":{"v":275.4,"d":"275.40"}},{"$f":"IF(OR(D7=\"\",D7=0,DI7=\"\"),\"\",D7)","v":{"v":200,"d":"200.00"}},{"$f":"IF(OR(E7=\"\",E7=0),\"\",E7)","v":""},{"$f":"IF(OR(F7=\"\",F7=0),\"\",F7)","v":""},{"$f":"IF(OR(G7=\"\",G7=0),\"\",G7)","v":""},{"$f":"IF(OR(H7=\"\",H7=0),\"\",H7)","v":""},{"$f":"IF(OR(I7=\"\",I7=0),\"\",I7)","v":""},{"$f":"IF(OR(J7=\"\",J7=0),\"\",J7)","v":""},{"$f":"IF(OR(K7=\"\",K7=0,DI7=\"\"),\"\",K7)","v":{"v":275.4,"d":"275.40"}},{"$f":"IF(OR(L7=\"\",L7=0,DI7=\"\"),\"\",L7)","v":{"v":200,"d":"200.00"}},{"$f":"IF(OR(M7=\"\",M7=0),\"\",M7)","v":123},{"$f":"IF(OR(N7=\"\",N7=0),\"\",N7)","v":123},{"$f":"IF(OR(O7=\"\",O7=0),\"\",O7)","v":246},{"$f":"IF(OR(P7=\"\",P7=0),\"\",P7)","v":123},{"$f":"IF(OR(Q7=\"\",Q7=0),\"\",Q7)","v":123},{"$f":"IF(OR(R7=\"\",R7=0),\"\",R7)","v":246},{"$f":"IF(OR(S7=\"\",S7=0),\"\",S7)","v":{"v":24.6,"d":"25"}},{"$f":"IF(OR(T7=\"\",T7=0),\"\",T7)","v":""},{"$f":"IF(OR(U7=\"\",U7=0,DI7=\"\"),\"\",U7)","v":{"v":250.79999999999998,"d":"250.800"}},{"$f":"IF(OR(V7=\"\",V7=0,DI7=\"\"),\"\",V7)","v":{"v":200,"d":"200.000"}},{"$f":"IF(OR(W7=\"\",W7=0),\"\",W7)","v":{"v":1222.62,"d":"1223"}},{"$f":"IF(OR(X7=\"\",X7=0),\"\",X7)","v":"lCthjksVh"}]
[3,{"$f":"IF(AND('Att. Dairy'!B8=\"\"),\"\",'Att. Dairy'!B8)","v":"2022-07-03"},{"$f":"IFERROR(IF(AND(U7=\"\"),\"\",U7),\"\")","v":{"v":250.79999999999998,"d":"250.800"}},{"$f":"IFERROR(IF(AND(V7=\"\"),\"\",V7),\"\")","v":{"v":200,"d":"200.000"}},{"$nulls":6},{"v":250.79999999999998,"d":"250.800"},{"v":200,"d":"200.000"},{"$f":"IF(OR('Att. Dairy'!E8=\"\",R8=0,R8=\"\"),\"\",'Att. Dairy'!E8)","v":""},{"$f":"IF(OR('Att. Dairy'!F8=\"\",R8=0,R8=\"\"),\"\",'Att. Dairy'!F8)","v":""},0,{"$f":"IF(AND('Att. Dairy'!K8=\"\"),\"\",'Att. Dairy'!K8)","v":""},{"$f":"IF(AND('Att. Dairy'!L8=\"\"),\"\",'Att. Dairy'!L8)","v":""},0,{"v":0,"d":"0.000"},{"v":0,"d":"0.000"},{"v":250.79999999999998,"d":"250.800"},{"v":200,"d":"200.000"},{"$f":"IFERROR(IF(AND('Att. Dairy'!B8=\"\"),\"\",IF(AND(X8=\"vodk'k\"),\"\",IF(AND(R8=\"\"),\"\",R8*$AA$1))),\"\")","v":{"v":0,"d":"0.00"}},{"$f":"IF(AND('Att. Dairy'!B8=\"\"),\"\",IF(AND(P8=\"\"),\"\",AH8))","v":""},{"$nulls":6},{"$f":"IF(AND('Att. Dairy'!C8=\"\"),\"\",'Att. Dairy'!C8)","v":""},"",{"$f":"IF(AND('Att. Dairy'!D8=\"\"),\"\",'Att. Dairy'!D8)","v":"Sunday"},"vodk'k",{"$nulls":15},false,false,{"$nulls":45},"2022-07-03",{"$f":"IF(OR(C8=\"\",C8=0,DI8=\"\"),\"\",C8)","v":""},{"$f":"IF(OR(D8=\"\",D8=0,DI8=\"\"),\"\",D8)","v":""},"","","","","","",{"$f":"IF(OR(K8=\"\",K8=0,DI8=\"\"),\"\",K8)","v":""},{"$f":"IF(OR(L8=\"\",L8=0,DI8=\"\"),\"\",L8)","v":""},"","","","","","","","",{"$f":"IF(OR(U8=\"\",U8=0,DI8=\"\"),\"\",U8)","v":""},{"$f":"IF(OR(V8=\"\",V8=0,DI8=\"\"),\"\",V8)","v":""},"",""]
[4,{"$f":"IF(AND('Att. Dairy'!B9=\"\"),\"\",'Att. Dairy'!B9)","v":"2022-07-04"},{"v":250.79999999999998,"d":"250.800"},{"v":200,"d":"200.000"},{"$nulls":6},{"v":250.79999999999998,"d":"250.800"},{"v":200,"d":"200.000"},{"$f":"IF(OR('Att. Dairy'!E9=\"\",R9=0,R9=\"\"),\"\",'Att. Dairy'!E9)","v":""},{"$f":"IF(OR('Att. Dairy'!F9=\"\",R9=0,R9=\"\"),\"\",'Att. Dairy'!F9)","v":""},0,{"$f":"IF(AND('Att. Dairy'!K9=\"\"),\"\",'Att. Dairy'!K9)","v":""},{"$f":"IF(AND('Att. Dairy'!L9=\"\"),\"\",'Att. Dairy'!L9)","v":""},0,{"v":0,"d":"0.000"},{"v":0,"d":"0.000"},{"v":250.79999999999998,"d":"250.800"},{"v":200,"d":"200.000"},{"$f":"IFERROR(IF(AND('Att. Dairy'!B9=\"\"),\"\",IF(AND(X9=\"vodk'k\"),\"\",IF(AND(R9=\"\"),\"\",R9*$AA$1))),\"\")","v":{"v":0,"d":"0.00"}},{"$f":"IF(AND('Att. Dairy'!B9=\"\"),\"\",IF(AND(P9=\"\"),\"\",AH9))","v":""},{"$nulls":6},{"$f":"IF(AND('Att. Dairy'!C9=\"\"),\"\",'Att. Dairy'!C9)","v":""},"",{"$f":"IF(AND('Att. Dairy'!D9=\"\"),\"\",'Att. Dairy'!D9)","v":"Monday"},"lCthjksVh",{"$nulls":15},"W","W",{"$nulls":45},"2022-07-04","","","","","","","","","","","","","","","","","","","","","",""]
[5,{"$f":"IF(AND('Att. Dairy'!B10=\"\"),\"\",'Att. Dairy'!B10)","v":"2022-07-05"},{"v":250.79999999999998,"d":"250.800"},{"v":200,"d":"200.000"},{"$nulls":6},{"v":250.79999999999998,"d":"250.800"},{"v":200,"d":"200.000"},{"$f":"IF(OR('Att. Dairy'!E10=\"\",R10=0,R10=\"\"),\"\",'Att. Dairy'!E10)","v":""},{"$f":"IF(OR('Att. Dairy'!F10=\"\",R10=0,R10=\"\"),\"\",'Att. Dairy'!F10)","v":""},0,{"$f":"IF(AND('Att. Dairy'!K10=\"\"),\"\",'Att. Dairy'!K10)","v":""},{"$f":"IF(AND('Att. Dairy'!L10=\"\"),\"\",'Att. Dairy'!L10)","v":""},0,{"v":0,"d":"0.000"},{"v":0,"d":"0.000"},{"v":250.79999999999998,"d":"250.800"},{"v":200,"d":"200.000"},{"$f":"IFERROR(IF(AND('Att. Dairy'!B10=\"\"),\"\",IF(AND(X10=\"vodk'k\"),\"\",IF(AND(R10=\"\"),\"\",R10*$AA$1))),\"\")","v":{"v":0,"d":"0.00"}},{"$f":"IF(AND('Att. Dairy'!B10=\"\"),\"\",IF(AND(P10=\"\"),\"\",AH10))","v":""},{"$nulls":6},{"$f":"IF(AND('Att. Dairy'!C10=\"\"),\"\",'Att. Dairy'!C10)","v":""},"",{"$f":"IF(AND('Att. Dairy'!D10=\"\"),\"\",'Att. Dairy'!D10)","v":"Tuesday"},"nkypkoy",null,null,"YES",{"$nulls":12},"R","R",{"$nulls":45},"2022-07-05","","","","","","","","","","","","","","","","","","","","","",""]
[6,{"$f":"IF(AND('Att. Dairy'!B11=\"\"),\"\",'Att. Dairy'!B11)","v":"2022-07-06"},{"v":250.79999999999998,"d":"250.800"},{"v":200,"d":"200.000"},{"$nulls":6},{"v":250.79999999999998,"d":"250.800"},{"v":200,"d":"200.000"},{"$f":"IF(OR('Att. Dairy'!E11=\"\",R11=0,R11=\"\"),\"\",'Att. Dairy'!E11)","v":""},{"$f":"IF(OR('Att. Dairy'!F11=\"\",R11=0,R11=\"\"),\"\",'Att. Dairy'!F11)","v":""},0,{"$f":"IF(AND('Att. Dairy'!K11=\"\"),\"\",'Att. Dairy'!K11)","v":""},{"$f":"IF(AND('Att. Dairy'!L11=\"\"),\"\",'Att. Dairy'!L11)","v":""},0,{"v":0,"d":"0.000"},{"v":0,"d":"0.000"},{"v":250.79999999999998,"d":"250.800"},{"v":200,"d":"200.000"},{"$f":"IFERROR(IF(AND('Att. Dairy'!B11=\"\"),\"\",IF(AND(X11=\"vodk'k\"),\"\",IF(AND(R11=\"\"),\"\",R11*$AA$1))),\"\")","v":{"v":0,"d":"0.00"}},{"$f":"IF(AND('Att. Dairy'!B11=\"\"),\"\",IF(AND(P11=\"\"),\"\",AH11))","v":""},{"$nulls":6},{"$f":"IF(AND('Att. Dairy'!C11=\"\"),\"\",'Att. Dairy'!C11)","v":""},"",{"$f":"IF(AND('Att. Dairy'!D11=\"\"),\"\",'Att. Dairy'!D11)","v":"Wednesday"},{"$f":"IF(OR(AG11=0,AG11=\"\"),\"\",IF(AG11=\"tuesday\",\"nkypkoy\",IF(AG11=\"thursday\",\"f[kpM+h\",IF(OR(AG11=\"monday\",AG11=\"saturday\"),\"lCthjksVh\",IF(OR(AG11=\"wednesday\",AG11=\"friday\"),\"nkyjksVh\",\"vodk'k\")))))","v":"nkyjksVh"},null,null,"NO",{"$nulls":12},"W","W",{"$nulls":45},"2022-07-06","","","","","","","","","","","","","","","","","","","","","",""]
[7,{"$f":"IF(AND('Att. Dairy'!B12=\"\"),\"\",'Att. Dairy'!B12)","v":"2022-07-07"},{"v":250.79999999999998,"d":"250.800"},{"v":200,"d":"200.000"},{"$nulls":6},{"v":250.79999999999998,"d":"250.800"},{"v":200,"d":"200.000"},{"$f":"IF(OR('Att. Dairy'!E12=\"\",R12=0,R12=\"\"),\"\",'Att. Dairy'!E12)","v":""},{"$f":"IF(OR('Att. Dairy'!F12=\"\",R12=0,R12=\"\"),\"\",'Att. Dairy'!F12)","v":""},0,{"$f":"IF(AND('Att. Dairy'!K12=\"\"),\"\",'Att. Dairy'!K12)","v":""},{"$f":"IF(AND('Att. Dairy'!L12=\"\"),\"\",'Att. Dairy'!L12)","v":""},0,{"v":0,"d":"0.000"},{"v":0,"d":"0.000"},{"v":250.79999999999998,"d":"250.800"},{"v":200,"d":"200.000"},{"$f":"IFERROR(IF(AND('Att. Dairy'!B12=\"\"),\"\",IF(AND(X12=\"vodk'k\"),\"\",IF(AND(R12=\"\"),\"\",R12*$AA$1))),\"\")","v":{"v":0,"d":"0.00"}},{"$f":"IF(AND('Att. Dairy'!B12=\"\"),\"\",IF(AND(P12=\"\"),\"\",AH12))","v":""},{"$nulls":6},{"$f":"IF(AND('Att. Dairy'!C12=\"\"),\"\",'Att. Dairy'!C12)","v":""},"",{"$f":"IF(AND('Att. Dairy'!D12=\"\"),\"\",'Att. Dairy'!D12)","v":"Thursday"},"f[kpM+h",{"$nulls":15},"R","R",{"$nulls":45},"2022-07-07","","","","","","","","","","","","","","","","","","","","","",""]
[8,{"$f":"IF(AND('Att. Dairy'!B13=\"\"),\"\",'Att. Dairy'!B13)","v":"2022-07-08"},{"v":250.79999999999998,"d":"250.800"},{"v":200,"d":"200.000"},{"$nulls":6},{"v":250.79999999999998,"d":"250.800"},{"v":200,"d":"200.000"},{"$f":"IF(OR('Att. Dairy'!E13=\"\",R13=0,R13=\"\"),\"\",'Att. Dairy'!E13)","v":""},{"$f":"IF(OR('Att. Dairy'!F13=\"\",R13=0,R13=\"\"),\"\",'Att. Dairy'!F13)","v":""},0,{"$f":"IF(AND('Att. Dairy'!K13=\"\"),\"\",'Att. Dairy'!K13)","v":""},{"$f":"IF(AND('Att. Dairy'!L13=\"\"),\"\",'Att. Dairy'!L13)","v":""},0,{"v":0,"d":"0.000"},{"v":0,"d":"0.000"},{"v":250.79999999999998,"d":"250.800"},{"v":200,"d":"200.000"},{"$f":"IFERROR(IF(AND('Att. Dairy'!B13=\"\"),\"\",IF(AND(X13=\"vodk'k\"),\"\",IF(AND(R13=\"\"),\"\",R13*$AA$1))),\"\")","v":{"v":0,"d":"0.00"}},{"$f":"IF(AND('Att. Dairy'!B13=\"\"),\"\",IF(AND(P13=\"\"),\"\",AH13))","v":""},{"$nulls":6},{"$f":"IF(AND('Att. Dairy'!C13=\"\"),\"\",'Att. Dairy'!C13)","v":""},"",{"$f":"IF(AND('Att. Dairy'!D13=\"\"),\"\",'Att. Dairy'!D13)","v":"Friday"},"nkyjksVh",{"$nulls":15},"W","W",{"$nulls":45},"2022-07-08","","","","",{"$f":"IF(OR(G13=\"\",G13=0),\"\",G13)","v":""},"","","","","","","","","","","","","","","","",""]
[9,{"$f":"IF(AND('Att. Dairy'!B14=\"\"),\"\",'Att. Dairy'!B14)","v":"2022-07-09"},{"v":250.79999999999998,"d":"250.800"},{"v":200,"d":"200.000"},{"$nulls":6},{"v":250.79999999999998,"d":"250.800"},{"v":200,"d":"200.000"},{"$f":"IF(OR('Att. Dairy'!E14=\"\",R14=0,R14=\"\"),\"\",'Att. Dairy'!E14)","v":""},{"$f":"IF(OR('Att. Dairy'!F14=\"\",R14=0,R14=\"\"),\"\",'Att. Dairy'!F14)","v":""},0,{"$f":"IF(AND('Att. Dairy'!K14=\"\"),\"\",'Att. Dairy'!K14)","v":""},{"$f":"IF(AND('Att. Dairy'!L14=\"\"),\"\",'Att. Dairy'!L14)","v":""},0,{"v":0,"d":"0.000"},{"v":0,"d":"0.000"},{"v":250.79999999999998,"d":"250.800"},{"v":200,"d":"200.000"},{"$f":"IFERROR(IF(AND('Att. Dairy'!B14=\"\"),\"\",IF(AND(X14=\"vodk'k\"),\"\",IF(AND(R14=\"\"),\"\",R14*$AA$1))),\"\")","v":{"v":0,"d":"0.00"}},{"$f":"IF(AND('Att. Dairy'!B14=\"\"),\"\",IF(AND(P14=\"\"),\"\",AH14))","v":""},{"$nulls":6},{"$f":"IF(AND('Att. Dairy'!C14=\"\"),\"\",'Att. Dairy'!C14)","v":""},"",{"$f":"IF(AND('Att. Dairy'!D14=\"\"),\"\",'Att. Dairy'!D14)","v":"Saturday"},"lCthjksVh",{"$nulls":15},"W","W",{"$nulls":45},"2022-07-09","","","","","","","","","","","","","","","","","","","","","",""]
[10,{"$f":"IF(AND('Att. Dairy'!B15=\"\"),\"\",'Att. Dairy'!B15)","v":"2022-07-10"},{"v":250.79999999999998,"d":"250.800"},{"v":200,"d":"200.000"},{"$nulls":6},{"v":250.79999999999998,"d":"250.800"},{"v":200,"d":"200.000"},{"$f":"IF(OR('Att. Dairy'!E15=\"\",R15=0,R15=\"\"),\"\",'Att. Dairy'!E15)","v":""},{"$f":"IF(OR('Att. Dairy'!F15=\"\",R15=0,R15=\"\"),\"\",'Att. Dairy'!F15)","v":""},0,{"$f":"IF(AND('Att. Dairy'!K15=\"\"),\"\",'Att. Dairy'!K15)","v":""},{"$f":"IF(AND('Att. Dairy'!L15=\"\"),\"\",'Att. Dairy'!L15)","v":""},0,{"v":0,"d":"0.000"},{"v":0,"d":"0.000"},{"v":250.79999999999998,"d":"250.800"},{"v":200,"d":"200.000"},{"$f":"IFERROR(IF(AND('Att. Dairy'!B15=\"\"),\"\",IF(AND(X15=\"vodk'k\"),\"\",IF(AND(R15=\"\"),\"\",R15*$AA$1))),\"\")","v":{"v":0,"d":"0.00"}},{"$f":"IF(AND('Att. Dairy'!B15=\"\"),\"\",IF(AND(P15=\"\"),\"\",AH15))","v":""},{"$nulls":6},{"$f":"IF(AND('Att. Dairy'!C15=\"\"),\"\",'Att. Dairy'!C15)","v":""},"",{"$f":"IF(AND('Att. Dairy'!D15=\"\"),\"\",'Att. Dairy'!D15)","v":"Sunday"},"vodk'k",{"$nulls":15},false,false,{"$nulls":45},"2022-07-10","","","","","","","","","","","","","","","","","","","","","",""]
[11,{"$f":"IF(AND('Att. Dairy'!B16=\"\"),\"\",'Att. Dairy'!B16)","v":"2022-07-11"},{"v":250.79999999999998,"d":"250.800"},{"v":200,"d":"200.000"},{"$nulls":6},{"v":250.79999999999998,"d":"250.800"},{"v":200,"d":"200.000"},{"$f":"IF(OR('Att. Dairy'!E16=\"\",R16=0,R16=\"\"),\"\",'Att. Dairy'!E16)","v":""},{"$f":"IF(OR('Att. Dairy'!F16=\"\",R16=0,R16=\"\"),\"\",'Att. Dairy'!F16)","v":""},0,{"$f":"IF(AND('Att. Dairy'!K16=\"\"),\"\",'Att. Dairy'!K16)","v":""},{"$f":"IF(AND('Att. Dairy'!L16=\"\"),\"\",'Att. Dairy'!L16)","v":""},0,{"v":0,"d":"0.000"},{"v":0,"d":"0.000"},{"v":250.79999999999998,"d":"250.800"},{"v":200,"d":"200.000"},{"$f":"IFERROR(IF(AND('Att. Dairy'!B16=\"\"),\"\",IF(AND(X16=\"vodk'k\"),\"\",IF(AND(R16=\"\"),\"\",R16*$AA$1))),\"\")","v":{"v":0,"d":"0.00"}},{"$f":"IF(AND('Att. Dairy'!B16=\"\"),\"\",IF(AND(P16=\"\"),\"\",AH16))","v":""},{"$nulls":6},{"$f":"IF(AND('Att. Dairy'!C16=\"\"),\"\",'Att. Dairy'!C16)","v":""},"",{"$f":"IF(AND('Att. Dairy'!D16=\"\"),\"\",'Att. Dairy'!D16)","v":"Monday"},"lCthjksVh",{"$nulls":15},"W","W",{"$nulls":45},"2022-07-11","","","","","","","","","","","","","","","","","","","","","",""]
[12,{"$f":"IF(AND('Att. Dairy'!B17=\"\"),\"\",'Att. Dairy'!B17)","v":"2022-07-12"},{"v":250.79999999999998,"d":"250.800"},{"v":200,"d":"200.000"},{"$nulls":6},{"v":250.79999999999998,"d":"250.800"},{"v":200,"d":"200.000"},{"$f":"IF(OR('Att. Dairy'!E17=\"\",R17=0,R17=\"\"),\"\",'Att. Dairy'!E17)","v":""},{"$f":"IF(OR('Att. Dairy'!F17=\"\",R17=0,R17=\"\"),\"\",'Att. Dairy'!F17)","v":""},0,{"$f":"IF(AND('Att. Dairy'!K17=\"\"),\"\",'Att. Dairy'!K17)","v":""},{"$f":"IF(AND('Att. Dairy'!L17=\"\"),\"\",'Att. Dairy'!L17)","v":""},0,{"v":0,"d":"0.000"},{"v":0,"d":"0.000"},{"v":250.79999999999998,"d":"250.800"},{"v":200,"d":"200.000"},{"$f":"IFERROR(IF(AND('Att. Dairy'!B17=\"\"),\"\",IF(AND(X17=\"vodk'k\"),\"\",IF(AND(R17=\"\"),\"\",R17*$AA$1))),\"\")","v":{"v":0,"d":"0.00"}},{"$f":"IF(AND('Att. Dairy'!B17=\"\"),\"\",IF(AND(P17=\"\"),\"\",AH17))","v":""},{"$nulls":6},{"$f":"IF(AND('Att. Dairy'!C17=\"\"),\"\",'Att. Dairy'!C17)","v":""},"",{"$f":"IF(AND('Att. Dairy'!D17=\"\"),\"\",'Att. Dairy'!D17)","v":"Tuesday"},"nkypkoy",{"$nulls":15},"R","R",{"$nulls":45},"2022-07-12","","","","","","","","","","","","","","","","","","","","","",""]
[13,{"$f":"IF(AND('Att. Dairy'!B18=\"\"),\"\",'Att. Dairy'!B18)","v":"2022-07-13"},{"v":250.79999999999998,"d":"250.800"},{"v":200,"d":"200.000"},{"$nulls":6},{"v":250.79999999999998,"d":"250.800"},{"v":200,"d":"200.000"},{"$f":"IF(OR('Att. Dairy'!E18=\"\",R18=0,R18=\"\"),\"\",'Att. Dairy'!E18)","v":""},{"$f":"IF(OR('Att. Dairy'!F18=\"\",R18=0,R18=\"\"),\"\",'Att. Dairy'!F18)","v":""},0,{"$f":"IF(AND('Att. Dairy'!K18=\"\"),\"\",'Att. Dairy'!K18)","v":""},{"$f":"IF(AND('Att. Dairy'!L18=\"\"),\"\",'Att. Dairy'!L18)","v":""},0,{"v":0,"d":"0.000"},{"v":0,"d":"0.000"},{"v":250.79999999999998,"d":"250.800"},{"v":200,"d":"200.000"},{"$f":"IFERROR(IF(AND('Att. Dairy'!B18=\"\"),\"\",IF(AND(X18=\"vodk'k\"),\"\",IF(AND(R18=\"\"),\"\",R18*$AA$1))),\"\")","v":{"v":0,"d":"0.00"}},{"$f":"IF(AND('Att. Dairy'!B18=\"\"),\"\",IF(AND(P18=\"\"),\"\",AH18))","v":""},{"$nulls":6},{"$f":"IF(AND('Att. Dairy'!C18=\"\"),\"\",'Att. Dairy'!C18)","v":""},"",{"$f":"IF(AND('Att. Dairy'!D18=\"\"),\"\",'Att. Dairy'!D18)","v":"Wednesday"},"nkyjksVh",{"$nulls":15},"W","W",{"$nulls":45},"2022-07-13","","","","","","","","","","","","","","","","","","","","","",""]
[14,{"$f":"IF(AND('Att. Dairy'!B19=\"\"),\"\",'Att. Dairy'!B19)","v":"2022-07-14"},{"v":250.79999999999998,"d":"250.800"},{"v":200,"d":"200.000"},{"$nulls":6},{"v":250.79999999999998,"d":"250.800"},{"v":200,"d":"200.000"},{"$f":"IF(OR('Att. Dairy'!E19=\"\",R19=0,R19=\"\"),\"\",'Att. Dairy'!E19)","v":""},{"$f":"IF(OR('Att. Dairy'!F19=\"\",R19=0,R19=\"\"),\"\",'Att. Dairy'!F19)","v":""},0,{"$f":"IF(AND('Att. Dairy'!K19=\"\"),\"\",'Att. Dairy'!K19)","v":""},{"$f":"IF(AND('Att. Dairy'!L19=\"\"),\"\",'Att. Dairy'!L19)","v":""},0,{"v":0,"d":"0.000"},{"v":0,"d":"0.000"},{"v":250.79999999999998,"d":"250.800"},{"v":200,"d":"200.000"},{"$f":"IFERROR(IF(AND('Att. Dairy'!B19=\"\"),\"\",IF(AND(X19=\"vodk'k\"),\"\",IF(AND(R19=\"\"),\"\",R19*$AA$1))),\"\")","v":{"v":0,"d":"0.00"}},{"$f":"IF(AND('Att. Dairy'!B19=\"\"),\"\",IF(AND(P19=\"\"),\"\",AH19))","v":""},{"$nulls":6},{"$f":"IF(AND('Att. Dairy'!C19=\"\"),\"\",'Att. Dairy'!C19)","v":""},"",{"$f":"IF(AND('Att. Dairy'!D19=\"\"),\"\",'Att. Dairy'!D19)","v":"Thursday"},"f[kpM+h",{"$nulls":15},"R","R",{"$nulls":45},"2022-07-14","","","","","","","","","","","","","","","","","","","","","",""]
[15,{"$f":"IF(AND('Att. Dairy'!B20=\"\"),\"\",'Att. Dairy'!B20)","v":"2022-07-15"},{"v":250.79999999999998,"d":"250.800"},{"v":200,"d":"200.000"},{"$nulls":6},{"v":250.79999999999998,"d":"250.800"},{"v":200,"d":"200.000"},{"$f":"IF(OR('Att. Dairy'!E20=\"\",R20=0,R20=\"\"),\"\",'Att. Dairy'!E20)","v":""},{"$f":"IF(OR('Att. Dairy'!F20=\"\",R20=0,R20=\"\"),\"\",'Att. Dairy'!F20)","v":""},0,{"$f":"IF(AND('Att. Dairy'!K20=\"\"),\"\",'Att. Dairy'!K20)","v":""},{"$f":"IF(AND('Att. Dairy'!L20=\"\"),\"\",'Att. Dairy'!L20)","v":""},0,{"v":0,"d":"0.000"},{"v":0,"d":"0.000"},{"v":250.79999999999998,"d":"250.800"},{"v":200,"d":"200.000"},{"$f":"IFERROR(IF(AND('Att. Dairy'!B20=\"\"),\"\",IF(AND(X20=\"vodk'k\"),\"\",IF(AND(R20=\"\"),\"\",R20*$AA$1))),\"\")","v":{"v":0,"d":"0.00"}},{"$f":"IF(AND('Att. Dairy'!B20=\"\"),\"\",IF(AND(P20=\"\"),\"\",AH20))","v":""},{"$nulls":6},{"$f":"IF(AND('Att. Dairy'!C20=\"\"),\"\",'Att. Dairy'!C20)","v":""},"",{"$f":"IF(AND('Att. Dairy'!D20=\"\"),\"\",'Att. Dairy'!D20)","v":"Friday"},"nkyjksVh",{"$nulls":15},"W","W",{"$nulls":45},"2022-07-15","","","","","","","","","","","","","","","","","","","","","",""]
[16,{"$f":"IF(AND('Att. Dairy'!B21=\"\"),\"\",'Att. Dairy'!B21)","v":"2022-07-16"},{"v":250.79999999999998,"d":"250.800"},{"v":200,"d":"200.000"},{"$nulls":6},{"v":250.79999999999998,"d":"250.800"},{"v":200,"d":"200.000"},{"$f":"IF(OR('Att. Dairy'!E21=\"\",R21=0,R21=\"\"),\"\",'Att. Dairy'!E21)","v":""},{"$f":"IF(OR('Att. Dairy'!F21=\"\",R21=0,R21=\"\"),\"\",'Att. Dairy'!F21)","v":""},0,{"$f":"IF(AND('Att. Dairy'!K21=\"\"),\"\",'Att. Dairy'!K21)","v":""},{"$f":"IF(AND('Att. Dairy'!L21=\"\"),\"\",'Att. Dairy'!L21)","v":""},0,{"v":0,"d":"0.000"},{"v":0,"d":"0.000"},{"v":250.79999999999998,"d":"250.800"},{"v":200,"d":"200.000"},{"$f":"IFERROR(IF(AND('Att. Dairy'!B21=\"\"),\"\",IF(AND(X21=\"vodk'k\"),\"\",IF(AND(R21=\"\"),\"\",R21*$AA$1))),\"\")","v":{"v":0,"d":"0.00"}},{"$f":"IF(AND('Att. Dairy'!B21=\"\"),\"\",IF(AND(P21=\"\"),\"\",AH21))","v":""},{"$nulls":6},{"$f":"IF(AND('Att. Dairy'!C21=\"\"),\"\",'Att. Dairy'!C21)","v":""},"",{"$f":"IF(AND('Att. Dairy'!D21=\"\"),\"\",'Att. Dairy'!D21)","v":"Saturday"},"lCthjksVh",{"$nulls":15},"W","W",{"$nulls":45},"2022-07-16","","","","","","","","","","","","","","","","","","","","","",""]
[17,{"$f":"IF(AND('Att. Dairy'!B22=\"\"),\"\",'Att. Dairy'!B22)","v":"2022-07-17"},{"v":250.79999999999998,"d":"250.800"},{"v":200,"d":"200.000"},{"$nulls":6},{"v":250.79999999999998,"d":"250.800"},{"v":200,"d":"200.000"},{"$f":"IF(OR('Att. Dairy'!E22=\"\",R22=0,R22=\"\"),\"\",'Att. Dairy'!E22)","v":""},{"$f":"IF(OR('Att. Dairy'!F22=\"\",R22=0,R22=\"\"),\"\",'Att. Dairy'!F22)","v":""},0,{"$f":"IF(AND('Att. Dairy'!K22=\"\"),\"\",'Att. Dairy'!K22)","v":""},{"$f":"IF(AND('Att. Dairy'!L22=\"\"),\"\",'Att. Dairy'!L22)","v":""},0,{"v":0,"d":"0.000"},{"v":0,"d":"0.000"},{"v":250.79999999999998,"d":"250.800"},{"v":200,"d":"200.000"},{"$f":"IFERROR(IF(AND('Att. Dairy'!B22=\"\"),\"\",IF(AND(X22=\"vodk'k\"),\"\",IF(AND(R22=\"\"),\"\",R22*$AA$1))),\"\")","v":{"v":0,"d":"0.00"}},{"$f":"IF(AND('Att. Dairy'!B22=\"\"),\"\",IF(AND(P22=\"\"),\"\",AH22))","v":""},{"$nulls":6},{"$f":"IF(AND('Att. Dairy'!C22=\"\"),\"\",'Att. Dairy'!C22)","v":""},"",{"$f":"IF(AND('Att. Dairy'!D22=\"\"),\"\",'Att. Dairy'!D22)","v":"Sunday"},"vodk'k",{"$nulls":15},false,false,{"$nulls":45},"2022-07-17","","","","","","","","","","","","","","","","","","","","","",""]
[18,{"$f":"IF(AND('Att. Dairy'!B23=\"\"),\"\",'Att. Dairy'!B23)","v":"2022-07-18"},{"v":250.79999999999998,"d":"250.800"},{"v":200,"d":"200.000"},{"$nulls":6},{"v":250.79999999999998,"d":"250.800"},{"v":200,"d":"200.000"},{"$f":"IF(OR('Att. Dairy'!E23=\"\",R23=0,R23=\"\"),\"\",'Att. Dairy'!E23)","v":""},{"$f":"IF(OR('Att. Dairy'!F23=\"\",R23=0,R23=\"\"),\"\",'Att. Dairy'!F23)","v":""},0,{"$f":"IF(AND('Att. Dairy'!K23=\"\"),\"\",'Att. Dairy'!K23)","v":""},{"$f":"IF(AND('Att. Dairy'!L23=\"\"),\"\",'Att. Dairy'!L23)","v":""},0,{"v":0,"d":"0.000"},{"v":0,"d":"0.000"},{"v":250.79999999999998,"d":"250.800"},{"v":200,"d":"200.000"},{"$f":"IFERROR(IF(AND('Att. Dairy'!B23=\"\"),\"\",IF(AND(X23=\"vodk'k\"),\"\",IF(AND(R23=\"\"),\"\",R23*$AA$1))),\"\")","v":{"v":0,"d":"0.00"}},{"$f":"IF(AND('Att. Dairy'!B23=\"\"),\"\",IF(AND(P23=\"\"),\"\",AH23))","v":""},{"$nulls":6},{"$f":"IF(AND('Att. Dairy'!C23=\"\"),\"\",'Att. Dairy'!C23)","v":""},"",{"$f":"IF(AND('Att. Dairy'!D23=\"\"),\"\",'Att. Dairy'!D23)","v":"Monday"},"lCthjksVh",{"$nulls":15},"W","W",{"$nulls":45},"2022-07-18","","","","","","","","","","","","","","","","","","","","","",""]
[19,{"$f":"IF(AND('Att. Dairy'!B24=\"\"),\"\",'Att. Dairy'!B24)","v":"2022-07-19"},{"v":250.79999999999998,"d":"250.800"},{"v":200,"d":"200.000"},{"$nulls":6},{"v":250.79999999999998,"d":"250.800"},{"v":200,"d":"200.000"},{"$f":"IF(OR('Att. Dairy'!E24=\"\",R24=0,R24=\"\"),\"\",'Att. Dairy'!E24)","v":""},{"$f":"IF(OR('Att. Dairy'!F24=\"\",R24=0,R24=\"\"),\"\",'Att. Dairy'!F24)","v":""},0,{"$f":"IF(AND('Att. Dairy'!K24=\"\"),\"\",'Att. Dairy'!K24)","v":""},{"$f":"IF(AND('Att. Dairy'!L24=\"\"),\"\",'Att. Dairy'!L24)","v":""},0,{"v":0,"d":"0.000"},{"v":0,"d":"0.000"},{"v":250.79999999999998,"d":"250.800"},{"v":200,"d":"200.000"},{"$f":"IFERROR(IF(AND('Att. Dairy'!B24=\"\"),\"\",IF(AND(X24=\"vodk'k\"),\"\",IF(AND(R24=\"\"),\"\",R24*$AA$1))),\"\")","v":{"v":0,"d":"0.00"}},{"$f":"IF(AND('Att. Dairy'!B24=\"\"),\"\",IF(AND(P24=\"\"),\"\",AH24))","v":""},{"$nulls":6},{"$f":"IF(AND('Att. Dairy'!C24=\"\"),\"\",'Att. Dairy'!C24)","v":""},"",{"$f":"IF(AND('Att. Dairy'!D24=\"\"),\"\",'Att. Dairy'!D24)","v":"Tuesday"},"nkypkoy",{"$nulls":15},"R","R",{"$nulls":45},"2022-07-19","","","","","","","","","","","","","","","","","","","","","",""]
[20,{"$f":"IF(AND('Att. Dairy'!B25=\"\"),\"\",'Att. Dairy'!B25)","v":"2022-07-20"},{"v":250.79999999999998,"d":"250.800"},{"v":200,"d":"200.000"},{"$nulls":6},{"v":250.79999999999998,"d":"250.800"},{"v":200,"d":"200.000"},{"$f":"IF(OR('Att. Dairy'!E25=\"\",R25=0,R25=\"\"),\"\",'Att. Dairy'!E25)","v":""},{"$f":"IF(OR('Att. Dairy'!F25=\"\",R25=0,R25=\"\"),\"\",'Att. Dairy'!F25)","v":""},0,{"$f":"IF(AND('Att. Dairy'!K25=\"\"),\"\",'Att. Dairy'!K25)","v":""},{"$f":"IF(AND('Att. Dairy'!L25=\"\"),\"\",'Att. Dairy'!L25)","v":""},0,{"v":0,"d":"0.000"},{"v":0,"d":"0.000"},{"v":250.79999999999998,"d":"250.800"},{"v":200,"d":"200.000"},{"$f":"IFERROR(IF(AND('Att. Dairy'!B25=\"\"),\"\",IF(AND(X25=\"vodk'k\"),\"\",IF(AND(R25=\"\"),\"\",R25*$AA$1))),\"\")","v":{"v":0,"d":"0.00"}},{"$f":"IF(AND('Att. Dairy'!B25=\"\"),\"\",IF(AND(P25=\"\"),\"\",AH25))","v":""},{"$nulls":6},{"$f":"IF(AND('Att. Dairy'!C25=\"\"),\"\",'Att. Dairy'!C25)","v":""},"",{"$f":"IF(AND('Att. Dairy'!D25=\"\"),\"\",'Att. Dairy'!D25)","v":"Wednesday"},"nkyjksVh",{"$nulls":15},"W","W",{"$nulls":45},"2022-07-20","","","","","","","","","","","","","","","","","","","","","",""]
[21,{"$f":"IF(AND('Att. Dairy'!B26=\"\"),\"\",'Att. Dairy'!B26)","v":"2022-07-21"},{"v":250.79999999999998,"d":"250.800"},{"v":200,"d":"200.000"},{"$nulls":6},{"v":250.79999999999998,"d":"250.800"},{"v":200,"d":"200.000"},{"$f":"IF(OR('Att. Dairy'!E26=\"\",R26=0,R26=\"\"),\"\",'Att. Dairy'!E26)","v":""},{"$f":"IF(OR('Att. Dairy'!F26=\"\",R26=0,R26=\"\"),\"\",'Att. Dairy'!F26)","v":""},0,{"$f":"IF(AND('Att. Dairy'!K26=\"\"),\"\",'Att. Dairy'!K26)","v":""},{"$f":"IF(AND('Att. Dairy'!L26=\"\"),\"\",'Att. Dairy'!L26)","v":""},0,{"v":0,"d":"0.000"},{"v":0,"d":"0.000"},{"v":250.79999999999998,"d":"250.800"},{"v":200,"d":"200.000"},{"$f":"IFERROR(IF(AND('Att. Dairy'!B26=\"\"),\"\",IF(AND(X26=\"vodk'k\"),\"\",IF(AND(R26=\"\"),\"\",R26*$AA$1))),\"\")","v":{"v":0,"d":"0.00"}},{"$f":"IF(AND('Att. Dairy'!B26=\"\"),\"\",IF(AND(P26=\"\"),\"\",AH26))","v":""},{"$nulls":6},{"$f":"IF(AND('Att. Dairy'!C26=\"\"),\"\",'Att. Dairy'!C26)","v":""},"",{"$f":"IF(AND('Att. Dairy'!D26=\"\"),\"\",'Att. Dairy'!D26)","v":"Thursday"},"f[kpM+h",{"$nulls":15},"R","R",{"$nulls":45},"2022-07-21","","","","","","","","","","","","","","","","","","","","","",""]
[22,{"$f":"IF(AND('Att. Dairy'!B27=\"\"),\"\",'Att. Dairy'!B27)","v":"2022-07-22"},{"v":250.79999999999998,"d":"250.800"},{"v":200,"d":"200.000"},{"$nulls":6},{"v":250.79999999999998,"d":"250.800"},{"v":200,"d":"200.000"},{"$f":"IF(OR('Att. Dairy'!E27=\"\",R27=0,R27=\"\"),\"\",'Att. Dairy'!E27)","v":""},{"$f":"IF(OR('Att. Dairy'!F27=\"\",R27=0,R27=\"\"),\"\",'Att. Dairy'!F27)","v":""},0,{"$f":"IF(AND('Att. Dairy'!K27=\"\"),\"\",'Att. Dairy'!K27)","v":""},{"$f":"IF(AND('Att. Dairy'!L27=\"\"),\"\",'Att. Dairy'!L27)","v":""},0,{"v":0,"d":"0.000"},{"v":0,"d":"0.000"},{"v":250.79999999999998,"d":"250.800"},{"v":200,"d":"200.000"},{"$f":"IFERROR(IF(AND('Att. Dairy'!B27=\"\"),\"\",IF(AND(X27=\"vodk'k\"),\"\",IF(AND(R27=\"\"),\"\",R27*$AA$1))),\"\")","v":{"v":0,"d":"0.00"}},{"$f":"IF(AND('Att. Dairy'!B27=\"\"),\"\",IF(AND(P27=\"\"),\"\",AH27))","v":""},{"$nulls":6},{"$f":"IF(AND('Att. Dairy'!C27=\"\"),\"\",'Att. Dairy'!C27)","v":""},"",{"$f":"IF(AND('Att. Dairy'!D27=\"\"),\"\",'Att. Dairy'!D27)","v":"Friday"},"nkyjksVh",{"$nulls":15},"W","W",{"$nulls":45},"2022-07-22","","","","","","","","","","","","","","","","","","","","","",""]
[23,{"$f":"IF(AND('Att. Dairy'!B28=\"\"),\"\",'Att. Dairy'!B28)","v":"2022-07-23"},{"v":250.79999999999998,"d":"250.800"},{"v":200,"d":"200.000"},{"$nulls":6},{"v":250.79999999999998,"d":"250.800"},{"v":200,"d":"200.000"},{"$f":"IF(OR('Att. Dairy'!E28=\"\",R28=0,R28=\"\"),\"\",'Att. Dairy'!E28)","v":""},{"$f":"IF(OR('Att. Dairy'!F28=\"\",R28=0,R28=\"\"),\"\",'Att. Dairy'!F28)","v":""},0,{"$f":"IF(AND('Att. Dairy'!K28=\"\"),\"\",'Att. Dairy'!K28)","v":""},{"$f":"IF(AND('Att. Dairy'!L28=\"\"),\"\",'Att. Dairy'!L28)","v":""},0,{"v":0,"d":"0.000"},{"v":0,"d":"0.000"},{"v":250.79999999999998,"d":"250.800"},{"v":200,"d":"200.000"},{"$f":"IFERROR(IF(AND('Att. Dairy'!B28=\"\"),\"\",IF(AND(X28=\"vodk'k\"),\"\",IF(AND(R28=\"\"),\"\",R28*$AA$1))),\"\")","v":{"v":0,"d":"0.00"}},{"$f":"IF(AND('Att. Dairy'!B28=\"\"),\"\",IF(AND(P28=\"\"),\"\",AH28))","v":""},{"$nulls":6},{"$f":"IF(AND('Att. Dairy'!C28=\"\"),\"\",'Att. Dairy'!C28)","v":""},"",{"$f":"IF(AND('Att. Dairy'!D28=\"\"),\"\",'Att. Dairy'!D28)","v":"Saturday"},"lCthjksVh",{"$nulls":15},"W","W",{"$nulls":45},"2022-07-23","","","","","","","","","","","","","","","","","","","","","",""]
[24,{"$f":"IF(AND('Att. Dairy'!B29=\"\"),\"\",'Att. Dairy'!B29)","v":"2022-07-24"},{"v":250.79999999999998,"d":"250.800"},{"v":200,"d":"200.000"},{"$nulls":6},{"v":250.79999999999998,"d":"250.800"},{"v":200,"d":"200.000"},{"$f":"IF(OR('Att. Dairy'!E29=\"\",R29=0,R29=\"\"),\"\",'Att. Dairy'!E29)","v":""},{"$f":"IF(OR('Att. Dairy'!F29=\"\",R29=0,R29=\"\"),\"\",'Att. Dairy'!F29)","v":""},0,{"$f":"IF(AND('Att. Dairy'!K29=\"\"),\"\",'Att. Dairy'!K29)","v":""},{"$f":"IF(AND('Att. Dairy'!L29=\"\"),\"\",'Att. Dairy'!L29)","v":""},0,{"v":0,"d":"0.000"},{"v":0,"d":"0.000"},{"v":250.79999999999998,"d":"250.800"},{"v":200,"d":"200.000"},{"$f":"IFERROR(IF(AND('Att. Dairy'!B29=\"\"),\"\",IF(AND(X29=\"vodk'k\"),\"\",IF(AND(R29=\"\"),\"\",R29*$AA$1))),\"\")","v":{"v":0,"d":"0.00"}},{"$f":"IF(AND('Att. Dairy'!B29=\"\"),\"\",IF(AND(P29=\"\"),\"\",AH29))","v":""},{"$nulls":6},{"$f":"IF(AND('Att. Dairy'!C29=\"\"),\"\",'Att. Dairy'!C29)","v":""},"",{"$f":"IF(AND('Att. Dairy'!D29=\"\"),\"\",'Att. Dairy'!D29)","v":"Sunday"},"vodk'k",{"$nulls":15},false,false,{"$nulls":45},"2022-07-24","","","","","","","","","","","","","","","","","","","","","",""]
[25,{"$f":"IF(AND('Att. Dairy'!B30=\"\"),\"\",'Att. Dairy'!B30)","v":"2022-07-25"},{"v":250.79999999999998,"d":"250.800"},{"v":200,"d":"200.000"},{"$nulls":6},{"v":250.79999999999998,"d":"250.800"},{"v":200,"d":"200.000"},{"$f":"IF(OR('Att. Dairy'!E30=\"\",R30=0,R30=\"\"),\"\",'Att. Dairy'!E30)","v":""},{"$f":"IF(OR('Att. Dairy'!F30=\"\",R30=0,R30=\"\"),\"\",'Att. Dairy'!F30)","v":""},0,{"$f":"IF(AND('Att. Dairy'!K30=\"\"),\"\",'Att. Dairy'!K30)","v":""},{"$f":"IF(AND('Att. Dairy'!L30=\"\"),\"\",'Att. Dairy'!L30)","v":""},0,{"v":0,"d":"0.000"},{"v":0,"d":"0.000"},{"v":250.79999999999998,"d":"250.800"},{"v":200,"d":"200.000"},{"$f":"IFERROR(IF(AND('Att. Dairy'!B30=\"\"),\"\",IF(AND(X30=\"vodk'k\"),\"\",IF(AND(R30=\"\"),\"\",R30*$AA$1))),\"\")","v":{"v":0,"d":"0.00"}},{"$f":"IF(AND('Att. Dairy'!B30=\"\"),\"\",IF(AND(P30=\"\"),\"\",AH30))","v":""},{"$nulls":6},{"$f":"IF(AND('Att. Dairy'!C30=\"\"),\"\",'Att. Dairy'!C30)","v":""},"",{"$f":"IF(AND('Att. Dairy'!D30=\"\"),\"\",'Att. Dairy'!D30)","v":"Monday"},"lCthjksVh",{"$nulls":15},"W","W",{"$nulls":45},"2022-07-25","","","","","","","","","","","","","","","","","","","","","",""]
[26,{"$f":"IF(AND('Att. Dairy'!B31=\"\"),\"\",'Att. Dairy'!B31)","v":"2022-07-26"},{"v":250.79999999999998,"d":"250.800"},{"v":200,"d":"200.000"},{"$nulls":6},{"v":250.79999999999998,"d":"250.800"},{"v":200,"d":"200.000"},{"$f":"IF(OR('Att. Dairy'!E31=\"\",R31=0,R31=\"\"),\"\",'Att. Dairy'!E31)","v":""},{"$f":"IF(OR('Att. Dairy'!F31=\"\",R31=0,R31=\"\"),\"\",'Att. Dairy'!F31)","v":""},0,{"$f":"IF(AND('Att. Dairy'!K31=\"\"),\"\",'Att. Dairy'!K31)","v":""},{"$f":"IF(AND('Att. Dairy'!L31=\"\"),\"\",'Att. Dairy'!L31)","v":""},0,{"v":0,"d":"0.000"},{"v":0,"d":"0.000"},{"v":250.79999999999998,"d":"250.800"},{"v":200,"d":"200.000"},{"$f":"IFERROR(IF(AND('Att. Dairy'!B31=\"\"),\"\",IF(AND(X31=\"vodk'k\"),\"\",IF(AND(R31=\"\"),\"\",R31*$AA$1))),\"\")","v":{"v":0,"d":"0.00"}},{"$f":"IF(AND('Att. Dairy'!B31=\"\"),\"\",IF(AND(P31=\"\"),\"\",AH31))","v":""},{"$nulls":6},{"$f":"IF(AND('Att. Dairy'!C31=\"\"),\"\",'Att. Dairy'!C31)","v":""},"",{"$f":"IF(AND('Att. Dairy'!D31=\"\"),\"\",'Att. Dairy'!D31)","v":"Tuesday"},"nkypkoy",{"$nulls":15},"R","R",{"$nulls":45},"2022-07-26","","","","","","","","","","","","","","","","","","","","","",""]
[27,{"$f":"IF(AND('Att. Dairy'!B32=\"\"),\"\",'Att. Dairy'!B32)","v":"2022-07-27"},{"v":250.79999999999998,"d":"250.800"},{"v":200,"d":"200.000"},{"$nulls":6},{"v":250.79999999999998,"d":"250.800"},{"v":200,"d":"200.000"},{"$f":"IF(OR('Att. Dairy'!E32=\"\",R32=0,R32=\"\"),\"\",'Att. Dairy'!E32)","v":""},{"$f":"IF(OR('Att. Dairy'!F32=\"\",R32=0,R32=\"\"),\"\",'Att. Dairy'!F32)","v":""},0,{"$f":"IF(AND('Att. Dairy'!K32=\"\"),\"\",'Att. Dairy'!K32)","v":""},{"$f":"IF(AND('Att. Dairy'!L32=\"\"),\"\",'Att. Dairy'!L32)","v":""},0,{"v":0,"d":"0.000"},{"v":0,"d":"0.000"},{"v":250.79999999999998,"d":"250.800"},{"v":200,"d":"200.000"},{"$f":"IFERROR(IF(AND('Att. Dairy'!B32=\"\"),\"\",IF(AND(X32=\"vodk'k\"),\"\",IF(AND(R32=\"\"),\"\",R32*$AA$1))),\"\")","v":{"v":0,"d":"0.00"}},{"$f":"IF(AND('Att. Dairy'!B32=\"\"),\"\",IF(AND(P32=\"\"),\"\",AH32))","v":""},{"$nulls":6},{"$f":"IF(AND('Att. Dairy'!C32=\"\"),\"\",'Att. Dairy'!C32)","v":""},"",{"$f":"IF(AND('Att. Dairy'!D32=\"\"),\"\",'Att. Dairy'!D32)","v":"Wednesday"},"nkyjksVh",{"$nulls":15},"W","W",{"$nulls":45},"2022-07-27","","","","","","","","","","","","","","","","","","","","","",""]
[28,{"$f":"IF(AND('Att. Dairy'!B33=\"\"),\"\",'Att. Dairy'!B33)","v":"2022-07-28"},{"v":250.79999999999998,"d":"250.800"},{"v":200,"d":"200.000"},{"$nulls":6},{"v":250.79999999999998,"d":"250.800"},{"v":200,"d":"200.000"},{"$f":"IF(OR('Att. Dairy'!E33=\"\",R33=0,R33=\"\"),\"\",'Att. Dairy'!E33)","v":""},{"$f":"IF(OR('Att. Dairy'!F33=\"\",R33=0,R33=\"\"),\"\",'Att. Dairy'!F33)","v":""},0,{"$f":"IF(AND('Att. Dairy'!K33=\"\"),\"\",'Att. Dairy'!K33)","v":""},{"$f":"IF(AND('Att. Dairy'!L33=\"\"),\"\",'Att. Dairy'!L33)","v":""},0,{"v":0,"d":"0.000"},{"v":0,"d":"0.000"},{"v":250.79999999999998,"d":"250.800"},{"v":200,"d":"200.000"},{"$f":"IFERROR(IF(AND('Att. Dairy'!B33=\"\"),\"\",IF(AND(X33=\"vodk'k\"),\"\",IF(AND(R33=\"\"),\"\",R33*$AA$1))),\"\")","v":{"v":0,"d":"0.00"}},{"$f":"IF(AND('Att. Dairy'!B33=\"\"),\"\",IF(AND(P33=\"\"),\"\",AH33))","v":""},{"$nulls":6},{"$f":"IF(AND('Att. Dairy'!C33=\"\"),\"\",'Att. Dairy'!C33)","v":""},"",{"$f":"IF(AND('Att. Dairy'!D33=\"\"),\"\",'Att. Dairy'!D33)","v":"Thursday"},"f[kpM+h",{"$nulls":15},"R","R",{"$nulls":45},"2022-07-28","","","","","","","","","","","","","","","","","","","","","",""]
[29,{"$f":"IF(AND('Att. Dairy'!B34=\"\"),\"\",'Att. Dairy'!B34)","v":"2022-07-29"},{"v":250.79999999999998,"d":"250.800"},{"v":200,"d":"200.000"},{"$nulls":6},{"v":250.79999999999998,"d":"250.800"},{"v":200,"d":"200.000"},{"$f":"IF(OR('Att. Dairy'!E34=\"\",R34=0,R34=\"\"),\"\",'Att. Dairy'!E34)","v":""},{"$f":"IF(OR('Att. Dairy'!F34=\"\",R34=0,R34=\"\"),\"\",'Att. Dairy'!F34)","v":""},0,{"$f":"IF(AND('Att. Dairy'!K34=\"\"),\"\",'Att. Dairy'!K34)","v":""},{"$f":"IF(AND('Att. Dairy'!L34=\"\"),\"\",'Att. Dairy'!L34)","v":""},0,{"v":0,"d":"0.000"},{"v":0,"d":"0.000"},{"v":250.79999999999998,"d":"250.800"},{"v":200,"d":"200.000"},{"$f":"IFERROR(IF(AND('Att. Dairy'!B34=\"\"),\"\",IF(AND(X34=\"vodk'k\"),\"\",IF(AND(R34=\"\"),\"\",R34*$AA$1))),\"\")","v":{"v":0,"d":"0.00"}},{"$f":"IF(AND('Att. Dairy'!B34=\"\"),\"\",IF(AND(P34=\"\"),\"\",AH34))","v":""},{"$nulls":6},{"$f":"IF(AND('Att. Dairy'!C34=\"\"),\"\",'Att. Dairy'!C34)","v":""},"",{"$f":"IF(AND('Att. Dairy'!D34=\"\"),\"\",'Att. Dairy'!D34)","v":"Friday"},"nkyjksVh",{"$nulls":15},"W","W",{"$nulls":45},"2022-07-29","","","","","","","","","","","","","","","","","","","","","",""]
[30,{"$f":"IF(AND('Att. Dairy'!B35=\"\"),\"\",'Att. Dairy'!B35)","v":"2022-07-30"},{"v":250.79999999999998,"d":"250.800"},{"v":200,"d":"200.000"},{"$nulls":6},{"v":250.79999999999998,"d":"250.800"},{"v":200,"d":"200.000"},{"$f":"IF(OR('Att. Dairy'!E35=\"\",R35=0,R35=\"\"),\"\",'Att. Dairy'!E35)","v":""},{"$f":"IF(OR('Att. Dairy'!F35=\"\",R35=0,R35=\"\"),\"\",'Att. Dairy'!F35)","v":""},0,{"$f":"IF(AND('Att. Dairy'!K35=\"\"),\"\",'Att. Dairy'!K35)","v":""},{"$f":"IF(AND('Att. Dairy'!L35=\"\"),\"\",'Att. Dairy'!L35)","v":""},0,{"v":0,"d":"0.000"},{"v":0,"d":"0.000"},{"v":250.79999999999998,"d":"250.800"},{"v":200,"d":"200.000"},{"$f":"IFERROR(IF(AND('Att. Dairy'!B35=\"\"),\"\",IF(AND(X35=\"vodk'k\"),\"\",IF(AND(R35=\"\"),\"\",R35*$AA$1))),\"\")","v":{"v":0,"d":"0.00"}},{"$f":"IF(AND('Att. Dairy'!B35=\"\"),\"\",IF(AND(P35=\"\"),\"\",AH35))","v":""},{"$nulls":6},{"$f":"IF(AND('Att. Dairy'!C35=\"\"),\"\",'Att. Dairy'!C35)","v":""},"",{"$f":"IF(AND('Att. Dairy'!D35=\"\"),\"\",'Att. Dairy'!D35)","v":"Saturday"},"lCthjksVh",{"$nulls":15},"W","W",{"$nulls":45},"2022-07-30","","","","","","","","","","","","","","","","","","","","","",""]
[31,{"$f":"IF(AND('Att. Dairy'!B36=\"\"),\"\",'Att. Dairy'!B36)","v":"2022-07-31"},{"v":250.79999999999998,"d":"250.800"},{"v":200,"d":"200.000"},{"$nulls":6},{"v":250.79999999999998,"d":"250.800"},{"v":200,"d":"200.000"},{"$f":"IF(OR('Att. Dairy'!E36=\"\",R36=0,R36=\"\"),\"\",'Att. Dairy'!E36)","v":""},{"$f":"IF(OR('Att. Dairy'!F36=\"\",R36=0,R36=\"\"),\"\",'Att. Dairy'!F36)","v":""},0,{"$f":"IF(AND('Att. Dairy'!K36=\"\"),\"\",'Att. Dairy'!K36)","v":""},{"$f":"IF(AND('Att. Dairy'!L36=\"\"),\"\",'Att. Dairy'!L36)","v":""},0,{"v":0,"d":"0.000"},{"v":0,"d":"0.000"},{"v":250.79999999999998,"d":"250.800"},{"v":200,"d":"200.000"},{"$f":"IFERROR(IF(AND('Att. Dairy'!B36=\"\"),\"\",IF(AND(X36=\"vodk'k\"),\"\",IF(AND(R36=\"\"),\"\",R36*$AA$1))),\"\")","v":{"v":0,"d":"0.00"}},{"$f":"IF(AND('Att. Dairy'!B36=\"\"),\"\",IF(AND(P36=\"\"),\"\",AH36))","v":""},{"$nulls":6},{"$f":"IF(AND('Att. Dairy'!C36=\"\"),\"\",'Att. Dairy'!C36)","v":""},"",{"$f":"IF(AND('Att. Dairy'!D36=\"\"),\"\",'Att. Dairy'!D36)","v":"Sunday"},"vodk'k",{"$nulls":15},false,false,{"$nulls":45},"2022-07-31","","","","","","","","","","","","","","","","","","","","","",""]
[null,null,"dqy",null,{"$f":"SUM(E6:E36)","v":{"v":0,"d":"0.000"}},{"$f":"SUM(F6:F36)","v":{"v":0,"d":"0.000"}},{"$f":"SUM(G6:G36)","v":{"v":0,"d":"0.000"}},{"$f":"SUM(H6:H36)","v":{"v":0,"d":"0.000"}},{"v":0,"d":"0.000"},{"v":0,"d":"0.000"},null,null,{"$f":"SUM(M6:M36)","v":246},{"$f":"SUM(N6:N36)","v":247},493,246,246,492,{"$f":"SUM(S6:S36)","v":{"v":49.2,"d":"49.200"}},{"$f":"SUM(T6:T36)","v":{"v":0,"d":"0.000"}},null,null,{"$f":"SUM(W6:W36)","v":2445.24},{"$nulls":7},{"$f":"IF(AND('Att. Dairy'!C37=\"\"),\"\",'Att. Dairy'!C37)","v":"Total "},false,{"$f":"IF(AND('Att. Dairy'!D37=\"\"),\"\",'Att. Dairy'!D37)","v":""},{"$nulls":16},"",false,{"$nulls":48},{"$f":"SUM(CV6:CV36)","v":{"v":0,"d":"0.00"}},{"$f":"SUM(CW6:CW36)","v":{"v":0,"d":"0.00"}},{"v":0,"d":"0.00"},{"v":0,"d":"0.00"},{"$f":"SUM(CZ6:CZ36)","v":{"v":0,"d":"0.00"}},{"$f":"SUM(DA6:DA36)","v":{"v":0,"d":"0.00"}},null,null,{"$f":"SUM(DD6:DD36)","v":246},{"$f":"SUM(DE6:DE36)","v":247},null,246,246,null,{"$f":"SUM(DJ6:DJ36)","v":{"v":49.2,"d":"49.200"}},{"$f":"SUM(DK6:DK36)","v":{"v":0,"d":"0.000"}},null,null,{"$f":"SUM(DN6:DN36)","v":2445.24}]
[{"$nulls":19},{"$f":"S37+T37","v":{"v":49.2,"d":"49.200"}},null,null,{"$f":"SUM(#REF!)","v":{"$error":"#REF!"}},{"$nulls":7},{"$f":"IF(AND('Att. Dairy'!C38=\"\"),\"\",'Att. Dairy'!C38)","v":""},"",{"$nulls":16},{"v":0,"d":"0.000"},"",""]
[{"$nulls":8},{"$f":"G37+I37","v":{"v":0,"d":"0.000"}},{"$f":"H37+J37","v":{"v":0,"d":"0.000"}},{"$nulls":12},{"$f":"#REF!","v":{"$error":"#REF!"}},{"$nulls":7},{"$f":"IF(AND('Att. Dairy'!C39=\"\"),\"\",'Att. Dairy'!C39)","v":""},"",{"$nulls":16},0,"",""]
[{"$nulls":8},{"v":0,"d":"0.000"},{"v":0,"d":"0.000"},{"$nulls":12},{"$f":"SUM(W39-W37+W38)","v":{"$error":"#REF!"}},{"$nulls":7},{"$f":"IF(AND('Att. Dairy'!C40=\"\"),\"\",'Att. Dairy'!C40)","v":""},"",{"$nulls":16},{"v":0,"d":"0.00"},"",""]
[{"$nulls":30},{"$f":"IF(AND('Att. Dairy'!#REF!=\"\"),\"\",'Att. Dairy'!#REF!)","v":{"$error":"#REF!"}},{"$error":"#REF!"},{"$nulls":17},"",{"$error":"#REF!"}]
[{"$nulls":30},{"$f":"IF(AND('Att. Dairy'!#REF!=\"\"),\"\",'Att. Dairy'!#REF!)","v":{"$error":"#REF!"}},{"$error":"#REF!"},{"$nulls":17},"",{"$error":"#REF!"}]
[{"$nulls":18},"ekg esa çkIr dqy jkf'k",{"$nulls":11},{"$f":"IF(AND('Att. Dairy'!#REF!=\"\"),\"\",'Att. Dairy'!#REF!)","v":{"$error":"#REF!"}},{"$error":"#REF!"},{"$nulls":17},"",{"$error":"#REF!"}]
[{"$nulls":18},"ekg esa O;; dqy jkf'k",{"$nulls":11},{"$f":"IF(AND('Att. Dairy'!#REF!=\"\"),\"\",'Att. Dairy'!#REF!)","v":{"$error":"#REF!"}},{"$error":"#REF!"},{"$nulls":17},"",{"$f":"IF(AND(AU44=\"\"),AX44,AV44)","v":""}]
[{"$nulls":18},"ekg esa 'ks\"k jkf'k",{"$nulls":11},{"$f":"IF(AND('Att. Dairy'!C41=\"\"),\"\",'Att. Dairy'!C41)","v":""}]
[{"$nulls":18},"ekg esa ykHkfUor fo|kFkhZ",{"$nulls":11},{"$f":"IF(AND('Att. Dairy'!C42=\"\"),\"\",'Att. Dairy'!C42)","v":""}]
[{"$nulls":30},{"$f":"IF(AND('Att. Dairy'!C43=\"\"),\"\",'Att. Dairy'!C43)","v":""}]
[{"$nulls":30},{"$f":"IF(AND('Att. Dairy'!C44=\"\"),\"\",'Att. Dairy'!C44)","v":""}]

{"sheet":"UPS balance Sheet","index":5,"n_rows":48,"n_cols":119,"rows_kept":48,"merged":[[0,1,0,3],[0,4,0,10],[0,15,0,17],[1,1,4,1],[1,2,3,3],[1,4,3,5],[1,6,2,7],[1,8,2,9],[1,10,3,11],[1,12,3,14],[1,15,3,17],[1,18,3,19],[1,20,3,21],[1,22,4,22],[1,23,4,23],[1,96,4,96],[1,97,3,98],[1,99,3,100],[1,101,3,102],[1,103,3,104],[1,105,3,106],[1,107,3,109],[1,110,3,112],[1,113,3,114],[1,115,3,116],[1,117,4,117],[1,118,4,118],[3,6,3,7],[3,8,3,9],[36,2,36,3],[36,97,36,98],[42,18,42,19],[43,18,43,19],[44,18,44,19],[45,18,45,19]]}
[null,"Presented By:-",null,null,"Mr. HeeraLaL Jat Sojat (PALI)   ",{"$nulls":10},{"$f":"CONCATENATE('MASTER DATA'!I4, 'MASTER DATA'!J4)","v":"ekg %&tqykbZ&2022"},{"$nulls":10},{"$f":"'MASTER DATA'!C31","v":7.45},null,{"$f":"AC7=IF(AND('MASTER DATA'!C18=\"Rural\"),'MASTER DATA'!I31,'MASTER DATA'!I30)","v":true}]
[null,"fnukad","çkjfEHkd [kk|ku o  nky  dh  ek=k fdyks xzke esa ",null,"forj.k drkZ ls çkIr [kk|ku fdyks xzke esa",null,"vU;= lzksr ls m/kkj  fy;k@fn;k¼fdxzk½",null,"vU; fo|ky; ls m/kkj fy;k@fn;k¼fdxzk½",null,"dqy [kk|ku",null,"  dqy ukekadu d{kk 6 ls 8",null,null,"dqy ykHkkfUor Nk=@Nk=k      \n d{kk 6 ls 8",null,null,"ekg esa mi;ksx fy;k x;k izfrfnu [kk|ku",null," 'ks\"k [kk|ku ",null,"ekg esa izfrfnu dUotZu ij O;; jkf'k","feuw ds vuqlkj Hkkstu",{"$nulls":72},"fnukad","çkjfEHkd [kk|ku dh  ek=k fdyks xzke esa ",null,"forj.k drkZ ls çkIr [kk|ku fdyks xzke esa",null,"vU;= lzksr ls m/kkj  fy;k@fn;k¼fdxzk½",null,"vU;= fo|ky; ls m/kkj  fy;k@fn;k¼fdxzk½",null,"dqy [kk|ku ",null,"dqy ukekadu \nd{kk 1 ls 5",null,null,"dqy ykHkkfUor Nk=@Nk=k       \nd{kk 1 ls 5",null,null,"ekg esa mi;ksx fy;k x;k izfrfnu [kk|ku",null," 'ks\"k [kk|ku",null,"ekg esa izfrfnu dUotZu ij O;; jkf'k","feuw ds vuqlkj Hkkstu"]
[]
[{"$nulls":6},"m/kkj nsus ij¼&½fpUg yxk,",null,"m/kkj nsus ij¼&½fpUg yxk,"]
["Sr.",null,"xsagw","pkoy","xsagw","pkoy","xsagw","pkoy","xsagw","pkoy","xsagw","pkoy","Nk=","Nk=k","dqy","Nk=","Nk=k","dqy","xsagw","pkoy","xsagw","pkoy",{"$nulls":9},"Wheat/Rice",{"$nulls":17},"Wheat/Rice","Wheat/Rice",{"$nulls":46},"xsagw","pkoy","xsagw","pkoy","xsagw","pkoy","xsagw","pkoy","xsagw","pkoy","Nk=","Nk=k",";ksx","Nk=","Nk=k",";ksx","xsagw","pkoy","xsagw","pkoy"]
[1,{"$f":"IF(AND('Att. Dairy'!B6=\"\"),\"\",'Att. Dairy'!B6)","v":"2022-07-01"},{"$f":"'Prarmbhik Shesh'!F7","v":{"v":250,"d":"250.000"}},{"$f":"'Prarmbhik Shesh'!F8","v":{"v":150,"d":"150.000"}},{"$nulls":6},{"$f":"IFERROR(IF(AND(C6=\"\"),\"\",SUM(C6,E6,G6,I6)),\"\")","v":{"v":250,"d":"250.000"}},{"$f":"IFERROR(IF(AND(D6=\"\"),\"\",SUM(D6,F6,H6,J6)),\"\")","v":{"v":150,"d":"150.000"}},{"$f":"IF(OR('Att. Dairy'!H6=\"\",R6=0,R6=\"\"),\"\",'Att. Dairy'!H6)","v":90},{"$f":"IF(OR('Att. Dairy'!I6=\"\",R6=0,R6=\"\"),\"\",'Att. Dairy'!I6)","v":110},{"$f":"SUM(M6,N6)","v":200},{"$f":"IF(AND('Att. Dairy'!N6=\"\"),\"\",'Att. Dairy'!N6)","v":90},{"$f":"IF(AND('Att. Dairy'!O6=\"\"),\"\",'Att. Dairy'!O6)","v":109},{"$f":"SUM(P6,Q6)","v":199},{"$f":"IF(AND(R6=\"\"),0,IF(AND(AY6=\"w\"),R6*150/1000,0))","v":{"v":29.85,"d":"29.850"}},{"$f":"IF(AND(R6=\"\"),0,IF(AND(AY6=\"R\"),R6*150/1000,0))","v":{"v":0,"d":"0.000"}},{"$f":"SUM(K6-S6)","v":{"v":220.15,"d":"220.150"}},{"$f":"(L6-T6)","v":{"v":150,"d":"150.000"}},{"$f":"IFERROR(IF(AND('Att. Dairy'!B6=\"\"),\"\",IF(AND(X6=\"vodk'k\"),\"\",IF(AND(R6=\"\"),\"\",R6*$AA$1))),\"\")","v":1482.55},{"$f":"IF(AND('Att. Dairy'!B6=\"\"),\"\",IF(AND(P6=\"\"),\"\",AH6))","v":"nkyjksVh"},{"$nulls":6},{"$f":"IF(AND('Att. Dairy'!C6=\"\"),\"\",'Att. Dairy'!C6)","v":""},{"$f":"IF(AND(AE6=\"\"),\"\",IF(AE6=\"Rice\",\"R\",IF(AE6=\"Wheat\",\"W\")))","v":""},{"$f":"IF(AND('Att. Dairy'!D6=\"\"),\"\",'Att. Dairy'!D6)","v":"Friday"},{"$f":"IF(OR(AG6=0,AG6=\"\"),\"\",IF(AG6=\"tuesday\",\"nkypkoy\",IF(AG6=\"thursday\",\"f[kpM+h\",IF(OR(AG6=\"monday\",AG6=\"saturday\"),\"lCthjksVh\",IF(OR(AG6=\"wednesday\",AG6=\"friday\"),\"nkyjksVh\",\"vodk'k\")))))","v":"nkyjksVh"},{"$nulls":15},{"$f":"IF(OR(AG6=0,AG6=\"\"),\"\",IF(AG6=\"tuesday\",\"R\",IF(AG6=\"thursday\",\"R\",IF(OR(AG6=\"monday\",AG6=\"saturday\"),\"W\",IF(OR(AG6=\"wednesday\",AG6=\"friday\"),\"W\")))))","v":"W"},{"$f":"IF(AND(AE6=\"\"),AX6,AF6)","v":"W"},{"$nulls":45},{"$f":"IF(AND(B6=\"\"),\"\",B6)","v":"2022-07-01"},{"$f":"IF(OR(C6=\"\",C6=0),\"\",C6)","v":{"v":250,"d":"250.00"}},{"$f":"IF(OR(D6=\"\",D6=0),\"\",D6)","v":{"v":150,"d":"150.00"}},"","","","","","",{"$f":"IF(OR(K6=\"\",K6=0,DI7=\"\"),\"\",K6)","v":{"v":250,"d":"250.00"}},{"$f":"IF(OR(L6=\"\",L6=0,DI7=\"\"),\"\",L6)","v":{"v":150,"d":"150.00"}},{"$f":"IF(OR(M6=\"\",M6=0),\"\",M6)","v":90},{"$f":"IF(OR(N6=\"\",N6=0),\"\",N6)","v":110},200,90,109,199,{"v":29.85,"d":"30"},"",{"$f":"IF(OR(U6=\"\",U6=0,DI7=\"\"),\"\",U6)","v":{"v":220.15,"d":"220.150"}},{"$f":"IF(OR(V6=\"\",V6=0,DI7=\"\"),\"\",V6)","v":{"v":150,"d":"150.000"}},{"$f":"IF(OR(W6=\"\",W6=0),\"\",W6)","v":{"v":1482.55,"d":"1483"}},"nkyjksVh"]
[2,{"$f":"IF(AND('Att. Dairy'!B7=\"\"),\"\",'Att. Dairy'!B7)","v":"2022-07-02"},{"$f":"IFERROR(IF(AND(U6=\"\"),\"\",U6),\"\")","v":{"v":220.15,"d":"220.150"}},{"$f":"IFERROR(IF(AND(V6=\"\"),\"\",V6),\"\")","v":{"v":150,"d":"150.000"}},{"$nulls":6},{"$f":"IFERROR(IF(AND(C7=\"\"),\"\",SUM(C7,E7,G7,I7)),\"\")","v":{"v":220.15,"d":"220.150"}},{"$f":"IFERROR(IF(AND(D7=\"\"),\"\",SUM(D7,F7,H7,J7)),\"\")","v":{"v":150,"d":"150.000"}},{"$f":"IF(OR('Att. Dairy'!H7=\"\",R7=0,R7=\"\"),\"\",'Att. Dairy'!H7)","v":90},{"$f":"IF(OR('Att. Dairy'!I7=\"\",R7=0,R7=\"\"),\"\",'Att. Dairy'!I7)","v":100},{"$f":"SUM(M7,N7)","v":190},{"$f":"IF(AND('Att. Dairy'!N7=\"\"),\"\",'Att. Dairy'!N7)","v":90},{"$f":"IF(AND('Att. Dairy'!O7=\"\"),\"\",'Att. Dairy'!O7)","v":100},{"$f":"SUM(P7,Q7)","v":190},{"$f":"IF(AND(R7=\"\"),0,IF(AND(AY7=\"w\"),R7*150/1000,0))","v":{"v":28.5,"d":"28.500"}},{"$f":"IF(AND(R7=\"\"),0,IF(AND(AY7=\"R\"),R7*150/1000,0))","v":{"v":0,"d":"0.000"}},{"$f":"SUM(K7-S7)","v":{"v":191.65,"d":"191.650"}},{"$f":"(L7-T7)","v":{"v":150,"d":"150.000"}},{"$f":"IFERROR(IF(AND('Att. Dairy'!B7=\"\"),\"\",IF(AND(X7=\"vodk'k\"),\"\",IF(AND(R7=\"\"),\"\",R7*$AA$1))),\"\")","v":{"v":1415.5,"d":"1415.50"}},{"$f":"IF(AND('Att. Dairy'!B7=\"\"),\"\",IF(AND(P7=\"\"),\"\",AH7))","v":"lCthjksVh"},{"$nulls":6},{"$f":"IF(AND('Att. Dairy'!C7=\"\"),\"\",'Att. Dairy'!C7)","v":""},{"$f":"IF(AND(AE7=\"\"),\"\",IF(AE7=\"Rice\",\"R\",IF(AE7=\"Wheat\",\"W\")))","v":""},{"$f":"IF(AND('Att. Dairy'!D7=\"\"),\"\",'Att. Dairy'!D7)","v":"Saturday"},{"$f":"IF(OR(AG7=0,AG7=\"\"),\"\",IF(AG7=\"tuesday\",\"nkypkoy\",IF(AG7=\"thursday\",\"f[kpM+h\",IF(OR(AG7=\"monday\",AG7=\"saturday\"),\"lCthjksVh\",IF(OR(AG7=\"wednesday\",AG7=\"friday\"),\"nkyjksVh\",\"vodk'k\")))))","v":"lCthjksVh"},{"$nulls":15},{"$f":"IF(OR(AG7=0,AG7=\"\"),\"\",IF(AG7=\"tuesday\",\"R\",IF(AG7=\"thursday\",\"R\",IF(OR(AG7=\"monday\",AG7=\"saturday\"),\"W\",IF(OR(AG7=\"wednesday\",AG7=\"friday\"),\"W\")))))","v":"W"},"W",{"$nulls":45},{"$f":"IF(AND(B7=\"\"),\"\",B7)","v":"2022-07-02"},{"$f":"IF(OR(C7=\"\",C7=0,DI7=\"\"),\"\",C7)","v":220.15},{"$f":"IF(OR(D7=\"\",D7=0,DI7=\"\"),\"\",D7)","v":{"v":150,"d":"150.00"}},"","","","","","",{"$f":"IF(OR(K7=\"\",K7=0,DI7=\"\"),\"\",K7)","v":220.15},{"$f":"IF(OR(L7=\"\",L7=0,DI7=\"\"),\"\",L7)","v":{"v":150,"d":"150.00"}},{"$f":"IF(OR(M7=\"\",M7=0),\"\",M7)","v":90},100,{"$f":"IF(OR(O7=\"\",O7=0),\"\",O7)","v":190},90,100,190,{"v":28.5,"d":"29"},"",{"$f":"IF(OR(U7=\"\",U7=0,DI7=\"\"),\"\",U7)","v":{"v":191.65,"d":"191.650"}},{"$f":"IF(OR(V7=\"\",V7=0,DI7=\"\"),\"\",V7)","v":{"v":150,"d":"150.000"}},{"v":1415.5,"d":"1416"},"lCthjksVh"]
[3,{"$f":"IF(AND('Att. Dairy'!B8=\"\"),\"\",'Att. Dairy'!B8)","v":"2022-07-03"},{"$f":"IFERROR(IF(AND(U7=\"\"),\"\",U7),\"\")","v":{"v":191.65,"d":"191.650"}},{"$f":"IFERROR(IF(AND(V7=\"\"),\"\",V7),\"\")","v":{"v":150,"d":"150.000"}},{"$nulls":6},{"v":191.65,"d":"191.650"},{"v":150,"d":"150.000"},{"$f":"IF(OR('Att. Dairy'!H8=\"\",R8=0,R8=\"\"),\"\",'Att. Dairy'!H8)","v":""},{"$f":"IF(OR('Att. Dairy'!I8=\"\",R8=0,R8=\"\"),\"\",'Att. Dairy'!I8)","v":""},0,{"$f":"IF(AND('Att. Dairy'!N8=\"\"),\"\",'Att. Dairy'!N8)","v":""},{"$f":"IF(AND('Att. Dairy'!O8=\"\"),\"\",'Att. Dairy'!O8)","v":""},0,{"v":0,"d":"0.000"},{"v":0,"d":"0.000"},{"v":191.65,"d":"191.650"},{"v":150,"d":"150.000"},{"$f":"IFERROR(IF(AND('Att. Dairy'!B8=\"\"),\"\",IF(AND(X8=\"vodk'k\"),\"\",IF(AND(R8=\"\"),\"\",R8*$AA$1))),\"\")","v":{"v":0,"d":"0.00"}},{"$f":"IF(AND('Att. Dairy'!B8=\"\"),\"\",IF(AND(P8=\"\"),\"\",AH8))","v":""},{"$nulls":6},{"$f":"IF(AND('Att. Dairy'!C8=\"\"),\"\",'Att. Dairy'!C8)","v":""},"",{"$f":"IF(AND('Att. Dairy'!D8=\"\"),\"\",'Att. Dairy'!D8)","v":"Sunday"},"vodk'k",{"$nulls":15},false,false,{"$nulls":45},"2022-07-03",{"$f":"IF(OR(C8=\"\",C8=0,DI8=\"\"),\"\",C8)","v":""},{"$f":"IF(OR(D8=\"\",D8=0,DI8=\"\"),\"\",D8)","v":""},"","","","","","",{"$f":"IF(OR(K8=\"\",K8=0,DI8=\"\"),\"\",K8)","v":""},{"$f":"IF(OR(L8=\"\",L8=0,DI8=\"\"),\"\",L8)","v":""},"","","","","","","","",{"$f":"IF(OR(U8=\"\",U8=0,DI8=\"\"),\"\",U8)","v":""},{"$f":"IF(OR(V8=\"\",V8=0,DI8=\"\"),\"\",V8)","v":""},"",""]
[4,{"$f":"IF(AND('Att. Dairy'!B9=\"\"),\"\",'Att. Dairy'!B9)","v":"2022-07-04"},{"v":191.65,"d":"191.650"},{"v":150,"d":"150.000"},{"$nulls":6},{"$f":"IFERROR(IF(AND(C9=\"\"),\"\",SUM(C9,E9,G9,I9)),\"\")","v":{"v":191.65,"d":"191.650"}},{"v":150,"d":"150.000"},{"$f":"IF(OR('Att. Dairy'!H9=\"\",R9=0,R9=\"\"),\"\",'Att. Dairy'!H9)","v":""},{"$f":"IF(OR('Att. Dairy'!I9=\"\",R9=0,R9=\"\"),\"\",'Att. Dairy'!I9)","v":""},0,{"$f":"IF(AND('Att. Dairy'!N9=\"\"),\"\",'Att. Dairy'!N9)","v":""},{"$f":"IF(AND('Att. Dairy'!O9=\"\"),\"\",'Att. Dairy'!O9)","v":""},0,{"v":0,"d":"0.000"},{"v":0,"d":"0.000"},{"v":191.65,"d":"191.650"},{"v":150,"d":"150.000"},{"$f":"IFERROR(IF(AND('Att. Dairy'!B9=\"\"),\"\",IF(AND(X9=\"vodk'k\"),\"\",IF(AND(R9=\"\"),\"\",R9*$AA$1))),\"\")","v":{"v":0,"d":"0.00"}},{"$f":"IF(AND('Att. Dairy'!B9=\"\"),\"\",IF(AND(P9=\"\"),\"\",AH9))","v":""},{"$nulls":6},{"$f":"IF(AND('Att. Dairy'!C9=\"\"),\"\",'Att. Dairy'!C9)","v":""},"",{"$f":"IF(AND('Att. Dairy'!D9=\"\"),\"\",'Att. Dairy'!D9)","v":"Monday"},"lCthjksVh",{"$nulls":15},"W","W",{"$nulls":45},"2022-07-04","","","","","","","","","","","","","","","","","","","","","",""]
[5,{"$f":"IF(AND('Att. Dairy'!B10=\"\"),\"\",'Att. Dairy'!B10)","v":"2022-07-05"},{"v":191.65,"d":"191.650"},{"v":150,"d":"150.000"},{"$nulls":6},{"v":191.65,"d":"191.650"},{"v":150,"d":"150.000"},{"$f":"IF(OR('Att. Dairy'!H10=\"\",R10=0,R10=\"\"),\"\",'Att. Dairy'!H10)","v":""},{"$f":"IF(OR('Att. Dairy'!I10=\"\",R10=0,R10=\"\"),\"\",'Att. Dairy'!I10)","v":""},0,{"$f":"IF(AND('Att. Dairy'!N10=\"\"),\"\",'Att. Dairy'!N10)","v":""},{"$f":"IF(AND('Att. Dairy'!O10=\"\"),\"\",'Att. Dairy'!O10)","v":""},0,{"v":0,"d":"0.000"},{"v":0,"d":"0.000"},{"v":191.65,"d":"191.650"},{"v":150,"d":"150.000"},{"$f":"IFERROR(IF(AND('Att. Dairy'!B10=\"\"),\"\",IF(AND(X10=\"vodk'k\"),\"\",IF(AND(R10=\"\"),\"\",R10*$AA$1))),\"\")","v":{"v":0,"d":"0.00"}},{"$f":"IF(AND('Att. Dairy'!B10=\"\"),\"\",IF(AND(P10=\"\"),\"\",AH10))","v":""},{"$nulls":6},{"$f":"IF(AND('Att. Dairy'!C10=\"\"),\"\",'Att. Dairy'!C10)","v":""},"",{"$f":"IF(AND('Att. Dairy'!D10=\"\"),\"\",'Att. Dairy'!D10)","v":"Tuesday"},"nkypkoy",null,null,"YES",{"$nulls":12},"R","R",{"$nulls":45},"2022-07-05","","","","","","","","","","","","","","","","","","","","","",""]
[6,{"$f":"IF(AND('Att. Dairy'!B11=\"\"),\"\",'Att. Dairy'!B11)","v":"2022-07-06"},{"v":191.65,"d":"191.650"},{"v":150,"d":"150.000"},{"$nulls":6},{"v":191.65,"d":"191.650"},{"v":150,"d":"150.000"},{"$f":"IF(OR('Att. Dairy'!H11=\"\",R11=0,R11=\"\"),\"\",'Att. Dairy'!H11)","v":""},{"$f":"IF(OR('Att. Dairy'!I11=\"\",R11=0,R11=\"\"),\"\",'Att. Dairy'!I11)","v":""},0,{"$f":"IF(AND('Att. Dairy'!N11=\"\"),\"\",'Att. Dairy'!N11)","v":""},{"$f":"IF(AND('Att. Dairy'!O11=\"\"),\"\",'Att. Dairy'!O11)","v":""},0,{"v":0,"d":"0.000"},{"v":0,"d":"0.000"},{"v":191.65,"d":"191.650"},{"v":150,"d":"150.000"},{"$f":"IFERROR(IF(AND('Att. Dairy'!B11=\"\"),\"\",IF(AND(X11=\"vodk'k\"),\"\",IF(AND(R11=\"\"),\"\",R11*$AA$1))),\"\")","v":{"v":0,"d":"0.00"}},{"$f":"IF(AND('Att. Dairy'!B11=\"\"),\"\",IF(AND(P11=\"\"),\"\",AH11))","v":""},{"$nulls":6},{"$f":"IF(AND('Att. Dairy'!C11=\"\"),\"\",'Att. Dairy'!C11)","v":""},"",{"$f":"IF(AND('Att. Dairy'!D11=\"\"),\"\",'Att. Dairy'!D11)","v":"Wednesday"},{"$f":"IF(OR(AG11=0,AG11=\"\"),\"\",IF(AG11=\"tuesday\",\"nkypkoy\",IF(AG11=\"thursday\",\"f[kpM+h\",IF(OR(AG11=\"monday\",AG11=\"saturday\"),\"lCthjksVh\",IF(OR(AG11=\"wednesday\",AG11=\"friday\"),\"nkyjksVh\",\"vodk'k\")))))","v":"nkyjksVh"},null,null,"NO",{"$nulls":12},"W","W",{"$nulls":45},"2022-07-06","","","","","","","","","","","","","","","","","","","","","",""]
[7,{"$f":"IF(AND('Att. Dairy'!B12=\"\"),\"\",'Att. Dairy'!B12)","v":"2022-07-07"},{"v":191.65,"d":"191.650"},{"v":150,"d":"150.000"},{"$nulls":6},{"v":191.65,"d":"191.650"},{"v":150,"d":"150.000"},{"$f":"IF(OR('Att. Dairy'!H12=\"\",R12=0,R12=\"\"),\"\",'Att. Dairy'!H12)","v":""},{"$f":"IF(OR('Att. Dairy'!I12=\"\",R12=0,R12=\"\"),\"\",'Att. Dairy'!I12)","v":""},0,{"$f":"IF(AND('Att. Dairy'!N12=\"\"),\"\",'Att. Dairy'!N12)","v":""},{"$f":"IF(AND('Att. Dairy'!O12=\"\"),\"\",'Att. Dairy'!O12)","v":""},0,{"v":0,"d":"0.000"},{"v":0,"d":"0.000"},{"v":191.65,"d":"191.650"},{"v":150,"d":"150.000"},{"$f":"IFERROR(IF(AND('Att. Dairy'!B12=\"\"),\"\",IF(AND(X12=\"vodk'k\"),\"\",IF(AND(R12=\"\"),\"\",R12*$AA$1))),\"\")","v":{"v":0,"d":"0.00"}},{"$f":"IF(AND('Att. Dairy'!B12=\"\"),\"\",IF(AND(P12=\"\"),\"\",AH12))","v":""},{"$nulls":6},{"$f":"IF(AND('Att. Dairy'!C12=\"\"),\"\",'Att. Dairy'!C12)","v":""},"",{"$f":"IF(AND('Att. Dairy'!D12=\"\"),\"\",'Att. Dairy'!D12)","v":"Thursday"},"f[kpM+h",{"$nulls":15},"R","R",{"$nulls":45},"2022-07-07","","","","","","","","","","","","","","","","","","","","","",""]
[8,{"$f":"IF(AND('Att. Dairy'!B13=\"\"),\"\",'Att. Dairy'!B13)","v":"2022-07-08"},{"v":191.65,"d":"191.650"},{"v":150,"d":"150.000"},{"$nulls":6},{"v":191.65,"d":"191.650"},{"v":150,"d":"150.000"},{"$f":"IF(OR('Att. Dairy'!H13=\"\",R13=0,R13=\"\"),\"\",'Att. Dairy'!H13)","v":""},{"$f":"IF(OR('Att. Dairy'!I13=\"\",R13=0,R13=\"\"),\"\",'Att. Dairy'!I13)","v":""},0,{"$f":"IF(AND('Att. Dairy'!N13=\"\"),\"\",'Att. Dairy'!N13)","v":""},{"$f":"IF(AND('Att. Dairy'!O13=\"\"),\"\",'Att. Dairy'!O13)","v":""},0,{"v":0,"d":"0.000"},{"v":0,"d":"0.000"},{"v":191.65,"d":"191.650"},{"v":150,"d":"150.000"},{"$f":"IFERROR(IF(AND('Att. Dairy'!B13=\"\"),\"\",IF(AND(X13=\"vodk'k\"),\"\",IF(AND(R13=\"\"),\"\",R13*$AA$1))),\"\")","v":{"v":0,"d":"0.00"}},{"$f":"IF(AND('Att. Dairy'!B13=\"\"),\"\",IF(AND(P13=\"\"),\"\",AH13))","v":""},{"$nulls":6},{"$f":"IF(AND('Att. Dairy'!C13=\"\"),\"\",'Att. Dairy'!C13)","v":""},"",{"$f":"IF(AND('Att. Dairy'!D13=\"\"),\"\",'Att. Dairy'!D13)","v":"Friday"},"nkyjksVh",{"$nulls":15},"W","W",{"$nulls":45},"2022-07-08","","","","",{"$f":"IF(OR(G13=\"\",G13=0),\"\",G13)","v":""},"","","","","","","","","","","","","","","","",""]
[9,{"$f":"IF(AND('Att. Dairy'!B14=\"\"),\"\",'Att. Dairy'!B14)","v":"2022-07-09"},{"v":191.65,"d":"191.650"},{"v":150,"d":"150.000"},{"$nulls":6},{"v":191.65,"d":"191.650"},{"v":150,"d":"150.000"},{"$f":"IF(OR('Att. Dairy'!H14=\"\",R14=0,R14=\"\"),\"\",'Att. Dairy'!H14)","v":""},{"$f":"IF(OR('Att. Dairy'!I14=\"\",R14=0,R14=\"\"),\"\",'Att. Dairy'!I14)","v":""},0,{"$f":"IF(AND('Att. Dairy'!N14=\"\"),\"\",'Att. Dairy'!N14)","v":""},{"$f":"IF(AND('Att. Dairy'!O14=\"\"),\"\",'Att. Dairy'!O14)","v":""},0,{"v":0,"d":"0.000"},{"v":0,"d":"0.000"},{"v":191.65,"d":"191.650"},{"v":150,"d":"150.000"},{"$f":"IFERROR(IF(AND('Att. Dairy'!B14=\"\"),\"\",IF(AND(X14=\"vodk'k\"),\"\",IF(AND(R14=\"\"),\"\",R14*$AA$1))),\"\")","v":{"v":0,"d":"0.00"}},{"$f":"IF(AND('Att. Dairy'!B14=\"\"),\"\",IF(AND(P14=\"\"),\"\",AH14))","v":""},{"$nulls":6},{"$f":"IF(AND('Att. Dairy'!C14=\"\"),\"\",'Att. Dairy'!C14)","v":""},"",{"$f":"IF(AND('Att. Dairy'!D14=\"\"),\"\",'Att. Dairy'!D14)","v":"Saturday"},"lCthjksVh",{"$nulls":15},"W","W",{"$nulls":45},"2022-07-09","","","","","","","","","","","","","","","","","","","","","",""]
[10,{"$f":"IF(AND('Att. Dairy'!B15=\"\"),\"\",'Att. Dairy'!B15)","v":"2022-07-10"},{"v":191.65,"d":"191.650"},{"v":150,"d":"150.000"},{"$nulls":6},{"v":191.65,"d":"191.650"},{"v":150,"d":"150.000"},{"$f":"IF(OR('Att. Dairy'!H15=\"\",R15=0,R15=\"\"),\"\",'Att. Dairy'!H15)","v":""},{"$f":"IF(OR('Att. Dairy'!I15=\"\",R15=0,R15=\"\"),\"\",'Att. Dairy'!I15)","v":""},0,{"$f":"IF(AND('Att. Dairy'!N15=\"\"),\"\",'Att. Dairy'!N15)","v":""},{"$f":"IF(AND('Att. Dairy'!O15=\"\"),\"\",'Att. Dairy'!O15)","v":""},0,{"v":0,"d":"0.000"},{"v":0,"d":"0.000"},{"v":191.65,"d":"191.650"},{"v":150,"d":"150.000"},{"$f":"IFERROR(IF(AND('Att. Dairy'!B15=\"\"),\"\",IF(AND(X15=\"vodk'k\"),\"\",IF(AND(R15=\"\"),\"\",R15*$AA$1))),\"\")","v":{"v":0,"d":"0.00"}},{"$f":"IF(AND('Att. Dairy'!B15=\"\"),\"\",IF(AND(P15=\"\"),\"\",AH15))","v":""},{"$nulls":6},{"$f":"IF(AND('Att. Dairy'!C15=\"\"),\"\",'Att. Dairy'!C15)","v":""},"",{"$f":"IF(AND('Att. Dairy'!D15=\"\"),\"\",'Att. Dairy'!D15)","v":"Sunday"},"vodk'k",{"$nulls":15},false,false,{"$nulls":45},"2022-07-10","","","","","","","","","","","","","","","","","","","","","",""]
[11,{"$f":"IF(AND('Att. Dairy'!B16=\"\"),\"\",'Att. Dairy'!B16)","v":"2022-07-11"},{"v":191.65,"d":"191.650"},{"v":150,"d":"150.000"},{"$nulls":6},{"v":191.65,"d":"191.650"},{"v":150,"d":"150.000"},{"$f":"IF(OR('Att. Dairy'!H16=\"\",R16=0,R16=\"\"),\"\",'Att. Dairy'!H16)","v":""},{"$f":"IF(OR('Att. Dairy'!I16=\"\",R16=0,R16=\"\"),\"\",'Att. Dairy'!I16)","v":""},0,{"$f":"IF(AND('Att. Dairy'!N16=\"\"),\"\",'Att. Dairy'!N16)","v":""},{"$f":"IF(AND('Att. Dairy'!O16=\"\"),\"\",'Att. Dairy'!O16)","v":""},0,{"v":0,"d":"0.000"},{"v":0,"d":"0.000"},{"v":191.65,"d":"191.650"},{"v":150,"d":"150.000"},{"$f":"IFERROR(IF(AND('Att. Dairy'!B16=\"\"),\"\",IF(AND(X16=\"vodk'k\"),\"\",IF(AND(R16=\"\"),\"\",R16*$AA$1))),\"\")","v":{"v":0,"d":"0.00"}},{"$f":"IF(AND('Att. Dairy'!B16=\"\"),\"\",IF(AND(P16=\"\"),\"\",AH16))","v":""},{"$nulls":6},{"$f":"IF(AND('Att. Dairy'!C16=\"\"),\"\",'Att. Dairy'!C16)","v":""},"",{"$f":"IF(AND('Att. Dairy'!D16=\"\"),\"\",'Att. Dairy'!D16)","v":"Monday"},"lCthjksVh",{"$nulls":15},"W","W",{"$nulls":45},"2022-07-11","","","","","","","","","","","","","","","","","","","","","",""]
[12,{"$f":"IF(AND('Att. Dairy'!B17=\"\"),\"\",'Att. Dairy'!B17)","v":"2022-07-12"},{"v":191.65,"d":"191.650"},{"v":150,"d":"150.000"},{"$nulls":6},{"v":191.65,"d":"191.650"},{"v":150,"d":"150.000"},{"$f":"IF(OR('Att. Dairy'!H17=\"\",R17=0,R17=\"\"),\"\",'Att. Dairy'!H17)","v":""},{"$f":"IF(OR('Att. Dairy'!I17=\"\",R17=0,R17=\"\"),\"\",'Att. Dairy'!I17)","v":""},0,{"$f":"IF(AND('Att. Dairy'!N17=\"\"),\"\",'Att. Dairy'!N17)","v":""},{"$f":"IF(AND('Att. Dairy'!O17=\"\"),\"\",'Att. Dairy'!O17)","v":""},0,{"v":0,"d":"0.000"},{"v":0,"d":"0.000"},{"v":191.65,"d":"191.650"},{"v":150,"d":"150.000"},{"$f":"IFERROR(IF(AND('Att. Dairy'!B17=\"\"),\"\",IF(AND(X17=\"vodk'k\"),\"\",IF(AND(R17=\"\"),\"\",R17*$AA$1))),\"\")","v":{"v":0,"d":"0.00"}},{"$f":"IF(AND('Att. Dairy'!B17=\"\"),\"\",IF(AND(P17=\"\"),\"\",AH17))","v":""},{"$nulls":6},{"$f":"IF(AND('Att. Dairy'!C17=\"\"),\"\",'Att. Dairy'!C17)","v":""},"",{"$f":"IF(AND('Att. Dairy'!D17=\"\"),\"\",'Att. Dairy'!D17)","v":"Tuesday"},"nkypkoy",{"$nulls":15},"R","R",{"$nulls":45},"2022-07-12","","","","","","","","","","","","","","","","","","","","","",""]
[13,{"$f":"IF(AND('Att. Dairy'!B18=\"\"),\"\",'Att. Dairy'!B18)","v":"2022-07-13"},{"v":191.65,"d":"191.650"},{"v":150,"d":"150.000"},{"$nulls":6},{"v":191.65,"d":"191.650"},{"v":150,"d":"150.000"},{"$f":"IF(OR('Att. Dairy'!H18=\"\",R18=0,R18=\"\"),\"\",'Att. Dairy'!H18)","v":""},{"$f":"IF(OR('Att. Dairy'!I18=\"\",R18=0,R18=\"\"),\"\",'Att. Dairy'!I18)","v":""},0,{"$f":"IF(AND('Att. Dairy'!N18=\"\"),\"\",'Att. Dairy'!N18)","v":""},{"$f":"IF(AND('Att. Dairy'!O18=\"\"),\"\",'Att. Dairy'!O18)","v":""},0,{"v":0,"d":"0.000"},{"v":0,"d":"0.000"},{"v":191.65,"d":"191.650"},{"v":150,"d":"150.000"},{"$f":"IFERROR(IF(AND('Att. Dairy'!B18=\"\"),\"\",IF(AND(X18=\"vodk'k\"),\"\",IF(AND(R18=\"\"),\"\",R18*$AA$1))),\"\")","v":{"v":0,"d":"0.00"}},{"$f":"IF(AND('Att. Dairy'!B18=\"\"),\"\",IF(AND(P18=\"\"),\"\",AH18))","v":""},{"$nulls":6},{"$f":"IF(AND('Att. Dairy'!C18=\"\"),\"\",'Att. Dairy'!C18)","v":""},"",{"$f":"IF(AND('Att. Dairy'!D18=\"\"),\"\",'Att. Dairy'!D18)","v":"Wednesday"},"nkyjksVh",{"$nulls":15},"W","W",{"$nulls":45},"2022-07-13","","","","","","","","","","","","","","","","","","","","","",""]
[14,{"$f":"IF(AND('Att. Dairy'!B19=\"\"),\"\",'Att. Dairy'!B19)","v":"2022-07-14"},{"v":191.65,"d":"191.650"},{"v":150,"d":"150.000"},{"$nulls":6},{"v":191.65,"d":"191.650"},{"v":150,"d":"150.000"},{"$f":"IF(OR('Att. Dairy'!H19=\"\",R19=0,R19=\"\"),\"\",'Att. Dairy'!H19)","v":""},{"$f":"IF(OR('Att. Dairy'!I19=\"\",R19=0,R19=\"\"),\"\",'Att. Dairy'!I19)","v":""},0,{"$f":"IF(AND('Att. Dairy'!N19=\"\"),\"\",'Att. Dairy'!N19)","v":""},{"$f":"IF(AND('Att. Dairy'!O19=\"\"),\"\",'Att. Dairy'!O19)","v":""},0,{"v":0,"d":"0.000"},{"v":0,"d":"0.000"},{"v":191.65,"d":"191.650"},{"v":150,"d":"150.000"},{"$f":"IFERROR(IF(AND('Att. Dairy'!B19=\"\"),\"\",IF(AND(X19=\"vodk'k\"),\"\",IF(AND(R19=\"\"),\"\",R19*$AA$1))),\"\")","v":{"v":0,"d":"0.00"}},{"$f":"IF(AND('Att. Dairy'!B19=\"\"),\"\",IF(AND(P19=\"\"),\"\",AH19))","v":""},{"$nulls":6},{"$f":"IF(AND('Att. Dairy'!C19=\"\"),\"\",'Att. Dairy'!C19)","v":""},"",{"$f":"IF(AND('Att. Dairy'!D19=\"\"),\"\",'Att. Dairy'!D19)","v":"Thursday"},"f[kpM+h",{"$nulls":15},"R","R",{"$nulls":45},"2022-07-14","","","","","","","","","","","","","","","","","","","","","",""]
[15,{"$f":"IF(AND('Att. Dairy'!B20=\"\"),\"\",'Att. Dairy'!B20)","v":"2022-07-15"},{"v":191.65,"d":"191.650"},{"v":150,"d":"150.000"},{"$nulls":6},{"v":191.65,"d":"191.650"},{"v":150,"d":"150.000"},{"$f":"IF(OR('Att. Dairy'!H20=\"\",R20=0,R20=\"\"),\"\",'Att. Dairy'!H20)","v":""},{"$f":"IF(OR('Att. Dairy'!I20=\"\",R20=0,R20=\"\"),\"\",'Att. Dairy'!I20)","v":""},0,{"$f":"IF(AND('Att. Dairy'!N20=\"\"),\"\",'Att. Dairy'!N20)","v":""},{"$f":"IF(AND('Att. Dairy'!O20=\"\"),\"\",'Att. Dairy'!O20)","v":""},0,{"v":0,"d":"0.000"},{"v":0,"d":"0.000"},{"v":191.65,"d":"191.650"},{"v":150,"d":"150.000"},{"$f":"IFERROR(IF(AND('Att. Dairy'!B20=\"\"),\"\",IF(AND(X20=\"vodk'k\"),\"\",IF(AND(R20=\"\"),\"\",R20*$AA$1))),\"\")","v":{"v":0,"d":"0.00"}},{"$f":"IF(AND('Att. Dairy'!B20=\"\"),\"\",IF(AND(P20=\"\"),\"\",AH20))","v":""},{"$nulls":6},{"$f":"IF(AND('Att. Dairy'!C20=\"\"),\"\",'Att. Dairy'!C20)","v":""},"",{"$f":"IF(AND('Att. Dairy'!D20=\"\"),\"\",'Att. Dairy'!D20)","v":"Friday"},"nkyjksVh",{"$nulls":15},"W","W",{"$nulls":45},"2022-07-15","","","","","","","","","","","","","","","","","","","","","",""]
[16,{"$f":"IF(AND('Att. Dairy'!B21=\"\"),\"\",'Att. Dairy'!B21)","v":"2022-07-16"},{"v":191.65,"d":"191.650"},{"v":150,"d":"150.000"},{"$nulls":6},{"v":191.65,"d":"191.650"},{"v":150,"d":"150.000"},{"$f":"IF(OR('Att. Dairy'!H21=\"\",R21=0,R21=\"\"),\"\",'Att. Dairy'!H21)","v":""},{"$f":"IF(OR('Att. Dairy'!I21=\"\",R21=0,R21=\"\"),\"\",'Att. Dairy'!I21)","v":""},0,{"$f":"IF(AND('Att. Dairy'!N21=\"\"),\"\",'Att. Dairy'!N21)","v":""},{"$f":"IF(AND('Att. Dairy'!O21=\"\"),\"\",'Att. Dairy'!O21)","v":""},0,{"v":0,"d":"0.000"},{"v":0,"d":"0.000"},{"v":191.65,"d":"191.650"},{"v":150,"d":"150.000"},{"$f":"IFERROR(IF(AND('Att. Dairy'!B21=\"\"),\"\",IF(AND(X21=\"vodk'k\"),\"\",IF(AND(R21=\"\"),\"\",R21*$AA$1))),\"\")","v":{"v":0,"d":"0.00"}},{"$f":"IF(AND('Att. Dairy'!B21=\"\"),\"\",IF(AND(P21=\"\"),\"\",AH21))","v":""},{"$nulls":6},{"$f":"IF(AND('Att. Dairy'!C21=\"\"),\"\",'Att. Dairy'!C21)","v":""},"",{"$f":"IF(AND('Att. Dairy'!D21=\"\"),\"\",'Att. Dairy'!D21)","v":"Saturday"},"lCthjksVh",{"$nulls":15},"W","W",{"$nulls":45},"2022-07-16","","","","","","","","","","","","","","","","","","","","","",""]
[17,{"$f":"IF(AND('Att. Dairy'!B22=\"\"),\"\",'Att. Dairy'!B22)","v":"2022-07-17"},{"v":191.65,"d":"191.650"},{"v":150,"d":"150.000"},{"$nulls":6},{"v":191.65,"d":"191.650"},{"v":150,"d":"150.000"},{"$f":"IF(OR('Att. Dairy'!H22=\"\",R22=0,R22=\"\"),\"\",'Att. Dairy'!H22)","v":""},{"$f":"IF(OR('Att. Dairy'!I22=\"\",R22=0,R22=\"\"),\"\",'Att. Dairy'!I22)","v":""},0,{"$f":"IF(AND('Att. Dairy'!N22=\"\"),\"\",'Att. Dairy'!N22)","v":""},{"$f":"IF(AND('Att. Dairy'!O22=\"\"),\"\",'Att. Dairy'!O22)","v":""},0,{"v":0,"d":"0.000"},{"v":0,"d":"0.000"},{"v":191.65,"d":"191.650"},{"v":150,"d":"150.000"},{"$f":"IFERROR(IF(AND('Att. Dairy'!B22=\"\"),\"\",IF(AND(X22=\"vodk'k\"),\"\",IF(AND(R22=\"\"),\"\",R22*$AA$1))),\"\")","v":{"v":0,"d":"0.00"}},{"$f":"IF(AND('Att. Dairy'!B22=\"\"),\"\",IF(AND(P22=\"\"),\"\",AH22))","v":""},{"$nulls":6},{"$f":"IF(AND('Att. Dairy'!C22=\"\"),\"\",'Att. Dairy'!C22)","v":""},"",{"$f":"IF(AND('Att. Dairy'!D22=\"\"),\"\",'Att. Dairy'!D22)","v":"Sunday"},"vodk'k",{"$nulls":15},false,false,{"$nulls":45},"2022-07-17","","",{"$f":"IF(OR(E22=\"\",E22=0),\"\",E22)","v":""},"","","","","","","","","","",{"$f":"IF(OR(P22=\"\",P22=0),\"\",P22)","v":""},"","","","","","",{"$f":"IF(OR(W22=\"\",W22=0),\"\",W22)","v":""},""]
[18,{"$f":"IF(AND('Att. Dairy'!B23=\"\"),\"\",'Att. Dairy'!B23)","v":"2022-07-18"},{"v":191.65,"d":"191.650"},{"v":150,"d":"150.000"},{"$nulls":6},{"v":191.65,"d":"191.650"},{"v":150,"d":"150.000"},{"$f":"IF(OR('Att. Dairy'!H23=\"\",R23=0,R23=\"\"),\"\",'Att. Dairy'!H23)","v":""},{"$f":"IF(OR('Att. Dairy'!I23=\"\",R23=0,R23=\"\"),\"\",'Att. Dairy'!I23)","v":""},0,{"$f":"IF(AND('Att. Dairy'!N23=\"\"),\"\",'Att. Dairy'!N23)","v":""},{"$f":"IF(AND('Att. Dairy'!O23=\"\"),\"\",'Att. Dairy'!O23)","v":""},0,{"v":0,"d":"0.000"},{"v":0,"d":"0.000"},{"v":191.65,"d":"191.650"},{"v":150,"d":"150.000"},{"$f":"IFERROR(IF(AND('Att. Dairy'!B23=\"\"),\"\",IF(AND(X23=\"vodk'k\"),\"\",IF(AND(R23=\"\"),\"\",R23*$AA$1))),\"\")","v":{"v":0,"d":"0.00"}},{"$f":"IF(AND('Att. Dairy'!B23=\"\"),\"\",IF(AND(P23=\"\"),\"\",AH23))","v":""},{"$nulls":6},{"$f":"IF(AND('Att. Dairy'!C23=\"\"),\"\",'Att. Dairy'!C23)","v":""},"",{"$f":"IF(AND('Att. Dairy'!D23=\"\"),\"\",'Att. Dairy'!D23)","v":"Monday"},"lCthjksVh",{"$nulls":15},"W","W",{"$nulls":45},"2022-07-18","","","","","","","","","","","","","","","","","","","","","",""]
[19,{"$f":"IF(AND('Att. Dairy'!B24=\"\"),\"\",'Att. Dairy'!B24)","v":"2022-07-19"},{"v":191.65,"d":"191.650"},{"v":150,"d":"150.000"},{"$nulls":6},{"v":191.65,"d":"191.650"},{"v":150,"d":"150.000"},{"$f":"IF(OR('Att. Dairy'!H24=\"\",R24=0,R24=\"\"),\"\",'Att. Dairy'!H24)","v":""},{"$f":"IF(OR('Att. Dairy'!I24=\"\",R24=0,R24=\"\"),\"\",'Att. Dairy'!I24)","v":""},0,{"$f":"IF(AND('Att. Dairy'!N24=\"\"),\"\",'Att. Dairy'!N24)","v":""},{"$f":"IF(AND('Att. Dairy'!O24=\"\"),\"\",'Att. Dairy'!O24)","v":""},0,{"v":0,"d":"0.000"},{"v":0,"d":"0.000"},{"v":191.65,"d":"191.650"},{"v":150,"d":"150.000"},{"$f":"IFERROR(IF(AND('Att. Dairy'!B24=\"\"),\"\",IF(AND(X24=\"vodk'k\"),\"\",IF(AND(R24=\"\"),\"\",R24*$AA$1))),\"\")","v":{"v":0,"d":"0.00"}},{"$f":"IF(AND('Att. Dairy'!B24=\"\"),\"\",IF(AND(P24=\"\"),\"\",AH24))","v":""},{"$nulls":6},{"$f":"IF(AND('Att. Dairy'!C24=\"\"),\"\",'Att. Dairy'!C24)","v":""},"",{"$f":"IF(AND('Att. Dairy'!D24=\"\"),\"\",'Att. Dairy'!D24)","v":"Tuesday"},"nkypkoy",{"$nulls":15},"R","R",{"$nulls":45},"2022-07-19","","","","","","","","","","","","","","","","","","","","","",""]
[20,{"$f":"IF(AND('Att. Dairy'!B25=\"\"),\"\",'Att. Dairy'!B25)","v":"2022-07-20"},{"v":191.65,"d":"191.650"},{"v":150,"d":"150.000"},{"$nulls":6},{"v":191.65,"d":"191.650"},{"v":150,"d":"150.000"},{"$f":"IF(OR('Att. Dairy'!H25=\"\",R25=0,R25=\"\"),\"\",'Att. Dairy'!H25)","v":""},{"$f":"IF(OR('Att. Dairy'!I25=\"\",R25=0,R25=\"\"),\"\",'Att. Dairy'!I25)","v":""},0,{"$f":"IF(AND('Att. Dairy'!N25=\"\"),\"\",'Att. Dairy'!N25)","v":""},{"$f":"IF(AND('Att. Dairy'!O25=\"\"),\"\",'Att. Dairy'!O25)","v":""},0,{"v":0,"d":"0.000"},{"v":0,"d":"0.000"},{"v":191.65,"d":"191.650"},{"v":150,"d":"150.000"},{"$f":"IFERROR(IF(AND('Att. Dairy'!B25=\"\"),\"\",IF(AND(X25=\"vodk'k\"),\"\",IF(AND(R25=\"\"),\"\",R25*$AA$1))),\"\")","v":{"v":0,"d":"0.00"}},{"$f":"IF(AND('Att. Dairy'!B25=\"\"),\"\",IF(AND(P25=\"\"),\"\",AH25))","v":""},{"$nulls":6},{"$f":"IF(AND('Att. Dairy'!C25=\"\"),\"\",'Att. Dairy'!C25)","v":""},"",{"$f":"IF(AND('Att. Dairy'!D25=\"\"),\"\",'Att. Dairy'!D25)","v":"Wednesday"},"nkyjksVh",{"$nulls":15},"W","W",{"$nulls":45},"2022-07-20","","","","","","","","","","","","","","","","","","","","","",""]
[21,{"$f":"IF(AND('Att. Dairy'!B26=\"\"),\"\",'Att. Dairy'!B26)","v":"2022-07-21"},{"v":191.65,"d":"191.650"},{"v":150,"d":"150.000"},{"$nulls":6},{"v":191.65,"d":"191.650"},{"v":150,"d":"150.000"},{"$f":"IF(OR('Att. Dairy'!H26=\"\",R26=0,R26=\"\"),\"\",'Att. Dairy'!H26)","v":""},{"$f":"IF(OR('Att. Dairy'!I26=\"\",R26=0,R26=\"\"),\"\",'Att. Dairy'!I26)","v":""},0,{"$f":"IF(AND('Att. Dairy'!N26=\"\"),\"\",'Att. Dairy'!N26)","v":""},{"$f":"IF(AND('Att. Dairy'!O26=\"\"),\"\",'Att. Dairy'!O26)","v":""},0,{"v":0,"d":"0.000"},{"v":0,"d":"0.000"},{"v":191.65,"d":"191.650"},{"v":150,"d":"150.000"},{"$f":"IFERROR(IF(AND('Att. Dairy'!B26=\"\"),\"\",IF(AND(X26=\"vodk'k\"),\"\",IF(AND(R26=\"\"),\"\",R26*$AA$1))),\"\")","v":{"v":0,"d":"0.00"}},{"$f":"IF(AND('Att. Dairy'!B26=\"\"),\"\",IF(AND(P26=\"\"),\"\",AH26))","v":""},{"$nulls":6},{"$f":"IF(AND('Att. Dairy'!C26=\"\"),\"\",'Att. Dairy'!C26)","v":""},"",{"$f":"IF(AND('Att. Dairy'!D26=\"\"),\"\",'Att. Dairy'!D26)","v":"Thursday"},"f[kpM+h",{"$nulls":15},"R","R",{"$nulls":45},"2022-07-21","","","","","","","","","","","","","","","","","","","","","",""]
[22,{"$f":"IF(AND('Att. Dairy'!B27=\"\"),\"\",'Att. Dairy'!B27)","v":"2022-07-22"},{"v":191.65,"d":"191.650"},{"v":150,"d":"150.000"},{"$nulls":6},{"v":191.65,"d":"191.650"},{"v":150,"d":"150.000"},{"$f":"IF(OR('Att. Dairy'!H27=\"\",R27=0,R27=\"\"),\"\",'Att. Dairy'!H27)","v":""},{"$f":"IF(OR('Att. Dairy'!I27=\"\",R27=0,R27=\"\"),\"\",'Att. Dairy'!I27)","v":""},0,{"$f":"IF(AND('Att. Dairy'!N27=\"\"),\"\",'Att. Dairy'!N27)","v":""},{"$f":"IF(AND('Att. Dairy'!O27=\"\"),\"\",'Att. Dairy'!O27)","v":""},0,{"v":0,"d":"0.000"},{"v":0,"d":"0.000"},{"v":191.65,"d":"191.650"},{"v":150,"d":"150.000"},{"$f":"IFERROR(IF(AND('Att. Dairy'!B27=\"\"),\"\",IF(AND(X27=\"vodk'k\"),\"\",IF(AND(R27=\"\"),\"\",R27*$AA$1))),\"\")","v":{"v":0,"d":"0.00"}},{"$f":"IF(AND('Att. Dairy'!B27=\"\"),\"\",IF(AND(P27=\"\"),\"\",AH27))","v":""},{"$nulls":6},{"$f":"IF(AND('Att. Dairy'!C27=\"\"),\"\",'Att. Dairy'!C27)","v":""},"",{"$f":"IF(AND('Att. Dairy'!D27=\"\"),\"\",'Att. Dairy'!D27)","v":"Friday"},"nkyjksVh",{"$nulls":15},"W","W",{"$nulls":45},"2022-07-22","","","","","","","","","","","","","","","","","","","","","",""]
[23,{"$f":"IF(AND('Att. Dairy'!B28=\"\"),\"\",'Att. Dairy'!B28)","v":"2022-07-23"},{"v":191.65,"d":"191.650"},{"v":150,"d":"150.000"},{"$nulls":6},{"v":191.65,"d":"191.650"},{"v":150,"d":"150.000"},{"$f":"IF(OR('Att. Dairy'!H28=\"\",R28=0,R28=\"\"),\"\",'Att. Dairy'!H28)","v":""},{"$f":"IF(OR('Att. Dairy'!I28=\"\",R28=0,R28=\"\"),\"\",'Att. Dairy'!I28)","v":""},0,{"$f":"IF(AND('Att. Dairy'!N28=\"\"),\"\",'Att. Dairy'!N28)","v":""},{"$f":"IF(AND('Att. Dairy'!O28=\"\"),\"\",'Att. Dairy'!O28)","v":""},0,{"v":0,"d":"0.000"},{"v":0,"d":"0.000"},{"v":191.65,"d":"191.650"},{"v":150,"d":"150.000"},{"$f":"IFERROR(IF(AND('Att. Dairy'!B28=\"\"),\"\",IF(AND(X28=\"vodk'k\"),\"\",IF(AND(R28=\"\"),\"\",R28*$AA$1))),\"\")","v":{"v":0,"d":"0.00"}},{"$f":"IF(AND('Att. Dairy'!B28=\"\"),\"\",IF(AND(P28=\"\"),\"\",AH28))","v":""},{"$nulls":6},{"$f":"IF(AND('Att. Dairy'!C28=\"\"),\"\",'Att. Dairy'!C28)","v":""},"",{"$f":"IF(AND('Att. Dairy'!D28=\"\"),\"\",'Att. Dairy'!D28)","v":"Saturday"},"lCthjksVh",{"$nulls":15},"W","W",{"$nulls":45},"2022-07-23","","","","","","","","","","","","","","","","","","","","","",""]
[24,{"$f":"IF(AND('Att. Dairy'!B29=\"\"),\"\",'Att. Dairy'!B29)","v":"2022-07-24"},{"v":191.65,"d":"191.650"},{"v":150,"d":"150.000"},{"$nulls":6},{"v":191.65,"d":"191.650"},{"v":150,"d":"150.000"},{"$f":"IF(OR('Att. Dairy'!H29=\"\",R29=0,R29=\"\"),\"\",'Att. Dairy'!H29)","v":""},{"$f":"IF(OR('Att. Dairy'!I29=\"\",R29=0,R29=\"\"),\"\",'Att. Dairy'!I29)","v":""},0,{"$f":"IF(AND('Att. Dairy'!N29=\"\"),\"\",'Att. Dairy'!N29)","v":""},{"$f":"IF(AND('Att. Dairy'!O29=\"\"),\"\",'Att. Dairy'!O29)","v":""},0,{"v":0,"d":"0.000"},{"v":0,"d":"0.000"},{"v":191.65,"d":"191.650"},{"v":150,"d":"150.000"},{"$f":"IFERROR(IF(AND('Att. Dairy'!B29=\"\"),\"\",IF(AND(X29=\"vodk'k\"),\"\",IF(AND(R29=\"\"),\"\",R29*$AA$1))),\"\")","v":{"v":0,"d":"0.00"}},{"$f":"IF(AND('Att. Dairy'!B29=\"\"),\"\",IF(AND(P29=\"\"),\"\",AH29))","v":""},{"$nulls":6},{"$f":"IF(AND('Att. Dairy'!C29=\"\"),\"\",'Att. Dairy'!C29)","v":""},"",{"$f":"IF(AND('Att. Dairy'!D29=\"\"),\"\",'Att. Dairy'!D29)","v":"Sunday"},"vodk'k",{"$nulls":15},false,false,{"$nulls":45},"2022-07-24","","","","","","","","","","","","","","","","","","","","","",""]
[25,{"$f":"IF(AND('Att. Dairy'!B30=\"\"),\"\",'Att. Dairy'!B30)","v":"2022-07-25"},{"v":191.65,"d":"191.650"},{"v":150,"d":"150.000"},{"$nulls":6},{"v":191.65,"d":"191.650"},{"v":150,"d":"150.000"},{"$f":"IF(OR('Att. Dairy'!H30=\"\",R30=0,R30=\"\"),\"\",'Att. Dairy'!H30)","v":""},{"$f":"IF(OR('Att. Dairy'!I30=\"\",R30=0,R30=\"\"),\"\",'Att. Dairy'!I30)","v":""},0,{"$f":"IF(AND('Att. Dairy'!N30=\"\"),\"\",'Att. Dairy'!N30)","v":""},{"$f":"IF(AND('Att. Dairy'!O30=\"\"),\"\",'Att. Dairy'!O30)","v":""},0,{"v":0,"d":"0.000"},{"v":0,"d":"0.000"},{"v":191.65,"d":"191.650"},{"v":150,"d":"150.000"},{"$f":"IFERROR(IF(AND('Att. Dairy'!B30=\"\"),\"\",IF(AND(X30=\"vodk'k\"),\"\",IF(AND(R30=\"\"),\"\",R30*$AA$1))),\"\")","v":{"v":0,"d":"0.00"}},{"$f":"IF(AND('Att. Dairy'!B30=\"\"),\"\",IF(AND(P30=\"\"),\"\",AH30))","v":""},{"$nulls":6},{"$f":"IF(AND('Att. Dairy'!C30=\"\"),\"\",'Att. Dairy'!C30)","v":""},"",{"$f":"IF(AND('Att. Dairy'!D30=\"\"),\"\",'Att. Dairy'!D30)","v":"Monday"},"lCthjksVh",{"$nulls":15},"W","W",{"$nulls":45},"2022-07-25","","","","","","","","","","","","","","","","","","","","","",""]
[26,{"$f":"IF(AND('Att. Dairy'!B31=\"\"),\"\",'Att. Dairy'!B31)","v":"2022-07-26"},{"v":191.65,"d":"191.650"},{"v":150,"d":"150.000"},{"$nulls":6},{"v":191.65,"d":"191.650"},{"v":150,"d":"150.000"},{"$f":"IF(OR('Att. Dairy'!H31=\"\",R31=0,R31=\"\"),\"\",'Att. Dairy'!H31)","v":""},{"$f":"IF(OR('Att. Dairy'!I31=\"\",R31=0,R31=\"\"),\"\",'Att. Dairy'!I31)","v":""},0,{"$f":"IF(AND('Att. Dairy'!N31=\"\"),\"\",'Att. Dairy'!N31)","v":""},{"$f":"IF(AND('Att. Dairy'!O31=\"\"),\"\",'Att. Dairy'!O31)","v":""},0,{"v":0,"d":"0.000"},{"v":0,"d":"0.000"},{"v":191.65,"d":"191.650"},{"v":150,"d":"150.000"},{"$f":"IFERROR(IF(AND('Att. Dairy'!B31=\"\"),\"\",IF(AND(X31=\"vodk'k\"),\"\",IF(AND(R31=\"\"),\"\",R31*$AA$1))),\"\")","v":{"v":0,"d":"0.00"}},{"$f":"IF(AND('Att. Dairy'!B31=\"\"),\"\",IF(AND(P31=\"\"),\"\",AH31))","v":""},{"$nulls":6},{"$f":"IF(AND('Att. Dairy'!C31=\"\"),\"\",'Att. Dairy'!C31)","v":""},"",{"$f":"IF(AND('Att. Dairy'!D31=\"\"),\"\",'Att. Dairy'!D31)","v":"Tuesday"},"nkypkoy",{"$nulls":15},"R","R",{"$nulls":45},"2022-07-26","","","","","","","","","","","","","","","","","","","","","",""]
[27,{"$f":"IF(AND('Att. Dairy'!B32=\"\"),\"\",'Att. Dairy'!B32)","v":"2022-07-27"},{"v":191.65,"d":"191.650"},{"v":150,"d":"150.000"},{"$nulls":6},{"v":191.65,"d":"191.650"},{"v":150,"d":"150.000"},{"$f":"IF(OR('Att. Dairy'!H32=\"\",R32=0,R32=\"\"),\"\",'Att. Dairy'!H32)","v":""},{"$f":"IF(OR('Att. Dairy'!I32=\"\",R32=0,R32=\"\"),\"\",'Att. Dairy'!I32)","v":""},0,{"$f":"IF(AND('Att. Dairy'!N32=\"\"),\"\",'Att. Dairy'!N32)","v":""},{"$f":"IF(AND('Att. Dairy'!O32=\"\"),\"\",'Att. Dairy'!O32)","v":""},0,{"v":0,"d":"0.000"},{"v":0,"d":"0.000"},{"v":191.65,"d":"191.650"},{"v":150,"d":"150.000"},{"$f":"IFERROR(IF(AND('Att. Dairy'!B32=\"\"),\"\",IF(AND(X32=\"vodk'k\"),\"\",IF(AND(R32=\"\"),\"\",R32*$AA$1))),\"\")","v":{"v":0,"d":"0.00"}},{"$f":"IF(AND('Att. Dairy'!B32=\"\"),\"\",IF(AND(P32=\"\"),\"\",AH32))","v":""},{"$nulls":6},{"$f":"IF(AND('Att. Dairy'!C32=\"\"),\"\",'Att. Dairy'!C32)","v":""},"",{"$f":"IF(AND('Att. Dairy'!D32=\"\"),\"\",'Att. Dairy'!D32)","v":"Wednesday"},"nkyjksVh",{"$nulls":15},"W","W",{"$nulls":45},"2022-07-27","","","","","","","","","","","","","","","","","","","","","",""]
[28,{"$f":"IF(AND('Att. Dairy'!B33=\"\"),\"\",'Att. Dairy'!B33)","v":"2022-07-28"},{"v":191.65,"d":"191.650"},{"v":150,"d":"150.000"},{"$nulls":6},{"v":191.65,"d":"191.650"},{"v":150,"d":"150.000"},{"$f":"IF(OR('Att. Dairy'!H33=\"\",R33=0,R33=\"\"),\"\",'Att. Dairy'!H33)","v":""},{"$f":"IF(OR('Att. Dairy'!I33=\"\",R33=0,R33=\"\"),\"\",'Att. Dairy'!I33)","v":""},0,{"$f":"IF(AND('Att. Dairy'!N33=\"\"),\"\",'Att. Dairy'!N33)","v":""},{"$f":"IF(AND('Att. Dairy'!O33=\"\"),\"\",'Att. Dairy'!O33)","v":""},0,{"v":0,"d":"0.000"},{"v":0,"d":"0.000"},{"v":191.65,"d":"191.650"},{"v":150,"d":"150.000"},{"$f":"IFERROR(IF(AND('Att. Dairy'!B33=\"\"),\"\",IF(AND(X33=\"vodk'k\"),\"\",IF(AND(R33=\"\"),\"\",R33*$AA$1))),\"\")","v":{"v":0,"d":"0.00"}},{"$f":"IF(AND('Att. Dairy'!B33=\"\"),\"\",IF(AND(P33=\"\"),\"\",AH33))","v":""},{"$nulls":6},{"$f":"IF(AND('Att. Dairy'!C33=\"\"),\"\",'Att. Dairy'!C33)","v":""},"",{"$f":"IF(AND('Att. Dairy'!D33=\"\"),\"\",'Att. Dairy'!D33)","v":"Thursday"},"f[kpM+h",{"$nulls":15},"R","R",{"$nulls":45},"2022-07-28","","","","","","","","","","","","","","","","","","","","","",""]
[29,{"$f":"IF(AND('Att. Dairy'!B34=\"\"),\"\",'Att. Dairy'!B34)","v":"2022-07-29"},{"v":191.65,"d":"191.650"},{"v":150,"d":"150.000"},{"$nulls":6},{"v":191.65,"d":"191.650"},{"v":150,"d":"150.000"},{"$f":"IF(OR('Att. Dairy'!H34=\"\",R34=0,R34=\"\"),\"\",'Att. Dairy'!H34)","v":""},{"$f":"IF(OR('Att. Dairy'!I34=\"\",R34=0,R34=\"\"),\"\",'Att. Dairy'!I34)","v":""},0,{"$f":"IF(AND('Att. Dairy'!N34=\"\"),\"\",'Att. Dairy'!N34)","v":""},{"$f":"IF(AND('Att. Dairy'!O34=\"\"),\"\",'Att. Dairy'!O34)","v":""},0,{"v":0,"d":"0.000"},{"v":0,"d":"0.000"},{"v":191.65,"d":"191.650"},{"v":150,"d":"150.000"},{"$f":"IFERROR(IF(AND('Att. Dairy'!B34=\"\"),\"\",IF(AND(X34=\"vodk'k\"),\"\",IF(AND(R34=\"\"),\"\",R34*$AA$1))),\"\")","v":{"v":0,"d":"0.00"}},{"$f":"IF(AND('Att. Dairy'!B34=\"\"),\"\",IF(AND(P34=\"\"),\"\",AH34))","v":""},{"$nulls":6},{"$f":"IF(AND('Att. Dairy'!C34=\"\"),\"\",'Att. Dairy'!C34)","v":""},"",{"$f":"IF(AND('Att. Dairy'!D34=\"\"),\"\",'Att. Dairy'!D34)","v":"Friday"},"nkyjksVh",{"$nulls":15},"W","W",{"$nulls":45},"2022-07-29","","","","","","","","","","","","","","","","","","","","","",""]
[30,{"$f":"IF(AND('Att. Dairy'!B35=\"\"),\"\",'Att. Dairy'!B35)","v":"2022-07-30"},{"v":191.65,"d":"191.650"},{"v":150,"d":"150.000"},{"$nulls":6},{"v":191.65,"d":"191.650"},{"v":150,"d":"150.000"},{"$f":"IF(OR('Att. Dairy'!H35=\"\",R35=0,R35=\"\"),\"\",'Att. Dairy'!H35)","v":""},{"$f":"IF(OR('Att. Dairy'!I35=\"\",R35=0,R35=\"\"),\"\",'Att. Dairy'!I35)","v":""},0,{"$f":"IF(AND('Att. Dairy'!N35=\"\"),\"\",'Att. Dairy'!N35)","v":""},{"$f":"IF(AND('Att. Dairy'!O35=\"\"),\"\",'Att. Dairy'!O35)","v":""},0,{"v":0,"d":"0.000"},{"v":0,"d":"0.000"},{"v":191.65,"d":"191.650"},{"v":150,"d":"150.000"},{"$f":"IFERROR(IF(AND('Att. Dairy'!B35=\"\"),\"\",IF(AND(X35=\"vodk'k\"),\"\",IF(AND(R35=\"\"),\"\",R35*$AA$1))),\"\")","v":{"v":0,"d":"0.00"}},{"$f":"IF(AND('Att. Dairy'!B35=\"\"),\"\",IF(AND(P35=\"\"),\"\",AH35))","v":""},{"$nulls":6},{"$f":"IF(AND('Att. Dairy'!C35=\"\"),\"\",'Att. Dairy'!C35)","v":""},"",{"$f":"IF(AND('Att. Dairy'!D35=\"\"),\"\",'Att. Dairy'!D35)","v":"Saturday"},"lCthjksVh",{"$nulls":15},"W","W",{"$nulls":45},"2022-07-30","","","","","","","","","","","","","","","","","","","","","",""]
[31,{"$f":"IF(AND('Att. Dairy'!B36=\"\"),\"\",'Att. Dairy'!B36)","v":"2022-07-31"},{"v":191.65,"d":"191.650"},{"v":150,"d":"150.000"},{"$nulls":6},{"v":191.65,"d":"191.650"},{"v":150,"d":"150.000"},{"$f":"IF(OR('Att. Dairy'!H36=\"\",R36=0,R36=\"\"),\"\",'Att. Dairy'!H36)","v":""},{"$f":"IF(OR('Att. Dairy'!I36=\"\",R36=0,R36=\"\"),\"\",'Att. Dairy'!I36)","v":""},0,{"$f":"IF(AND('Att. Dairy'!N36=\"\"),\"\",'Att. Dairy'!N36)","v":""},{"$f":"IF(AND('Att. Dairy'!O36=\"\"),\"\",'Att. Dairy'!O36)","v":""},0,{"v":0,"d":"0.000"},{"v":0,"d":"0.000"},{"v":191.65,"d":"191.650"},{"v":150,"d":"150.000"},{"$f":"IFERROR(IF(AND('Att. Dairy'!B36=\"\"),\"\",IF(AND(X36=\"vodk'k\"),\"\",IF(AND(R36=\"\"),\"\",R36*$AA$1))),\"\")","v":{"v":0,"d":"0.00"}},{"$f":"IF(AND('Att. Dairy'!B36=\"\"),\"\",IF(AND(P36=\"\"),\"\",AH36))","v":""},{"$nulls":6},{"$f":"IF(AND('Att. Dairy'!C36=\"\"),\"\",'Att. Dairy'!C36)","v":""},"",{"$f":"IF(AND('Att. Dairy'!D36=\"\"),\"\",'Att. Dairy'!D36)","v":"Sunday"},"vodk'k",{"$nulls":15},false,false,{"$nulls":45},"2022-07-31","","","","","","","","","","","","","","","","","","","","","",""]
[null,null,"dqy",null,{"$f":"SUM(E6:E36)","v":{"v":0,"d":"0.000"}},{"$f":"SUM(F6:F36)","v":{"v":0,"d":"0.000"}},{"$f":"SUM(G6:G36)","v":{"v":0,"d":"0.000"}},{"$f":"SUM(H6:H36)","v":{"v":0,"d":"0.000"}},{"v":0,"d":"0.000"},{"v":0,"d":"0.000"},null,null,{"$f":"SUM(M6:M36)","v":180},{"$f":"SUM(N6:N36)","v":210},390,180,209,389,{"$f":"SUM(S6:S36)","v":{"v":58.35,"d":"58.350"}},{"$f":"SUM(T6:T36)","v":{"v":0,"d":"0.000"}},null,null,{"$f":"SUM(W6:W36)","v":2898.05},{"$nulls":7},{"$f":"IF(AND('Att. Dairy'!C37=\"\"),\"\",'Att. Dairy'!C37)","v":"Total "},false,{"$f":"IF(AND('Att. Dairy'!D37=\"\"),\"\",'Att. Dairy'!D37)","v":""},{"$nulls":16},"",false,{"$nulls":48},{"$f":"SUM(CV6:CV36)","v":{"v":0,"d":"0.00"}},{"$f":"SUM(CW6:CW36)","v":{"v":0,"d":"0.00"}},{"v":0,"d":"0.00"},{"v":0,"d":"0.00"},{"v":0,"d":"0.00"},{"v":0,"d":"0.00"},null,null,{"$f":"SUM(DD6:DD36)","v":180},{"$f":"SUM(DE6:DE36)","v":210},null,180,209,null,{"$f":"SUM(DJ6:DJ36)","v":{"v":58.35,"d":"58.350"}},{"$f":"SUM(DK6:DK36)","v":{"v":0,"d":"0.000"}},null,null,{"$f":"SUM(DN6:DN36)","v":2898.05}]
[{"$nulls":19},{"$f":"S37+T37","v":{"v":58.35,"d":"58.350"}},null,null,{"$f":"SUM(#REF!)","v":{"$error":"#REF!"}},{"$nulls":7},{"$f":"IF(AND('Att. Dairy'!C38=\"\"),\"\",'Att. Dairy'!C38)","v":""},"",{"$nulls":16},{"v":0,"d":"0.000"},"",""]
[{"$nulls":8},{"$f":"G37+I37","v":{"v":0,"d":"0.000"}},{"$f":"H37+J37","v":{"v":0,"d":"0.000"}},{"$nulls":12},{"$f":"#REF!","v":{"$error":"#REF!"}},{"$nulls":7},{"$f":"IF(AND('Att. Dairy'!C39=\"\"),\"\",'Att. Dairy'!C39)","v":""},"",{"$nulls":16},0,"",""]
[{"$nulls":8},{"v":0,"d":"0.000"},{"v":0,"d":"0.000"},{"$nulls":12},{"$f":"SUM(W39-W37+W38)","v":{"$error":"#REF!"}},{"$nulls":7},{"$f":"IF(AND('Att. Dairy'!C40=\"\"),\"\",'Att. Dairy'!C40)","v":""},"",{"$nulls":16},{"v":0,"d":"0.00"},"",""]
[{"$nulls":30},{"$f":"IF(AND('Att. Dairy'!#REF!=\"\"),\"\",'Att. Dairy'!#REF!)","v":{"$error":"#REF!"}},{"$error":"#REF!"},{"$nulls":17},"",{"$error":"#REF!"}]
[{"$nulls":30},{"$f":"IF(AND('Att. Dairy'!#REF!=\"\"),\"\",'Att. Dairy'!#REF!)","v":{"$error":"#REF!"}},{"$error":"#REF!"},{"$nulls":17},"",{"$error":"#REF!"}]
[{"$nulls":18},"ekg esa çkIr dqy jkf'k",{"$nulls":11},{"$f":"IF(AND('Att. Dairy'!#REF!=\"\"),\"\",'Att. Dairy'!#REF!)","v":{"$error":"#REF!"}},{"$error":"#REF!"},{"$nulls":17},"",{"$error":"#REF!"}]
[{"$nulls":18},"ekg esa O;; dqy jkf'k",{"$nulls":11},{"$f":"IF(AND('Att. Dairy'!#REF!=\"\"),\"\",'Att. Dairy'!#REF!)","v":{"$error":"#REF!"}},{"$error":"#REF!"},{"$nulls":17},"",{"$f":"IF(AND(AU44=\"\"),AX44,AV44)","v":""}]
[{"$nulls":18},"ekg esa 'ks\"k jkf'k",{"$nulls":11},{"$f":"IF(AND('Att. Dairy'!C41=\"\"),\"\",'Att. Dairy'!C41)","v":""}]
[{"$nulls":18},"ekg esa ykHkfUor fo|kFkhZ",{"$nulls":11},{"$f":"IF(AND('Att. Dairy'!C42=\"\"),\"\",'Att. Dairy'!C42)","v":""}]
[{"$nulls":30},{"$f":"IF(AND('Att. Dairy'!C43=\"\"),\"\",'Att. Dairy'!C43)","v":""}]
[{"$nulls":30},{"$f":"IF(AND('Att. Dairy'!C44=\"\"),\"\",'Att. Dairy'!C44)","v":""}]

{"sheet":"Dak","index":6,"n_rows":83,"n_cols":29,"rows_kept":83,"merged":[[1,4,1,6],[3,0,3,8],[4,1,4,9],[5,13,6,14],[6,1,6,9],[7,1,7,9],[9,1,9,10],[10,1,10,2],[10,3,10,5],[10,6,10,7],[10,8,10,10],[11,1,11,2],[11,3,11,5],[11,6,11,7],[11,8,11,10],[12,1,12,2],[12,3,12,4],[12,6,12,7],[12,8,12,9],[13,1,13,2],[13,3,13,4],[13,6,13,7],[13,8,13,9],[14,1,14,2],[14,3,14,4],[14,6,14,7],[14,8,14,9],[15,3,15,4],[15,6,15,7],[15,8,15,10],[16,3,16,4],[16,6,16,7],[16,8,16,10],[17,1,17,2],[17,3,17,4],[17,6,17,7],[17,8,17,10],[18,1,18,2],[18,3,18,4],[18,6,18,7],[18,8,18,10],[19,1,19,2],[19,3,19,4],[19,6,19,7],[19,8,19,10],[20,1,20,2],[20,3,20,5],[20,6,20,7],[20,8,20,10],[22,1,22,10],[23,1,23,6],[23,7,23,8],[23,9,23,10],[24,1,24,6],[24,7,24,8],[24,9,24,10],[25,1,25,6],[25,7,25,8],[25,9,25,10],[26,1,26,6],[26,7,26,8],[26,9,26,10],[27,1,27,10],[28,1,28,10],[29,1,29,2],[29,3,29,5],[29,6,29,8],[29,9,29,10],[30,1,30,2],[30,3,30,5],[30,6,30,8],[30,9,30,10],[31,1,32,3],[31,4,31,5],[31,6,32,6],[31,7,32,8],[31,9,32,10],[33,1,33,3],[33,7,33,8],[33,9,33,10],[34,1,34,3],[34,7,34,8],[34,9,34,10],[35,1,35,3],[35,7,35,8],[35,9,35,10],[36,1,36,3],[36,7,36,8],[36,9,36,10],[37,1,37,3],[37,7,37,8],[37,9,37,10],[41,1,41,3],[41,6,41,10],[43,1,43,10],[44,1,44,5],[44,6,44,10],[45,4,45,5],[45,9,45,10],[46,4,46,5],[46,9,46,10],[48,1,48,10],[49,1,49,2],[49,3,49,5],[49,6,49,8],[49,9,49,10],[50,1,50,2],[50,3,50,5],[50,6,50,8],[50,9,50,10],[52,1,52,10],[53,1,53,5],[53,6,53,10],[54,9,54,10],[55,9,55,10],[56,9,56,10],[58,1,58,10],[59,1,59,8],[59,9,59,10],[60,1,60,8],[60,9,60,10],[61,1,61,8],[61,9,61,10],[62,1,62,8],[62,9,62,10],[63,0,63,10],[64,1,64,10],[65,1,65,5],[66,1,66,5],[66,6,66,7],[66,8,66,10],[67,1,67,5],[67,6,67,10],[68,1,68,5],[68,6,68,10],[69,1,69,5],[69,6,69,10],[70,1,70,5],[70,6,70,10],[72,1,72,10],[73,1,73,5],[73,6,73,10],[77,8,77,10],[78,1,78,4],[78,8,78,10],[79,1,79,5],[82,1,82,3],[82,6,82,10]]}
[]
[{"$nulls":4},"jktLFkku ljdkj"]
[]
["Mid Day Meal Scheme"]
[null,"School Monthaly Data capture Format (MDCF)"]
[]
[null,"Instructions : Keep Following Registers At The Time Filling The Form:-"]
[null,"1) Enrolment Register , 2) Account , 3) Bank Account Pass Book , 4) Cooking Coast Details etc."]
[]
[null,"1. School Details"]
[null,"Month :",null,{"$f":"'MASTER DATA'!C20","v":"July-2022"},null,null,"Year :",null,{"$f":"CONCATENATE('MASTER DATA'!F4,\"-\",'MASTER DATA'!H4)","v":"2022-2023"}]
[null,"School Code",null,{"$f":"'MASTER DATA'!C11","v":1009},null,null,"School Name",null,{"$f":"'MASTER DATA'!C4","v":"MGGS Bar"}]
[null,"school Type",null,"i) Government",null,{"$f":"IF(AND(Z20=\"Government\"),\"ü\",\"\")","v":"ü"},"Category",null,"i) PS , UPS"]
[{"$nulls":3},"ii)  Local Body",null,{"$f":"IF(AND(Z20=\"Local Body\"),\"ü\",\"\")","v":""},null,null,"ii) Secondary"]
[{"$nulls":3},"iii)  EGS/AIE Centers",null,{"$f":"IF(AND(Z20=\"EGS/AIE Centers\"),\"ü\",\"\")","v":""},null,null,"iii) Sr. Secondary",null,"ü"]
[{"$nulls":3},"iv)  NCLP",null,{"$f":"IF(AND(Z20=\"NCLP\"),\"ü\",\"\")","v":""},"Village / Ward",null,{"$f":"'MASTER DATA'!C12","v":"BAR"}]
[{"$nulls":3},"v) Madarsa/ Maqtab",null,{"$f":"IF(AND(Z20=\"Madarsa/ Maqtab\"),\"ü\",\"\")","v":""},"Block",null,{"$f":"'MASTER DATA'!C19","v":"RAIPUR"}]
[null,"Area",null,"i) Rural",null,{"$f":"IF(AND(Z18=\"Rural\"),\"ü\",\"\")","v":"ü"},"District",null,{"$f":"'MASTER DATA'!C18","v":"PALI"},{"$nulls":16},{"$f":"'MASTER DATA'!C16","v":"Rural"}]
[{"$nulls":3},"ii) Urban",null,{"$f":"IF(AND(Z18=\"Urban\"),\"ü\",\"\")","v":""},"Type of Kitchen",null,"School Kitchen"]
[{"$nulls":3},"iii) Rural cum Urban",null,{"$f":"IF(AND(Z18=\"Rural cum Urban\"),\"ü\",\"\")","v":""},"Total Enrolment",null,{"$f":"'MASTER DATA'!P20","v":496},{"$nulls":16},{"$f":" 'MASTER DATA'!C15","v":"Government"}]
[null,"State",null,{"$f":"'MASTER DATA'!C17","v":"Rajasthan"},null,null,"NGO / SHG"]
[]
[null,"2. Meals Availed Status"]
[{"$nulls":7},"Primary",null,"upper Primary",{"$nulls":15},{"$f":"IF(AND(B34=\"\"),\"\",IF(AND('MASTER DATA'!AF30=TRUE),\"MALE\",IF(AND('MASTER DATA'!AF30=FALSE),\"FEMALE\")))","v":"FEMALE"},null,{"$f":"IF(AND(B34=\"\"),\"\",IF(AND('MASTER DATA'!AH30=TRUE),\"GEN\",IF(AND('MASTER DATA'!AI30=TRUE),\"OBC\",IF(AND('MASTER DATA'!AJ30=TRUE),\"SC\",IF(AND('MASTER DATA'!AK30=TRUE),\"ST\")))))","v":"OBC"},{"$f":"IF(AND(B34=\"\"),\"\",IF(AND('MASTER DATA'!AL30=TRUE),\"By Cheqe\",IF(AND('MASTER DATA'!AM30=FALSE),\"By Cash\")))","v":"By Cheqe"}]
[null,"i) Number of School days during month.",{"$nulls":5},{"$f":"'Att. Dairy'!K42","v":2},null,{"$f":"'Att. Dairy'!N42","v":2},{"$nulls":15},{"$f":"IF(AND(B35=\"\"),\"\",IF(AND('MASTER DATA'!AF31=TRUE),\"MALE\",IF(AND('MASTER DATA'!AF31=FALSE),\"FEMALE\")))","v":"FEMALE"},null,{"$f":"IF(AND(B35=\"\"),\"\",IF(AND('MASTER DATA'!AH31=TRUE),\"GEN\",IF(AND('MASTER DATA'!AI31=TRUE),\"OBC\",IF(AND('MASTER DATA'!AJ31=TRUE),\"SC\",IF(AND('MASTER DATA'!AK31=TRUE),\"ST\")))))","v":"GEN"},{"$f":"IF(AND(B35=\"\"),\"\",IF(AND('MASTER DATA'!AL31=TRUE),\"By Cheqe\",IF(AND('MASTER DATA'!AM31=FALSE),\"By Cash\")))","v":"By Cheqe"}]
[null,"ii) Actual number of days Mid day Meal served",{"$nulls":5},{"$f":"'Att. Dairy'!K39","v":2},null,{"$f":"'Att. Dairy'!N39","v":2},{"$nulls":15},{"$f":"IF(AND(B36=\"\"),\"\",IF(AND('MASTER DATA'!AF32=TRUE),\"MALE\",IF(AND('MASTER DATA'!AF32=FALSE),\"FEMALE\")))","v":""},null,{"$f":"IF(AND(B36=\"\"),\"\",IF(AND('MASTER DATA'!AH32=TRUE),\"GEN\",IF(AND('MASTER DATA'!AI32=TRUE),\"OBC\",IF(AND('MASTER DATA'!AJ32=TRUE),\"SC\",IF(AND('MASTER DATA'!AK32=TRUE),\"ST\")))))","v":""},{"$f":"IF(AND(B36=\"\"),\"\",IF(AND('MASTER DATA'!AL32=TRUE),\"By Cheqe\",IF(AND('MASTER DATA'!AM32=FALSE),\"By Cash\")))","v":""}]
[null,"iii) Total Meals served during the month*",{"$nulls":5},{"$f":"'PS Balance Sheet'!R37","v":492},null,{"$f":"'UPS balance Sheet'!R37","v":389},{"$nulls":15},{"$f":"IF(AND(B37=\"\"),\"\",IF(AND('MASTER DATA'!AF33=TRUE),\"MALE\",IF(AND('MASTER DATA'!AF33=FALSE),\"FEMALE\")))","v":""},null,{"$f":"IF(AND(B37=\"\"),\"\",IF(AND('MASTER DATA'!AH33=TRUE),\"GEN\",IF(AND('MASTER DATA'!AI33=TRUE),\"OBC\",IF(AND('MASTER DATA'!AJ33=TRUE),\"SC\",IF(AND('MASTER DATA'!AK33=TRUE),\"ST\")))))","v":""},{"$f":"IF(AND(B37=\"\"),\"\",IF(AND('MASTER DATA'!AL33=TRUE),\"By Cheqe\",IF(AND('MASTER DATA'!AM33=FALSE),\"By Cash\")))","v":""}]
[null,"*total Meals served during the Month : Total attendance (-Minus) total children not availed Mid Day Meals during the Month."]
[null,"3. Cook Cum Helper Amount Detail (In Rs.)"]
[null,"Opening Balance",null,"Received during the Month",null,null,"Total Expenditure during the Month",null,null,"closing Balance"]
[null,{"$f":"'Prarmbhik Shesh'!D14+'Prarmbhik Shesh'!F14","v":4000},null,{"$f":"'Prarmbhik Shesh'!D15+'Prarmbhik Shesh'!F15","v":12000},null,null,{"$f":"'Prarmbhik Shesh'!D17+'Prarmbhik Shesh'!F17","v":0},null,null,{"$f":"B31+D31-G31","v":16000}]
[null,"Cook-cum-helper Name",null,null,"Gender                     ",null,"Category","Mode of Payment                    ( Cash/Bank)",null,"Amount Received during the month (Rs.)"]
[{"$nulls":4},"Male","Female"]
[null,{"$f":"IF(AND('MASTER DATA'!C35=\"\"),\"\",'MASTER DATA'!C35)","v":"Dhagalai Devi"},null,null,{"$f":"IF(AND(Z24=\"Male\"),\"ü\",\"\")","v":""},{"$f":"IF(AND(Z24=\"Female\"),\"ü\",\"\")","v":"ü"},{"$f":"AB24","v":"OBC"},{"$f":"AC24","v":"By Cheqe"},null,{"$f":"IF(AND('MASTER DATA'!P35=\"\"),\"\",'MASTER DATA'!P35)","v":{"v":1320,"d":"1320.00"}},{"$nulls":5},"YES"]
[null,{"$f":"IF(AND('MASTER DATA'!C36=\"\"),\"\",'MASTER DATA'!C36)","v":"Geeta Devi"},null,null,{"$f":"IF(AND(Z25=\"Male\"),\"ü\",\"\")","v":""},{"$f":"IF(AND(Z25=\"Female\"),\"ü\",\"\")","v":"ü"},{"$f":"AB25","v":"GEN"},{"$f":"AC25","v":"By Cheqe"},null,{"$f":"IF(AND('MASTER DATA'!P36=\"\"),\"\",'MASTER DATA'!P36)","v":{"v":1320,"d":"1320.00"}},{"$nulls":5},"NO"]
[null,{"$f":"IF(AND('MASTER DATA'!C37=\"\"),\"\",'MASTER DATA'!C37)","v":""},null,null,{"$f":"IF(AND(Z26=\"Male\"),\"ü\",\"\")","v":""},{"$f":"IF(AND(Z26=\"Female\"),\"ü\",\"\")","v":""},"","",null,{"$f":"IF(AND('MASTER DATA'!P37=\"\"),\"\",'MASTER DATA'!P37)","v":""}]
[null,{"$f":"IF(AND('MASTER DATA'!C38=\"\"),\"\",'MASTER DATA'!C38)","v":""},null,null,"",{"$f":"IF(AND(Z27=\"Female\"),\"ü\",\"\")","v":""},"",{"$f":"AC27","v":""},null,{"$f":"IF(AND('MASTER DATA'!P38=\"\"),\"\",'MASTER DATA'!P38)","v":""}]
[null,{"$f":"IF(AND('MASTER DATA'!C39=\"\"),\"\",'MASTER DATA'!C39)","v":""},null,null,"",""]
[]
[]
[]
[null,"monthly data capture formet",{"$nulls":4},"Mid Day Meals scheme, MHRD, Govt. Of India"]
[]
[null,"4. Cooking cost Details (In Rs.)"]
[null,"Primary",{"$nulls":4},"Upper Primary"]
[null,"Opening Balance","Amount Received during Month","Expenditure during the month","closing Balance",null,"Opening Balance","Amount Received during Month","Expenditure during the month","closing Balance"]
[null,{"$f":"'Prarmbhik Shesh'!D9","v":10000},{"$f":"'Prarmbhik Shesh'!D10","v":0},{"$f":"'PS Balance Sheet'!W37","v":2445.24},{"$f":"B47+C47-D47","v":7554.76},null,{"$f":"'Prarmbhik Shesh'!F9","v":15000},{"$f":"'Prarmbhik Shesh'!F10","v":0},{"$f":"'UPS balance Sheet'!W37","v":2898.05},{"$f":"G47+H47-I47","v":12101.95}]
[]
[null,"5. School Expenses  : Management , Monitoring and Evaluation Expenses"]
[null,"Opening Balance",null," Received during the Month",null,null,"Total Expenditure during the month",null,null,"closing Balance"]
[null,0,{"$nulls":4},0,null,null,{"$f":"B51+D51-G51","v":0}]
[]
[null,"6. Details of food grain (In kilograme)"]
[null,"Primary",{"$nulls":4},"Upper Primary"]
[null,"Food Grain","Opening Balance","Food grain Received during Month","Consumption during the month","Closing Balance","Opening Balance","Food grain Received during Month","Consumption during the month","closing Balance"]
[null,"Wheat",{"$f":"'Prarmbhik Shesh'!D7","v":{"v":300,"d":"300.00"}},{"$f":"'PS Balance Sheet'!E37+'PS Balance Sheet'!G37+'PS Balance Sheet'!I37","v":0},{"$f":"'PS Balance Sheet'!S37","v":{"v":49.2,"d":"49.200"}},{"$f":"C56+D56-E56","v":{"v":250.8,"d":"250.800"}},{"$f":"'Prarmbhik Shesh'!F7","v":{"v":250,"d":"250.00"}},{"$f":"'UPS balance Sheet'!E37+'UPS balance Sheet'!G37+'UPS balance Sheet'!I37","v":0},{"$f":"'UPS balance Sheet'!S37","v":{"v":58.35,"d":"58.350"}},{"$f":"G56+H56-I56","v":{"v":191.65,"d":"191.650"}}]
[null,"Rice",{"$f":"'Prarmbhik Shesh'!D8","v":{"v":200,"d":"200.00"}},{"$f":"'PS Balance Sheet'!F37+'PS Balance Sheet'!H37+'PS Balance Sheet'!J37","v":0},{"$f":"'PS Balance Sheet'!T37","v":{"v":0,"d":"0.000"}},{"$f":"C57+D57-E57","v":{"v":200,"d":"200.000"}},{"$f":"'Prarmbhik Shesh'!F8","v":{"v":150,"d":"150.00"}},{"$f":"'UPS balance Sheet'!F37+'UPS balance Sheet'!H37+'UPS balance Sheet'!J37","v":0},{"$f":"'UPS balance Sheet'!T37","v":{"v":0,"d":"0.000"}},{"$f":"G57+H57-I57","v":{"v":150,"d":"150.000"}}]
[]
[null,"7. Children Health Status"]
[null,"1) No. of children from class 1 to 8 who had received 4 IFA tablets (Boys)"]
[null,"2) No. of children from class 1 to 8 who had received 4 IFA tablets (Girls)"]
[null,"3) No. of children screened by mobile health (RBSK) team"]
[null,"3) No. of children referred by mobile health (RBSK) team"]
[]
[null,"8. school Inspection"]
[null,"school inspection done during the month",{"$nulls":4},"Yes",null,"No"]
[null,"Inspected By",{"$nulls":4},"(In Numbers)"]
[null,"Member of Task Force"]
[null,"District Officials"]
[null,"Block/taluka level officials"]
[null,"SMC Members"]
[]
[null,"9. Untowards incidents during the month ( If any)"]
[null,"Number of Incident occurred during the month"]
[]
[]
[]
[{"$nulls":8},"…………………………………………………"]
[null,"……………………………………………………………….",{"$nulls":6},"Signature of Head Teacher"]
[null,"Signature of the SMC Chairperson / Gram Pradhan"]
[]
[]
[null,"monthly data capture formet",{"$nulls":4},"Mid Day Meals scheme, MHRD, Govt. Of India"]

{"sheet":"UC Food","index":7,"n_rows":27,"n_cols":36,"rows_kept":27,"merged":[[0,8,0,27],[1,8,1,24],[2,1,2,2],[2,3,2,13],[2,14,2,18],[2,19,2,31],[3,10,3,21],[3,26,3,27],[3,28,3,33],[4,0,6,0],[4,1,6,1],[4,2,4,3],[4,4,4,5],[4,6,4,9],[4,10,4,13],[4,14,4,17],[4,18,4,21],[4,22,4,25],[4,26,4,29],[4,30,4,33],[4,34,6,34],[4,35,6,35],[5,2,6,2],[5,3,6,3],[5,4,6,4],[5,5,6,5],[5,6,5,7],[5,8,5,9],[5,10,5,11],[5,12,5,13],[5,14,5,15],[5,16,5,17],[5,18,5,19],[5,20,5,21],[5,22,5,23],[5,24,5,25],[5,26,5,27],[5,28,5,29],[5,30,5,31],[5,32,5,33],[10,8,10,24],[11,10,11,21],[12,0,14,0],[12,1,14,2],[12,3,12,11],[12,12,12,17],[12,18,12,23],[12,24,12,29],[12,30,12,35],[13,3,14,5],[13,6,14,8],[13,9,14,11],[13,12,14,13],[13,14,14,15],[13,16,14,17],[13,18,14,19],[13,20,14,21],[13,22,14,23],[13,24,14,25],[13,26,14,27],[13,28,14,29],[13,30,14,31],[13,32,14,33],[13,34,14,35],[15,1,15,2],[15,3,15,5],[15,6,15,8],[15,9,15,11],[15,12,15,13],[15,14,15,15],[15,16,15,17],[15,18,15,19],[15,20,15,21],[15,22,15,23],[15,24,15,25],[15,26,15,27],[15,28,15,29],[15,30,15,31],[15,32,15,33],[15,34,15,35],[16,1,16,2],[16,3,16,5],[16,6,16,8],[16,9,16,11],[16,12,16,13],[16,14,16,15],[16,16,16,17],[16,18,16,19],[16,20,16,21],[16,22,16,23],[16,24,16,25],[16,26,16,27],[16,28,16,29],[16,30,16,31],[16,32,16,33],[16,34,16,35],[18,8,18,24],[19,10,19,21],[20,0,22,0],[20,1,22,2],[20,3,20,6],[20,7,20,14],[20,19,20,22],[20,23,22,24],[20,25,22,26],[20,27,22,28],[20,29,22,30],[20,31,22,33],[20,34,22,35],[21,3,22,4],[21,5,22,6],[21,7,21,8],[21,9,21,10],[21,11,21,12],[21,13,21,14],[21,15,22,15],[21,16,22,16],[21,17,22,18],[21,19,22,20],[21,21,22,22],[23,1,23,2],[23,3,23,4],[23,5,23,6],[23,17,23,18],[23,19,23,20],[23,21,23,22],[23,23,23,24],[23,25,23,26],[23,27,23,28],[23,29,23,30],[23,31,23,33],[23,34,23,35],[24,1,24,2],[24,3,24,4],[24,5,24,6],[24,17,24,18],[24,19,24,20],[24,21,24,22],[24,23,24,24],[24,25,24,26],[24,27,24,28],[24,29,24,30],[24,31,24,33],[24,34,24,35],[25,1,25,18],[26,24,27,34]]}
[{"$nulls":8},"feM&Ms&ehy dk;ZØe"]
[{"$nulls":8},"[kk|kUu dk mi;ksfxrk izek.k&i= ¼lesfdr½ ¼fdyksxzke esa½"]
[null," fo|ky; dk uke %&",null,{"$f":"IF(AND('MASTER DATA'!C4=\"\"),\"\",'MASTER DATA'!C4)","v":"MGGS Bar"},{"$nulls":10},"uksMy dsUnz dk uke %&",{"$nulls":4},{"$f":"IF(AND('MASTER DATA'!C5=\"\"),\"\",'MASTER DATA'!C5)","v":"jkmekfo cj"}]
[{"$nulls":10},"izi=&1",{"$nulls":15},"ekg %&",null,{"$f":"IF(AND('MASTER DATA'!J4=\"\"),\"\",'MASTER DATA'!J4)","v":"tqykbZ&2022"}]
["Øl"," fo|ky; dk uke","dqy ukekadu",null,"dqy ykHkkfoUr Nk=@Nk=k",null,"iwoZ dk 'ks\"k [kk|kUu",{"$nulls":3},"lIyk;j ls izkIr",{"$nulls":3},"tu lg;ksx ;k vU; ls izkIr",{"$nulls":3},"dqy miyC/k [kk|kUu",{"$nulls":3},"ekg esa mi;ksx",{"$nulls":3},"vU;= O;ofLFkr fd;k x;k [kk|kUu",{"$nulls":3}," 'ks\"k [kk|kUu",{"$nulls":3},"dk;Z fnol","dqd de gsYij  dh la[;k"]
[null,null,"d{kk 1 ls 5","d{kk 6 ls 8","d{kk 1 ls 5","d{kk 6 ls 8","d{kk 1 ls 5",null,"d{kk 6 ls 8",null,"d{kk 1 ls 5",null,"d{kk 6 ls 8",null,"d{kk 1 ls 5",null,"d{kk 6 ls 8",null,"d{kk 1 ls 5",null,"d{kk 6 ls 8",null,"d{kk 1 ls 5",null,"d{kk 6 ls 8",null,"d{kk 1 ls 5",null,"d{kk 6 ls 8",null,"d{kk 1 ls 5",null,"d{kk 6 ls 8"]
[{"$nulls":6},"xsagqW","pkoy","xsagqW","pkoy","xsagqW","pkoy","xsagqW","pkoy","xsagqW","pkoy","xsagqW","pkoy","xsagqW","pkoy","xsagqW","pkoy","xsagqW","pkoy","xsagqW","pkoy","xsagqW","pkoy","xsagqW","pkoy","xsagqW","pkoy","xsagqW","pkoy"]
[1,2,3,4,5,6,7,8,9,10,11,12,13,14,15,16,17,18,19,20,21,22,23,24,25,26,27,28,29,30,31,32,33,34,35,36]
[1,{"$f":"'MASTER DATA'!C4","v":"MGGS Bar"},{"$f":"'PS Balance Sheet'!O37","v":493},{"$f":"'UPS balance Sheet'!O37","v":390},{"$f":"'PS Balance Sheet'!R37","v":492},{"$f":"'UPS balance Sheet'!R37","v":389},{"$f":"'Prarmbhik Shesh'!D7","v":{"v":300,"d":"300.00"}},{"$f":"'Prarmbhik Shesh'!D8","v":{"v":200,"d":"200.00"}},{"$f":"'Prarmbhik Shesh'!F7","v":{"v":250,"d":"250.00"}},{"$f":"'Prarmbhik Shesh'!F8","v":{"v":150,"d":"150.00"}},{"$f":"'PS Balance Sheet'!E37","v":{"v":0,"d":"0.000"}},{"$f":"'PS Balance Sheet'!F37","v":{"v":0,"d":"0.000"}},{"$f":"'UPS balance Sheet'!E37","v":{"v":0,"d":"0.000"}},{"$f":"'UPS balance Sheet'!F37","v":{"v":0,"d":"0.000"}},{"$f":"'PS Balance Sheet'!G37","v":{"v":0,"d":"0.000"}},{"$f":"'PS Balance Sheet'!H37","v":{"v":0,"d":"0.000"}},{"$f":"'UPS balance Sheet'!G37","v":{"v":0,"d":"0.000"}},{"$f":"'UPS balance Sheet'!H37","v":{"v":0,"d":"0.000"}},{"$f":"G9+K9+O9","v":{"v":300,"d":"300.000"}},{"$f":"H9+L9+P9","v":{"v":200,"d":"200.000"}},{"$f":"I9+M9+Q9","v":{"v":250,"d":"250.000"}},{"$f":"J9+N9+R9","v":{"v":150,"d":"150.000"}},{"$f":"'PS Balance Sheet'!S37","v":{"v":49.2,"d":"49.200"}},{"$f":"'PS Balance Sheet'!T37","v":{"v":0,"d":"0.000"}},{"$f":"'UPS balance Sheet'!S37","v":{"v":58.35,"d":"58.350"}},{"$f":"'UPS balance Sheet'!T37","v":{"v":0,"d":"0.000"}},{"$f":"'PS Balance Sheet'!I37","v":0},{"$f":"'PS Balance Sheet'!J37","v":0},{"$f":"'UPS balance Sheet'!I37","v":0},{"$f":"'UPS balance Sheet'!J37","v":0},{"$f":"S9-W9-AA9","v":{"v":250.8,"d":"250.800"}},{"$f":"T9-X9-AB9","v":{"v":200,"d":"200.000"}},{"$f":"U9-Y9-AC9","v":{"v":191.65,"d":"191.650"}},{"v":150,"d":"150.000"},{"$f":"'Att. Dairy'!Q40","v":2},{"$f":"COUNTA('MASTER DATA'!C35:D38)-COUNTIF('MASTER DATA'!C35:D38,\"0\")-COUNTIF('MASTER DATA'!C35:D38,\"blank\")","v":2}]
[]
[{"$nulls":8},"jkf'k dk mi;ksfxrk izek.k&i= ¼lesfdr½ ¼:i;ksa esa½"]
[{"$nulls":10},"izi=&2"]
["Øl"," fo|ky; dk uke",null,"izkjfEHkd 'ks\"k",{"$nulls":8},"izkIr jkf'k",{"$nulls":5},"dqy izkIr jkf'k",{"$nulls":5},"ekg esa mi;ksx jkf'k",{"$nulls":5},"Hkqxrku i'pkr 'ks\"k jkf'k"]
[{"$nulls":3},"d{kk 1 ls 5        ¼ $ ;k & ½",null,null,"d{kk 6 ls 8         ¼ $ ;k & ½",null,null,"d{kk 1 ls 8         ¼ $ ;k & ½",null,null,"d{kk 1   \n ls 5",null,"d{kk 6    \nls 8",null,"d{kk 1    \nls 8",null,"d{kk 1   \n ls 5",null,"d{kk 6   \n ls 8",null,"d{kk 1   \n ls 8",null,"d{kk 1    \nls 5",null,"d{kk 6    \nls 8",null,"d{kk 1    \nls 8",null,"d{kk 1    ls 5",null,"d{kk 6    ls 8",null,"d{kk 1    ls 8"]
[]
[1,2,null,3,null,null,4,null,null,5,null,null,6,null,7,null,8,null,9,null,10,null,11,null,12,null,13,null,14,null,15,null,16,null,17]
[1,{"$f":"'MASTER DATA'!C4","v":"MGGS Bar"},null,{"$f":"'Prarmbhik Shesh'!D9","v":{"v":10000,"d":"10000.00"}},null,null,{"$f":"'Prarmbhik Shesh'!F9","v":{"v":15000,"d":"15000.00"}},null,null,{"$f":"D17+G17","v":{"v":25000,"d":"25000.00"}},null,null,{"$f":"'Prarmbhik Shesh'!D10","v":{"v":0,"d":"0.00"}},null,{"$f":"'Prarmbhik Shesh'!F10","v":{"v":0,"d":"0.00"}},null,{"$f":"M17+O17","v":{"v":0,"d":"0.00"}},null,{"$f":"D17+M17","v":{"v":10000,"d":"10000.00"}},null,{"$f":"G17+O17","v":{"v":15000,"d":"15000.00"}},null,{"$f":"J17+Q17","v":{"v":25000,"d":"25000.00"}},null,{"$f":"'Prarmbhik Shesh'!D12","v":2445.24},null,{"$f":"'Prarmbhik Shesh'!F12","v":2898.05},null,{"$f":"Y17+AA17","v":5343.29},null,{"$f":"S17-Y17","v":7554.76},null,{"$f":"U17-AA17","v":12101.95},null,{"$f":"W17-AC17","v":19656.71}]
[]
[{"$nulls":8},"HkkSfrd izxfr fjiksVZ ¼lesfdr½"]
[{"$nulls":10},"izi=&3"]
["Øl"," fo|ky; dk uke",null,"fujh{k.k dk fooj.k la[;k",{"$nulls":3},"fdpu 'ksM dh fLFkfr",{"$nulls":7},"is;ty lqfo/kk ¼gs.MiEi½",{"$nulls":3}," 'kkSpky; gS ;k ugh",{"$nulls":3},"vk;ksftr cSBd ,l-,elh- ¼fnuakd ½",null,"rjktq gS ;k ugh",null,"[kk|kUu lqjf{kr j[kus\nds crZu  la[;k",null,"jsEi gS ;k ugh",null,"ekg ds vUr rd dqy\n[kkyh cksfj;kW dh la[;k",null,null,"pkj fnokjh gS ;k ugh"]
[{"$nulls":3},"tuizfrfuf/k }kjk ",null,"vf/kdkfj;ksa }kjk",null,"Mh-ih-bZ-ih- }kjk",null,",l-th-vkj-okbZ }kjk",null,"vkn'kZ jlksbZ?kj",null,",e-Mh-,e- ;kstuk }kjk",null,"pkyw","[kjkc","udkjk",null,"Nk=",null,"Nk=k"]
[{"$nulls":7},"iw.kZ","viw.kZ","iw.kZ","viw.kZ","iw.kZ","viw.kZ","iw.kZ","viw.kZ"]
[1,2,null,3,null,4,null,5,6,7,8,9,10,11,12,13,14,15,null,16,null,17,null,18,null,19,null,20,null,21,null,22,null,null,23]
[1,{"$f":"'MASTER DATA'!C4","v":"MGGS Bar"},null,{"$f":"'MASTER DATA'!C24","v":0},null,{"$f":"'MASTER DATA'!E24","v":0},null,{"$f":"IF(AND('MASTER DATA'!AF36='MASTER DATA'!AF28),\"ü\",\"\")","v":""},{"$f":"IF(AND('MASTER DATA'!AG36='MASTER DATA'!AG28),\"ü\",\"\")","v":""},{"$f":"IF(AND('MASTER DATA'!AH36='MASTER DATA'!AH28),\"ü\",\"\")","v":""},{"$f":"IF(AND('MASTER DATA'!AI36='MASTER DATA'!AI28),\"ü\",\"\")","v":""},{"$f":"IF(AND('MASTER DATA'!AJ36='MASTER DATA'!AJ28),\"ü\",\"\")","v":"ü"},{"$f":"IF(AND('MASTER DATA'!AK36='MASTER DATA'!AK28),\"ü\",\"\")","v":""},{"$f":"IF(AND('MASTER DATA'!AL36='MASTER DATA'!AL28),\"ü\",\"\")","v":"ü"},{"$f":"IF(AND('MASTER DATA'!AM36='MASTER DATA'!AM28),\"ü\",\"\")","v":""},{"$f":"IF(AND('MASTER DATA'!AN36='MASTER DATA'!AN28),\"ü\",\"\")","v":"ü"},{"$f":"IF(AND('MASTER DATA'!AO36='MASTER DATA'!AO28),\"ü\",\"\")","v":""},{"$f":"IF(AND('MASTER DATA'!AP36='MASTER DATA'!AP28),\"ü\",\"\")","v":""},null,{"$f":"IF(AND('MASTER DATA'!AH38='MASTER DATA'!AP28),\"ü\",\"\")","v":"ü"},null,{"$f":"IF(AND('MASTER DATA'!AJ38='MASTER DATA'!AR28),\"ü\",\"\")","v":"ü"},null,{"$f":"IF(AND('MASTER DATA'!D27=\"\"),\"\",'MASTER DATA'!D27)","v":"2022-03-08"},null,{"$f":"IF(AND('MASTER DATA'!AF37='MASTER DATA'!AP28),\"YES\",\"NO\")","v":"YES"},null,{"$f":"IF(AND('MASTER DATA'!I27=\"\"),\"\",'MASTER DATA'!I27)","v":5},null,{"$f":"IF(AND('MASTER DATA'!AH37='MASTER DATA'!AP28),\"YES\",\"NO\")","v":"YES"},null,{"$f":"IF(AND('MASTER DATA'!P27=\"\"),\"\",'MASTER DATA'!P27)","v":2},null,null,{"$f":"IF(AND('MASTER DATA'!AJ37='MASTER DATA'!AP28),\"YES\",\"NO\")","v":"YES"}]
[null,"uksV %& lHkh dkWye dks lgh ,oa iw.kZ :i ls HkjsaA bldh leLr ftEesnkjh gLrk{kjdrkZ dh gksxhA"]
[{"$nulls":24},"gLrk{kj iz/kkuk/;kid @ iz/kkukpk;Z @ uksMy izHkkjh"]

{"sheet":"New UC Dak","index":8,"n_rows":58,"n_cols":35,"rows_kept":58,"merged":[[0,0,0,22],[1,8,1,13],[1,14,1,16],[2,7,2,16],[3,0,3,4],[3,5,3,14],[3,15,3,17],[3,18,3,22],[4,0,4,4],[4,5,4,14],[4,15,4,17],[4,18,4,22],[5,0,5,4],[5,5,5,14],[5,15,5,17],[5,18,5,22],[6,0,6,4],[6,5,6,14],[6,15,6,17],[6,18,6,22],[7,7,7,15],[8,0,8,4],[8,5,8,14],[8,15,8,17],[8,18,8,22],[9,0,12,0],[9,1,9,10],[9,11,11,11],[9,12,9,21],[9,22,11,22],[10,1,10,2],[10,3,10,4],[10,5,10,6],[10,7,10,8],[10,9,10,10],[10,12,10,13],[10,14,10,15],[10,16,10,17],[10,18,10,19],[10,20,10,21],[13,7,13,15],[14,0,14,9],[14,10,14,16],[14,17,14,22],[15,0,15,9],[15,10,15,16],[15,17,15,22],[16,7,16,15],[17,0,17,1],[17,2,17,11],[17,12,17,14],[17,15,17,17],[17,18,17,20],[17,21,17,22],[18,0,18,1],[18,2,18,11],[18,12,18,14],[18,15,18,17],[18,18,18,20],[18,21,18,22],[19,0,19,1],[19,2,19,11],[19,12,19,14],[19,15,19,17],[19,18,19,20],[19,21,19,22],[20,0,20,1],[20,2,20,11],[20,12,20,14],[20,15,20,17],[20,18,20,20],[20,21,20,22],[21,0,21,1],[21,2,21,11],[21,12,21,14],[21,15,21,17],[21,18,21,20],[21,21,21,22],[22,7,22,15],[23,0,23,1],[23,2,23,11],[23,12,23,14],[23,15,23,17],[23,18,23,22],[24,0,24,1],[24,2,24,11],[24,12,24,14],[24,15,24,17],[24,18,24,22],[25,0,25,1],[25,2,25,11],[25,12,25,14],[25,15,25,17],[25,18,25,22],[26,0,26,1],[26,2,26,11],[26,12,26,14],[26,15,26,17],[26,18,26,22],[27,0,27,1],[27,2,27,11],[27,12,27,14],[27,15,27,17],[27,18,27,22],[28,0,28,1],[28,2,28,11],[28,12,28,14],[28,15,28,17],[28,18,28,22],[29,3,29,20],[30,0,30,1],[30,2,30,6],[30,7,30,22],[31,0,31,1],[31,2,31,6],[31,7,31,22],[32,7,32,15],[33,0,34,1],[33,2,33,11],[33,12,33,22],[34,2,34,3],[34,4,34,5],[34,6,34,7],[34,8,34,9],[34,10,34,11],[34,12,34,13],[34,14,34,15],[34,16,34,17],[34,18,34,19],[34,20,34,22],[35,0,35,1],[35,2,35,3],[35,4,35,5],[35,6,35,7],[35,8,35,9],[35,10,35,11],[35,12,35,13],[35,14,35,15],[35,16,35,17],[35,18,35,19],[35,20,35,22],[36,0,36,1],[36,2,36,3],[36,4,36,5],[36,6,36,7],[36,8,36,9],[36,10,36,11],[36,12,36,13],[36,14,36,15],[36,16,36,17],[36,18,36,19],[36,20,36,22],[37,0,37,1],[37,2,37,3],[37,4,37,5],[37,6,37,7],[37,8,37,9],[37,10,37,11],[37,12,37,13],[37,14,37,15],[37,16,37,17],[37,18,37,19],[37,20,37,22],[38,6,38,16],[39,0,45,1],[39,2,39,22],[40,2,40,8],[40,9,40,15],[40,16,41,22],[41,2,41,8],[41,9,41,15],[42,2,42,8],[42,9,42,15],[42,16,42,22],[43,2,43,11],[43,12,43,22],[44,2,44,3],[44,4,44,5],[44,6,44,7],[44,8,44,9],[44,10,44,11],[44,12,44,13],[44,14,44,15],[44,16,44,17],[44,18,44,19],[44,20,44,22],[45,2,45,3],[45,4,45,5],[45,6,45,7],[45,8,45,9],[45,10,45,11],[45,12,45,13],[45,14,45,15],[45,16,45,17],[45,18,45,19],[45,20,45,22],[47,7,47,15],[48,0,48,4],[48,5,48,9],[48,10,48,16],[48,17,48,22],[49,0,49,4],[49,5,49,9],[49,10,49,16],[49,17,49,22],[50,7,50,15],[51,0,51,4],[51,5,51,9],[51,10,51,16],[51,17,51,22],[52,0,52,4],[52,5,52,9],[52,10,52,16],[52,17,52,22],[55,1,55,7],[55,14,55,21],[56,0,56,7],[56,14,56,21],[57,0,57,4],[57,5,57,8],[57,13,57,18],[57,19,57,22]]}
["jk\"Vªh; iks\"kkgkj lgk;rk dk;ZØe (Mid Day Meal) "]
[{"$nulls":8},"fo|ky; ekfld lwpuk l=%&",{"$nulls":5},{"$f":"CONCATENATE('MASTER DATA'!F4,\"-\",'MASTER DATA'!H4)","v":"2022-2023"}]
[{"$nulls":7},"izi= & 1"]
["fo|ky; dk uke %&",{"$nulls":4},{"$f":"IF(AND('MASTER DATA'!C3=\"\"),\"\",'MASTER DATA'!C3)","v":"egkRek xka/kh jktdh; fo|ky; ¼vaxzsth ek/;e½ cj ] ikyh"},{"$nulls":9},"MkbZl dksM ua- %&",null,null,{"$f":"IF(AND('MASTER DATA'!C10=\"\"),\"\",'MASTER DATA'!C10)","v":8200303101}]
["ihbZbZvks@uksMy dk uke %&",{"$nulls":4},{"$f":"IF(AND('MASTER DATA'!C5=\"\"),\"\",'MASTER DATA'!C5)","v":"jkmekfo cj"},{"$nulls":9},"CykWd dk uke %&",null,null,{"$f":"IF(AND('MASTER DATA'!C14=\"\"),\"\",'MASTER DATA'!C14)","v":"jk;iqj"}]
["xzke iapk;r dk uke %&",{"$nulls":4},{"$f":"IF(AND('MASTER DATA'!C13=\"\"),\"\",'MASTER DATA'!C13)","v":"cj"},{"$nulls":9},"ekg@o\"kZ %&",null,null,{"$f":"IF(AND('MASTER DATA'!J4=\"\"),\"\",'MASTER DATA'!J4)","v":"tqykbZ&2022"}]
["tkod Øekad la[;k %&",{"$nulls":14},"fnukad %&",null,null,{"$f":"TODAY()","v":"2022-07-03"}]
[{"$nulls":7},"1- fo|ky; fooj.k"]
["fo|ky; dk izdkj %&",{"$nulls":4},{"$f":"IF(AND('MASTER DATA'!C15=\"\"),\"\",'MASTER DATA'!C15)","v":"Government"},{"$nulls":9},"{ks= %&",null,null,{"$f":"IF(AND('MASTER DATA'!C16=\"\"),\"\",'MASTER DATA'!C16)","v":"Rural"}]
["ukekadu","izkFkfed ",{"$nulls":9},"Grant Total","mPp izkFkfed ",{"$nulls":9},"Grant Total",{"$nulls":11},true]
[null,"SC",null,"ST",null,"OBC",null,"GEN",null,"TOTAL",null,null,"SC",null,"ST",null,"OBC",null,"GEN",null,"TOTAL"]
[null,"B","G","B","G","B","G","B","G","B","G",null,"B","G","B","G","B","G","B","G","B","G"]
[null,{"$f":"'MASTER DATA'!F15","v":33},{"$f":"'MASTER DATA'!G15","v":40},{"$f":"'MASTER DATA'!H15","v":33},{"$f":"'MASTER DATA'!I15","v":31},{"$f":"'MASTER DATA'!J15","v":44},{"$f":"'MASTER DATA'!K15","v":46},{"$f":"'MASTER DATA'!L15","v":34},{"$f":"'MASTER DATA'!M15","v":28},{"$f":"'MASTER DATA'!N15","v":144},{"$f":"'MASTER DATA'!O15","v":145},{"$f":"'MASTER DATA'!P15","v":289},{"$f":"'MASTER DATA'!F19","v":28},{"$f":"'MASTER DATA'!G19","v":27},{"$f":"'MASTER DATA'!H19","v":24},{"$f":"'MASTER DATA'!I19","v":33},{"$f":"'MASTER DATA'!J19","v":22},{"$f":"'MASTER DATA'!K19","v":22},{"$f":"'MASTER DATA'!L19","v":22},{"$f":"'MASTER DATA'!M19","v":29},{"$f":"'MASTER DATA'!N19","v":96},{"$f":"'MASTER DATA'!O19","v":111},{"$f":"'MASTER DATA'!P19","v":207}]
[{"$nulls":7},"2- cSad [kkrk fooj.k"]
["cSad dk uke e; 'kk[kk",{"$nulls":9},"vkbZ,Q,llh dksM ua-",{"$nulls":6},"[kkrk la[;k"]
[{"$f":"'MASTER DATA'!G29","v":"SBI BAR"},{"$nulls":9},{"$f":"'MASTER DATA'!G30","v":"SBIN0033382"},{"$nulls":6},{"$f":"'MASTER DATA'!G31","v":51022334455}]
[{"$nulls":7},"3- dqd de gsYij fooj.k"]
["Ø-l-",null,"dqd de gsYij dk uke",{"$nulls":9},"fyax",null,null,"oxZ",null,null,"ns; jkf'k dk izdkj ",null,null,"jkf'k"]
[1,null,{"$f":"IF(AND('MASTER DATA'!C35=\"\"),\"\",'MASTER DATA'!C35)","v":"Dhagalai Devi"},{"$nulls":9},{"$f":"IF(AND(C19=\"\"),\"\",IF(AND('MASTER DATA'!AF30=\"TRUE\"),\"MALE\",\"FEMALE\"))","v":"FEMALE"},null,null,{"$f":"IF(AND(C19=\"\"),\"\",IF(AND('MASTER DATA'!AH30=AI$10),\"GEN\",IF(AND('MASTER DATA'!AI30=AI$10),\"OBC\",IF(AND('MASTER DATA'!AJ30=AI$10),\"SC\",IF(AND('MASTER DATA'!AK30=AI$10),\"ST\")))))","v":"OBC"},null,null,{"$f":"IF(AND(C19=\"\"),\"\",IF(AND('MASTER DATA'!AL30=AI$10),\"By Cheque\",\"By Cash\"))","v":"By Cheque"},null,null,{"$f":"IF(AND(C19=\"\"),\"\",IF(AND('MASTER DATA'!P35=\"\"),\"\",'MASTER DATA'!P35))","v":1320}]
[2,null,{"$f":"IF(AND('MASTER DATA'!C36=\"\"),\"\",'MASTER DATA'!C36)","v":"Geeta Devi"},{"$nulls":9},{"$f":"IF(AND(C20=\"\"),\"\",IF(AND('MASTER DATA'!AF31=\"TRUE\"),\"MALE\",\"FEMALE\"))","v":"FEMALE"},null,null,{"$f":"IF(AND(C20=\"\"),\"\",IF(AND('MASTER DATA'!AH31=AI$10),\"GEN\",IF(AND('MASTER DATA'!AI31=AI$10),\"OBC\",IF(AND('MASTER DATA'!AJ31=AI$10),\"SC\",IF(AND('MASTER DATA'!AK31=AI$10),\"ST\")))))","v":"GEN"},null,null,{"$f":"IF(AND(C20=\"\"),\"\",IF(AND('MASTER DATA'!AL31=AI$10),\"By Cheque\",\"By Cash\"))","v":"By Cheque"},null,null,{"$f":"IF(AND(C20=\"\"),\"\",IF(AND('MASTER DATA'!P36=\"\"),\"\",'MASTER DATA'!P36))","v":1320}]
[3,null,{"$f":"IF(AND('MASTER DATA'!C37=\"\"),\"\",'MASTER DATA'!C37)","v":""},{"$nulls":9},{"$f":"IF(AND(C21=\"\"),\"\",IF(AND('MASTER DATA'!AF32=\"TRUE\"),\"MALE\",\"FEMALE\"))","v":""},null,null,{"$f":"IF(AND(C21=\"\"),\"\",IF(AND('MASTER DATA'!AH32=AI$10),\"GEN\",IF(AND('MASTER DATA'!AI32=AI$10),\"OBC\",IF(AND('MASTER DATA'!AJ32=AI$10),\"SC\",IF(AND('MASTER DATA'!AK32=AI$10),\"ST\")))))","v":""},null,null,{"$f":"IF(AND(C21=\"\"),\"\",IF(AND('MASTER DATA'!AL32=AI$10),\"By Cheque\",\"By Cash\"))","v":""},null,null,{"$f":"IF(AND(C21=\"\"),\"\",IF(AND('MASTER DATA'!P37=\"\"),\"\",'MASTER DATA'!P37))","v":""}]
[4,null,{"$f":"IF(AND('MASTER DATA'!C38=\"\"),\"\",'MASTER DATA'!C38)","v":""},{"$nulls":9},{"$f":"IF(AND(C22=\"\"),\"\",IF(AND('MASTER DATA'!AF33=\"TRUE\"),\"MALE\",\"FEMALE\"))","v":""},null,null,{"$f":"IF(AND(C22=\"\"),\"\",IF(AND('MASTER DATA'!AH33=AI$10),\"GEN\",IF(AND('MASTER DATA'!AI33=AI$10),\"OBC\",IF(AND('MASTER DATA'!AJ33=AI$10),\"SC\",IF(AND('MASTER DATA'!AK33=AI$10),\"ST\")))))","v":""},null,null,{"$f":"IF(AND(C22=\"\"),\"\",IF(AND('MASTER DATA'!AL33=AI$10),\"By Cheque\",\"By Cash\"))","v":""},null,null,{"$f":"IF(AND(C22=\"\"),\"\",IF(AND('MASTER DATA'!P38=\"\"),\"\",'MASTER DATA'!P38))","v":""}]
[{"$nulls":7},"4- bl ekg esa fo|ky; dk fujh{k.k"]
["Ø-l-",null,"vf/kdkjh dk fooj.k",{"$nulls":9},"gkW ;k ugh",null,null,"fnukad",null,null,"vf/kdkjh dk uke"]
[1,null,"l?ku fujh{k.k Vhe }kjk"]
[2,null,"ftyk Lrjh; Lrjh; vf/kdkjh }kjk"]
[3,null,"CykWd@rgfly Lrjh; Lrjh; vf/kdkjh }kjk"]
[4,null,"ihbZbZvks@iapk;r Lrjh; Lrjh; vf/kdkjh }kjk"]
[5,null,",l-Mh-,e-lh-@,l-,e-lh- ds lnL; }kjk"]
[{"$nulls":3},"5- bl ekg esa ?kfVr dksbZ feM Ms fey lEcfU/kr ?kVuk ;k f'kdk;r dk fooj.k ¼;fn dksbZ gks½"]
["Ø-l-",null,"f'kdk;r la[;k",{"$nulls":4},"?kVuk dk fooj.k"]
[1]
[{"$nulls":7},"6- [kk|kUu dh tkudkjh ¼fdyksxzke esa½"]
["[kk|kUu dk izdkj",null,"izkFkfed Lrj ij 100 xzke izfr fo|kFkhZ",{"$nulls":9},"mPp izkFkfed Lrj ij 150 xzke izfr fo|kFkhZ"]
[null,null,"izkjfEHkd 'ks\"k",null,"bl ekg esa izkIr",null,"dqy ",null,"bl ekg esa [kpZ ",null,"vfUre 'ks\"k [kk|kUu",null,"izkjfEHkd 'ks\"k",null,"bl ekg esa izkIr",null,"dqy ",null,"bl ekg esa [kpZ ",null,"vfUre 'ks\"k [kk|kUu"]
["xsgwW",null,{"$f":"'Prarmbhik Shesh'!D7","v":{"v":300,"d":"300.00"}},null,{"$f":"'PS Balance Sheet'!E37+'PS Balance Sheet'!G37+'PS Balance Sheet'!I37","v":{"v":0,"d":"0.00"}},null,{"$f":"C36+E36","v":{"v":300,"d":"300.00"}},null,{"$f":"'PS Balance Sheet'!S37","v":{"v":49.2,"d":"49.20"}},null,{"$f":"G36-I36","v":{"v":250.8,"d":"250.80"}},null,{"$f":"'Prarmbhik Shesh'!F7","v":{"v":250,"d":"250.00"}},null,{"$f":"'UPS balance Sheet'!E37+'UPS balance Sheet'!G37+'UPS balance Sheet'!I37","v":{"v":0,"d":"0.00"}},null,{"$f":"M36+O36","v":{"v":250,"d":"250.00"}},null,{"$f":"'UPS balance Sheet'!S37","v":58.35},null,{"$f":"Q36-S36","v":191.65}]
["pkoy",null,{"$f":"'Prarmbhik Shesh'!D8","v":{"v":200,"d":"200.00"}},null,{"$f":"'PS Balance Sheet'!F37+'PS Balance Sheet'!H37+'PS Balance Sheet'!J37","v":{"v":0,"d":"0.00"}},null,{"$f":"C37+E37","v":{"v":200,"d":"200.00"}},null,{"$f":"'PS Balance Sheet'!T37","v":{"v":0,"d":"0.00"}},null,{"$f":"G37-I37","v":{"v":200,"d":"200.00"}},null,{"$f":"'Prarmbhik Shesh'!F8","v":{"v":150,"d":"150.00"}},null,{"$f":"'UPS balance Sheet'!F37+'UPS balance Sheet'!H37+'UPS balance Sheet'!J37","v":{"v":0,"d":"0.00"}},null,{"$f":"M37+O37","v":{"v":150,"d":"150.00"}},null,{"$f":"'UPS balance Sheet'!T37","v":{"v":0,"d":"0.00"}},null,{"$f":"Q37-S37","v":{"v":150,"d":"150.00"}}]
[";ksx",null,{"$f":"C36+C37","v":{"v":500,"d":"500.00"}},null,{"$f":"E36+E37","v":{"v":0,"d":"0.00"}},null,{"$f":"G36+G37","v":{"v":500,"d":"500.00"}},null,{"$f":"I36+I37","v":{"v":49.2,"d":"49.20"}},null,{"$f":"K36+K37","v":{"v":450.8,"d":"450.80"}},null,{"$f":"M36+M37","v":{"v":400,"d":"400.00"}},null,{"$f":"O36+O37","v":{"v":0,"d":"0.00"}},null,{"$f":"Q36+Q37","v":{"v":400,"d":"400.00"}},null,{"$f":"S36+S37","v":58.35},null,{"$f":"U36+U37","v":341.65}]
[{"$nulls":6},"7- Hkkstu idkusa esa O;; dh jkf'k dh tkudkjh ¼:Ik;ksa esa½"]
["dqfdax dUotZu jkf'k",null,"Hkkstu cukusa esa O;; jkf'k"]
[null,null,"izkFkfed",{"$nulls":6},"mPp izkFkfrd",{"$nulls":6},"dqy ;ksx"]
[null,null,{"$f":"CONCATENATE(\"RS\",\"-\",\"  \",'MASTER DATA'!$C$30,\"  \",\"@ Unit\")","v":"RS-  4.97  @ Unit"},{"$nulls":6},{"$f":"CONCATENATE(\"RS\",\"-\",\"  \",'MASTER DATA'!$C$31,\"  \",\"@ Unit\")","v":"RS-  7.45  @ Unit"}]
[null,null,{"$f":"'PS Balance Sheet'!W37","v":2445.24},{"$nulls":6},{"$f":"'UPS balance Sheet'!W37","v":2898.05},{"$nulls":6},{"$f":"C43+J43","v":5343.29}]
[null,null,"izkFkfed",{"$nulls":9},"mPp izkFkfed"]
[null,null,"izkjfEHkd 'ks\"k",null,"bl ekg esa izkIr jkf'k",null,"dqy jkf'k",null,"bl ekg esa [kpZ jkf'k",null,"vfUre 'ks\"k ",null,"izkjfEHkd 'ks\"k",null,"bl ekg esa izkIr jkf'k",null,"dqy jkf'k",null,"bl ekg esa [kpZ jkf'k",null,"vfUre 'ks\"k "]
[null,null,{"$f":"'Prarmbhik Shesh'!D9","v":{"v":10000,"d":"10000.00"}},null,{"$f":"'Prarmbhik Shesh'!D10","v":{"v":0,"d":"0.00"}},null,{"$f":"C46+E46","v":{"v":10000,"d":"10000.00"}},null,{"$f":"'PS Balance Sheet'!W37","v":2445.24},null,{"$f":"G46-I46","v":7554.76},null,{"$f":"'Prarmbhik Shesh'!F9","v":{"v":15000,"d":"15000.00"}},null,{"$f":"'Prarmbhik Shesh'!F10","v":{"v":0,"d":"0.00"}},null,{"$f":"M46+O46","v":{"v":15000,"d":"15000.00"}},null,{"$f":"'UPS balance Sheet'!W37","v":2898.05},null,{"$f":"Q46-S46","v":12101.95}]
[]
[{"$nulls":7},"8- dqd de gsYij dh jkf'k dk fooj.k"]
["izkjfEHkd 'ks\"k",{"$nulls":4},"bl ekg esa izkIr jkf'k",{"$nulls":4},"bl ekg esa [kpZ jkf'k",{"$nulls":6},"vfUre 'ks\"k "]
[{"$f":"'Prarmbhik Shesh'!D14+'Prarmbhik Shesh'!F14","v":4000},{"$nulls":4},{"$f":"'Prarmbhik Shesh'!D15+'Prarmbhik Shesh'!F15","v":12000},{"$nulls":4},{"$f":"'Prarmbhik Shesh'!D17+'Prarmbhik Shesh'!F17","v":0},{"$nulls":6},{"$f":"A50+F50-K50","v":16000}]
[{"$nulls":7},"9- ,e-,e-bZ jkf'k dk fooj.k"]
["izkjfEHkd 'ks\"k",{"$nulls":4},"bl ekg esa izkIr jkf'k",{"$nulls":4},"bl ekg esa [kpZ jkf'k",{"$nulls":6},"vfUre 'ks\"k "]
[{"$nulls":17},{"$f":"A53+F53-K53","v":0}]
[]
[]
[null,{"$f":"IF(AND('MASTER DATA'!C7=\"\"),\"\",'MASTER DATA'!C7)","v":"vfHkeU;q flag"},{"$nulls":12},{"$f":"IF(AND('MASTER DATA'!C6=\"\"),\"\",'MASTER DATA'!C6)","v":"m\"kk ify;k"}]
["iks\"kkgkj izHkkjh gLrk{kj e; lhy",{"$nulls":13},"laLFkk iz/kku gLrk{kj e; lhy"]
["iks\"kkgkj izHkkjh eks-u- %&",{"$nulls":4},{"$f":"IF(AND('MASTER DATA'!C9=\"\"),\"\",'MASTER DATA'!C9)","v":9929247228},{"$nulls":7},"laLFkk iz/kku eksckbZy uEcj %&",{"$nulls":5},{"$f":"IF(AND('MASTER DATA'!C8=\"\"),\"\",'MASTER DATA'!C8)","v":9929247227}]

{"sheet":"Stock","index":9,"n_rows":77,"n_cols":76,"rows_kept":77,"merged":[[0,10,0,12],[1,2,2,14],[4,2,4,11],[4,12,4,14],[7,0,7,2],[7,21,8,26],[9,21,10,22],[9,23,10,26],[12,21,12,22],[12,23,12,26],[13,21,13,22],[13,23,13,26],[14,21,14,22],[14,23,14,26],[15,21,15,22],[15,23,15,26],[16,21,16,22],[16,23,16,26],[17,21,17,22],[17,23,17,26],[21,23,22,26],[23,19,24,20],[23,22,24,24],[23,26,24,28],[26,19,26,20],[27,19,27,20],[28,19,28,20],[29,19,29,20],[30,19,30,20],[30,22,30,24],[30,26,30,28],[31,19,32,28],[42,2,42,10],[42,11,42,14],[45,0,45,2]]}
[]
[null,null,"QqzV~l ds fy, fuf'pr okj dks forfjr djds otu fdyksxzke esa fu;r~ rkjh[k ds lkeusa fy[ksa ;g dkWye vuykWd ¼lQsn dyj esa½ gSa H ↓"]
[]
[]
[null,null,"izfrfnu jk'ku lQykbZ dh ek=k",{"$nulls":9},"izkFkfed d{kk gsrq"]
[]
["fnukad","okj","dqy ykHkkfUor","xsagq","pkoy","lCth","nky","rsy","fephZ","/kfu;k","gYnh","thjk","ued","ÝqV","Gas"]
["izkjfEHkd 'ks\"k",null,null,{"$f":"'Prarmbhik Shesh'!D7","v":{"v":300,"d":"300.000"}},{"$f":"'Prarmbhik Shesh'!D8","v":{"v":200,"d":"200.000"}},{"v":45,"d":"45.000"},{"v":25,"d":"25.000"},{"v":15,"d":"15.000"},{"v":3,"d":"3.000"},{"v":2,"d":"2.000"},{"v":2,"d":"2.000"},{"v":1,"d":"1.000"},{"v":3,"d":"3.000"},null,30,"KG",{"$nulls":5},"भोजन  Menu"]
[{"$f":"IFERROR('Att. Dairy'!B6,\"\")","v":"2022-07-01"},{"$f":"IFERROR('Att. Dairy'!D6,\"\")","v":"Friday"},{"$f":"IFERROR('PS Balance Sheet'!R6,\"\")","v":246},{"$f":"D8-'PS Balance Sheet'!S6","v":{"v":275.4,"d":"275.400"}},{"$f":"E8-'PS Balance Sheet'!T6","v":{"v":200,"d":"200.000"}},{"$f":"F8-IF(AND($B9=\"monday\"),C9*0.05,IF(AND($B9=\"thursday\"),C9*0.025,IF(AND($B9=\"saturday\"),C9*0.05,\"0\")))","v":{"v":45,"d":"45.000"}},{"$f":"G8-IF(AND($B9=\"Tuesday\"),C9*0.02,IF(AND($B9=\"Wednesday\"),C9*0.02,IF(AND($B9=\"thursday\"),C9*0.005,IF(AND($B9=\"Friday\"),C9*0.02,\"0\"))))","v":{"v":20.08,"d":"20.080"}},{"$f":"H8-IF(AND(C9=\"\"),\"\",C9*0.005)","v":{"v":13.77,"d":"13.770"}},{"$f":"I8-IF(AND(C9=\"\"),\"\",C9*0.0015)","v":2.6310000000000002},{"$f":"J8-IF(AND(C9=\"\"),\"\",C9*0.0015)","v":1.631},{"$f":"K8-IF(AND(C9=\"\"),\"\",C9*0.0005)","v":1.877},{"$f":"L8-IF(AND(C9=\"\"),\"\",C9*0.0005)","v":0.877},{"$f":"M8-IF(AND(C9=\"\"),\"\",C9*0.0015)","v":2.6310000000000002},null,{"$f":"O8-IF(AND($O$7=\"Fire Woods\"),C9*0.2,IF(AND($O$7=\"Gas\"),C9*0.02,\"\"))","v":{"v":25.08,"d":"25.080"}}]
[{"$f":"IFERROR('Att. Dairy'!B7,\"\")","v":"2022-07-02"},{"$f":"IFERROR('Att. Dairy'!D7,\"\")","v":"Saturday"},{"$f":"IFERROR('PS Balance Sheet'!R7,\"\")","v":246},{"$f":"D9-'PS Balance Sheet'!S7","v":{"v":250.79999999999998,"d":"250.800"}},{"$f":"E9-'PS Balance Sheet'!T7","v":{"v":200,"d":"200.000"}},{"v":32.7,"d":"32.700"},{"$f":"G9-IF(AND($B10=\"Tuesday\"),C10*0.02,IF(AND($B10=\"Wednesday\"),C10*0.02,IF(AND($B10=\"thursday\"),C10*0.005,IF(AND($B10=\"Friday\"),C10*0.02,\"0\"))))","v":{"v":20.08,"d":"20.080"}},{"v":12.54,"d":"12.540"},2.2620000000000005,1.262,1.754,0.754,2.2620000000000005,null,{"v":20.159999999999997,"d":"20.160"},{"$nulls":6},"वार",null,"भोजन का प्रकार "]
[{"$f":"IFERROR('Att. Dairy'!B8,\"\")","v":"2022-07-03"},{"$f":"IFERROR('Att. Dairy'!D8,\"\")","v":"Sunday"},{"$f":"IFERROR('PS Balance Sheet'!R8,\"\")","v":0},{"$f":"D10-'PS Balance Sheet'!S8","v":{"v":250.79999999999998,"d":"250.800"}},{"$f":"E10-'PS Balance Sheet'!T8","v":{"v":200,"d":"200.000"}},{"v":32.7,"d":"32.700"},{"v":20.08,"d":"20.080"},{"v":12.54,"d":"12.540"},2.2620000000000005,1.262,1.754,0.754,2.2620000000000005,null,{"v":20.159999999999997,"d":"20.160"},{"$nulls":60},"Fire Woods"]
[{"$f":"IFERROR('Att. Dairy'!B9,\"\")","v":"2022-07-04"},{"$f":"IFERROR('Att. Dairy'!D9,\"\")","v":"Monday"},{"$f":"IFERROR('PS Balance Sheet'!R9,\"\")","v":0},{"$f":"D11-'PS Balance Sheet'!S9","v":{"v":250.79999999999998,"d":"250.800"}},{"$f":"E11-'PS Balance Sheet'!T9","v":{"v":200,"d":"200.000"}},{"v":32.7,"d":"32.700"},{"v":20.08,"d":"20.080"},{"v":12.54,"d":"12.540"},2.2620000000000005,1.262,1.754,0.754,2.2620000000000005,null,{"v":20.159999999999997,"d":"20.160"},{"$nulls":60},"Gas"]
[{"$f":"IFERROR('Att. Dairy'!B10,\"\")","v":"2022-07-05"},{"$f":"IFERROR('Att. Dairy'!D10,\"\")","v":"Tuesday"},{"$f":"IFERROR('PS Balance Sheet'!R10,\"\")","v":0},{"$f":"D12-'PS Balance Sheet'!S10","v":{"v":250.79999999999998,"d":"250.800"}},{"$f":"E12-'PS Balance Sheet'!T10","v":{"v":200,"d":"200.000"}},{"v":32.7,"d":"32.700"},{"v":20.08,"d":"20.080"},{"v":12.54,"d":"12.540"},2.2620000000000005,1.262,1.754,0.754,2.2620000000000005,null,{"v":20.159999999999997,"d":"20.160"},{"$nulls":6},"सोमवार ",null,"सब्जी रोटी "]
[{"$f":"IFERROR('Att. Dairy'!B11,\"\")","v":"2022-07-06"},{"$f":"IFERROR('Att. Dairy'!D11,\"\")","v":"Wednesday"},{"$f":"IFERROR('PS Balance Sheet'!R11,\"\")","v":0},{"$f":"D13-'PS Balance Sheet'!S11","v":{"v":250.79999999999998,"d":"250.800"}},{"$f":"E13-'PS Balance Sheet'!T11","v":{"v":200,"d":"200.000"}},{"v":32.7,"d":"32.700"},{"v":20.08,"d":"20.080"},{"v":12.54,"d":"12.540"},2.2620000000000005,1.262,1.754,0.754,2.2620000000000005,null,{"v":20.159999999999997,"d":"20.160"},{"$nulls":6},"मंगलवार ",null,"दाल चावल "]
[{"$f":"IFERROR('Att. Dairy'!B12,\"\")","v":"2022-07-07"},{"$f":"IFERROR('Att. Dairy'!D12,\"\")","v":"Thursday"},{"$f":"IFERROR('PS Balance Sheet'!R12,\"\")","v":0},{"$f":"D14-'PS Balance Sheet'!S12","v":{"v":250.79999999999998,"d":"250.800"}},{"$f":"E14-'PS Balance Sheet'!T12","v":{"v":200,"d":"200.000"}},{"v":32.7,"d":"32.700"},{"v":20.08,"d":"20.080"},{"v":12.54,"d":"12.540"},2.2620000000000005,1.262,1.754,0.754,2.2620000000000005,null,{"v":20.159999999999997,"d":"20.160"},{"$nulls":6},"बुधवार ",null,"दाल रोटी "]
[{"$f":"IFERROR('Att. Dairy'!B13,\"\")","v":"2022-07-08"},{"$f":"IFERROR('Att. Dairy'!D13,\"\")","v":"Friday"},{"$f":"IFERROR('PS Balance Sheet'!R13,\"\")","v":0},{"$f":"D15-'PS Balance Sheet'!S13","v":{"v":250.79999999999998,"d":"250.800"}},{"$f":"E15-'PS Balance Sheet'!T13","v":{"v":200,"d":"200.000"}},{"v":32.7,"d":"32.700"},{"v":20.08,"d":"20.080"},{"v":12.54,"d":"12.540"},2.2620000000000005,1.262,1.754,0.754,2.2620000000000005,null,{"v":20.159999999999997,"d":"20.160"},{"$nulls":6},"गुरुवार ",null,"खिचड़ी "]
[{"$f":"IFERROR('Att. Dairy'!B14,\"\")","v":"2022-07-09"},{"$f":"IFERROR('Att. Dairy'!D14,\"\")","v":"Saturday"},{"$f":"IFERROR('PS Balance Sheet'!R14,\"\")","v":0},{"$f":"D16-'PS Balance Sheet'!S14","v":{"v":250.79999999999998,"d":"250.800"}},{"$f":"E16-'PS Balance Sheet'!T14","v":{"v":200,"d":"200.000"}},{"v":32.7,"d":"32.700"},{"v":20.08,"d":"20.080"},{"v":12.54,"d":"12.540"},2.2620000000000005,1.262,1.754,0.754,2.2620000000000005,null,{"v":20.159999999999997,"d":"20.160"},{"$nulls":6},"शुक्रवार ",null,"दाल रोटी "]
[{"$f":"IFERROR('Att. Dairy'!B15,\"\")","v":"2022-07-10"},{"$f":"IFERROR('Att. Dairy'!D15,\"\")","v":"Sunday"},{"$f":"IFERROR('PS Balance Sheet'!R15,\"\")","v":0},{"$f":"D17-'PS Balance Sheet'!S15","v":{"v":250.79999999999998,"d":"250.800"}},{"$f":"E17-'PS Balance Sheet'!T15","v":{"v":200,"d":"200.000"}},{"v":32.7,"d":"32.700"},{"v":20.08,"d":"20.080"},{"v":12.54,"d":"12.540"},2.2620000000000005,1.262,1.754,0.754,2.2620000000000005,null,{"v":20.159999999999997,"d":"20.160"},{"$nulls":6},"शनिवार ",null,"सब्जी रोटी "]
[{"$f":"IFERROR('Att. Dairy'!B16,\"\")","v":"2022-07-11"},{"$f":"IFERROR('Att. Dairy'!D16,\"\")","v":"Monday"},{"$f":"IFERROR('PS Balance Sheet'!R16,\"\")","v":0},{"$f":"D18-'PS Balance Sheet'!S16","v":{"v":250.79999999999998,"d":"250.800"}},{"$f":"E18-'PS Balance Sheet'!T16","v":{"v":200,"d":"200.000"}},{"v":32.7,"d":"32.700"},{"v":20.08,"d":"20.080"},{"v":12.54,"d":"12.540"},2.2620000000000005,1.262,1.754,0.754,2.2620000000000005,null,{"v":20.159999999999997,"d":"20.160"}]
[{"$f":"IFERROR('Att. Dairy'!B17,\"\")","v":"2022-07-12"},{"$f":"IFERROR('Att. Dairy'!D17,\"\")","v":"Tuesday"},{"$f":"IFERROR('PS Balance Sheet'!R17,\"\")","v":0},{"$f":"D19-'PS Balance Sheet'!S17","v":{"v":250.79999999999998,"d":"250.800"}},{"$f":"E19-'PS Balance Sheet'!T17","v":{"v":200,"d":"200.000"}},{"v":32.7,"d":"32.700"},{"v":20.08,"d":"20.080"},{"v":12.54,"d":"12.540"},2.2620000000000005,1.262,1.754,0.754,2.2620000000000005,null,{"v":20.159999999999997,"d":"20.160"}]
[{"$f":"IFERROR('Att. Dairy'!B18,\"\")","v":"2022-07-13"},{"$f":"IFERROR('Att. Dairy'!D18,\"\")","v":"Wednesday"},{"$f":"IFERROR('PS Balance Sheet'!R18,\"\")","v":0},{"$f":"D20-'PS Balance Sheet'!S18","v":{"v":250.79999999999998,"d":"250.800"}},{"$f":"E20-'PS Balance Sheet'!T18","v":{"v":200,"d":"200.000"}},{"v":32.7,"d":"32.700"},{"v":20.08,"d":"20.080"},{"v":12.54,"d":"12.540"},2.2620000000000005,1.262,1.754,0.754,2.2620000000000005,null,{"v":20.159999999999997,"d":"20.160"}]
[{"$f":"IFERROR('Att. Dairy'!B19,\"\")","v":"2022-07-14"},{"$f":"IFERROR('Att. Dairy'!D19,\"\")","v":"Thursday"},{"$f":"IFERROR('PS Balance Sheet'!R19,\"\")","v":0},{"$f":"D21-'PS Balance Sheet'!S19","v":{"v":250.79999999999998,"d":"250.800"}},{"$f":"E21-'PS Balance Sheet'!T19","v":{"v":200,"d":"200.000"}},{"v":32.7,"d":"32.700"},{"v":20.08,"d":"20.080"},{"v":12.54,"d":"12.540"},2.2620000000000005,1.262,1.754,0.754,2.2620000000000005,null,{"v":20.159999999999997,"d":"20.160"},{"$nulls":8},"सामग्री विवरण "]
[{"$f":"IFERROR('Att. Dairy'!B20,\"\")","v":"2022-07-15"},{"$f":"IFERROR('Att. Dairy'!D20,\"\")","v":"Friday"},{"$f":"IFERROR('PS Balance Sheet'!R20,\"\")","v":0},{"$f":"D22-'PS Balance Sheet'!S20","v":{"v":250.79999999999998,"d":"250.800"}},{"$f":"E22-'PS Balance Sheet'!T20","v":{"v":200,"d":"200.000"}},{"v":32.7,"d":"32.700"},{"v":20.08,"d":"20.080"},{"v":12.54,"d":"12.540"},2.2620000000000005,1.262,1.754,0.754,2.2620000000000005,null,{"v":20.159999999999997,"d":"20.160"}]
[{"$f":"IFERROR('Att. Dairy'!B21,\"\")","v":"2022-07-16"},{"$f":"IFERROR('Att. Dairy'!D21,\"\")","v":"Saturday"},{"$f":"IFERROR('PS Balance Sheet'!R21,\"\")","v":0},{"$f":"D23-'PS Balance Sheet'!S21","v":{"v":250.79999999999998,"d":"250.800"}},{"$f":"E23-'PS Balance Sheet'!T21","v":{"v":200,"d":"200.000"}},{"v":32.7,"d":"32.700"},{"v":20.08,"d":"20.080"},{"v":12.54,"d":"12.540"},2.2620000000000005,1.262,1.754,0.754,2.2620000000000005,null,{"v":20.159999999999997,"d":"20.160"},{"$nulls":4},"सामग्री ",null,null,"प्राथमिक कक्षाओ हेतु",{"$nulls":3},"उच्च प्राथमिक कक्षाओ हेतु "]
[{"$f":"IFERROR('Att. Dairy'!B22,\"\")","v":"2022-07-17"},{"$f":"IFERROR('Att. Dairy'!D22,\"\")","v":"Sunday"},{"$f":"IFERROR('PS Balance Sheet'!R22,\"\")","v":0},{"$f":"D24-'PS Balance Sheet'!S22","v":{"v":250.79999999999998,"d":"250.800"}},{"$f":"E24-'PS Balance Sheet'!T22","v":{"v":200,"d":"200.000"}},{"v":32.7,"d":"32.700"},{"v":20.08,"d":"20.080"},{"v":12.54,"d":"12.540"},2.2620000000000005,1.262,1.754,0.754,2.2620000000000005,null,{"v":20.159999999999997,"d":"20.160"}]
[{"$f":"IFERROR('Att. Dairy'!B23,\"\")","v":"2022-07-18"},{"$f":"IFERROR('Att. Dairy'!D23,\"\")","v":"Monday"},{"$f":"IFERROR('PS Balance Sheet'!R23,\"\")","v":0},{"$f":"D25-'PS Balance Sheet'!S23","v":{"v":250.79999999999998,"d":"250.800"}},{"$f":"E25-'PS Balance Sheet'!T23","v":{"v":200,"d":"200.000"}},{"v":32.7,"d":"32.700"},{"v":20.08,"d":"20.080"},{"v":12.54,"d":"12.540"},2.2620000000000005,1.262,1.754,0.754,2.2620000000000005,null,{"v":20.159999999999997,"d":"20.160"}]
[{"$f":"IFERROR('Att. Dairy'!B24,\"\")","v":"2022-07-19"},{"$f":"IFERROR('Att. Dairy'!D24,\"\")","v":"Tuesday"},{"$f":"IFERROR('PS Balance Sheet'!R24,\"\")","v":0},{"$f":"D26-'PS Balance Sheet'!S24","v":{"v":250.79999999999998,"d":"250.800"}},{"$f":"E26-'PS Balance Sheet'!T24","v":{"v":200,"d":"200.000"}},{"v":32.7,"d":"32.700"},{"v":20.08,"d":"20.080"},{"v":12.54,"d":"12.540"},2.2620000000000005,1.262,1.754,0.754,2.2620000000000005,null,{"v":20.159999999999997,"d":"20.160"},{"$nulls":4},"खाद्यान्न ",null,null,100,"ग्राम",{"$nulls":3},150,"ग्राम"]
[{"$f":"IFERROR('Att. Dairy'!B25,\"\")","v":"2022-07-20"},{"$f":"IFERROR('Att. Dairy'!D25,\"\")","v":"Wednesday"},{"$f":"IFERROR('PS Balance Sheet'!R25,\"\")","v":0},{"$f":"D27-'PS Balance Sheet'!S25","v":{"v":250.79999999999998,"d":"250.800"}},{"$f":"E27-'PS Balance Sheet'!T25","v":{"v":200,"d":"200.000"}},{"v":32.7,"d":"32.700"},{"v":20.08,"d":"20.080"},{"v":12.54,"d":"12.540"},2.2620000000000005,1.262,1.754,0.754,2.2620000000000005,null,{"v":20.159999999999997,"d":"20.160"},{"$nulls":4},"दालें",null,null,20,"ग्राम",{"$nulls":3},30,"ग्राम"]
[{"$f":"IFERROR('Att. Dairy'!B26,\"\")","v":"2022-07-21"},{"$f":"IFERROR('Att. Dairy'!D26,\"\")","v":"Thursday"},{"$f":"IFERROR('PS Balance Sheet'!R26,\"\")","v":0},{"$f":"D28-'PS Balance Sheet'!S26","v":{"v":250.79999999999998,"d":"250.800"}},{"$f":"E28-'PS Balance Sheet'!T26","v":{"v":200,"d":"200.000"}},{"v":32.7,"d":"32.700"},{"v":20.08,"d":"20.080"},{"v":12.54,"d":"12.540"},2.2620000000000005,1.262,1.754,0.754,2.2620000000000005,null,{"v":20.159999999999997,"d":"20.160"},{"$nulls":4},"सब्जी ",null,null,50,"ग्राम",{"$nulls":3},75,"ग्राम"]
[{"$f":"IFERROR('Att. Dairy'!B27,\"\")","v":"2022-07-22"},{"$f":"IFERROR('Att. Dairy'!D27,\"\")","v":"Friday"},{"$f":"IFERROR('PS Balance Sheet'!R27,\"\")","v":0},{"$f":"D29-'PS Balance Sheet'!S27","v":{"v":250.79999999999998,"d":"250.800"}},{"$f":"E29-'PS Balance Sheet'!T27","v":{"v":200,"d":"200.000"}},{"v":32.7,"d":"32.700"},{"v":20.08,"d":"20.080"},{"v":12.54,"d":"12.540"},2.2620000000000005,1.262,1.754,0.754,2.2620000000000005,null,{"v":20.159999999999997,"d":"20.160"},{"$nulls":4},"तेल ",null,null,5,"ग्राम",{"$nulls":3},7.5,"ग्राम"]
[{"$f":"IFERROR('Att. Dairy'!B28,\"\")","v":"2022-07-23"},{"$f":"IFERROR('Att. Dairy'!D28,\"\")","v":"Saturday"},{"$f":"IFERROR('PS Balance Sheet'!R28,\"\")","v":0},{"$f":"D30-'PS Balance Sheet'!S28","v":{"v":250.79999999999998,"d":"250.800"}},{"$f":"E30-'PS Balance Sheet'!T28","v":{"v":200,"d":"200.000"}},{"v":32.7,"d":"32.700"},{"v":20.08,"d":"20.080"},{"v":12.54,"d":"12.540"},2.2620000000000005,1.262,1.754,0.754,2.2620000000000005,null,{"v":20.159999999999997,"d":"20.160"},{"$nulls":4},"नमक व मसाले ",null,null,"आवश्यकतानुसार",{"$nulls":3},"आवश्यकतानुसार"]
[{"$f":"IFERROR('Att. Dairy'!B29,\"\")","v":"2022-07-24"},{"$f":"IFERROR('Att. Dairy'!D29,\"\")","v":"Sunday"},{"$f":"IFERROR('PS Balance Sheet'!R29,\"\")","v":0},{"$f":"D31-'PS Balance Sheet'!S29","v":{"v":250.79999999999998,"d":"250.800"}},{"$f":"E31-'PS Balance Sheet'!T29","v":{"v":200,"d":"200.000"}},{"v":32.7,"d":"32.700"},{"v":20.08,"d":"20.080"},{"v":12.54,"d":"12.540"},2.2620000000000005,1.262,1.754,0.754,2.2620000000000005,null,{"v":20.159999999999997,"d":"20.160"},{"$nulls":4},"सप्ताह में मौसम के अनुसार एक बार फल का वितरण "]
[{"$f":"IFERROR('Att. Dairy'!B30,\"\")","v":"2022-07-25"},{"$f":"IFERROR('Att. Dairy'!D30,\"\")","v":"Monday"},{"$f":"IFERROR('PS Balance Sheet'!R30,\"\")","v":0},{"$f":"D32-'PS Balance Sheet'!S30","v":{"v":250.79999999999998,"d":"250.800"}},{"$f":"E32-'PS Balance Sheet'!T30","v":{"v":200,"d":"200.000"}},{"v":32.7,"d":"32.700"},{"v":20.08,"d":"20.080"},{"v":12.54,"d":"12.540"},2.2620000000000005,1.262,1.754,0.754,2.2620000000000005,null,{"v":20.159999999999997,"d":"20.160"}]
[{"$f":"IFERROR('Att. Dairy'!B31,\"\")","v":"2022-07-26"},{"$f":"IFERROR('Att. Dairy'!D31,\"\")","v":"Tuesday"},{"$f":"IFERROR('PS Balance Sheet'!R31,\"\")","v":0},{"$f":"D33-'PS Balance Sheet'!S31","v":{"v":250.79999999999998,"d":"250.800"}},{"$f":"E33-'PS Balance Sheet'!T31","v":{"v":200,"d":"200.000"}},{"v":32.7,"d":"32.700"},{"v":20.08,"d":"20.080"},{"v":12.54,"d":"12.540"},2.2620000000000005,1.262,1.754,0.754,2.2620000000000005,null,{"v":20.159999999999997,"d":"20.160"}]
[{"$f":"IFERROR('Att. Dairy'!B32,\"\")","v":"2022-07-27"},{"$f":"IFERROR('Att. Dairy'!D32,\"\")","v":"Wednesday"},{"$f":"IFERROR('PS Balance Sheet'!R32,\"\")","v":0},{"$f":"D34-'PS Balance Sheet'!S32","v":{"v":250.79999999999998,"d":"250.800"}},{"$f":"E34-'PS Balance Sheet'!T32","v":{"v":200,"d":"200.000"}},{"v":32.7,"d":"32.700"},{"v":20.08,"d":"20.080"},{"v":12.54,"d":"12.540"},2.2620000000000005,1.262,1.754,0.754,2.2620000000000005,null,{"v":20.159999999999997,"d":"20.160"}]
[{"$f":"IFERROR('Att. Dairy'!B33,\"\")","v":"2022-07-28"},{"$f":"IFERROR('Att. Dairy'!D33,\"\")","v":"Thursday"},{"$f":"IFERROR('PS Balance Sheet'!R33,\"\")","v":0},{"$f":"D35-'PS Balance Sheet'!S33","v":{"v":250.79999999999998,"d":"250.800"}},{"$f":"E35-'PS Balance Sheet'!T33","v":{"v":200,"d":"200.000"}},{"v":32.7,"d":"32.700"},{"v":20.08,"d":"20.080"},{"v":12.54,"d":"12.540"},2.2620000000000005,1.262,1.754,0.754,2.2620000000000005,null,{"v":20.159999999999997,"d":"20.160"}]
[{"$f":"IFERROR('Att. Dairy'!B34,\"\")","v":"2022-07-29"},{"$f":"IFERROR('Att. Dairy'!D34,\"\")","v":"Friday"},{"$f":"IFERROR('PS Balance Sheet'!R34,\"\")","v":0},{"$f":"D36-'PS Balance Sheet'!S34","v":{"v":250.79999999999998,"d":"250.800"}},{"$f":"E36-'PS Balance Sheet'!T34","v":{"v":200,"d":"200.000"}},{"v":32.7,"d":"32.700"},{"v":20.08,"d":"20.080"},{"v":12.54,"d":"12.540"},2.2620000000000005,1.262,1.754,0.754,2.2620000000000005,null,{"v":20.159999999999997,"d":"20.160"}]
[{"$f":"IFERROR('Att. Dairy'!B35,\"\")","v":"2022-07-30"},{"$f":"IFERROR('Att. Dairy'!D35,\"\")","v":"Saturday"},{"$f":"IFERROR('PS Balance Sheet'!R35,\"\")","v":0},{"$f":"D37-'PS Balance Sheet'!S35","v":{"v":250.79999999999998,"d":"250.800"}},{"$f":"E37-'PS Balance Sheet'!T35","v":{"v":200,"d":"200.000"}},{"v":32.7,"d":"32.700"},{"v":20.08,"d":"20.080"},{"v":12.54,"d":"12.540"},2.2620000000000005,1.262,1.754,0.754,2.2620000000000005,null,{"v":20.159999999999997,"d":"20.160"}]
[{"$f":"IFERROR('Att. Dairy'!B36,\"\")","v":"2022-07-31"},{"$f":"IFERROR('Att. Dairy'!D36,\"\")","v":"Sunday"},{"$f":"IFERROR('PS Balance Sheet'!R36,\"\")","v":0},{"$f":"D38-'PS Balance Sheet'!S36","v":{"v":250.79999999999998,"d":"250.800"}},{"$f":"E38-'PS Balance Sheet'!T36","v":{"v":200,"d":"200.000"}},{"$f":"F38-IF(AND($B39=\"monday\"),C39*BP$13/1000,IF(AND($B39=\"thursday\"),C39*BP$13/2000,IF(AND($B39=\"saturday\"),C39*BP$13/1000,\"0\")))","v":{"v":32.7,"d":"32.700"}},{"$f":"G38-IF(AND($B39=\"Tuesday\"),C39*0.02,IF(AND($B39=\"Wednesday\"),C39*0.02,IF(AND($B39=\"thursday\"),C39*0.005,IF(AND($B39=\"Friday\"),C39*0.02,\"0\"))))","v":{"v":20.08,"d":"20.080"}},{"$f":"H38-IF(AND(C39=\"\"),\"\",C39*BP$14/1000)","v":{"v":12.54,"d":"12.540"}},2.2620000000000005,1.262,1.754,0.754,2.2620000000000005,{"$f":"SUM(N9:N38)","v":0},{"v":20.159999999999997,"d":"20.160"}]
[]
[]
[]
[null,null,"izfrfnu jk'ku lQykbZ dh ek=k",{"$nulls":8},"mPp izkFkfed d{kk gsrq"]
[]
["fnukad","okj","dqy ykHkkfUor","xsagq","pkoy","lCth","nky","rsy","fephZ","/kfu;k","gYnh","thjk","ued","ÝqV","Gas"]
["izkjfEHkd 'ks\"k",null,null,{"$f":"'Prarmbhik Shesh'!F7","v":{"v":250,"d":"250.000"}},{"$f":"'Prarmbhik Shesh'!F8","v":{"v":150,"d":"150.000"}},{"v":45,"d":"45.000"},{"v":35,"d":"35.000"},{"v":15,"d":"15.000"},{"v":3,"d":"3.000"},{"v":2,"d":"2.000"},{"v":2,"d":"2.000"},{"v":1,"d":"1.000"},{"v":3,"d":"3.000"},null,30,"KG"]
[{"$f":"'Att. Dairy'!B6","v":"2022-07-01"},{"$f":"'Att. Dairy'!D6","v":"Friday"},{"$f":"'UPS balance Sheet'!R6","v":199},{"$f":"D46-'UPS balance Sheet'!S6","v":{"v":220.15,"d":"220.150"}},{"$f":"E46-'UPS balance Sheet'!T6","v":{"v":150,"d":"150.000"}},{"$f":"F46-IF(AND($B47=\"monday\"),C47*0.075,IF(AND($B47=\"thursday\"),C47*0.038,IF(AND($B47=\"saturday\"),C47*0.075,\"0\")))","v":{"v":45,"d":"45.000"}},{"$f":"G46-IF(AND($B47=\"Tuesday\"),C47*0.03,IF(AND($B47=\"Wednesday\"),C47*0.03,IF(AND($B47=\"thursday\"),C47*0.005,IF(AND($B47=\"Friday\"),C47*0.03,\"0\"))))","v":{"v":29.03,"d":"29.030"}},{"$f":"H46-IF(AND(C47=\"\"),\"\",C47*0.0075)","v":{"v":13.5075,"d":"13.508"}},{"$f":"I46-IF(AND(C47=\"\"),\"\",C47*0.0015)","v":{"v":2.7015000000000002,"d":"2.702"}},{"$f":"J46-IF(AND(C47=\"\"),\"\",C47*0.0015)","v":{"v":1.7015,"d":"1.702"}},{"$f":"K46-IF(AND(C47=\"\"),\"\",C47*0.0005)","v":{"v":1.9005,"d":"1.901"}},{"$f":"L46-IF(AND(C47=\"\"),\"\",C47*0.0005)","v":{"v":0.9005,"d":"0.901"}},{"$f":"M46-IF(AND(C47=\"\"),\"\",C47*0.0015)","v":{"v":2.7015000000000002,"d":"2.702"}},null,{"$f":"O46-IF(AND($O$45=\"Fire Woods\"),C47*0.2,IF(AND($O$45=\"Gas\"),C47*0.02,\"\"))","v":{"v":26.02,"d":"26.020"}}]
[{"$f":"'Att. Dairy'!B7","v":"2022-07-02"},{"$f":"'Att. Dairy'!D7","v":"Saturday"},{"$f":"'UPS balance Sheet'!R7","v":190},{"$f":"D47-'UPS balance Sheet'!S7","v":{"v":191.65,"d":"191.650"}},{"$f":"E47-'UPS balance Sheet'!T7","v":{"v":150,"d":"150.000"}},{"v":30.75,"d":"30.750"},{"$f":"G47-IF(AND($B48=\"Tuesday\"),C48*0.03,IF(AND($B48=\"Wednesday\"),C48*0.03,IF(AND($B48=\"thursday\"),C48*0.005,IF(AND($B48=\"Friday\"),C48*0.03,\"0\"))))","v":{"v":29.03,"d":"29.030"}},{"v":12.0825,"d":"12.083"},{"v":2.4165,"d":"2.417"},{"v":1.4165,"d":"1.417"},{"v":1.8055,"d":"1.806"},{"v":0.8055,"d":"0.806"},{"v":2.4165,"d":"2.417"},null,{"v":22.22,"d":"22.220"}]
[{"$f":"'Att. Dairy'!B8","v":"2022-07-03"},{"$f":"'Att. Dairy'!D8","v":"Sunday"},{"$f":"'UPS balance Sheet'!R8","v":0},{"$f":"D48-'UPS balance Sheet'!S8","v":{"v":191.65,"d":"191.650"}},{"$f":"E48-'UPS balance Sheet'!T8","v":{"v":150,"d":"150.000"}},{"v":30.75,"d":"30.750"},{"v":29.03,"d":"29.030"},{"v":12.0825,"d":"12.083"},{"v":2.4165,"d":"2.417"},{"v":1.4165,"d":"1.417"},{"v":1.8055,"d":"1.806"},{"v":0.8055,"d":"0.806"},{"v":2.4165,"d":"2.417"},null,{"v":22.22,"d":"22.220"}]
[{"$f":"'Att. Dairy'!B9","v":"2022-07-04"},{"$f":"'Att. Dairy'!D9","v":"Monday"},{"$f":"'UPS balance Sheet'!R9","v":0},{"$f":"D49-'UPS balance Sheet'!S9","v":{"v":191.65,"d":"191.650"}},{"$f":"E49-'UPS balance Sheet'!T9","v":{"v":150,"d":"150.000"}},{"v":30.75,"d":"30.750"},{"v":29.03,"d":"29.030"},{"v":12.0825,"d":"12.083"},{"v":2.4165,"d":"2.417"},{"v":1.4165,"d":"1.417"},{"v":1.8055,"d":"1.806"},{"v":0.8055,"d":"0.806"},{"v":2.4165,"d":"2.417"},null,{"v":22.22,"d":"22.220"}]
[{"$f":"'Att. Dairy'!B10","v":"2022-07-05"},{"$f":"'Att. Dairy'!D10","v":"Tuesday"},{"$f":"'UPS balance Sheet'!R10","v":0},{"$f":"D50-'UPS balance Sheet'!S10","v":{"v":191.65,"d":"191.650"}},{"$f":"E50-'UPS balance Sheet'!T10","v":{"v":150,"d":"150.000"}},{"v":30.75,"d":"30.750"},{"v":29.03,"d":"29.030"},{"v":12.0825,"d":"12.083"},{"v":2.4165,"d":"2.417"},{"v":1.4165,"d":"1.417"},{"v":1.8055,"d":"1.806"},{"v":0.8055,"d":"0.806"},{"v":2.4165,"d":"2.417"},null,{"v":22.22,"d":"22.220"}]
[{"$f":"'Att. Dairy'!B11","v":"2022-07-06"},{"$f":"'Att. Dairy'!D11","v":"Wednesday"},{"$f":"'UPS balance Sheet'!R11","v":0},{"$f":"D51-'UPS balance Sheet'!S11","v":{"v":191.65,"d":"191.650"}},{"$f":"E51-'UPS balance Sheet'!T11","v":{"v":150,"d":"150.000"}},{"v":30.75,"d":"30.750"},{"v":29.03,"d":"29.030"},{"v":12.0825,"d":"12.083"},{"v":2.4165,"d":"2.417"},{"v":1.4165,"d":"1.417"},{"v":1.8055,"d":"1.806"},{"v":0.8055,"d":"0.806"},{"v":2.4165,"d":"2.417"},null,{"v":22.22,"d":"22.220"}]
[{"$f":"'Att. Dairy'!B12","v":"2022-07-07"},{"$f":"'Att. Dairy'!D12","v":"Thursday"},{"$f":"'UPS balance Sheet'!R12","v":0},{"$f":"D52-'UPS balance Sheet'!S12","v":{"v":191.65,"d":"191.650"}},{"$f":"E52-'UPS balance Sheet'!T12","v":{"v":150,"d":"150.000"}},{"v":30.75,"d":"30.750"},{"v":29.03,"d":"29.030"},{"v":12.0825,"d":"12.083"},{"v":2.4165,"d":"2.417"},{"v":1.4165,"d":"1.417"},{"v":1.8055,"d":"1.806"},{"v":0.8055,"d":"0.806"},{"v":2.4165,"d":"2.417"},null,{"v":22.22,"d":"22.220"}]
[{"$f":"'Att. Dairy'!B13","v":"2022-07-08"},{"$f":"'Att. Dairy'!D13","v":"Friday"},{"$f":"'UPS balance Sheet'!R13","v":0},{"$f":"D53-'UPS balance Sheet'!S13","v":{"v":191.65,"d":"191.650"}},{"$f":"E53-'UPS balance Sheet'!T13","v":{"v":150,"d":"150.000"}},{"v":30.75,"d":"30.750"},{"v":29.03,"d":"29.030"},{"v":12.0825,"d":"12.083"},{"v":2.4165,"d":"2.417"},{"v":1.4165,"d":"1.417"},{"v":1.8055,"d":"1.806"},{"v":0.8055,"d":"0.806"},{"v":2.4165,"d":"2.417"},null,{"v":22.22,"d":"22.220"}]
[{"$f":"'Att. Dairy'!B14","v":"2022-07-09"},{"$f":"'Att. Dairy'!D14","v":"Saturday"},{"$f":"'UPS balance Sheet'!R14","v":0},{"$f":"D54-'UPS balance Sheet'!S14","v":{"v":191.65,"d":"191.650"}},{"$f":"E54-'UPS balance Sheet'!T14","v":{"v":150,"d":"150.000"}},{"v":30.75,"d":"30.750"},{"v":29.03,"d":"29.030"},{"v":12.0825,"d":"12.083"},{"v":2.4165,"d":"2.417"},{"v":1.4165,"d":"1.417"},{"v":1.8055,"d":"1.806"},{"v":0.8055,"d":"0.806"},{"v":2.4165,"d":"2.417"},null,{"v":22.22,"d":"22.220"}]
[{"$f":"'Att. Dairy'!B15","v":"2022-07-10"},{"$f":"'Att. Dairy'!D15","v":"Sunday"},{"$f":"'UPS balance Sheet'!R15","v":0},{"$f":"D55-'UPS balance Sheet'!S15","v":{"v":191.65,"d":"191.650"}},{"$f":"E55-'UPS balance Sheet'!T15","v":{"v":150,"d":"150.000"}},{"v":30.75,"d":"30.750"},{"v":29.03,"d":"29.030"},{"v":12.0825,"d":"12.083"},{"v":2.4165,"d":"2.417"},{"v":1.4165,"d":"1.417"},{"v":1.8055,"d":"1.806"},{"v":0.8055,"d":"0.806"},{"v":2.4165,"d":"2.417"},null,{"v":22.22,"d":"22.220"}]
[{"$f":"'Att. Dairy'!B16","v":"2022-07-11"},{"$f":"'Att. Dairy'!D16","v":"Monday"},{"$f":"'UPS balance Sheet'!R16","v":0},{"$f":"D56-'UPS balance Sheet'!S16","v":{"v":191.65,"d":"191.650"}},{"$f":"E56-'UPS balance Sheet'!T16","v":{"v":150,"d":"150.000"}},{"v":30.75,"d":"30.750"},{"v":29.03,"d":"29.030"},{"v":12.0825,"d":"12.083"},{"v":2.4165,"d":"2.417"},{"v":1.4165,"d":"1.417"},{"v":1.8055,"d":"1.806"},{"v":0.8055,"d":"0.806"},{"v":2.4165,"d":"2.417"},null,{"v":22.22,"d":"22.220"}]
[{"$f":"'Att. Dairy'!B17","v":"2022-07-12"},{"$f":"'Att. Dairy'!D17","v":"Tuesday"},{"$f":"'UPS balance Sheet'!R17","v":0},{"$f":"D57-'UPS balance Sheet'!S17","v":{"v":191.65,"d":"191.650"}},{"$f":"E57-'UPS balance Sheet'!T17","v":{"v":150,"d":"150.000"}},{"v":30.75,"d":"30.750"},{"v":29.03,"d":"29.030"},{"v":12.0825,"d":"12.083"},{"v":2.4165,"d":"2.417"},{"v":1.4165,"d":"1.417"},{"v":1.8055,"d":"1.806"},{"v":0.8055,"d":"0.806"},{"v":2.4165,"d":"2.417"},null,{"v":22.22,"d":"22.220"}]
[{"$f":"'Att. Dairy'!B18","v":"2022-07-13"},{"$f":"'Att. Dairy'!D18","v":"Wednesday"},{"$f":"'UPS balance Sheet'!R18","v":0},{"$f":"D58-'UPS balance Sheet'!S18","v":{"v":191.65,"d":"191.650"}},{"$f":"E58-'UPS balance Sheet'!T18","v":{"v":150,"d":"150.000"}},{"v":30.75,"d":"30.750"},{"v":29.03,"d":"29.030"},{"v":12.0825,"d":"12.083"},{"v":2.4165,"d":"2.417"},{"v":1.4165,"d":"1.417"},{"v":1.8055,"d":"1.806"},{"v":0.8055,"d":"0.806"},{"v":2.4165,"d":"2.417"},null,{"v":22.22,"d":"22.220"}]
[{"$f":"'Att. Dairy'!B19","v":"2022-07-14"},{"$f":"'Att. Dairy'!D19","v":"Thursday"},{"$f":"'UPS balance Sheet'!R19","v":0},{"$f":"D59-'UPS balance Sheet'!S19","v":{"v":191.65,"d":"191.650"}},{"$f":"E59-'UPS balance Sheet'!T19","v":{"v":150,"d":"150.000"}},{"v":30.75,"d":"30.750"},{"v":29.03,"d":"29.030"},{"v":12.0825,"d":"12.083"},{"v":2.4165,"d":"2.417"},{"v":1.4165,"d":"1.417"},{"v":1.8055,"d":"1.806"},{"v":0.8055,"d":"0.806"},{"v":2.4165,"d":"2.417"},null,{"v":22.22,"d":"22.220"}]
[{"$f":"'Att. Dairy'!B20","v":"2022-07-15"},{"$f":"'Att. Dairy'!D20","v":"Friday"},{"$f":"'UPS balance Sheet'!R20","v":0},{"$f":"D60-'UPS balance Sheet'!S20","v":{"v":191.65,"d":"191.650"}},{"$f":"E60-'UPS balance Sheet'!T20","v":{"v":150,"d":"150.000"}},{"v":30.75,"d":"30.750"},{"v":29.03,"d":"29.030"},{"v":12.0825,"d":"12.083"},{"v":2.4165,"d":"2.417"},{"v":1.4165,"d":"1.417"},{"v":1.8055,"d":"1.806"},{"v":0.8055,"d":"0.806"},{"v":2.4165,"d":"2.417"},null,{"v":22.22,"d":"22.220"}]
[{"$f":"'Att. Dairy'!B21","v":"2022-07-16"},{"$f":"'Att. Dairy'!D21","v":"Saturday"},{"$f":"'UPS balance Sheet'!R21","v":0},{"$f":"D61-'UPS balance Sheet'!S21","v":{"v":191.65,"d":"191.650"}},{"$f":"E61-'UPS balance Sheet'!T21","v":{"v":150,"d":"150.000"}},{"v":30.75,"d":"30.750"},{"v":29.03,"d":"29.030"},{"v":12.0825,"d":"12.083"},{"v":2.4165,"d":"2.417"},{"v":1.4165,"d":"1.417"},{"v":1.8055,"d":"1.806"},{"v":0.8055,"d":"0.806"},{"v":2.4165,"d":"2.417"},null,{"v":22.22,"d":"22.220"}]
[{"$f":"'Att. Dairy'!B22","v":"2022-07-17"},{"$f":"'Att. Dairy'!D22","v":"Sunday"},{"$f":"'UPS balance Sheet'!R22","v":0},{"$f":"D62-'UPS balance Sheet'!S22","v":{"v":191.65,"d":"191.650"}},{"$f":"E62-'UPS balance Sheet'!T22","v":{"v":150,"d":"150.000"}},{"v":30.75,"d":"30.750"},{"v":29.03,"d":"29.030"},{"v":12.0825,"d":"12.083"},{"v":2.4165,"d":"2.417"},{"v":1.4165,"d":"1.417"},{"v":1.8055,"d":"1.806"},{"v":0.8055,"d":"0.806"},{"v":2.4165,"d":"2.417"},null,{"v":22.22,"d":"22.220"}]
[{"$f":"'Att. Dairy'!B23","v":"2022-07-18"},{"$f":"'Att. Dairy'!D23","v":"Monday"},{"$f":"'UPS balance Sheet'!R23","v":0},{"$f":"D63-'UPS balance Sheet'!S23","v":{"v":191.65,"d":"191.650"}},{"$f":"E63-'UPS balance Sheet'!T23","v":{"v":150,"d":"150.000"}},{"v":30.75,"d":"30.750"},{"v":29.03,"d":"29.030"},{"v":12.0825,"d":"12.083"},{"v":2.4165,"d":"2.417"},{"v":1.4165,"d":"1.417"},{"v":1.8055,"d":"1.806"},{"v":0.8055,"d":"0.806"},{"v":2.4165,"d":"2.417"},null,{"v":22.22,"d":"22.220"}]
[{"$f":"'Att. Dairy'!B24","v":"2022-07-19"},{"$f":"'Att. Dairy'!D24","v":"Tuesday"},{"$f":"'UPS balance Sheet'!R24","v":0},{"$f":"D64-'UPS balance Sheet'!S24","v":{"v":191.65,"d":"191.650"}},{"$f":"E64-'UPS balance Sheet'!T24","v":{"v":150,"d":"150.000"}},{"v":30.75,"d":"30.750"},{"v":29.03,"d":"29.030"},{"v":12.0825,"d":"12.083"},{"v":2.4165,"d":"2.417"},{"v":1.4165,"d":"1.417"},{"v":1.8055,"d":"1.806"},{"v":0.8055,"d":"0.806"},{"v":2.4165,"d":"2.417"},null,{"v":22.22,"d":"22.220"}]
[{"$f":"'Att. Dairy'!B25","v":"2022-07-20"},{"$f":"'Att. Dairy'!D25","v":"Wednesday"},{"$f":"'UPS balance Sheet'!R25","v":0},{"$f":"D65-'UPS balance Sheet'!S25","v":{"v":191.65,"d":"191.650"}},{"$f":"E65-'UPS balance Sheet'!T25","v":{"v":150,"d":"150.000"}},{"v":30.75,"d":"30.750"},{"v":29.03,"d":"29.030"},{"v":12.0825,"d":"12.083"},{"v":2.4165,"d":"2.417"},{"v":1.4165,"d":"1.417"},{"v":1.8055,"d":"1.806"},{"v":0.8055,"d":"0.806"},{"v":2.4165,"d":"2.417"},null,{"v":22.22,"d":"22.220"}]
[{"$f":"'Att. Dairy'!B26","v":"2022-07-21"},{"$f":"'Att. Dairy'!D26","v":"Thursday"},{"$f":"'UPS balance Sheet'!R26","v":0},{"$f":"D66-'UPS balance Sheet'!S26","v":{"v":191.65,"d":"191.650"}},{"$f":"E66-'UPS balance Sheet'!T26","v":{"v":150,"d":"150.000"}},{"v":30.75,"d":"30.750"},{"v":29.03,"d":"29.030"},{"v":12.0825,"d":"12.083"},{"v":2.4165,"d":"2.417"},{"v":1.4165,"d":"1.417"},{"v":1.8055,"d":"1.806"},{"v":0.8055,"d":"0.806"},{"v":2.4165,"d":"2.417"},null,{"v":22.22,"d":"22.220"}]
[{"$f":"'Att. Dairy'!B27","v":"2022-07-22"},{"$f":"'Att. Dairy'!D27","v":"Friday"},{"$f":"'UPS balance Sheet'!R27","v":0},{"$f":"D67-'UPS balance Sheet'!S27","v":{"v":191.65,"d":"191.650"}},{"$f":"E67-'UPS balance Sheet'!T27","v":{"v":150,"d":"150.000"}},{"v":30.75,"d":"30.750"},{"v":29.03,"d":"29.030"},{"v":12.0825,"d":"12.083"},{"v":2.4165,"d":"2.417"},{"v":1.4165,"d":"1.417"},{"v":1.8055,"d":"1.806"},{"v":0.8055,"d":"0.806"},{"v":2.4165,"d":"2.417"},null,{"v":22.22,"d":"22.220"}]
[{"$f":"'Att. Dairy'!B28","v":"2022-07-23"},{"$f":"'Att. Dairy'!D28","v":"Saturday"},{"$f":"'UPS balance Sheet'!R28","v":0},{"$f":"D68-'UPS balance Sheet'!S28","v":{"v":191.65,"d":"191.650"}},{"$f":"E68-'UPS balance Sheet'!T28","v":{"v":150,"d":"150.000"}},{"v":30.75,"d":"30.750"},{"v":29.03,"d":"29.030"},{"v":12.0825,"d":"12.083"},{"v":2.4165,"d":"2.417"},{"v":1.4165,"d":"1.417"},{"v":1.8055,"d":"1.806"},{"v":0.8055,"d":"0.806"},{"v":2.4165,"d":"2.417"},null,{"v":22.22,"d":"22.220"}]
[{"$f":"'Att. Dairy'!B29","v":"2022-07-24"},{"$f":"'Att. Dairy'!D29","v":"Sunday"},{"$f":"'UPS balance Sheet'!R29","v":0},{"$f":"D69-'UPS balance Sheet'!S29","v":{"v":191.65,"d":"191.650"}},{"$f":"E69-'UPS balance Sheet'!T29","v":{"v":150,"d":"150.000"}},{"v":30.75,"d":"30.750"},{"v":29.03,"d":"29.030"},{"v":12.0825,"d":"12.083"},{"v":2.4165,"d":"2.417"},{"v":1.4165,"d":"1.417"},{"v":1.8055,"d":"1.806"},{"v":0.8055,"d":"0.806"},{"v":2.4165,"d":"2.417"},null,{"v":22.22,"d":"22.220"}]
[{"$f":"'Att. Dairy'!B30","v":"2022-07-25"},{"$f":"'Att. Dairy'!D30","v":"Monday"},{"$f":"'UPS balance Sheet'!R30","v":0},{"$f":"D70-'UPS balance Sheet'!S30","v":{"v":191.65,"d":"191.650"}},{"$f":"E70-'UPS balance Sheet'!T30","v":{"v":150,"d":"150.000"}},{"v":30.75,"d":"30.750"},{"v":29.03,"d":"29.030"},{"v":12.0825,"d":"12.083"},{"v":2.4165,"d":"2.417"},{"v":1.4165,"d":"1.417"},{"v":1.8055,"d":"1.806"},{"v":0.8055,"d":"0.806"},{"v":2.4165,"d":"2.417"},null,{"v":22.22,"d":"22.220"}]
[{"$f":"'Att. Dairy'!B31","v":"2022-07-26"},{"$f":"'Att. Dairy'!D31","v":"Tuesday"},{"$f":"'UPS balance Sheet'!R31","v":0},{"$f":"D71-'UPS balance Sheet'!S31","v":{"v":191.65,"d":"191.650"}},{"$f":"E71-'UPS balance Sheet'!T31","v":{"v":150,"d":"150.000"}},{"v":30.75,"d":"30.750"},{"v":29.03,"d":"29.030"},{"v":12.0825,"d":"12.083"},{"v":2.4165,"d":"2.417"},{"v":1.4165,"d":"1.417"},{"v":1.8055,"d":"1.806"},{"v":0.8055,"d":"0.806"},{"v":2.4165,"d":"2.417"},null,{"v":22.22,"d":"22.220"}]
[{"$f":"'Att. Dairy'!B32","v":"2022-07-27"},{"$f":"'Att. Dairy'!D32","v":"Wednesday"},{"$f":"'UPS balance Sheet'!R32","v":0},{"$f":"D72-'UPS balance Sheet'!S32","v":{"v":191.65,"d":"191.650"}},{"$f":"E72-'UPS balance Sheet'!T32","v":{"v":150,"d":"150.000"}},{"v":30.75,"d":"30.750"},{"v":29.03,"d":"29.030"},{"v":12.0825,"d":"12.083"},{"v":2.4165,"d":"2.417"},{"v":1.4165,"d":"1.417"},{"v":1.8055,"d":"1.806"},{"v":0.8055,"d":"0.806"},{"v":2.4165,"d":"2.417"},null,{"v":22.22,"d":"22.220"}]
[{"$f":"'Att. Dairy'!B33","v":"2022-07-28"},{"$f":"'Att. Dairy'!D33","v":"Thursday"},{"$f":"'UPS balance Sheet'!R33","v":0},{"$f":"D73-'UPS balance Sheet'!S33","v":{"v":191.65,"d":"191.650"}},{"$f":"E73-'UPS balance Sheet'!T33","v":{"v":150,"d":"150.000"}},{"v":30.75,"d":"30.750"},{"v":29.03,"d":"29.030"},{"v":12.0825,"d":"12.083"},{"v":2.4165,"d":"2.417"},{"v":1.4165,"d":"1.417"},{"v":1.8055,"d":"1.806"},{"v":0.8055,"d":"0.806"},{"v":2.4165,"d":"2.417"},null,{"v":22.22,"d":"22.220"}]
[{"$f":"'Att. Dairy'!B34","v":"2022-07-29"},{"$f":"'Att. Dairy'!D34","v":"Friday"},{"$f":"'UPS balance Sheet'!R34","v":0},{"$f":"D74-'UPS balance Sheet'!S34","v":{"v":191.65,"d":"191.650"}},{"$f":"E74-'UPS balance Sheet'!T34","v":{"v":150,"d":"150.000"}},{"v":30.75,"d":"30.750"},{"v":29.03,"d":"29.030"},{"v":12.0825,"d":"12.083"},{"v":2.4165,"d":"2.417"},{"v":1.4165,"d":"1.417"},{"v":1.8055,"d":"1.806"},{"v":0.8055,"d":"0.806"},{"v":2.4165,"d":"2.417"},null,{"v":22.22,"d":"22.220"}]
[{"$f":"'Att. Dairy'!B35","v":"2022-07-30"},{"$f":"'Att. Dairy'!D35","v":"Saturday"},{"$f":"'UPS balance Sheet'!R35","v":0},{"$f":"D75-'UPS balance Sheet'!S35","v":{"v":191.65,"d":"191.650"}},{"$f":"E75-'UPS balance Sheet'!T35","v":{"v":150,"d":"150.000"}},{"v":30.75,"d":"30.750"},{"v":29.03,"d":"29.030"},{"v":12.0825,"d":"12.083"},{"v":2.4165,"d":"2.417"},{"v":1.4165,"d":"1.417"},{"v":1.8055,"d":"1.806"},{"v":0.8055,"d":"0.806"},{"v":2.4165,"d":"2.417"},null,{"v":22.22,"d":"22.220"}]
[{"$f":"'Att. Dairy'!B36","v":"2022-07-31"},{"$f":"'Att. Dairy'!D36","v":"Sunday"},{"$f":"'UPS balance Sheet'!R36","v":0},{"$f":"D76-'UPS balance Sheet'!S36","v":{"v":191.65,"d":"191.650"}},{"$f":"E76-'UPS balance Sheet'!T36","v":{"v":150,"d":"150.000"}},{"v":30.75,"d":"30.750"},{"v":29.03,"d":"29.030"},{"v":12.0825,"d":"12.083"},{"v":2.4165,"d":"2.417"},{"v":1.4165,"d":"1.417"},{"v":1.8055,"d":"1.806"},{"v":0.8055,"d":"0.806"},{"v":2.4165,"d":"2.417"},{"$f":"SUM(N47:N76)","v":0},{"v":22.22,"d":"22.220"}]

{"sheet":"Bill generate","index":10,"n_rows":27,"n_cols":10,"rows_kept":27,"merged":[[0,0,0,1],[0,2,0,9],[1,3,1,6],[3,0,3,9],[4,0,4,9],[5,0,5,3],[5,4,5,9],[6,0,8,0],[6,1,6,2],[6,3,6,9],[7,1,7,2],[7,3,7,9],[8,1,8,2],[8,3,8,9],[9,0,12,0],[9,1,9,9],[10,1,10,2],[10,3,10,4],[10,5,10,6],[10,7,10,9],[11,1,11,2],[11,3,11,4],[11,5,11,6],[11,7,11,9],[12,1,12,2],[12,3,12,4],[12,5,12,6],[12,7,12,9],[13,0,13,4],[13,5,13,9],[14,1,14,2],[14,5,14,6],[14,7,14,8],[15,1,15,2],[15,5,15,6],[15,7,15,8],[16,3,16,9],[17,1,17,2],[17,3,17,5],[17,6,17,8],[18,1,18,2],[18,3,18,5],[18,6,18,8],[19,1,19,2],[19,3,19,5],[19,6,19,8],[20,1,20,2],[20,3,20,5],[20,6,20,8],[21,1,21,2],[21,3,21,5],[21,6,21,8],[22,1,22,2],[22,3,22,5],[22,6,22,8],[23,1,23,2],[23,3,23,5],[23,6,23,8],[24,0,24,9],[25,1,25,2],[25,3,25,8],[26,1,26,2],[26,3,26,8]]}
["dk;kZy;",null,{"$f":"'MASTER DATA'!C3","v":"egkRek xka/kh jktdh; fo|ky; ¼vaxzsth ek/;e½ cj ] ikyh"}]
[{"$nulls":3},"pkyw ekg esa LVkWd o fcy fooj.k"]
[]
["feM Ms ehy dk¸kZØe"]
["vuqekfur fcy"]
["Month",{"$nulls":3},{"$f":"'MASTER DATA'!J4","v":"tqykbZ&2022"}]
[{"$nulls":3},"pkyw ekg esa ykHkkfUor fo|kFkhZ"]
[null,"çkFkfed",null,{"$f":"'PS Balance Sheet'!R37","v":492}]
[null,"mPp çkFkfed",null,{"$f":"'UPS balance Sheet'!R37","v":389}]
[null,"jk'ku lkexzh vuqekfur ek=k ¼fdyksxzke esa ½"]
[{"$nulls":3},"çkFkfed",null,"mPp çkFkfed",null,"dqy ek=k"]
[null,"lCth",null,{"$f":"Stock!F8-Stock!F39","v":{"v":12.299999999999997,"d":"12.300"}},null,{"$f":"Stock!F46-Stock!F77","v":{"v":14.25,"d":"14.250"}},null,{"$f":"D12+F12","v":{"v":26.549999999999997,"d":"26.550"}}]
[null,"rsy ",null,{"$f":"Stock!H8-Stock!H39","v":{"v":2.460000000000001,"d":"2.460"}},null,{"$f":"Stock!H46-Stock!H77","v":{"v":2.9175000000000004,"d":"2.918"}},null,{"$f":"D13+F13","v":{"v":5.377500000000001,"d":"5.378"}}]
[" ekg dh izkjfEHkd 'ks\"k jkf'k",{"$nulls":4}," ekg ds nkSjku izkIr jkf'k"]
[1,"çkFkfed",null,{"$f":"'Prarmbhik Shesh'!D9","v":{"v":10000,"d":"10000.00"}},":Ik,","çkFkfed",null,{"$f":"'Prarmbhik Shesh'!D10","v":{"v":0,"d":"0.00"}},null,":Ik,"]
[2,"mPPk çkFkfed",null,{"$f":"'Prarmbhik Shesh'!F9","v":{"v":15000,"d":"15000.00"}},":Ik,","mPPk çkFkfed",null,{"$f":"'Prarmbhik Shesh'!F10","v":{"v":0,"d":"0.00"}},null,":Ik,"]
[{"$nulls":3},"ekg ds nkSjku [kpZ jkf'k :Ik, ¼estimate Bill½"]
[null,"lkexzh",null,"çkFkfed",null,null," mPp çkFkfed"]
["1-","ydMh @ xSal",null,{"$f":"'PS Balance Sheet'!W37*10/100","v":{"v":244.52399999999997,"d":"244.52"}},null,null,{"$f":"'UPS balance Sheet'!W37*10/100","v":{"v":289.805,"d":"289.81"}},null,null,":Ik,"]
["2-","xsagw filkbZ ",null,{"$f":"'PS Balance Sheet'!S37*2.5","v":{"v":123,"d":"123.00"}},null,null,{"$f":"'UPS balance Sheet'!S37*2.5","v":{"v":145.875,"d":"145.88"}},null,null,":Ik,"]
[3,"Qy",null,{"$f":"'PS Balance Sheet'!W37*15/100","v":{"v":366.786,"d":"366.79"}},null,null,{"$f":"'UPS balance Sheet'!W37*15/100","v":{"v":434.7075,"d":"434.71"}},null,null,":Ik,"]
[4,"lCth",null,{"$f":"'PS Balance Sheet'!W37*30/100","v":{"v":733.572,"d":"733.57"}},null,null,{"$f":"'UPS balance Sheet'!W37*30/100","v":{"v":869.415,"d":"869.42"}},null,null,":Ik,"]
[5,"fdjk.kk jk'ku",null,{"$f":"'PS Balance Sheet'!W37-D19-D20-D21-D22","v":{"v":977.3579999999998,"d":"977.36"}},null,null,{"$f":"'UPS balance Sheet'!W37-G19-G20-G21-G22","v":{"v":1158.2475000000004,"d":"1158.25"}},null,null,":Ik,"]
[null,"dqy vuqekfur jkf'k",null,{"$f":"SUM(D19:F23)","v":2445.24},null,null,{"$f":"SUM(G19:I23)","v":2898.05},null,null,":Ik,"]
[" ekg ds vUr esa 'ks\"k jkf'k"]
[1,"çkFkfed",null,{"$f":"D15+H15-D24","v":7554.76},{"$nulls":5},":Ik,"]
[2,"mPp çkFkfed",null,{"$f":"D16+H16-G24","v":12101.95},{"$nulls":5},":Ik,"]