{"text_format":"3","workbook":"xlsx","n_sheets":4,"sheets":["How to Use","Master Sheet","Arrear Sheet","Unlock sheet"],"not_rendered":{"images":2,"defined_names":5},"read":"whole","date_system":"1900"}

{"sheet":"How to Use","index":0,"n_rows":22,"n_cols":6,"rows_kept":22,"merged":[[0,1,1,2],[3,1,3,2]]}
[null,"यह एक्सेल प्रोग्राम इष्टदेव बजरंगबली व पाबूजी महाराज की असीम कृपा तथा गुरुदेव वासुदेवजी महाराज के आशीर्वाद और माता -पिता के शुभ आशीष से आप तक हाजिर किया जा रहा है "]
[]
[]
[null," ::   निर्देश  ::"]
[null,"Video No. 01 link :-","https://youtu.be/e9tzJ3zCZPk"]
[null,"Video No. 02 link :-","https://youtu.be/KZNCz_sq6iQ"]
[null,"Video No. 03 link :-","https://youtu.be/ZmZ-D7xZTpA"]
[1,"Master Sheet :-","इस शीट पर आप अपने से सम्बंधित सूचना की एंट्री कर सकते है I सबसे पहले आप अपने विद्यालय का नाम तथा उसके बाद अपने डीडीओ का नाम व पद , उसके बाद अपना स्वयं का नाम व पद इनपुट करें I उसके बाद आपको किस माह से एरियर बनाना है , उस माह को सलेक्ट बटन से सलेक्ट करे तथा अगले कॉलम में किस माह तक एरियर बनाना है उसे सलेक्ट करें I मकान किराया दर , पे मेट्रिक्स लेवल और इनकम टैक्स कटवाना है तो प्रतिशत में लिखे अन्यथा शुन्य ही रहने देवे I उसके बाद वेतन का प्रकार लिखें , इसमे आप रेगुलर पे और फिक्स पे में से चयन करें I यदि आप फिक्स वेतन को सलेक्ट करते है तो फ़िक्स पे के वेतन वाला कॉलम खुल जायेगा और रेगुलर वेतन वाला कॉलम फ्रीज़ हो जायेगा I और यदि आप रेगुलर पे का आप्शन सलेक्ट करते है तो रेगुलर पे वाला आप्शन अनफ्रीज़ हो जायेगा I उसके बाद आप जिस दिनांक से वेतन बनाना चाहते है उस दिनांक को DD/MM/YYYY के फॉर्मेट में लिखें I नवीन वेतन का बेसिक पे लिखें , जिसके द्वारा एरियर की कैलकुलेशन होगी I उसके बाद यदि आप किसी पूर्व राजकीय सेवा में रहने के कारण एरियर बनाना है तो इसमे YES सलेक्ट करें I जैसे ही YES सलेक्ट करेंगे तो वेतन लिखने के लिए कॉलम अनफ्रीज़ हो जायेगा , जिसमे वेतन लिख पायेंगे I उसके बाद यदि आपके S.I. कटौती हो रही है तो S.I. कटौती को इन्द्राज करें I उसके बाद यदि आपके G.P.F. कटौती हो रही है तो पहले YES सलेक्ट करें तथा उसके बाद आप G.P.F. कटौती को इन्द्राज करें I अन्त में यदि एरियर बनाने के पीरियड में आपके वेतन में जुलाई की वेतन वृद्धि के अलावा ओर किसी प्रकार की वेतन वृद्धि हुई है तो YES सलेक्ट करे , YES सलेक्ट करते ही वेतन लिखने के लिए आप्शन शो हो जायेंगे I नियमित वेतन वृद्धि स्वतः होगी I\n   मार्च 2020 के वेतन से कोरोना की कटौती हुई हो तो yes सेलेक्ट करे I जैसे ही yes सलेक्ट करेंगे दिनों की संख्या भरने के आप्शन शो हो जायेगा I वहा दिनों की संख्या सलेक्ट कर लेवे I",null,null," "]
{"$rows_left_out":15}
{"sheet":"Master Sheet","index":1,"n_rows":80,"n_cols":33,"rows_kept":80,"merged":[[0,3,0,8],[0,9,0,10],[1,9,1,10],[2,3,2,10],[4,8,4,9],[4,13,5,13],[6,8,6,9],[6,14,6,15],[8,1,8,2],[8,8,8,9],[10,1,10,2],[10,8,10,9],[12,1,12,2],[12,8,12,9],[14,1,14,5],[14,8,14,9],[15,1,15,2],[16,1,16,2],[16,8,16,9],[18,1,18,2],[18,8,18,9],[20,1,20,2],[20,8,20,9],[22,1,22,2],[22,8,22,9],[24,1,24,2],[24,8,24,9],[26,1,26,2],[28,1,28,2],[28,5,28,9],[30,8,30,9],[33,10,33,12],[34,2,34,3],[34,4,34,6],[34,10,34,12],[35,2,35,3],[35,4,35,6],[36,2,36,3],[36,4,36,6],[37,2,37,3],[37,4,37,6],[38,2,38,3],[38,4,38,6],[39,4,39,6],[40,4,40,6]]}
[{"$nulls":3},"DATA ENTRY",{"$nulls":5},"You tube Video Link\nGiven Bleow"]
[]
[null,null,"Office Name :-","Mahatma Gandhi Government School (English Medium) Bar, PALI",{"$nulls":28},"2017-01-01"]
[{"$nulls":32},"2017-02-01"]
[null,null,"डीडीओ का नाम :-","USHA PALIYA",null,"डीडीओ का पद  :-","Principal",null,"जुलाई 2021 से पूर्व मकान किराया दर :-",null,8,"%",null,"HRA पुराना ही लिखे \nनए के लिए Cell no. D29",{"$nulls":18},"2017-03-01"]
[{"$nulls":32},"2017-04-01"]
[null,null,"कार्मिक का नाम :-","HEERALAL JAT",null,"कार्मिक का पद :-","Sr. Teacher",null,"निर्धारित पे मैट्रिक्स लेवल :-",null,{"v":10,"d":"L-10"},{"$nulls":3},"परम पूज्य गुरुदेव वासुदेवजी महाराज ",{"$nulls":17},"2017-05-01"]
[{"$nulls":32},"2017-06-01"]
{"$rows_left_out":73}
{"sheet":"Arrear Sheet","index":2,"n_rows":95,"n_cols":68,"rows_kept":95,"merged":[[0,2,0,29],[1,2,1,29],[2,2,2,4],[2,5,2,11],[2,12,2,13],[2,14,2,18],[2,19,2,21],[2,22,2,23],[2,25,2,27],[2,28,2,29],[3,2,3,4],[3,7,3,12],[3,13,3,15],[3,17,3,19],[3,20,3,22],[3,23,3,29],[5,1,6,1],[5,2,6,2],[5,3,5,6],[5,7,5,10],[5,11,5,14],[5,15,5,17],[5,18,5,20],[5,21,5,23],[5,24,6,24],[5,25,6,25],[5,26,6,26],[5,27,6,27],[5,28,6,28],[5,29,6,29]]}
[null,null,{"$f":"IF('Master Sheet'!D3=\"\",\"\",CONCATENATE(\"Office \",'Master Sheet'!D3,))","v":"Office Mahatma Gandhi Government School (English Medium) Bar, PALI"},{"$nulls":34},"2022-03-01",null,null,"2020-03-01",{"$nulls":3},{"$f":"'Master Sheet'!K31","v":2100}]
[null,null,"Difference Arrear Sheet",{"$nulls":34},"NPS",null,null,{"$f":"'Master Sheet'!D27","v":"NO"},{"$f":"'Master Sheet'!G27","v":3},{"$f":"IFERROR(IF(AP4=\"\",0,MONTH(AP4)),\"\")","v":10},{"$nulls":3},{"$f":"IF(AO4=AO3,29,IF(AQ2=1,31,IF(AQ2=2,28,IF(AQ2=3,31,IF(AQ2=4,30,IF(AQ2=5,31,IF(AQ2=6,30,IF(AQ2=7,31,IF(AQ2=8,31,IF(AQ2=9,30,IF(AQ2=10,31,IF(AQ2=11,30,IF(AQ2=12,31,0)))))))))))))","v":31},null,"2017-07-01","2023-07-01"]
[null,null,"Name Of Employee :",null,null,{"$f":"IFERROR(UPPER('Master Sheet'!D7),\"\")","v":"HEERALAL JAT"},{"$nulls":6},"    Post :  ",null,{"$f":"IFERROR(UPPER('Master Sheet'!G7),\"\")","v":"SR. TEACHER"},{"$nulls":4},"    Pay Matrix Level : ",null,null,{"$f":"IFERROR(CONCATENATE(\"L - \",'Master Sheet'!K7),\"\")","v":"L - 10"},null,null,"GPF / NPS :-",null,null,{"$f":"IF($AO$18=$AO$20,\"GPF\",\"NPS\")","v":"NPS"},{"$nulls":9},{"$f":"MONTH(AQ10)","v":11},null,{"$f":"'Master Sheet'!D9","v":"2020-10-01"},null,{"$f":"IFERROR(IF(AO6=\"\",0,MONTH(AO6)),\"\")","v":10},{"$nulls":3},{"$f":"IF(AO4=AO3,29,IF(AQ2=1,31,IF(AQ2=2,28,IF(AQ2=3,31,IF(AQ2=4,30,IF(AQ2=5,31,IF(AQ2=6,30,IF(AQ2=7,31,IF(AQ2=8,31,IF(AQ2=9,30,IF(AQ2=10,31,IF(AQ2=11,30,IF(AQ2=12,31,0)))))))))))))","v":31},null,"2018-07-01"]
[{"$nulls":7},"Arrear From Date :",{"$nulls":5},{"$f":"IFERROR('Master Sheet'!D9,\"\")","v":"2020-10-01"},null,null,"to",{"$f":"IFERROR('Master Sheet'!G9,\"\")","v":"2022-06-01"},null,null,"Posting Place :",null,null,{"$f":"'Master Sheet'!D3","v":"Mahatma Gandhi Government School (English Medium) Bar, PALI"},{"$nulls":13},{"$f":"IF(AC3=\"GPF\",\" GPF\",\"GPF-2004\")","v":"GPF-2004"},{"$f":"MONTH(AP6)","v":6},null,"2020-02-01",{"$f":"'Master Sheet'!D13","v":"2020-10-05"},{"$f":"IFERROR(IF(AP4=\"\",0,DAY(AP4)-1),\"\")","v":4},{"$nulls":3},{"$f":"IFERROR(SUM(AU3-AQ4),\"\")","v":27},null,"2019-07-01"]
[{"$nulls":48},"2020-07-01"]
[null,"Sr. No.","Month","Pay Due",{"$nulls":3},"Pay Drawn",{"$nulls":3},"Pay Difference",{"$nulls":3},{"$f":"IF($AO$18=$AO$20,\"GPF\",\"NPS/GPF-2004\")","v":"NPS/GPF-2004"},null,null,"SI",null,null,"Corona relief fund",null,null,{"$f":"CONCATENATE(\"GPF In \",AL4)","v":"GPF In GPF-2004"},"Income Tax","Total Deduction","Net Payment","Bill No./Date","Encashment Date",{"$nulls":8},"2020-09-01","2020-10-01",{"$f":"IF('Master Sheet'!D9=\"\",\"\",'Master Sheet'!D9)","v":"2020-10-01"},{"$f":"IF('Master Sheet'!G9=\"\",\"\",'Master Sheet'!G9)","v":"2022-06-01"},{"$f":"IFERROR(IF(AP4=\"\",0,DAY(AP4)-1),\"\")","v":4},{"$nulls":3},{"$f":"IFERROR(SUM(AU2-AQ4),\"\")","v":27},null,"2021-07-01"]
[{"$nulls":3},"Pay","DA","HRA","Total","Pay","DA","HRA","Total","Pay","DA","HRA","Total","Due","Ded","Diff.","Due","Ded","Diff.","Due","Ded","Diff.",{"$nulls":13},{"$f":"IF(AM7=\"NO\",28,31)","v":31},{"$f":"IF('Master Sheet'!K29=\"\",\"\",'Master Sheet'!K29)","v":"YES"},null,{"$f":"IF('Master Sheet'!K9=\"\",\"\",'Master Sheet'!K9)","v":0},null,{"$f":"IF('Master Sheet'!K5=\"\",\"\",'Master Sheet'!K5)","v":8},{"$nulls":3},{"$f":"IF('Master Sheet'!D29=\"\",\"\",'Master Sheet'!D29)","v":9},"2021-07-01","2022-07-01",{"$nulls":11},{"$f":"ROUND(ROUND(M8*3%,0)*10%,0)","v":15}]
[{"$f":"IF(LEN(C8)>=2,1,0)","v":1},{"$f":"IFERROR(IF(A8=\"\",\"\",IF(A8=0,\"\",A8)),\"\")","v":1},{"$f":"IFERROR(IF(AT9=\"\",\"\",AT9),\"\")","v":"2020-10-01"},{"$f":"IFERROR(IF(AU9=\"\",\"\",AU9),\"\")","v":29439},{"$f":"IFERROR(IF(AV9=\"\",\"\",AV9),\"\")","v":5005},{"$f":"IFERROR(IF(OR(C8=$AM$16,C8=$AM$17,C8=$AM$18,C8=$AM$19,C8=$AM$20,C8=$AM$21,C8=$AM$22,C8=$AM$23,C8=$AM$24),0,IF(AW9=\"\",\"\",AW9)),\"\")","v":2355},{"$f":"IF(C8=\"\",\"\",SUM(D8:F8))","v":36799},{"$f":"IFERROR(IF(AY9=\"\",\"\",AY9),\"\")","v":20642},{"$f":"IFERROR(IF(AZ9=\"\",\"\",AZ9),\"\")","v":0},{"$f":"IFERROR(IF(OR(C8=$AM$16,C8=$AM$17,C8=$AM$18,C8=$AM$19,C8=$AM$20,C8=$AM$21,C8=$AM$22,C8=$AM$23,C8=$AM$24),0,IF(BA9=\"\",\"\",BA9)),\"\")","v":0},{"$f":"IF(C8=\"\",\"\",SUM(H8:J8))","v":20642},{"$f":"IFERROR(IF(C8=\"\",\"\",IF(D8=\"\",\"\",IF(H8=\"\",\"\",SUM(D8-H8)))),\"\")","v":8797},{"$f":"IFERROR(IF(C8=\"\",\"\",IF(E8=\"\",\"\",IF(I8=\"\",\"\",SUM(E8-I8)))),\"\")","v":5005},{"$f":"IFERROR(IF(C8=\"\",\"\",IF(F8=\"\",\"\",IF(J8=\"\",\"\",SUM(F8-J8)))),\"\")","v":2355},{"$f":"IFERROR(IF(C8=\"\",\"\",IF(G8=\"\",\"\",IF(K8=\"\",\"\",SUM(G8-K8)))),\"\")","v":16157},{"$f":"IFERROR(IF(C8=\"\",\"\",IF(AND(C8>$AL$1,$AC$3=$AL$2),BO9,IF($AO$18=$AO$20,SUM(BB9+BJ9),ROUND((D8+E8)*10%,0)))),\"\")","v":3444},{"$f":"IFERROR(IF(C8=\"\",\"\",IF(H8=\"\",\"\",IF(I8=\"\",\"\",IF(AND(C8>$AL$1,$AC$3=$AL$2),BO9,IF($AO$18=$AO$20,$AO$21,ROUND((H8+I8)*10%,0)))))),\"\")","v":2064},{"$f":"IFERROR(IF(C8=\"\",\"\",SUM(P8-Q8)),\"\")","v":1380},{"$f":"IFERROR(IF(C8=\"\",\"\",IF($AO$16=$AO$17,0,IF($AO$19=$AO$20,$AO$25,0))),\"\")","v":0},{"$f":"IFERROR(IF(C8=\"\",\"\",IF($AO$16=$AO$17,0,IF($AO$19=$AO$20,$AO$24,0))),\"\")","v":0},{"$f":"IFERROR(IF(C8=\"\",\"\",SUM(S8-T8)),\"\")","v":0},{"$f":"IF(C8=\"\",\"\",IF(AND($AO$2=$AO$20,C8=$AO$1),ROUND(D8/31*$AP$2,0),IF(C8=$AM$6,ROUND((G8)*1/30,0),IF(C8=$AN$6,ROUND((G8)*1/31,0),\"\"))))","v":1187},{"$f":"IF(C8=\"\",\"\",IF(AND($AO$2=$AO$20,C8=$AO$1),ROUND(H8/31*$AP$2,0),IF(C8=$AM$6,ROUND((K8)*1/30,0),IF(C8=$AN$6,ROUND((K8)*1/31,0),\"\"))))","v":666},{"$f":"IFERROR(IF(C8=\"\",\"\",SUM(V8-W8)),\"\")","v":521},{"$f":"IFERROR(IF(BG9=\"\",\"\",IF(AND($P$6=\"NPS\",BG9=\"YES\"),SUM(BH9+BO9),\"\")),\"\")","v":""},{"$f":"IFERROR(IF(C8=\"\",\"\",ROUND(O8*$AO$7%,0)),\"\")","v":0},{"$f":"IFERROR(IF(C8=\"\",\"\",IF($AC$3=\"GPF\",SUM(R8,U8,X8,Y8,Z8),SUM(U8,X8,Y8,Z8))),\"\")","v":521},{"$f":"IFERROR(IF(C8=\"\",\"\",SUM(O8-AA8)),\"\")","v":15636},{"$nulls":33},"GPF"]
{"$rows_left_out":88}
{"sheet":"Unlock sheet","index":3,"n_rows":89,"n_cols":29,"rows_kept":89,"merged":[[0,1,0,28],[1,1,1,28],[2,1,2,3],[2,4,2,10],[2,11,2,12],[2,13,2,17],[2,18,2,20],[2,21,2,22],[2,24,2,26],[2,27,2,28],[3,1,3,3],[3,6,3,11],[3,12,3,14],[3,16,3,18],[3,19,3,21],[3,22,3,28],[5,0,6,0],[5,1,6,1],[5,2,5,5],[5,6,5,9],[5,10,5,13],[5,14,5,16],[5,17,5,19],[5,20,5,22],[5,23,6,23],[5,24,6,24],[5,25,6,25],[5,26,6,26],[5,27,6,27],[5,28,6,28],[79,0,79,1],[79,30,88,34],[79,35,88,35],[80,6,80,7],[80,8,80,27],[81,20,81,27],[82,2,82,6],[82,9,82,10],[82,20,82,27],[83,1,83,7],[84,1,84,6],[84,20,84,27],[85,1,85,4],[85,5,85,14],[85,20,85,27],[86,1,86,2],[86,20,87,27],[88,1,88,2]]}
[null,{"$f":"IF('Master Sheet'!D3=\"\",\"\",CONCATENATE(\"Office \",'Master Sheet'!D3))","v":"Office Mahatma Gandhi Government School (English Medium) Bar, PALI"}]
[null,"Difference Arrear Sheet"]
[null,"Name Of Employee :",null,null,{"$f":"IFERROR(UPPER('Master Sheet'!D7),\"\")","v":"HEERALAL JAT"},{"$nulls":6},"    Post :  ",null,{"$f":"IFERROR(UPPER('Master Sheet'!G7),\"\")","v":"SR. TEACHER"},{"$nulls":4},"    Pay Matrix Level : ",null,null,{"$f":"IFERROR(CONCATENATE(\"L - \",'Master Sheet'!K7),\"\")","v":"L - 10"},null,null,"GPF / NPS :-",null,null,{"$f":"IF('Arrear Sheet'!AO18='Arrear Sheet'!AO20,\"GPF\",\"NPS\")","v":"NPS"}]
[{"$nulls":6},"Arrear From Date :",{"$nulls":5},{"$f":"IFERROR('Master Sheet'!D9,\"\")","v":"2020-10-01"},null,null,"to",{"$f":"IFERROR('Master Sheet'!G9,\"\")","v":"2022-06-01"},null,null,"Posting Place :",null,null,{"$f":"IFERROR(IF('Arrear Sheet'!X4=\"\",\"\",'Arrear Sheet'!X4),\"\")","v":"Mahatma Gandhi Government School (English Medium) Bar, PALI"}]
[]
["Sr. No.","Month","Pay Due",{"$nulls":3},"Pay Drawn",{"$nulls":3},"Pay Difference",{"$nulls":3},{"$f":"'Arrear Sheet'!P6","v":"NPS/GPF-2004"},null,null,"SI",null,null,"Corona relief fund",null,null,"Arrear inGPF-2004","Income Tax","Total Deduction","Net Payment","Bill No./Date","Encashment Date"]
[null,null,"Pay","DA","HRA","Total","Pay","DA","HRA","Total","Pay","DA","HRA","Total","Due","Ded","Diff.","Due","Ded","Diff.","Due","Ded","Diff."]
[{"$f":"IF('Arrear Sheet'!B8=\"\",\"\",'Arrear Sheet'!B8)","v":1},{"$f":"IF('Arrear Sheet'!C8=\"\",\"\",IF('Arrear Sheet'!C8=\"TOTAL\",\"\",'Arrear Sheet'!C8))","v":"2020-10-01"},{"$f":"IF('Arrear Sheet'!D8=\"\",\"\",IF('Arrear Sheet'!C8=\"TOTAL\",\"\",IF('Arrear Sheet'!D8=\"अक्षरें राशि :-\",\"\",'Arrear Sheet'!D8)))","v":29439},{"$f":"IF('Arrear Sheet'!E8=\"\",\"\",IF('Arrear Sheet'!C8=\"TOTAL\",\"\",'Arrear Sheet'!E8))","v":5005},{"$f":"IF('Arrear Sheet'!F8=\"\",\"\",IF('Arrear Sheet'!C8=\"TOTAL\",\"\",'Arrear Sheet'!F8))","v":2355},{"$f":"IF('Arrear Sheet'!G8=\"\",\"\",IF('Arrear Sheet'!C8=\"TOTAL\",\"\",SUM(C8:E8)))","v":36799},{"$f":"IF('Arrear Sheet'!H8=\"\",\"\",IF('Arrear Sheet'!C8=\"TOTAL\",\"\",'Arrear Sheet'!H8))","v":20642},{"$f":"IF('Arrear Sheet'!I8=\"\",\"\",IF('Arrear Sheet'!C8=\"TOTAL\",\"\",'Arrear Sheet'!I8))","v":0},{"$f":"IF('Arrear Sheet'!J8=\"\",\"\",IF('Arrear Sheet'!C8=\"TOTAL\",\"\",'Arrear Sheet'!J8))","v":0},{"$f":"IF('Arrear Sheet'!K8=\"\",\"\",IF('Arrear Sheet'!C8=\"TOTAL\",\"\",SUM(G8:I8)))","v":20642},{"$f":"IF('Arrear Sheet'!L8=\"\",\"\",IF('Arrear Sheet'!C8=\"TOTAL\",\"\",'Arrear Sheet'!L8))","v":8797},{"$f":"IF('Arrear Sheet'!M8=\"\",\"\",IF('Arrear Sheet'!C8=\"TOTAL\",\"\",'Arrear Sheet'!M8))","v":5005},{"$f":"IF('Arrear Sheet'!N8=\"\",\"\",IF('Arrear Sheet'!C8=\"TOTAL\",\"\",'Arrear Sheet'!N8))","v":2355},{"$f":"IF('Arrear Sheet'!O8=\"\",\"\",IF('Arrear Sheet'!C8=\"TOTAL\",\"\",SUM(K8:M8)))","v":16157},{"$f":"IF('Arrear Sheet'!P8=\"\",\"\",IF('Arrear Sheet'!C8=\"TOTAL\",\"\",'Arrear Sheet'!P8))","v":3444},{"$f":"IF('Arrear Sheet'!Q8=\"\",\"\",IF('Arrear Sheet'!C8=\"TOTAL\",\"\",'Arrear Sheet'!Q8))","v":2064},{"$f":"IF('Arrear Sheet'!R8=\"\",\"\",IF('Arrear Sheet'!C8=\"TOTAL\",\"\",'Arrear Sheet'!R8))","v":1380},{"$f":"IF('Arrear Sheet'!S8=\"\",\"\",IF('Arrear Sheet'!C8=\"TOTAL\",\"\",'Arrear Sheet'!S8))","v":0},{"$f":"IF('Arrear Sheet'!T8=\"\",\"\",IF('Arrear Sheet'!C8=\"TOTAL\",\"\",'Arrear Sheet'!T8))","v":0},{"$f":"IF('Arrear Sheet'!U8=\"\",\"\",IF('Arrear Sheet'!C8=\"TOTAL\",\"\",'Arrear Sheet'!U8))","v":0},{"$f":"IF('Arrear Sheet'!V8=\"\",\"\",IF('Arrear Sheet'!C8=\"TOTAL\",\"\",'Arrear Sheet'!V8))","v":1187},{"$f":"IF('Arrear Sheet'!W8=\"\",\"\",IF('Arrear Sheet'!C8=\"TOTAL\",\"\",'Arrear Sheet'!W8))","v":666},{"$f":"IF('Arrear Sheet'!X8=\"\",\"\",IF('Arrear Sheet'!C8=\"TOTAL\",\"\",'Arrear Sheet'!X8))","v":521},{"$f":"IF('Arrear Sheet'!Y8=\"\",\"\",IF('Arrear Sheet'!C8=\"TOTAL\",\"\",'Arrear Sheet'!Y8))","v":""},{"$f":"IF('Arrear Sheet'!Z8=\"\",\"\",IF('Arrear Sheet'!C8=\"TOTAL\",\"\",'Arrear Sheet'!Z8))","v":0},{"$f":"IF('Arrear Sheet'!AA8=\"\",\"\",'Arrear Sheet'!AA8)","v":521},{"$f":"IF('Arrear Sheet'!AB8=\"\",\"\",IF('Arrear Sheet'!C8=\"TOTAL\",\"\",SUM(N8-Z8)))","v":15636}]
{"$rows_left_out":81}