{"text_format":"3","workbook":"xlsx","n_sheets":4,"sheets":["How to Use","Master Sheet","Arrear Sheet","Unlock sheet"],"not_rendered":{"images":2,"defined_names":5},"read":"whole","date_system":"1900"}

{"sheet":"How to Use","index":0,"n_rows":22,"n_cols":6,"rows_kept":22,"merged":[[0,1,1,2],[3,1,3,2]]}
[null,"यह एक्सेल प्रोग्राम इष्टदेव बजरंगबली व पाबूजी महाराज की असीम कृपा तथा गुरुदेव वासुदेवजी महाराज के आशीर्वाद और माता -पिता के शुभ आशीष से आप तक हाजिर किया जा रहा है "]
[]
[]
[null," ::   निर्देश  ::"]
[null,"Video No. 01 link :-","https://youtu.be/e9tzJ3zCZPk"]
[null,"Video No. 02 link :-","https://youtu.be/KZNCz_sq6iQ"]
[null,"Video No. 03 link :-","https://youtu.be/ZmZ-D7xZTpA"]
[1,"Master Sheet :-","इस शीट पर आप अपने से सम्बंधित सूचना की एंट्री कर सकते है I सबसे पहले आप अपने विद्यालय का नाम तथा उसके बाद अपने डीडीओ का नाम व पद , उसके बाद अपना स्वयं का नाम व पद इनपुट करें I उसके बाद आपको किस माह से एरियर बनाना है , उस माह को सलेक्ट बटन से सलेक्ट करे तथा अगले कॉलम में किस माह तक एरियर बनाना है उसे सलेक्ट करें I मकान किराया दर , पे मेट्रिक्स लेवल और इनकम टैक्स कटवाना है तो प्रतिशत में लिखे अन्यथा शुन्य ही रहने देवे I उसके बाद वेतन का प्रकार लिखें , इसमे आप रेगुलर पे और फिक्स पे में से चयन करें I यदि आप फिक्स वेतन को सलेक्ट करते है तो फ़िक्स पे के वेतन वाला कॉलम खुल जायेगा और रेगुलर वेतन वाला कॉलम फ्रीज़ हो जायेगा I और यदि आप रेगुलर पे का आप्शन सलेक्ट करते है तो रेगुलर पे वाला आप्शन अनफ्रीज़ हो जायेगा I उसके बाद आप जिस दिनांक से वेतन बनाना चाहते है उस दिनांक को DD/MM/YYYY के फॉर्मेट में लिखें I नवीन वेतन का बेसिक पे लिखें , जिसके द्वारा एरियर की कैलकुलेशन होगी I उसके बाद यदि आप किसी पूर्व राजकीय सेवा में रहने के कारण एरियर बनाना है तो इसमे YES सलेक्ट करें I जैसे ही YES सलेक्ट करेंगे तो वेतन लिखने के लिए कॉलम अनफ्रीज़ हो जायेगा , जिसमे वेतन लिख पायेंगे I उसके बाद यदि आपके S.I. कटौती हो रही है तो S.I. कटौती को इन्द्राज करें I उसके बाद यदि आपके G.P.F. कटौती हो रही है तो पहले YES सलेक्ट करें तथा उसके बाद आप G.P.F. कटौती को इन्द्राज करें I अन्त में यदि एरियर बनाने के पीरियड में आपके वेतन में जुलाई की वेतन वृद्धि के अलावा ओर किसी प्रकार की वेतन वृद्धि हुई है तो YES सलेक्ट करे , YES सलेक्ट करते ही वेतन लिखने के लिए आप्शन शो हो जायेंगे I नियमित वेतन वृद्धि स्वतः होगी I\n   मार्च 2020 के वेतन से कोरोना की कटौती हुई हो तो yes सेलेक्ट करे I जैसे ही yes सलेक्ट करेंगे दिनों की संख्या भरने के आप्शन शो हो जायेगा I वहा दिनों की संख्या सलेक्ट कर लेवे I",null,null," "]
[{"$nulls":3},"Update on"]
[null,null,"नोट :-  आप को जो भी एन्ट्री करनी है वो सब मास्टर शीट पर ही करनी है , एरियर शीट पर कुछ नहीं करना है I यदि आपको ड्राप डाउन लिस्ट में आपका पद नहीं मिल रहा है तो मास्टर शीट पर गुरुदेव की फोटो के निचे टेबल दे रखी है , उसमे लिख लेवे , वह पद लिस्ट में ऐड हो जाएगा I","2022-06-24"]
[null,null," "]
[2,"Arrear Sheet :-","यहाँ पर मास्टर शीट पर जो एंट्री की गयी है उसका आउटपुट मिलेगा I यहाँ किसी भी प्रकार की एन्ट्री नहीं होगी I जो भी संशोधन करना है तो मास्टर शीट पर करना है I यह शीट fully ऑटोमेटेड है , यहाँ पर केवल प्रिंट निकलना है , जो A4 साइज़ में पेज सेट किया हुआ है I"]
[]
[3,"Unlock Arrear Sheet :-","यह अनलॉक शीट इसलिए डाली गयी ताकि किसी भी अपवाद स्वरुप किसी कार्मिक का वेतन ड्रा (एरियर ) सही नहीं बैठ रहा है या फिर वेतन व कटोती में ज्यादा संशोधन है तो आप अनलॉक शीट काम में ले सकते है I कही पर त्रुटि रहने के समय काम ले सकते है I"]
[]
[null,"सूचना :-","वैसे इस प्रोग्राम को तैयार करने में पूर्ण सावधानी बरती गयी है , फिर भी मानवीय त्रुटि होना संम्भव है I अतः आप अपने स्तर पर जरुर चेक कर लेवे I इस हेतु निर्माणकर्ता कतई जिम्मेदार नहीं होगा I यह आपकी सुविधा के लिए है I"]
[]
[null,null,"वैसे शीट पूरी मेहनत से तैयार की गयी है , फिर भी अगर कही पर त्रुटि रहती है तो जरुर अवगत करावे , इस हेतु जरुर संशोधित संस्करण निकाला जायेगा I"]
[]
[null,null,"धन्यवाद "]
[null,null,"आपका दोस्त "]
[null,null,"हीरालाल जाट , वरिष्ठ अध्यापक (एक्सेल प्रोग्रामर )"]

{"sheet":"Master Sheet","index":1,"n_rows":80,"n_cols":33,"rows_kept":80,"merged":[[0,3,0,8],[0,9,0,10],[1,9,1,10],[2,3,2,10],[4,8,4,9],[4,13,5,13],[6,8,6,9],[6,14,6,15],[8,1,8,2],[8,8,8,9],[10,1,10,2],[10,8,10,9],[12,1,12,2],[12,8,12,9],[14,1,14,5],[14,8,14,9],[15,1,15,2],[16,1,16,2],[16,8,16,9],[18,1,18,2],[18,8,18,9],[20,1,20,2],[20,8,20,9],[22,1,22,2],[22,8,22,9],[24,1,24,2],[24,8,24,9],[26,1,26,2],[28,1,28,2],[28,5,28,9],[30,8,30,9],[33,10,33,12],[34,2,34,3],[34,4,34,6],[34,10,34,12],[35,2,35,3],[35,4,35,6],[36,2,36,3],[36,4,36,6],[37,2,37,3],[37,4,37,6],[38,2,38,3],[38,4,38,6],[39,4,39,6],[40,4,40,6]]}
[{"$nulls":3},"DATA ENTRY",{"$nulls":5},"You tube Video Link\nGiven Bleow"]
[]
[null,null,"Office Name :-","Mahatma Gandhi Government School (English Medium) Bar, PALI",{"$nulls":28},"2017-01-01"]
[{"$nulls":32},"2017-02-01"]
[null,null,"डीडीओ का नाम :-","USHA PALIYA",null,"डीडीओ का पद  :-","Principal",null,"जुलाई 2021 से पूर्व मकान किराया दर :-",null,8,"%",null,"HRA पुराना ही लिखे \nनए के लिए Cell no. D29",{"$nulls":18},"2017-03-01"]
[{"$nulls":32},"2017-04-01"]
[null,null,"कार्मिक का नाम :-","HEERALAL JAT",null,"कार्मिक का पद :-","Sr. Teacher",null,"निर्धारित पे मैट्रिक्स लेवल :-",null,{"v":10,"d":"L-10"},{"$nulls":3},"परम पूज्य गुरुदेव वासुदेवजी महाराज ",{"$nulls":17},"2017-05-01"]
[{"$nulls":32},"2017-06-01"]
[null,"किस माह से एरियर बनाना है :-",null,"2020-10-01",null,"तथा किस माह तक एरियर बनाना है :-","2022-06-01",null,"इन्कम टैक्स कटाना है तो % में लिखे :-",null,0,"%",{"$nulls":20},"2017-07-01"]
[{"$nulls":14},"Post",{"$nulls":17},"2017-08-01"]
[null,"जो पूर्व में वेतन मिला है उसका प्रकार सेलेक्ट करें :- ",null,"Fix Pay",null," फिक्स पे वेतन मिला हो तो यहाँ लिखें :-",23700,null,"यदि नियमित वेतन मिला हो तो यहाँ लिखें :- ",null,32800,{"$nulls":3},"CDEO",{"$nulls":17},"2017-09-01"]
[{"$nulls":14},"DEEO",{"$nulls":17},"2017-10-01"]
[null,"किस तारीख से एरियर बनाना है :- \n(Date Format :- DD/MM/YYYY ).           ",null,"2020-10-05",null,"नया वेतन मिलने के दिनों की संख्या :- \n(आप सिर्फ़ चेक कर सकते है )",{"$f":"IFERROR(IF('Arrear Sheet'!AU6=\"\",\"\",'Arrear Sheet'!AU6),\"\")","v":27},null,"नवीन निर्धारित वेतन (New Basic Salary) :- ",null,33800,{"$nulls":3},"ADEO",{"$nulls":17},"2017-11-01"]
[{"$nulls":14},"ADPC",{"$nulls":17},"2017-12-01"]
[null,"वर्तमान में यदि आप पूर्व राजकीय सेवा का वेतन आहरण किया है तो सामने कॉलम में YES सेलेक्ट करे :- ",{"$nulls":4},"NO",null,"पूर्व राजकीय सेवा का वेतन (बेसिक) यहाँ लिखे :-",null,30500,{"$nulls":3},"APC",{"$nulls":17},"2018-01-01"]
[{"$nulls":14},"CBEO",{"$nulls":17},"2018-02-01"]
[null,"यदि आपके वेतन से राज्य बीमा कटोती हो रही है तो  YES सेलेक्ट करें :-",null,"NO",null,"S.I. Deduction Premium Amount :-",2100,null,"S.I. Deduction Due Premium Amount :-",null,2100,{"$nulls":3},"ACBEO-1",{"$nulls":17},"2018-03-01"]
[{"$nulls":14},"ACBEO-2",{"$nulls":17},"2018-04-01"]
[null,"यदि एरियर बनाने की अवधि के दौरान राज्य बीमा कटोती में वृद्धि हुई है तो YES सेलेक्ट करें :-",null,"NO",null,"जिस माह में S.I. Premium में बदलाव आया है , वह माह सलेक्ट करें :- ","2019-03-01",null,"परिवर्तित प्रीमियम राशि यहाँ पर लिखें :- ",null,3000,{"$nulls":3},"PEEO",{"$nulls":17},"2018-05-01"]
[{"$nulls":14},"Principal",{"$nulls":17},"2018-06-01"]
[null,"यदि कार्मिक के जीपीएफ कटौती है तो    YES सेलेक्ट करें :-",null,"NO",null,"G.P.F. Deduction Premium Amount :-",3675,null,"G.P.F. Deduction Due Premium Amount :-",null,3675,{"$nulls":3},"PEEO",{"$nulls":17},"2018-07-01"]
[{"$nulls":14},"Principal",{"$nulls":17},"2018-08-01"]
[null,"यदि एरियर बनाने की अवधि के दौरान GPF कटोती में वृद्धि हुई है तो YES सेलेक्ट करें :-",null,"NO",null,"जिस माह में G.P.F. Ded. में वृद्धि करवाई  है , वह माह सलेक्ट करें :- ","2021-04-01",null,"परिवर्तित प्रीमियम राशि यहाँ पर लिखें :- ",null,5000,{"$nulls":3},"Head Master",{"$nulls":17},"2018-09-01"]
[{"$nulls":14},"Lecturer",{"$nulls":17},"2018-10-01"]
[null,"यदि एरियर ड्रा के दौरान आपके वेतन में फिक्सेशन या एसीपी के कारण वेतन में बदलाव आया हो तो  YES सेलेक्ट करें :-",null,"NO",null,"जिस माह में वेतन में बदलाव आया है , वह माह सलेक्ट करें :- ","2021-04-01",null,"परिवर्तित वेतन यहाँ पर लिखें :- ",null,41100,{"$nulls":3},"Sr. Teacher",{"$nulls":17},"2018-11-01"]
[{"$nulls":14},"Teacher L-2",{"$nulls":17},"2018-12-01"]
[null,"यदि आपके मार्च 2020 के वेतन से कोरोना  कटोती हुई है तो  YES सेलेक्ट करें :-",null,"NO",null,"कितने दिनों का वेतन काटा गया है , उन दिनों की संख्या को सलेक्ट करें :- ",3,{"$nulls":7},"Teacher L-1",{"$nulls":17},"2019-01-01"]
[{"$nulls":14},"Prabodhak",{"$nulls":17},"2019-02-01"]
[null," जुलाई 2021 से मकान किराया दर :-",null,{"$f":"IFERROR(IF(K5=8,9,18),\"\")","v":9},"%","यदि GPF-2004 की कटौती हो रही है तो YES सलेक्ट करे, नहीं तो NO सलेक्ट करें (1 अप्रैल 2022 से) :-",{"$nulls":4},"YES",{"$nulls":3},"PTI - 1",{"$nulls":17},"2019-03-01"]
[{"$nulls":14},"PTI - II",{"$nulls":17},"2019-04-01"]
[{"$nulls":8},"GPF-2004 के प्रीमियम राशि यहाँ पर लिखें :- ",null,2100,{"$nulls":3},"PTI - III",{"$nulls":17},"2019-05-01"]
[{"$nulls":14},"Librarian",{"$nulls":17},"2019-06-01"]
[{"$nulls":14},"OA",{"$nulls":17},"2019-07-01"]
[{"$nulls":10},"New Update Date",{"$nulls":3},"UDC",{"$nulls":17},"2019-08-01"]
[null,null,"You tube Video Link",null,"This Program Is Developed By :",{"$nulls":5},"2022-06-24",{"$nulls":3},"LDC",{"$nulls":17},"2019-09-01"]
[null,null,"https://youtu.be/e9tzJ3zCZPk",null,"Heeralal Jat",{"$nulls":9},"Lab Tec.",{"$nulls":17},"2019-10-01"]
[null,null,"https://youtu.be/KZNCz_sq6iQ",null,"Senior Teacher",{"$nulls":5},"https://youtu.be/ZmZ-D7xZTpA",{"$nulls":3},"Peon",{"$nulls":17},"2019-11-01"]
[null,null,"You tube Channal Link",null,"Mahatma Gandhi Government School Bar , PALI",{"$nulls":27},"2019-12-01"]
[null,null,"https://youtube.com/c/Heeralaljat",null,"V./P. :- Chandawal Nagar, Teh. - Sojat (Pali)",{"$nulls":27},"2020-01-01"]
[{"$nulls":4},"heeralaljatchandawal@gmail.com",{"$nulls":27},"2020-02-01"]
[{"$nulls":32},"2020-03-01"]
[{"$nulls":32},"2020-04-01"]
[{"$nulls":32},"2020-05-01"]
[{"$nulls":32},"2020-06-01"]
[{"$nulls":32},"2020-07-01"]
[{"$nulls":32},"2020-08-01"]
[{"$nulls":32},"2020-09-01"]
[{"$nulls":32},"2020-10-01"]
[{"$nulls":32},"2020-11-01"]
[{"$nulls":32},"2020-12-01"]
[{"$nulls":32},"2021-01-01"]
[{"$nulls":32},"2021-02-01"]
[{"$nulls":32},"2021-03-01"]
[{"$nulls":32},"2021-04-01"]
[{"$nulls":32},"2021-05-01"]
[{"$nulls":32},"2021-06-01"]
[{"$nulls":32},"2021-07-01"]
[{"$nulls":32},"2021-08-01"]
[{"$nulls":32},"2021-09-01"]
[{"$nulls":32},"2021-10-01"]
[{"$nulls":32},"2021-11-01"]
[{"$nulls":32},"2021-12-01"]
[{"$nulls":32},"2022-01-01"]
[{"$nulls":32},"2022-02-01"]
[{"$nulls":32},"2022-03-01"]
[{"$nulls":32},"2022-04-01"]
[{"$nulls":32},"2022-05-01"]
[{"$nulls":32},"2022-06-01"]
[{"$nulls":32},"2022-07-01"]
[{"$nulls":32},"2022-08-01"]
[{"$nulls":32},"2022-09-01"]
[{"$nulls":32},"2022-10-01"]
[{"$nulls":32},"2022-11-01"]
[{"$nulls":32},"2022-12-01"]
[{"$nulls":32},"2023-01-01"]
[{"$nulls":32},"2023-02-01"]
[{"$nulls":32},"2023-03-01"]
[{"$nulls":32},"2023-04-01"]
[{"$nulls":32},"2023-05-01"]
[{"$nulls":32},"2023-06-01"]

{"sheet":"Arrear Sheet","index":2,"n_rows":95,"n_cols":68,"rows_kept":95,"merged":[[0,2,0,29],[1,2,1,29],[2,2,2,4],[2,5,2,11],[2,12,2,13],[2,14,2,18],[2,19,2,21],[2,22,2,23],[2,25,2,27],[2,28,2,29],[3,2,3,4],[3,7,3,12],[3,13,3,15],[3,17,3,19],[3,20,3,22],[3,23,3,29],[5,1,6,1],[5,2,6,2],[5,3,5,6],[5,7,5,10],[5,11,5,14],[5,15,5,17],[5,18,5,20],[5,21,5,23],[5,24,6,24],[5,25,6,25],[5,26,6,26],[5,27,6,27],[5,28,6,28],[5,29,6,29]]}
[null,null,{"$f":"IF('Master Sheet'!D3=\"\",\"\",CONCATENATE(\"Office \",'Master Sheet'!D3,))","v":"Office Mahatma Gandhi Government School (English Medium) Bar, PALI"},{"$nulls":34},"2022-03-01",null,null,"2020-03-01",{"$nulls":3},{"$f":"'Master Sheet'!K31","v":2100}]
[null,null,"Difference Arrear Sheet",{"$nulls":34},"NPS",null,null,{"$f":"'Master Sheet'!D27","v":"NO"},{"$f":"'Master Sheet'!G27","v":3},{"$f":"IFERROR(IF(AP4=\"\",0,MONTH(AP4)),\"\")","v":10},{"$nulls":3},{"$f":"IF(AO4=AO3,29,IF(AQ2=1,31,IF(AQ2=2,28,IF(AQ2=3,31,IF(AQ2=4,30,IF(AQ2=5,31,IF(AQ2=6,30,IF(AQ2=7,31,IF(AQ2=8,31,IF(AQ2=9,30,IF(AQ2=10,31,IF(AQ2=11,30,IF(AQ2=12,31,0)))))))))))))","v":31},null,"2017-07-01","2023-07-01"]
[null,null,"Name Of Employee :",null,null,{"$f":"IFERROR(UPPER('Master Sheet'!D7),\"\")","v":"HEERALAL JAT"},{"$nulls":6},"    Post :  ",null,{"$f":"IFERROR(UPPER('Master Sheet'!G7),\"\")","v":"SR. TEACHER"},{"$nulls":4},"    Pay Matrix Level : ",null,null,{"$f":"IFERROR(CONCATENATE(\"L - \",'Master Sheet'!K7),\"\")","v":"L - 10"},null,null,"GPF / NPS :-",null,null,{"$f":"IF($AO$18=$AO$20,\"GPF\",\"NPS\")","v":"NPS"},{"$nulls":9},{"$f":"MONTH(AQ10)","v":11},null,{"$f":"'Master Sheet'!D9","v":"2020-10-01"},null,{"$f":"IFERROR(IF(AO6=\"\",0,MONTH(AO6)),\"\")","v":10},{"$nulls":3},{"$f":"IF(AO4=AO3,29,IF(AQ2=1,31,IF(AQ2=2,28,IF(AQ2=3,31,IF(AQ2=4,30,IF(AQ2=5,31,IF(AQ2=6,30,IF(AQ2=7,31,IF(AQ2=8,31,IF(AQ2=9,30,IF(AQ2=10,31,IF(AQ2=11,30,IF(AQ2=12,31,0)))))))))))))","v":31},null,"2018-07-01"]
[{"$nulls":7},"Arrear From Date :",{"$nulls":5},{"$f":"IFERROR('Master Sheet'!D9,\"\")","v":"2020-10-01"},null,null,"to",{"$f":"IFERROR('Master Sheet'!G9,\"\")","v":"2022-06-01"},null,null,"Posting Place :",null,null,{"$f":"'Master Sheet'!D3","v":"Mahatma Gandhi Government School (English Medium) Bar, PALI"},{"$nulls":13},{"$f":"IF(AC3=\"GPF\",\" GPF\",\"GPF-2004\")","v":"GPF-2004"},{"$f":"MONTH(AP6)","v":6},null,"2020-02-01",{"$f":"'Master Sheet'!D13","v":"2020-10-05"},{"$f":"IFERROR(IF(AP4=\"\",0,DAY(AP4)-1),\"\")","v":4},{"$nulls":3},{"$f":"IFERROR(SUM(AU3-AQ4),\"\")","v":27},null,"2019-07-01"]
[{"$nulls":48},"2020-07-01"]
[null,"Sr. No.","Month","Pay Due",{"$nulls":3},"Pay Drawn",{"$nulls":3},"Pay Difference",{"$nulls":3},{"$f":"IF($AO$18=$AO$20,\"GPF\",\"NPS/GPF-2004\")","v":"NPS/GPF-2004"},null,null,"SI",null,null,"Corona relief fund",null,null,{"$f":"CONCATENATE(\"GPF In \",AL4)","v":"GPF In GPF-2004"},"Income Tax","Total Deduction","Net Payment","Bill No./Date","Encashment Date",{"$nulls":8},"2020-09-01","2020-10-01",{"$f":"IF('Master Sheet'!D9=\"\",\"\",'Master Sheet'!D9)","v":"2020-10-01"},{"$f":"IF('Master Sheet'!G9=\"\",\"\",'Master Sheet'!G9)","v":"2022-06-01"},{"$f":"IFERROR(IF(AP4=\"\",0,DAY(AP4)-1),\"\")","v":4},{"$nulls":3},{"$f":"IFERROR(SUM(AU2-AQ4),\"\")","v":27},null,"2021-07-01"]
[{"$nulls":3},"Pay","DA","HRA","Total","Pay","DA","HRA","Total","Pay","DA","HRA","Total","Due","Ded","Diff.","Due","Ded","Diff.","Due","Ded","Diff.",{"$nulls":13},{"$f":"IF(AM7=\"NO\",28,31)","v":31},{"$f":"IF('Master Sheet'!K29=\"\",\"\",'Master Sheet'!K29)","v":"YES"},null,{"$f":"IF('Master Sheet'!K9=\"\",\"\",'Master Sheet'!K9)","v":0},null,{"$f":"IF('Master Sheet'!K5=\"\",\"\",'Master Sheet'!K5)","v":8},{"$nulls":3},{"$f":"IF('Master Sheet'!D29=\"\",\"\",'Master Sheet'!D29)","v":9},"2021-07-01","2022-07-01",{"$nulls":11},{"$f":"ROUND(ROUND(M8*3%,0)*10%,0)","v":15}]
[{"$f":"IF(LEN(C8)>=2,1,0)","v":1},{"$f":"IFERROR(IF(A8=\"\",\"\",IF(A8=0,\"\",A8)),\"\")","v":1},{"$f":"IFERROR(IF(AT9=\"\",\"\",AT9),\"\")","v":"2020-10-01"},{"$f":"IFERROR(IF(AU9=\"\",\"\",AU9),\"\")","v":29439},{"$f":"IFERROR(IF(AV9=\"\",\"\",AV9),\"\")","v":5005},{"$f":"IFERROR(IF(OR(C8=$AM$16,C8=$AM$17,C8=$AM$18,C8=$AM$19,C8=$AM$20,C8=$AM$21,C8=$AM$22,C8=$AM$23,C8=$AM$24),0,IF(AW9=\"\",\"\",AW9)),\"\")","v":2355},{"$f":"IF(C8=\"\",\"\",SUM(D8:F8))","v":36799},{"$f":"IFERROR(IF(AY9=\"\",\"\",AY9),\"\")","v":20642},{"$f":"IFERROR(IF(AZ9=\"\",\"\",AZ9),\"\")","v":0},{"$f":"IFERROR(IF(OR(C8=$AM$16,C8=$AM$17,C8=$AM$18,C8=$AM$19,C8=$AM$20,C8=$AM$21,C8=$AM$22,C8=$AM$23,C8=$AM$24),0,IF(BA9=\"\",\"\",BA9)),\"\")","v":0},{"$f":"IF(C8=\"\",\"\",SUM(H8:J8))","v":20642},{"$f":"IFERROR(IF(C8=\"\",\"\",IF(D8=\"\",\"\",IF(H8=\"\",\"\",SUM(D8-H8)))),\"\")","v":8797},{"$f":"IFERROR(IF(C8=\"\",\"\",IF(E8=\"\",\"\",IF(I8=\"\",\"\",SUM(E8-I8)))),\"\")","v":5005},{"$f":"IFERROR(IF(C8=\"\",\"\",IF(F8=\"\",\"\",IF(J8=\"\",\"\",SUM(F8-J8)))),\"\")","v":2355},{"$f":"IFERROR(IF(C8=\"\",\"\",IF(G8=\"\",\"\",IF(K8=\"\",\"\",SUM(G8-K8)))),\"\")","v":16157},{"$f":"IFERROR(IF(C8=\"\",\"\",IF(AND(C8>$AL$1,$AC$3=$AL$2),BO9,IF($AO$18=$AO$20,SUM(BB9+BJ9),ROUND((D8+E8)*10%,0)))),\"\")","v":3444},{"$f":"IFERROR(IF(C8=\"\",\"\",IF(H8=\"\",\"\",IF(I8=\"\",\"\",IF(AND(C8>$AL$1,$AC$3=$AL$2),BO9,IF($AO$18=$AO$20,$AO$21,ROUND((H8+I8)*10%,0)))))),\"\")","v":2064},{"$f":"IFERROR(IF(C8=\"\",\"\",SUM(P8-Q8)),\"\")","v":1380},{"$f":"IFERROR(IF(C8=\"\",\"\",IF($AO$16=$AO$17,0,IF($AO$19=$AO$20,$AO$25,0))),\"\")","v":0},{"$f":"IFERROR(IF(C8=\"\",\"\",IF($AO$16=$AO$17,0,IF($AO$19=$AO$20,$AO$24,0))),\"\")","v":0},{"$f":"IFERROR(IF(C8=\"\",\"\",SUM(S8-T8)),\"\")","v":0},{"$f":"IF(C8=\"\",\"\",IF(AND($AO$2=$AO$20,C8=$AO$1),ROUND(D8/31*$AP$2,0),IF(C8=$AM$6,ROUND((G8)*1/30,0),IF(C8=$AN$6,ROUND((G8)*1/31,0),\"\"))))","v":1187},{"$f":"IF(C8=\"\",\"\",IF(AND($AO$2=$AO$20,C8=$AO$1),ROUND(H8/31*$AP$2,0),IF(C8=$AM$6,ROUND((K8)*1/30,0),IF(C8=$AN$6,ROUND((K8)*1/31,0),\"\"))))","v":666},{"$f":"IFERROR(IF(C8=\"\",\"\",SUM(V8-W8)),\"\")","v":521},{"$f":"IFERROR(IF(BG9=\"\",\"\",IF(AND($P$6=\"NPS\",BG9=\"YES\"),SUM(BH9+BO9),\"\")),\"\")","v":""},{"$f":"IFERROR(IF(C8=\"\",\"\",ROUND(O8*$AO$7%,0)),\"\")","v":0},{"$f":"IFERROR(IF(C8=\"\",\"\",IF($AC$3=\"GPF\",SUM(R8,U8,X8,Y8,Z8),SUM(U8,X8,Y8,Z8))),\"\")","v":521},{"$f":"IFERROR(IF(C8=\"\",\"\",SUM(O8-AA8)),\"\")","v":15636},{"$nulls":33},"GPF"]
[{"$f":"IF(C9=\"TOTAL\",\"\",IF(LEN(C9)>=2,B8+1,0))","v":2},{"$f":"IFERROR(IF(A9=\"\",\"\",IF(A9=0,\"\",A9)),\"\")","v":2},{"$f":"IFERROR(IF(AT10=\"\",\"\",AT10),\"\")","v":"2020-11-01"},{"$f":"IFERROR(IF($C9=\"TOTAL\",SUM($D$8:D8),IF(AU10=\"\",\"\",AU10)),\"\")","v":33800},{"$f":"IFERROR(IF($C9=\"TOTAL\",SUM($E$8:E8),IF(AV10=\"\",\"\",AV10)),\"\")","v":5746},{"$f":"IFERROR(IF($C9=\"TOTAL\",SUM($F$8:F8),IF(OR(C9=$AM$16,C9=$AM$17,C9=$AM$18,C9=$AM$19,C9=$AM$20,C9=$AM$21,C9=$AM$22,C9=$AM$23,C9=$AM$24),0,IF(AW10=\"\",\"\",AW10))),\"\")","v":2704},{"$f":"IF(C9=\"\",\"\",SUM(D9:F9))","v":42250},{"$f":"IFERROR(IF($C9=\"TOTAL\",SUM($H$8:H8),IF(AY10=\"\",\"\",AY10)),\"\")","v":23700},{"$f":"IFERROR(IF($C9=\"TOTAL\",SUM($I$8:I8),IF(AZ10=\"\",\"\",AZ10)),\"\")","v":0},{"$f":"IFERROR(IF($C9=\"TOTAL\",SUM($J$8:J8),IF(OR(C9=$AM$16,C9=$AM$17,C9=$AM$18,C9=$AM$19,C9=$AM$20,C9=$AM$21,C9=$AM$22,C9=$AM$23,C9=$AM$24),0,IF(BA10=\"\",\"\",BA10))),\"\")","v":0},{"$f":"IF(C9=\"\",\"\",SUM(H9:J9))","v":23700},{"$f":"IFERROR(IF(C9=\"\",\"\",IF(D9=\"\",\"\",IF(H9=\"\",\"\",IF($C9=\"TOTAL\",SUM($L$8:L8),SUM(D9-H9))))),\"\")","v":10100},{"$f":"IFERROR(IF(C9=\"\",\"\",IF(E9=\"\",\"\",IF(I9=\"\",\"\",IF($C9=\"TOTAL\",SUM($M$8:M8),SUM(E9-I9))))),\"\")","v":5746},{"$f":"IFERROR(IF(C9=\"\",\"\",IF(F9=\"\",\"\",IF(J9=\"\",\"\",IF($C9=\"TOTAL\",SUM($N$8:N8),SUM(F9-J9))))),\"\")","v":2704},{"$f":"IFERROR(IF(C9=\"\",\"\",IF(G9=\"\",\"\",IF(K9=\"\",\"\",SUM(G9-K9)))),\"\")","v":18550},{"$f":"IFERROR(IF(C9=\"\",\"\",IF(AND(C9>$AL$1,$AC$3=$AL$2),BO10,IF($AO$18=$AO$20,SUM(BB10+BJ10),ROUND((D9+E9)*10%,0)))),\"\")","v":3955},{"$f":"IFERROR(IF(C9=\"\",\"\",IF(H9=\"\",\"\",IF(I9=\"\",\"\",IF(AND(C9>$AL$1,$AC$3=$AL$2),BO10,IF($AO$18=$AO$20,$AO$21,ROUND((H9+I9)*10%,0)))))),\"\")","v":2370},1585,{"$f":"IFERROR(IF(C9=\"\",\"\",IF($AO$16=$AO$17,0,IF($C9=\"TOTAL\",SUM($S$8:S8),IF($AO$19=$AO$31,0,IF(AND($AO$32=$AO$20,C9=$AO$33),$AO$34,S8))))),\"\")","v":0},{"$f":"IFERROR(IF(C9=\"\",\"\",IF($AO$16=$AO$17,0,IF($C9=\"TOTAL\",SUM($T$8:T8),IF($AO$19=$AO$20,$AO$24,0)))),\"\")","v":0},{"$f":"IFERROR(IF(C9=\"\",\"\",SUM(S9-T9)),\"\")","v":0},{"$f":"IF(C9=\"\",\"\",IF($C9=\"TOTAL\",SUM($V$8:V8),IF(AND($AO$2=$AO$20,C9=$AO$1),ROUND(D9/31*$AP$2,0),IF(C9=$AM$6,ROUND((G9)*1/30,0),IF(C9=$AN$6,ROUND((G9)*1/31,0),\"\")))))","v":""},{"$f":"IF(C9=\"\",\"\",IF($C9=\"TOTAL\",SUM($W$8:W8),IF(AND($AO$2=$AO$20,C9=$AO$1),ROUND(H9/31*$AP$2,0),IF(C9=$AM$6,ROUND((K9)*1/30,0),IF(C9=$AN$6,ROUND((K9)*1/31,0),\"\")))))","v":""},{"$f":"IFERROR(IF(C9=\"\",\"\",SUM(V9-W9)),\"\")","v":""},{"$f":"IFERROR(IF(C9=\"\",\"\",IF(AND(BH10=\"\",BO10=\"\"),\"\",IF($C9=\"TOTAL\",SUM($Y$8:Y8),BH10))),\"\")","v":""},{"$f":"IFERROR(IF(C9=\"\",\"\",IF($C9=\"TOTAL\",SUM($Z$8:Z8),ROUND(O9*$AO$7%,0))),\"\")","v":0},{"$f":"IFERROR(IF(C9=\"\",\"\",IF($C9=\"TOTAL\",SUM($AA$8:AA8),IF($AC$3=$AL$2,SUM(U9,X9,Y9,Z9),SUM(R9,U9,X9,Y9,Z9)))),\"\")","v":0},{"$f":"IFERROR(IF(C9=\"\",\"\",IF($C9=\"TOTAL\",SUM($AB$8:AB8),SUM(O9-AA9))),\"\")","v":18550},{"$nulls":8},{"$f":"IF(OR(AT9=$AN$9,AT9=$AN$10,AT9=$AN$11,AT9=$AN$12,AT9=$AN$13,AT9=$AN$14),4,IF(OR(AT9=$AN$15,AT9=$AN$16,AT9=$AN$17,AT9=$AN$18,AT9=$AN$19,AT9=$AN$20),5,IF(OR(AT9=$AN$21,AT9=$AN$22,AT9=$AN$23,AT9=$AN$24,AT9=$AN$25,AT9=$AN$26),7,IF(OR(AT9=$AN$27,AT9=$AN$28,AT9=$AN$29,AT9=$AN$30,AT9=$AN$31,AT9=$AN$32),9,IF(OR(AT9=$AN$33,AT9=$AN$34,AT9=$AN$35,AT9=$AN$36,AT9=$AN$37,AT9=$AN$38),12,IF(OR(AT9=$AN$39,AT9=$AN$40,AT9=$AN$41,AT9=$AN$42,AT9=$AN$43,AT9=$AN$44,AT9=$AN$45,AT9=$AN$46,AT9=$AN$47,AT9=$AN$48,AT9=$AN$49,AT9=$AN$50,AT9=$AN$51,AT9=$AN$52,AT9=$AN$53,AT9=$AN$54,AT9=$AN$55,AT9=$AN$56,AT9=$AN$57,AT9=$AN$58,AT9=$AN$59,AT9=$AN$60,AT9=$AN$61,AT9=$AN$62),17,IF(OR(AT9=$AN$63,AT9=$AN$64,AT9=$AN$65,AT9=$AN$66,AT9=$AN$67,AT9=$AN$68),31,34)))))))","v":17},{"$f":"IF(OR(AT9=$AN$9,AT9=$AN$10,AT9=$AN$11,AT9=$AN$12,AT9=$AN$13,AT9=$AN$14),4,IF(OR(AT9=$AN$15,AT9=$AN$16,AT9=$AN$17,AT9=$AN$18,AT9=$AN$19,AT9=$AN$20),5,IF(OR(AT9=$AN$21,AT9=$AN$22,AT9=$AN$23,AT9=$AN$24,AT9=$AN$25,AT9=$AN$26),7,IF(OR(AT9=$AN$27,AT9=$AN$28,AT9=$AN$29,AT9=$AN$30,AT9=$AN$31,AT9=$AN$32),9,IF(OR(AT9=$AN$33,AT9=$AN$34,AT9=$AN$35,AT9=$AN$36,AT9=$AN$37,AT9=$AN$38),12,IF(OR(AT9=$AN$39,AT9=$AN$40,AT9=$AN$41,AT9=$AN$42,AT9=$AN$43,AT9=$AN$44,AT9=$AN$45,AT9=$AN$46,AT9=$AN$47,AT9=$AN$48,AT9=$AN$49,AT9=$AN$50,AT9=$AN$51,AT9=$AN$52,AT9=$AN$53,AT9=$AN$54,AT9=$AN$55,AT9=$AN$56,AT9=$AN$57,AT9=$AN$58,AT9=$AN$59,AT9=$AN$60,AT9=$AN$61,AT9=$AN$62),17,IF(OR(AT9=$AN$63,AT9=$AN$64,AT9=$AN$65,AT9=$AN$66,AT9=$AN$67,AT9=$AN$68),31,34)))))))","v":17},null,"2017-01-01",{"$f":"'Master Sheet'!K13","v":33800},{"$f":"IF(AND($AO$6>$AP$6),\"\",DATE(YEAR(AO6),MONTH(AO6),DAY(AO6)))","v":"2020-10-01"},{"$f":"IF(AND(AP9=\"\"),\"\",IF(AND(AP9=$AN$9),$AN$9,IF(AND(AP9=$AN$10),$AN$10,IF(AND(AP9=$AN$11),$AN$11,IF(AND(AP9=$AN$12),$AN$12,IF(AND(AP9=$AN$13),$AN$13,IF(AND(AP9=$AN$14),$AN$14,IF(AND(AP9=$AN$15),$AN$15,IF(AND(AP9=$AN$16),$AN$16,IF(AND(AP9=$AN$17),$AN$17,IF(AND(AP9=$AN$18),$AN$18,IF(AND(AP9=$AN$19),$AN$19,IF(AND(AP9=$AN$20),$AN$20,IF(AND(AP9=$AN$21),$AN$21,IF(AND(AP9=$AN$22),$AN$22,IF(AND(AP9=$AN$23),$AN$23,IF(AND(AP9=$AN$24),$AN$24,IF(AND(AP9=$AN$25),$AN$25,IF(AND(AP9=$AN$26),$AN$26,IF(AND(AP9=$AN$27),$AN$27,IF(AND(AP9=$AN$28),$AN$28,IF(AND(AP9=$AN$29),$AN$29,IF(AND(AP9=$AN$30),$AN$30,IF(AND(AP9=$AN$31),$AN$31,IF(AND(AP9=$AN$32),$AN$32,IF(AND(AP9=$AN$33),$AN$33,IF(AND(AP9=$AN$34),$AN$34,IF(AND(AP9=$AN$35),$AN$35,IF(AND(AP9=$AN$36),$AN$36,IF(AND(AP9=$AN$37),$AN$37,IF(AND(AP9=$AN$38),$AN$38,IF(AND(AP9=$AN$39),$AN$39,IF(AND(AP9=$AN$40),$AN$40,IF(AND(AP9=$AN$41),$AN$41,IF(AND(AP9=$AN$42),$AN$42,IF(AND(AP9=$AN$43),$AN$43,IF(AND(AP9=$AN$44),$AN$44,IF(AND(AP9=$AN$45),$AN$45,IF(AND(AP9=$AN$46),$AN$46,IF(AND(AP9=$AN$47),$AN$47,IF(AND(AP9=$AN$48),$AN$48,IF(AND(AP9=$AN$49),$AN$49,IF(AND(AP9=$AN$50),$AN$50,IF(AND(AP9=$AN$51),$AN$51,IF(AND(AP9=$AN$52),$AN$52,IF(AND(AP9=$AN$53),$AN$53,IF(AND(AP9=$AN$54),$AN$54,IF(AND(AP9=$AN$55),$AN$55,IF(AND(AP9=$AN$56),$AN$56,IF(AND(AP9=$AN$57),$AN$57,IF(AND(AP9=$AN$58),$AN$58,IF(AND(AP9=$AN$59),$AN$59,IF(AND(AP9=$AN$60),$AN$60,IF(AND(AP9=$AN$61),$AN$61,IF(AND(AP9=$AN$62),$AN$62,IF(AND(AP9=$AN$63),$AN$63,IF(AND(AP9=$AN$64),$AN$64,IF(AND(AP9=$AN$65),$AN$65,IF(AND(AP9=$AN$66),$AN$66,IF(AND(AP9=$AN$67),$AN$67,IF(AND(AP9=$AN$68),$AN$68,IF(AND(AP9=$AN$69),$AN$69,IF(AND(AP9=$AN$70),$AN$70,IF(AND(AP9=$AN$71),$AN$71,\"\"))))))))))))))))))))))))))))))))))))))))))))))))))))))))))))))))","v":"2020-10-01"},{"$f":"IF(AND(AP9=\"\"),\"\",IF(AND(AP9=$AN$72),$AP$72,IF(AND(AP9=$AN$73),$AN$73,IF(AND(AP9=$AN$74),$AN$74,IF(AND(AP9=$AN$75),$AN$75,IF(AND(AP9=$AN$76),$AN$76,IF(AND(AP9=$AN$77),$AN$77,IF(AND(AP9=$AN$78),$AN$78,IF(AND(AP9=$AN$79),$AN$79,IF(AND(AP9=$AN$80),$AN$80,IF(AND(AP9=$AN$81),$AN$81,IF(AND(AP9=$AN$82),$AN$82,IF(AND(AP9=$AN$83),$AN$83,IF(AND(AP9=$AN$84),$AN$84,IF(AND(AP9=$AN$85),$AN$85,IF(AND(AP9=$AN$86),$AN$86,IF(AND(AP9=$AN$87),$AN$87,IF(AND(AP9=$AN$88),$AN$88,IF(AND(AP9=$AN$89),$AN$89,IF(AND(AP9=$AN$90),$AN$90,IF(AND(AP9=$AN$91),$AN$91,\"\")))))))))))))))))))))","v":""},{"$f":"IFERROR(IF(AND(AQ9=\"\",AR9=\"\"),\"\",IF(AQ9=\"\",AR9,AQ9)),\"\")","v":"2020-10-01"},{"$f":"IFERROR(IF(AND(AQ9=\"\",AS9=\"\"),\"\",IF(AS9>$AP$6,\"\",AS9)),\"\")","v":"2020-10-01"},{"$f":"IF(AT9=\"\",\"\",ROUND((AO9/AU3)*AU6,0))","v":29439},{"$f":"IF(AT9=\"\",\"\",IF(AT9=\"TOTAL\",\"\",ROUND(AU9*AK9%,0)))","v":5005},{"$f":"IF(AT9=\"\",\"\",IF(AT9=\"TOTAL\",\"\",IF(AT9>=$AV$7,ROUND(AU9*$AU$7%,0),ROUND(AU9*$AQ$7%,0))))","v":2355},null,{"$f":"IF(AT9=\"\",\"\",IF(AND($AO$10=\"\",$AO$14=\"\"),\"\",IF(AO26=AO20,ROUND((AO27/AU3)*AU6,0),IF($AO$13=$AO$15,ROUND(($AO$14/AU3)*AU6,0),ROUND(($AO$10/AU3)*AU6,0)))))","v":20642},{"$f":"IF(AT9=\"\",\"\",IF(AY9=\"\",\"\",IF($AO$16=$AO$17,0,ROUND(AY9*AL9%,0))))","v":0},{"$f":"IF(AT9=\"\",\"\",IF(AY9=\"\",\"\",IF($AO$16=$AO$17,0,IF(AT9>=$AV$7,ROUND(AY9*$AU$7%,0),ROUND(AY9*$AQ$7%,0)))))","v":0},{"$f":"IF(AT9=\"\",\"\",IF(AT9=\"TOTAL\",\"\",IF(AY9=\"\",\"\",IF($AO$16=$AO$17,0,IF(OR(C8=$AM$16,C8=$AM$17,C8=$AM$18,C8=$AM$19,C8=$AM$20,C8=$AM$21,C8=$AM$22,C8=$AM$23,C8=$AM$24),SUM(BE9+$AO$22),$AO$22)))))","v":0},null,null,{"$f":"IF(AT9=\"\",\"\",IF(AT9=\"TOTAL\",\"\",IF(AY9=\"\",\"\",SUM(O8)-SUM(($AO$22-$AO$21)+SUM(U8,X8,Z8)))))","v":15636},{"$f":"IF(AT9=\"\",\"\",IF(AT9=\"TOTAL\",\"\",IF(AND($AO$20=$AO$36,C9=$AO$37),$AO$38,$AO$22)))","v":3675},{"$f":"IF(OR(AT9=$AN$63,AT9=$AN$64,AT9=$AN$65),\"YES\",\"\")","v":""},{"$f":"IF(BG9=\"\",\"\",IF($AO$16=$AO$17,ROUND((D8)*3%,0),IF(OR(AT9=$AN$63,AT9=$AN$64,AT9=$AN$65),SUM(ROUND((D8-H8)*3%,0)),IF(OR(AT9=$AN$69,AT9=$AN$70,AT9=$AN$71),SUM(ROUND((D8-H8)*3%,0)),\"\"))))","v":""},{"$f":"IFERROR(IF(AND($AO$16=$AO$17,BG9=\"YES\"),ROUND(ROUND(D8*3%,0)*10%,0),IF(AND($AO$16=$AO$15,BG9=\"YES\",$AM$7=\"NO\"),ROUND(ROUND((L8+H8)*3%,0)*10%,0),IF(AND($AO$16=$AO$15,BG9=\"YES\",$AM$7=\"YES\"),ROUND(ROUND((L8+M8)*3%,0)*10%,0),0))),\"\")","v":0},{"$f":"IF(AND($AO$16=$AO$17,BG9=\"YES\"),ROUND(D8*3%,0),IF(AND($AO$16=$AO$15,BG9=\"YES\",$AM$7=\"NO\"),ROUND((L8+H8)*3%,0),IF(AND($AO$16=$AO$15,BG9=\"YES\",$AM$7=\"YES\"),ROUND((L8+M8)*3%,0),0)))","v":0},{"$f":"IF(AND($AO$16=$AO$17,BG9=\"YES\"),ROUND(ROUND(D8*3%,0)*10%,0),IF(AND($AO$16=$AO$15,BG9=\"YES\",$AM$7=\"NO\"),ROUND(ROUND((L8+H8)*3%,0)*10%,0),IF(AND($AO$16=$AO$15,BG9=\"YES\",$AM$7=\"YES\"),ROUND(ROUND((L8+M8)*3%,0)*10%,0),\"\")))","v":""},{"$nulls":3},{"$f":"IF(AND(AT9>$AL$1,$AC$3=$AL$2),$AS$1,\"\")","v":""}]
[{"$f":"IF(C10=\"TOTAL\",\"\",IF(B9=\"\",\"\",IF(LEN(C10)>=2,B9+1,0)))","v":3},3,"2020-12-01",{"$f":"IFERROR(IF($C9=\"TOTAL\",\"अक्षरें राशि :-\",IF($C10=\"TOTAL\",SUM($D$8:D9),IF(AU11=\"\",\"\",AU11))),\"\")","v":33800},{"$f":"IFERROR(IF($C10=\"TOTAL\",SUM($E$8:E9),IF(AV11=\"\",\"\",AV11)),\"\")","v":5746},{"$f":"IFERROR(IF($C10=\"TOTAL\",SUM($F$8:F9),IF(OR(C10=$AM$16,C10=$AM$17,C10=$AM$18,C10=$AM$19,C10=$AM$20,C10=$AM$21,C10=$AM$22,C10=$AM$23,C10=$AM$24),0,IF(AW11=\"\",\"\",AW11))),\"\")","v":2704},{"$f":"IF(C10=\"\",\"\",SUM(D10:F10))","v":42250},{"$f":"IFERROR(IF($C10=\"TOTAL\",SUM($H$8:H9),IF(AY11=\"\",\"\",AY11)),\"\")","v":23700},{"$f":"IFERROR(IF($C10=\"TOTAL\",SUM($I$8:I9),IF(AZ11=\"\",\"\",AZ11)),\"\")","v":0},{"$f":"IFERROR(IF($C10=\"TOTAL\",SUM($J$8:J9),IF(OR(C10=$AM$16,C10=$AM$17,C10=$AM$18,C10=$AM$19,C10=$AM$20,C10=$AM$21,C10=$AM$22,C10=$AM$23,C10=$AM$24),0,IF(BA11=\"\",\"\",BA11))),\"\")","v":0},{"$f":"IF(C10=\"\",\"\",SUM(H10:J10))","v":23700},{"$f":"IFERROR(IF(C10=\"\",\"\",IF(D10=\"\",\"\",IF(H10=\"\",\"\",IF($C10=\"TOTAL\",SUM($L$8:L9),SUM(D10-H10))))),\"\")","v":10100},{"$f":"IFERROR(IF(C10=\"\",\"\",IF(E10=\"\",\"\",IF(I10=\"\",\"\",IF($C10=\"TOTAL\",SUM($M$8:M9),SUM(E10-I10))))),\"\")","v":5746},{"$f":"IFERROR(IF(C10=\"\",\"\",IF(F10=\"\",\"\",IF(J10=\"\",\"\",IF($C10=\"TOTAL\",SUM($N$8:N9),SUM(F10-J10))))),\"\")","v":2704},{"$f":"IFERROR(IF(C10=\"\",\"\",IF(G10=\"\",\"\",IF(K10=\"\",\"\",SUM(G10-K10)))),\"\")","v":18550},{"$f":"IFERROR(IF(C10=\"\",\"\",IF($C10=\"TOTAL\",SUM($P$8:P9),IF(AND(C10>$AL$1,$AC$3=$AL$2),BO11,IF($AO$18=$AO$20,SUM(BB11+BJ11),ROUND((D10+E10)*10%,0))))),\"\")","v":3955},{"$f":"IFERROR(IF(C10=\"\",\"\",IF(H10=\"\",\"\",IF(I10=\"\",\"\",IF($C10=\"TOTAL\",SUM($Q$8:Q9),IF(AND(C10>$AL$1,$AC$3=$AL$2),BO11,IF($AO$18=$AO$20,$AO$21,ROUND((H10+I10)*10%,0))))))),\"\")","v":2370},{"$f":"IFERROR(IF(C10=\"\",\"\",SUM(P10-Q10)),\"\")","v":1585},{"$f":"IFERROR(IF(C10=\"\",\"\",IF($AO$16=$AO$17,0,IF($C10=\"TOTAL\",SUM($S$8:S9),IF($AO$19=$AO$31,0,IF(AND($AO$32=$AO$20,C10=$AO$33),$AO$34,S9))))),\"\")","v":0},{"$f":"IFERROR(IF(C10=\"\",\"\",IF($AO$16=$AO$17,0,IF($C10=\"TOTAL\",SUM($T$8:T9),IF($AO$19=$AO$20,$AO$24,0)))),\"\")","v":0},{"$f":"IFERROR(IF(C10=\"\",\"\",SUM(S10-T10)),\"\")","v":0},{"$f":"IF(C10=\"\",\"\",IF($C10=\"TOTAL\",SUM($V$8:V9),IF(AND($AO$2=$AO$20,C10=$AO$1),ROUND(D10/31*$AP$2,0),IF(C10=$AM$6,ROUND((G10)*1/30,0),IF(C10=$AN$6,ROUND((G10)*1/31,0),\"\")))))","v":""},{"$f":"IF(C10=\"\",\"\",IF($C10=\"TOTAL\",SUM($W$8:W9),IF(AND($AO$2=$AO$20,C10=$AO$1),ROUND(H10/31*$AP$2,0),IF(C10=$AM$6,ROUND((K10)*1/30,0),IF(C10=$AN$6,ROUND((K10)*1/31,0),\"\")))))","v":""},{"$f":"IFERROR(IF(C10=\"\",\"\",SUM(V10-W10)),\"\")","v":""},{"$f":"IFERROR(IF(C10=\"\",\"\",IF(AND(BH11=\"\",BO11=\"\"),\"\",IF($C10=\"TOTAL\",SUM($Y$8:Y9),BH11))),\"\")","v":""},{"$f":"IFERROR(IF(C10=\"\",\"\",IF($C10=\"TOTAL\",SUM($Z$8:Z9),ROUND(O10*$AO$7%,0))),\"\")","v":0},{"$f":"IFERROR(IF(C10=\"\",\"\",IF($C10=\"TOTAL\",SUM($AA$8:AA9),IF($AC$3=$AL$2,SUM(U10,X10,Y10,Z10),SUM(R10,U10,X10,Y10,Z10)))),\"\")","v":0},{"$f":"IFERROR(IF(C10=\"\",\"\",IF($C10=\"TOTAL\",SUM($AB$8:AB9),SUM(O10-AA10))),\"\")","v":18550},{"$nulls":8},{"$f":"IF(OR(AT10=$AN$9,AT10=$AN$10,AT10=$AN$11,AT10=$AN$12,AT10=$AN$13,AT10=$AN$14),4,IF(OR(AT10=$AN$15,AT10=$AN$16,AT10=$AN$17,AT10=$AN$18,AT10=$AN$19,AT10=$AN$20),5,IF(OR(AT10=$AN$21,AT10=$AN$22,AT10=$AN$23,AT10=$AN$24,AT10=$AN$25,AT10=$AN$26),7,IF(OR(AT10=$AN$27,AT10=$AN$28,AT10=$AN$29,AT10=$AN$30,AT10=$AN$31,AT10=$AN$32),9,IF(OR(AT10=$AN$33,AT10=$AN$34,AT10=$AN$35,AT10=$AN$36,AT10=$AN$37,AT10=$AN$38),12,IF(OR(AT10=$AN$39,AT10=$AN$40,AT10=$AN$41,AT10=$AN$42,AT10=$AN$43,AT10=$AN$44,AT10=$AN$45,AT10=$AN$46,AT10=$AN$47,AT10=$AN$48,AT10=$AN$49,AT10=$AN$50,AT10=$AN$51,AT10=$AN$52,AT10=$AN$53,AT10=$AN$54,AT10=$AN$55,AT10=$AN$56,AT10=$AN$57,AT10=$AN$58,AT10=$AN$59,AT10=$AN$60,AT10=$AN$61,AT10=$AN$62),17,IF(OR(AT10=$AN$63,AT10=$AN$64,AT10=$AN$65,AT10=$AN$66,AT10=$AN$67,AT10=$AN$68),31,34)))))))","v":17},{"$f":"IF(OR(AT10=$AN$9,AT10=$AN$10,AT10=$AN$11,AT10=$AN$12,AT10=$AN$13,AT10=$AN$14),4,IF(OR(AT10=$AN$15,AT10=$AN$16,AT10=$AN$17,AT10=$AN$18,AT10=$AN$19,AT10=$AN$20),5,IF(OR(AT10=$AN$21,AT10=$AN$22,AT10=$AN$23,AT10=$AN$24,AT10=$AN$25,AT10=$AN$26),7,IF(OR(AT10=$AN$27,AT10=$AN$28,AT10=$AN$29,AT10=$AN$30,AT10=$AN$31,AT10=$AN$32),9,IF(OR(AT10=$AN$33,AT10=$AN$34,AT10=$AN$35,AT10=$AN$36,AT10=$AN$37,AT10=$AN$38),12,IF(OR(AT10=$AN$39,AT10=$AN$40,AT10=$AN$41,AT10=$AN$42,AT10=$AN$43,AT10=$AN$44,AT10=$AN$45,AT10=$AN$46,AT10=$AN$47,AT10=$AN$48,AT10=$AN$49,AT10=$AN$50,AT10=$AN$51,AT10=$AN$52,AT10=$AN$53,AT10=$AN$54,AT10=$AN$55,AT10=$AN$56,AT10=$AN$57,AT10=$AN$58,AT10=$AN$59,AT10=$AN$60,AT10=$AN$61,AT10=$AN$62),17,IF(OR(AT10=$AN$63,AT10=$AN$64,AT10=$AN$65,AT10=$AN$66,AT10=$AN$67,AT10=$AN$68),31,34)))))))","v":17},null,"2017-02-01",{"$f":"'Master Sheet'!G11","v":23700},{"$f":"IF(AND($AO$6>$AP$6),\"\",DATE(YEAR(AP9),MONTH(AP9)+1,DAY(AP9)))","v":"2020-11-01"},{"$f":"IF(AND(AP10=\"\"),\"\",IF(AND(AP10=$AN$9),$AN$9,IF(AND(AP10=$AN$10),$AN$10,IF(AND(AP10=$AN$11),$AN$11,IF(AND(AP10=$AN$12),$AN$12,IF(AND(AP10=$AN$13),$AN$13,IF(AND(AP10=$AN$14),$AN$14,IF(AND(AP10=$AN$15),$AN$15,IF(AND(AP10=$AN$16),$AN$16,IF(AND(AP10=$AN$17),$AN$17,IF(AND(AP10=$AN$18),$AN$18,IF(AND(AP10=$AN$19),$AN$19,IF(AND(AP10=$AN$20),$AN$20,IF(AND(AP10=$AN$21),$AN$21,IF(AND(AP10=$AN$22),$AN$22,IF(AND(AP10=$AN$23),$AN$23,IF(AND(AP10=$AN$24),$AN$24,IF(AND(AP10=$AN$25),$AN$25,IF(AND(AP10=$AN$26),$AN$26,IF(AND(AP10=$AN$27),$AN$27,IF(AND(AP10=$AN$28),$AN$28,IF(AND(AP10=$AN$29),$AN$29,IF(AND(AP10=$AN$30),$AN$30,IF(AND(AP10=$AN$31),$AN$31,IF(AND(AP10=$AN$32),$AN$32,IF(AND(AP10=$AN$33),$AN$33,IF(AND(AP10=$AN$34),$AN$34,IF(AND(AP10=$AN$35),$AN$35,IF(AND(AP10=$AN$36),$AN$36,IF(AND(AP10=$AN$37),$AN$37,IF(AND(AP10=$AN$38),$AN$38,IF(AND(AP10=$AN$39),$AN$39,IF(AND(AP10=$AN$40),$AN$40,IF(AND(AP10=$AN$41),$AN$41,IF(AND(AP10=$AN$42),$AN$42,IF(AND(AP10=$AN$43),$AN$43,IF(AND(AP10=$AN$44),$AN$44,IF(AND(AP10=$AN$45),$AN$45,IF(AND(AP10=$AN$46),$AN$46,IF(AND(AP10=$AN$47),$AN$47,IF(AND(AP10=$AN$48),$AN$48,IF(AND(AP10=$AN$49),$AN$49,IF(AND(AP10=$AN$50),$AN$50,IF(AND(AP10=$AN$51),$AN$51,IF(AND(AP10=$AN$52),$AN$52,IF(AND(AP10=$AN$53),$AN$53,IF(AND(AP10=$AN$54),$AN$54,IF(AND(AP10=$AN$55),$AN$55,IF(AND(AP10=$AN$56),$AN$56,IF(AND(AP10=$AN$57),$AN$57,IF(AND(AP10=$AN$58),$AN$58,IF(AND(AP10=$AN$59),$AN$59,IF(AND(AP10=$AN$60),$AN$60,IF(AND(AP10=$AN$61),$AN$61,IF(AND(AP10=$AN$62),$AN$62,IF(AND(AP10=$AN$63),$AN$63,IF(AND(AP10=$AN$64),$AN$64,IF(AND(AP10=$AN$65),$AN$65,IF(AND(AP10=$AN$66),$AN$66,IF(AND(AP10=$AN$67),$AN$67,IF(AND(AP10=$AN$68),$AN$68,IF(AND(AP10=$AN$69),$AN$69,IF(AND(AP10=$AN$70),$AN$70,IF(AND(AP10=$AN$71),$AN$71,\"\"))))))))))))))))))))))))))))))))))))))))))))))))))))))))))))))))","v":"2020-11-01"},{"$f":"IF(AND(AP10=\"\"),\"\",IF(AND(AP10=$AN$72),$AP$72,IF(AND(AP10=$AN$73),$AN$73,IF(AND(AP10=$AN$74),$AN$74,IF(AND(AP10=$AN$75),$AN$75,IF(AND(AP10=$AN$76),$AN$76,IF(AND(AP10=$AN$77),$AN$77,IF(AND(AP10=$AN$78),$AN$78,IF(AND(AP10=$AN$79),$AN$79,IF(AND(AP10=$AN$80),$AN$80,IF(AND(AP10=$AN$81),$AN$81,IF(AND(AP10=$AN$82),$AN$82,IF(AND(AP10=$AN$83),$AN$83,IF(AND(AP10=$AN$84),$AN$84,IF(AND(AP10=$AN$85),$AN$85,IF(AND(AP10=$AN$86),$AN$86,IF(AND(AP10=$AN$87),$AN$87,IF(AND(AP10=$AN$88),$AN$88,IF(AND(AP10=$AN$89),$AN$89,IF(AND(AP10=$AN$90),$AN$90,IF(AND(AP10=$AN$91),$AN$91,\"\")))))))))))))))))))))","v":""},{"$f":"IFERROR(IF(AND(AQ10=\"\",AR10=\"\"),\"\",IF(AQ10=\"\",AR10,AQ10)),\"\")","v":"2020-11-01"},{"$f":"IFERROR(IF(AS10=\"\",\"\",IF(DATE(YEAR(AS10),MONTH(AS10),DAY(AS10))=DATE(YEAR($AP$6),MONTH($AP$6)+1,DAY($AP$6)),\"TOTAL\",IF(AS10>$AP$6,\"\",AS10))),\"\")","v":"2020-11-01"},{"$f":"IFERROR(IF(AT10=\"\",\"\",IF(AND($AO$20=$AO$28,$AO$30=AT10),$AO$29,IF(OR(AT10=$AW$2,AT10=$AW$3,AT10=$AW$4,AT10=$AW$5,AT10=$AW$6,AT10=$AW$7,AT10=$AX$2),MROUND(AO9*1.03,100),AO9))),\"\")","v":33800},5746,2704,null,{"$f":"IFERROR(IF(AT10=\"\",\"\",IF(AT10=\"TOTAL\",\"\",IF($AO$16=$AO$17,$AO$10,IF($AO$20=$AO$26,BC10,BD10)))),\"\")","v":23700},{"$f":"IF(AT10=\"\",\"\",IF(AT10=\"TOTAL\",\"\",IF(AY10=\"\",\"\",IF($AO$16=$AO$17,0,ROUND(AY10*AL10%,0)))))","v":0},{"$f":"IF(AT10=\"\",\"\",IF(AT10=\"TOTAL\",\"\",IF(AY10=\"\",\"\",IF($AO$16=$AO$17,0,IF(AT10>=$AV$7,ROUND(AY10*$AU$7%,0),ROUND(AY10*$AQ$7%,0))))))","v":0},{"$f":"IF(AT10=\"\",\"\",IF(AT10=\"TOTAL\",\"\",IF(AY10=\"\",\"\",IF($AO$16=$AO$17,0,IF(OR(C9=$AM$16,C9=$AM$17,C9=$AM$18,C9=$AM$19,C9=$AM$20,C9=$AM$21,C9=$AM$22,C9=$AM$23,C9=$AM$24),SUM(BE10+BF10),BF10)))))","v":0},{"$f":"IF(OR(AT10=$AW$2,AT10=$AW$3,AT10=$AW$4,AT10=$AW$5,AT10=$AW$6),MROUND(AO27*1.03,100),AO27)","v":30500},{"$f":"IF(OR(AT10=$AW$2,AT10=$AW$3,AT10=$AW$4,AT10=$AW$5,AT10=$AW$6),MROUND(AO14*1.03,100),AO14)","v":32800},{"$f":"IF(AT10=\"\",\"\",IF(AT10=\"TOTAL\",\"\",IF(AY10=\"\",\"\",SUM(O9)-SUM((BF10-$AO$21)+SUM(U9,X9,Z9)))))","v":18550},{"$f":"IF(AT9=\"\",\"\",IF(AT9=\"TOTAL\",\"\",IF(AND($AO$20=$AO$36,C10=$AO$37),$AO$38,BF9)))","v":3675},{"$f":"IF(OR(AT10=$AN$63,AT10=$AN$64,AT10=$AN$65),\"YES\",\"\")","v":""},{"$f":"IF(BG10=\"\",\"\",IF($AO$16=$AO$17,ROUND((D9)*3%,0),IF(OR(AT10=$AN$63,AT10=$AN$64,AT10=$AN$65),SUM(ROUND((D9-H9)*3%,0)),IF(OR(AT10=$AN$69,AT10=$AN$70,AT10=$AN$71),SUM(ROUND((D9-H9)*3%,0)),\"\"))))","v":""},{"$f":"IFERROR(IF(AND($AO$16=$AO$17,BG10=\"YES\"),ROUND(ROUND(D9*3%,0)*10%,0),IF(AND($AO$16=$AO$15,BG10=\"YES\",$AM$7=\"NO\"),ROUND(ROUND((L9+H9)*3%,0)*10%,0),IF(AND($AO$16=$AO$15,BG10=\"YES\",$AM$7=\"YES\"),ROUND(ROUND((L9+M9)*3%,0)*10%,0),0))),\"\")","v":0},{"$f":"IF(AND($AO$16=$AO$17,BG10=\"YES\"),ROUND(D9*3%,0),IF(AND($AO$16=$AO$15,BG10=\"YES\",$AM$7=\"NO\"),ROUND((L9+H9)*3%,0),IF(AND($AO$16=$AO$15,BG10=\"YES\",$AM$7=\"YES\"),ROUND((L9+M9)*3%,0),0)))","v":0},{"$nulls":4},{"$f":"IF(AND(AT10>$AL$1,$AC$3=$AL$2),$AS$1,\"\")","v":""}]
[{"$f":"IF(C11=\"TOTAL\",\"\",IF(B10=\"\",\"\",IF(LEN(C11)>=2,B10+1,0)))","v":4},4,{"$f":"IFERROR(IF(AT12=\"\",\"\",AT12),\"\")","v":"2021-01-01"},{"$f":"IFERROR(IF($C10=\"TOTAL\",\"अक्षरें राशि :-\",IF($C11=\"TOTAL\",SUM($D$8:D10),IF(AU12=\"\",\"\",AU12))),\"\")","v":33800},{"$f":"IFERROR(IF($C11=\"TOTAL\",SUM($E$8:E10),IF(AV12=\"\",\"\",AV12)),\"\")","v":5746},{"$f":"IFERROR(IF($C11=\"TOTAL\",SUM($F$8:F10),IF(OR(C11=$AM$16,C11=$AM$17,C11=$AM$18,C11=$AM$19,C11=$AM$20,C11=$AM$21,C11=$AM$22,C11=$AM$23,C11=$AM$24),0,IF(AW12=\"\",\"\",AW12))),\"\")","v":2704},{"$f":"IF(C11=\"\",\"\",SUM(D11:F11))","v":42250},{"$f":"IFERROR(IF($C11=\"TOTAL\",SUM($H$8:H10),IF(AY12=\"\",\"\",AY12)),\"\")","v":23700},{"$f":"IFERROR(IF($C11=\"TOTAL\",SUM($I$8:I10),IF(AZ12=\"\",\"\",AZ12)),\"\")","v":0},{"$f":"IFERROR(IF($C11=\"TOTAL\",SUM($J$8:J10),IF(OR(C11=$AM$16,C11=$AM$17,C11=$AM$18,C11=$AM$19,C11=$AM$20,C11=$AM$21,C11=$AM$22,C11=$AM$23,C11=$AM$24),0,IF(BA12=\"\",\"\",BA12))),\"\")","v":0},23700,{"$f":"IFERROR(IF(C11=\"\",\"\",IF(D11=\"\",\"\",IF(H11=\"\",\"\",IF($C11=\"TOTAL\",SUM($L$8:L10),SUM(D11-H11))))),\"\")","v":10100},{"$f":"IFERROR(IF(C11=\"\",\"\",IF(E11=\"\",\"\",IF(I11=\"\",\"\",IF($C11=\"TOTAL\",SUM($M$8:M10),SUM(E11-I11))))),\"\")","v":5746},{"$f":"IFERROR(IF(C11=\"\",\"\",IF(F11=\"\",\"\",IF(J11=\"\",\"\",IF($C11=\"TOTAL\",SUM($N$8:N10),SUM(F11-J11))))),\"\")","v":2704},18550,{"$f":"IFERROR(IF(C11=\"\",\"\",IF($C11=\"TOTAL\",SUM($P$8:P10),IF(AND(C11>$AL$1,$AC$3=$AL$2),BO12,IF($AO$18=$AO$20,SUM(BB12+BJ12),ROUND((D11+E11)*10%,0))))),\"\")","v":3955},{"$f":"IFERROR(IF(C11=\"\",\"\",IF(H11=\"\",\"\",IF(I11=\"\",\"\",IF($C11=\"TOTAL\",SUM($Q$8:Q10),IF(AND(C11>$AL$1,$AC$3=$AL$2),BO12,IF($AO$18=$AO$20,$AO$21,ROUND((H11+I11)*10%,0))))))),\"\")","v":2370},1585,{"$f":"IFERROR(IF(C11=\"\",\"\",IF($AO$16=$AO$17,0,IF($C11=\"TOTAL\",SUM($S$8:S10),IF($AO$19=$AO$31,0,IF(AND($AO$32=$AO$20,C11=$AO$33),$AO$34,S10))))),\"\")","v":0},{"$f":"IFERROR(IF(C11=\"\",\"\",IF($AO$16=$AO$17,0,IF($C11=\"TOTAL\",SUM($T$8:T10),IF($AO$19=$AO$20,$AO$24,0)))),\"\")","v":0},0,{"$f":"IF(C11=\"\",\"\",IF($C11=\"TOTAL\",SUM($V$8:V10),IF(AND($AO$2=$AO$20,C11=$AO$1),ROUND(D11/31*$AP$2,0),IF(C11=$AM$6,ROUND((G11)*1/30,0),IF(C11=$AN$6,ROUND((G11)*1/31,0),\"\")))))","v":""},{"$f":"IF(C11=\"\",\"\",IF($C11=\"TOTAL\",SUM($W$8:W10),IF(AND($AO$2=$AO$20,C11=$AO$1),ROUND(H11/31*$AP$2,0),IF(C11=$AM$6,ROUND((K11)*1/30,0),IF(C11=$AN$6,ROUND((K11)*1/31,0),\"\")))))","v":""},"",{"$f":"IFERROR(IF(C11=\"\",\"\",IF(AND(BH12=\"\",BO12=\"\"),\"\",IF($C11=\"TOTAL\",SUM($Y$8:Y10),BH12))),\"\")","v":""},{"$f":"IFERROR(IF(C11=\"\",\"\",IF($C11=\"TOTAL\",SUM($Z$8:Z10),ROUND(O11*$AO$7%,0))),\"\")","v":0},{"$f":"IFERROR(IF(C11=\"\",\"\",IF($C11=\"TOTAL\",SUM($AA$8:AA10),IF($AC$3=$AL$2,SUM(U11,X11,Y11,Z11),SUM(R11,U11,X11,Y11,Z11)))),\"\")","v":0},{"$f":"IFERROR(IF(C11=\"\",\"\",IF($C11=\"TOTAL\",SUM($AB$8:AB10),SUM(O11-AA11))),\"\")","v":18550},{"$nulls":8},17,17,{"$f":"IF(AV9=\"\",\"\",ROUND((AO11+AV9)*10%,0))","v":3444},"2017-03-01",{"$f":"IFERROR(ROUND((AO9/AU3)*AU6,0),\"\")","v":29439},"2020-12-01","2020-12-01","","2020-12-01",{"$f":"IFERROR(IF(AS11=\"\",\"\",IF(DATE(YEAR(AS11),MONTH(AS11),DAY(AS11))=DATE(YEAR($AP$6),MONTH($AP$6)+1,DAY($AP$6)),\"TOTAL\",IF(AS11>$AP$6,\"\",AS11))),\"\")","v":"2020-12-01"},{"$f":"IFERROR(IF(AT11=\"\",\"\",IF(AND($AO$20=$AO$28,$AO$30=AT11),$AO$29,IF(OR(AT11=$AW$2,AT11=$AW$3,AT11=$AW$4,AT11=$AW$5,AT11=$AW$6,AT11=$AW$7,AT11=$AX$2),MROUND(AU10*1.03,100),AU10))),\"\")","v":33800},5746,{"$f":"IF(AT11=\"\",\"\",IF(AT11=\"TOTAL\",\"\",IF(AT11>=$AV$7,ROUND(AU11*$AU$7%,0),ROUND(AU11*$AQ$7%,0))))","v":2704},null,{"$f":"IFERROR(IF(AT11=\"\",\"\",IF(AT11=\"TOTAL\",\"\",IF($AO$16=$AO$17,$AO$10,IF(OR(AT11=$AW$2,AT11=$AW$3,AT11=$AW$4,AT11=$AW$5,AT11=$AW$6,AT11=$AW$7,AT11=$AX$2),MROUND(AY10*1.03,100),AY10)))),\"\")","v":23700},0,{"$f":"IF(AT11=\"\",\"\",IF(AT11=\"TOTAL\",\"\",IF(AY11=\"\",\"\",IF($AO$16=$AO$17,0,IF(AT11>=$AV$7,ROUND(AY11*$AU$7%,0),ROUND(AY11*$AQ$7%,0))))))","v":0},{"$f":"IF(AT11=\"\",\"\",IF(AT11=\"TOTAL\",\"\",IF(AY11=\"\",\"\",IF($AO$16=$AO$17,0,IF(OR(C10=$AM$16,C10=$AM$17,C10=$AM$18,C10=$AM$19,C10=$AM$20,C10=$AM$21,C10=$AM$22,C10=$AM$23,C10=$AM$24),SUM(BE11+BF11),BF11)))))","v":0},{"$f":"IF(OR(AT11=$AW$2,AT11=$AW$3,AT11=$AW$4,AT11=$AW$5,AT11=$AW$6),MROUND(BC10*1.03,100),BC10)","v":30500},{"$f":"IF(OR(AT11=$AW$2,AT11=$AW$3,AT11=$AW$4,AT11=$AW$5,AT11=$AW$6),MROUND(BD10*1.03,100),BD10)","v":32800},{"$f":"IF(AT11=\"\",\"\",IF(AT11=\"TOTAL\",\"\",IF(AY11=\"\",\"\",SUM(O10)-SUM((BF11-$AO$21)+SUM(U10,X10,Z10)))))","v":18550},{"$f":"IF(AT10=\"\",\"\",IF(AT10=\"TOTAL\",\"\",IF(AND($AO$20=$AO$36,C11=$AO$37),$AO$38,BF10)))","v":3675},"","",0,0,{"$nulls":4},""]
[5,5,"2021-02-01",{"$f":"IFERROR(IF($C11=\"TOTAL\",\"अक्षरें राशि :-\",IF($C12=\"TOTAL\",SUM($D$8:D11),IF(AU13=\"\",\"\",AU13))),\"\")","v":33800},{"$f":"IFERROR(IF($C12=\"TOTAL\",SUM($E$8:E11),IF(AV13=\"\",\"\",AV13)),\"\")","v":5746},{"$f":"IFERROR(IF($C12=\"TOTAL\",SUM($F$8:F11),IF(OR(C12=$AM$16,C12=$AM$17,C12=$AM$18,C12=$AM$19,C12=$AM$20,C12=$AM$21,C12=$AM$22,C12=$AM$23,C12=$AM$24),0,IF(AW13=\"\",\"\",AW13))),\"\")","v":2704},42250,{"$f":"IFERROR(IF($C12=\"TOTAL\",SUM($H$8:H11),IF(AY13=\"\",\"\",AY13)),\"\")","v":23700},{"$f":"IFERROR(IF($C12=\"TOTAL\",SUM($I$8:I11),IF(AZ13=\"\",\"\",AZ13)),\"\")","v":0},{"$f":"IFERROR(IF($C12=\"TOTAL\",SUM($J$8:J11),IF(OR(C12=$AM$16,C12=$AM$17,C12=$AM$18,C12=$AM$19,C12=$AM$20,C12=$AM$21,C12=$AM$22,C12=$AM$23,C12=$AM$24),0,IF(BA13=\"\",\"\",BA13))),\"\")","v":0},23700,{"$f":"IFERROR(IF(C12=\"\",\"\",IF(D12=\"\",\"\",IF(H12=\"\",\"\",IF($C12=\"TOTAL\",SUM($L$8:L11),SUM(D12-H12))))),\"\")","v":10100},{"$f":"IFERROR(IF(C12=\"\",\"\",IF(E12=\"\",\"\",IF(I12=\"\",\"\",IF($C12=\"TOTAL\",SUM($M$8:M11),SUM(E12-I12))))),\"\")","v":5746},{"$f":"IFERROR(IF(C12=\"\",\"\",IF(F12=\"\",\"\",IF(J12=\"\",\"\",IF($C12=\"TOTAL\",SUM($N$8:N11),SUM(F12-J12))))),\"\")","v":2704},18550,{"$f":"IFERROR(IF(C12=\"\",\"\",IF($C12=\"TOTAL\",SUM($P$8:P11),IF(AND(C12>$AL$1,$AC$3=$AL$2),BO13,IF($AO$18=$AO$20,SUM(BB13+BJ13),ROUND((D12+E12)*10%,0))))),\"\")","v":3955},{"$f":"IFERROR(IF(C12=\"\",\"\",IF(H12=\"\",\"\",IF(I12=\"\",\"\",IF($C12=\"TOTAL\",SUM($Q$8:Q11),IF(AND(C12>$AL$1,$AC$3=$AL$2),BO13,IF($AO$18=$AO$20,$AO$21,ROUND((H12+I12)*10%,0))))))),\"\")","v":2370},1585,{"$f":"IFERROR(IF(C12=\"\",\"\",IF($AO$16=$AO$17,0,IF($C12=\"TOTAL\",SUM($S$8:S11),IF($AO$19=$AO$31,0,IF(AND($AO$32=$AO$20,C12=$AO$33),$AO$34,S11))))),\"\")","v":0},{"$f":"IFERROR(IF(C12=\"\",\"\",IF($AO$16=$AO$17,0,IF($C12=\"TOTAL\",SUM($T$8:T11),IF($AO$19=$AO$20,$AO$24,0)))),\"\")","v":0},0,{"$f":"IF(C12=\"\",\"\",IF($C12=\"TOTAL\",SUM($V$8:V11),IF(AND($AO$2=$AO$20,C12=$AO$1),ROUND(D12/31*$AP$2,0),IF(C12=$AM$6,ROUND((G12)*1/30,0),IF(C12=$AN$6,ROUND((G12)*1/31,0),\"\")))))","v":""},{"$f":"IF(C12=\"\",\"\",IF($C12=\"TOTAL\",SUM($W$8:W11),IF(AND($AO$2=$AO$20,C12=$AO$1),ROUND(H12/31*$AP$2,0),IF(C12=$AM$6,ROUND((K12)*1/30,0),IF(C12=$AN$6,ROUND((K12)*1/31,0),\"\")))))","v":""},"",{"$f":"IFERROR(IF(C12=\"\",\"\",IF(AND(BH13=\"\",BO13=\"\"),\"\",IF($C12=\"TOTAL\",SUM($Y$8:Y11),BH13))),\"\")","v":""},{"$f":"IFERROR(IF(C12=\"\",\"\",IF($C12=\"TOTAL\",SUM($Z$8:Z11),ROUND(O12*$AO$7%,0))),\"\")","v":0},{"$f":"IFERROR(IF(C12=\"\",\"\",IF($C12=\"TOTAL\",SUM($AA$8:AA11),IF($AC$3=$AL$2,SUM(U12,X12,Y12,Z12),SUM(R12,U12,X12,Y12,Z12)))),\"\")","v":0},{"$f":"IFERROR(IF(C12=\"\",\"\",IF($C12=\"TOTAL\",SUM($AB$8:AB11),SUM(O12-AA12))),\"\")","v":18550},{"$nulls":8},17,17,{"$f":"ROUND((AO12)*10%,0)","v":306},"2017-04-01",{"$f":"IFERROR(IF($AO$13=$AO$15,ROUND((AO14/AU3)*AQ6,0),ROUND((AO10/AU3)*AQ6,0)),\"\")","v":3058},"2021-01-01","2021-01-01","","2021-01-01","2021-01-01",{"$f":"IFERROR(IF(AT12=\"\",\"\",IF(AND($AO$20=$AO$28,$AO$30=AT12),$AO$29,IF(OR(AT12=$AW$2,AT12=$AW$3,AT12=$AW$4,AT12=$AW$5,AT12=$AW$6,AT12=$AW$7,AT12=$AX$2),MROUND(AU11*1.03,100),AU11))),\"\")","v":33800},5746,{"$f":"IF(AT12=\"\",\"\",IF(AT12=\"TOTAL\",\"\",IF(AT12>=$AV$7,ROUND(AU12*$AU$7%,0),ROUND(AU12*$AQ$7%,0))))","v":2704},null,{"$f":"IFERROR(IF(AT12=\"\",\"\",IF(AT12=\"TOTAL\",\"\",IF($AO$16=$AO$17,$AO$10,IF(OR(AT12=$AW$2,AT12=$AW$3,AT12=$AW$4,AT12=$AW$5,AT12=$AW$6,AT12=$AW$7,AT12=$AX$2),MROUND(AY11*1.03,100),AY11)))),\"\")","v":23700},0,{"$f":"IF(AT12=\"\",\"\",IF(AT12=\"TOTAL\",\"\",IF(AY12=\"\",\"\",IF($AO$16=$AO$17,0,IF(AT12>=$AV$7,ROUND(AY12*$AU$7%,0),ROUND(AY12*$AQ$7%,0))))))","v":0},0,null,null,18550,3675,"","",0,0,{"$nulls":4},""]
[6,6,"2021-03-01",{"$f":"IFERROR(IF($C12=\"TOTAL\",\"अक्षरें राशि :-\",IF($C13=\"TOTAL\",SUM($D$8:D12),IF(AU14=\"\",\"\",AU14))),\"\")","v":33800},{"$f":"IFERROR(IF($C13=\"TOTAL\",SUM($E$8:E12),IF(AV14=\"\",\"\",AV14)),\"\")","v":5746},{"$f":"IFERROR(IF($C13=\"TOTAL\",SUM($F$8:F12),IF(OR(C13=$AM$16,C13=$AM$17,C13=$AM$18,C13=$AM$19,C13=$AM$20,C13=$AM$21,C13=$AM$22,C13=$AM$23,C13=$AM$24),0,IF(AW14=\"\",\"\",AW14))),\"\")","v":2704},42250,{"$f":"IFERROR(IF($C13=\"TOTAL\",SUM($H$8:H12),IF(AY14=\"\",\"\",AY14)),\"\")","v":23700},{"$f":"IFERROR(IF($C13=\"TOTAL\",SUM($I$8:I12),IF(AZ14=\"\",\"\",AZ14)),\"\")","v":0},{"$f":"IFERROR(IF($C13=\"TOTAL\",SUM($J$8:J12),IF(OR(C13=$AM$16,C13=$AM$17,C13=$AM$18,C13=$AM$19,C13=$AM$20,C13=$AM$21,C13=$AM$22,C13=$AM$23,C13=$AM$24),0,IF(BA14=\"\",\"\",BA14))),\"\")","v":0},23700,{"$f":"IFERROR(IF(C13=\"\",\"\",IF(D13=\"\",\"\",IF(H13=\"\",\"\",IF($C13=\"TOTAL\",SUM($L$8:L12),SUM(D13-H13))))),\"\")","v":10100},{"$f":"IFERROR(IF(C13=\"\",\"\",IF(E13=\"\",\"\",IF(I13=\"\",\"\",IF($C13=\"TOTAL\",SUM($M$8:M12),SUM(E13-I13))))),\"\")","v":5746},{"$f":"IFERROR(IF(C13=\"\",\"\",IF(F13=\"\",\"\",IF(J13=\"\",\"\",IF($C13=\"TOTAL\",SUM($N$8:N12),SUM(F13-J13))))),\"\")","v":2704},18550,{"$f":"IFERROR(IF(C13=\"\",\"\",IF($C13=\"TOTAL\",SUM($P$8:P12),IF(AND(C13>$AL$1,$AC$3=$AL$2),BO14,IF($AO$18=$AO$20,SUM(BB14+BJ14),ROUND((D13+E13)*10%,0))))),\"\")","v":3955},{"$f":"IFERROR(IF(C13=\"\",\"\",IF(H13=\"\",\"\",IF(I13=\"\",\"\",IF($C13=\"TOTAL\",SUM($Q$8:Q12),IF(AND(C13>$AL$1,$AC$3=$AL$2),BO14,IF($AO$18=$AO$20,$AO$21,ROUND((H13+I13)*10%,0))))))),\"\")","v":2370},1585,{"$f":"IFERROR(IF(C13=\"\",\"\",IF($AO$16=$AO$17,0,IF($C13=\"TOTAL\",SUM($S$8:S12),IF($AO$19=$AO$31,0,IF(AND($AO$32=$AO$20,C13=$AO$33),$AO$34,S12))))),\"\")","v":0},{"$f":"IFERROR(IF(C13=\"\",\"\",IF($AO$16=$AO$17,0,IF($C13=\"TOTAL\",SUM($T$8:T12),IF($AO$19=$AO$20,$AO$24,0)))),\"\")","v":0},0,{"$f":"IF(C13=\"\",\"\",IF($C13=\"TOTAL\",SUM($V$8:V12),IF(AND($AO$2=$AO$20,C13=$AO$1),ROUND(D13/31*$AP$2,0),IF(C13=$AM$6,ROUND((G13)*1/30,0),IF(C13=$AN$6,ROUND((G13)*1/31,0),\"\")))))","v":""},{"$f":"IF(C13=\"\",\"\",IF($C13=\"TOTAL\",SUM($W$8:W12),IF(AND($AO$2=$AO$20,C13=$AO$1),ROUND(H13/31*$AP$2,0),IF(C13=$AM$6,ROUND((K13)*1/30,0),IF(C13=$AN$6,ROUND((K13)*1/31,0),\"\")))))","v":""},"",{"$f":"IFERROR(IF(C13=\"\",\"\",IF(AND(BH14=\"\",BO14=\"\"),\"\",IF($C13=\"TOTAL\",SUM($Y$8:Y12),BH14))),\"\")","v":""},{"$f":"IFERROR(IF(C13=\"\",\"\",IF($C13=\"TOTAL\",SUM($Z$8:Z12),ROUND(O13*$AO$7%,0))),\"\")","v":0},{"$f":"IFERROR(IF(C13=\"\",\"\",IF($C13=\"TOTAL\",SUM($AA$8:AA12),IF($AC$3=$AL$2,SUM(U13,X13,Y13,Z13),SUM(R13,U13,X13,Y13,Z13)))),\"\")","v":0},{"$f":"IFERROR(IF(C13=\"\",\"\",IF($C13=\"TOTAL\",SUM($AB$8:AB12),SUM(O13-AA13))),\"\")","v":18550},{"$nulls":8},17,17,null,"2017-05-01",{"$f":"'Master Sheet'!D11","v":"Fix Pay"},"2021-02-01","2021-02-01","","2021-02-01","2021-02-01",33800,{"$f":"IF(AT13=\"\",\"\",IF(AT13=\"TOTAL\",\"\",ROUND(AU13*AK13%,0)))","v":5746},2704,null,23700,0,0,0,null,null,{"$f":"IF(AT13=\"\",\"\",IF(AT13=\"TOTAL\",\"\",IF(AY13=\"\",\"\",SUM(O12)-SUM((BF13-$AO$21)+SUM(U12,X12,Z12)))))","v":18550},{"$f":"IF(AT12=\"\",\"\",IF(AT12=\"TOTAL\",\"\",IF(AND($AO$20=$AO$36,C13=$AO$37),$AO$38,BF12)))","v":3675},"","",{"$f":"IFERROR(IF(AND($AO$16=$AO$17,BG13=\"YES\"),ROUND(ROUND(D12*3%,0)*10%,0),IF(AND($AO$16=$AO$15,BG13=\"YES\",$AM$7=\"NO\"),ROUND(ROUND((L12+H12)*3%,0)*10%,0),IF(AND($AO$16=$AO$15,BG13=\"YES\",$AM$7=\"YES\"),ROUND(ROUND((L12+M12)*3%,0)*10%,0),0))),\"\")","v":0},{"$f":"IF(AND($AO$16=$AO$17,BG13=\"YES\"),ROUND(D12*3%,0),IF(AND($AO$16=$AO$15,BG13=\"YES\",$AM$7=\"NO\"),ROUND((L12+H12)*3%,0),IF(AND($AO$16=$AO$15,BG13=\"YES\",$AM$7=\"YES\"),ROUND((L12+M12)*3%,0),0)))","v":0},{"$nulls":4},""]
[7,7,"2021-04-01",{"$f":"IFERROR(IF($C13=\"TOTAL\",\"अक्षरें राशि :-\",IF($C14=\"TOTAL\",SUM($D$8:D13),IF(AU15=\"\",\"\",AU15))),\"\")","v":33800},{"$f":"IFERROR(IF($C14=\"TOTAL\",SUM($E$8:E13),IF(AV15=\"\",\"\",AV15)),\"\")","v":5746},{"$f":"IFERROR(IF($C14=\"TOTAL\",SUM($F$8:F13),IF(OR(C14=$AM$16,C14=$AM$17,C14=$AM$18,C14=$AM$19,C14=$AM$20,C14=$AM$21,C14=$AM$22,C14=$AM$23,C14=$AM$24),0,IF(AW15=\"\",\"\",AW15))),\"\")","v":2704},42250,{"$f":"IFERROR(IF($C14=\"TOTAL\",SUM($H$8:H13),IF(AY15=\"\",\"\",AY15)),\"\")","v":23700},{"$f":"IFERROR(IF($C14=\"TOTAL\",SUM($I$8:I13),IF(AZ15=\"\",\"\",AZ15)),\"\")","v":0},{"$f":"IFERROR(IF($C14=\"TOTAL\",SUM($J$8:J13),IF(OR(C14=$AM$16,C14=$AM$17,C14=$AM$18,C14=$AM$19,C14=$AM$20,C14=$AM$21,C14=$AM$22,C14=$AM$23,C14=$AM$24),0,IF(BA15=\"\",\"\",BA15))),\"\")","v":0},23700,{"$f":"IFERROR(IF(C14=\"\",\"\",IF(D14=\"\",\"\",IF(H14=\"\",\"\",IF($C14=\"TOTAL\",SUM($L$8:L13),SUM(D14-H14))))),\"\")","v":10100},{"$f":"IFERROR(IF(C14=\"\",\"\",IF(E14=\"\",\"\",IF(I14=\"\",\"\",IF($C14=\"TOTAL\",SUM($M$8:M13),SUM(E14-I14))))),\"\")","v":5746},{"$f":"IFERROR(IF(C14=\"\",\"\",IF(F14=\"\",\"\",IF(J14=\"\",\"\",IF($C14=\"TOTAL\",SUM($N$8:N13),SUM(F14-J14))))),\"\")","v":2704},18550,{"$f":"IFERROR(IF(C14=\"\",\"\",IF($C14=\"TOTAL\",SUM($P$8:P13),IF(AND(C14>$AL$1,$AC$3=$AL$2),BO15,IF($AO$18=$AO$20,SUM(BB15+BJ15),ROUND((D14+E14)*10%,0))))),\"\")","v":3955},{"$f":"IFERROR(IF(C14=\"\",\"\",IF(H14=\"\",\"\",IF(I14=\"\",\"\",IF($C14=\"TOTAL\",SUM($Q$8:Q13),IF(AND(C14>$AL$1,$AC$3=$AL$2),BO15,IF($AO$18=$AO$20,$AO$21,ROUND((H14+I14)*10%,0))))))),\"\")","v":2370},1585,{"$f":"IFERROR(IF(C14=\"\",\"\",IF($AO$16=$AO$17,0,IF($C14=\"TOTAL\",SUM($S$8:S13),IF($AO$19=$AO$31,0,IF(AND($AO$32=$AO$20,C14=$AO$33),$AO$34,S13))))),\"\")","v":0},{"$f":"IFERROR(IF(C14=\"\",\"\",IF($AO$16=$AO$17,0,IF($C14=\"TOTAL\",SUM($T$8:T13),IF($AO$19=$AO$20,$AO$24,0)))),\"\")","v":0},0,{"$f":"IF(C14=\"\",\"\",IF($C14=\"TOTAL\",SUM($V$8:V13),IF(AND($AO$2=$AO$20,C14=$AO$1),ROUND(D14/31*$AP$2,0),IF(C14=$AM$6,ROUND((G14)*1/30,0),IF(C14=$AN$6,ROUND((G14)*1/31,0),\"\")))))","v":""},{"$f":"IF(C14=\"\",\"\",IF($C14=\"TOTAL\",SUM($W$8:W13),IF(AND($AO$2=$AO$20,C14=$AO$1),ROUND(H14/31*$AP$2,0),IF(C14=$AM$6,ROUND((K14)*1/30,0),IF(C14=$AN$6,ROUND((K14)*1/31,0),\"\")))))","v":""},"",{"$f":"IFERROR(IF(C14=\"\",\"\",IF(AND(BH15=\"\",BO15=\"\"),\"\",IF($C14=\"TOTAL\",SUM($Y$8:Y13),BH15))),\"\")","v":""},{"$f":"IFERROR(IF(C14=\"\",\"\",IF($C14=\"TOTAL\",SUM($Z$8:Z13),ROUND(O14*$AO$7%,0))),\"\")","v":0},{"$f":"IFERROR(IF(C14=\"\",\"\",IF($C14=\"TOTAL\",SUM($AA$8:AA13),IF($AC$3=$AL$2,SUM(U14,X14,Y14,Z14),SUM(R14,U14,X14,Y14,Z14)))),\"\")","v":0},{"$f":"IFERROR(IF(C14=\"\",\"\",IF($C14=\"TOTAL\",SUM($AB$8:AB13),SUM(O14-AA14))),\"\")","v":18550},{"$nulls":8},17,17,null,"2017-06-01",{"$f":"'Master Sheet'!K11","v":32800},"2021-03-01","2021-03-01","","2021-03-01","2021-03-01",33800,{"$f":"IF(AT14=\"\",\"\",IF(AT14=\"TOTAL\",\"\",ROUND(AU14*AK14%,0)))","v":5746},2704,null,23700,0,0,0,null,null,18550,3675,"","",0,0,{"$nulls":4},""]
[8,8,"2021-05-01",{"$f":"IFERROR(IF($C14=\"TOTAL\",\"अक्षरें राशि :-\",IF($C15=\"TOTAL\",SUM($D$8:D14),IF(AU16=\"\",\"\",AU16))),\"\")","v":33800},{"$f":"IFERROR(IF($C15=\"TOTAL\",SUM($E$8:E14),IF(AV16=\"\",\"\",AV16)),\"\")","v":5746},{"$f":"IFERROR(IF($C15=\"TOTAL\",SUM($F$8:F14),IF(OR(C15=$AM$16,C15=$AM$17,C15=$AM$18,C15=$AM$19,C15=$AM$20,C15=$AM$21,C15=$AM$22,C15=$AM$23,C15=$AM$24),0,IF(AW16=\"\",\"\",AW16))),\"\")","v":2704},42250,{"$f":"IFERROR(IF($C15=\"TOTAL\",SUM($H$8:H14),IF(AY16=\"\",\"\",AY16)),\"\")","v":23700},{"$f":"IFERROR(IF($C15=\"TOTAL\",SUM($I$8:I14),IF(AZ16=\"\",\"\",AZ16)),\"\")","v":0},{"$f":"IFERROR(IF($C15=\"TOTAL\",SUM($J$8:J14),IF(OR(C15=$AM$16,C15=$AM$17,C15=$AM$18,C15=$AM$19,C15=$AM$20,C15=$AM$21,C15=$AM$22,C15=$AM$23,C15=$AM$24),0,IF(BA16=\"\",\"\",BA16))),\"\")","v":0},23700,{"$f":"IFERROR(IF(C15=\"\",\"\",IF(D15=\"\",\"\",IF(H15=\"\",\"\",IF($C15=\"TOTAL\",SUM($L$8:L14),SUM(D15-H15))))),\"\")","v":10100},{"$f":"IFERROR(IF(C15=\"\",\"\",IF(E15=\"\",\"\",IF(I15=\"\",\"\",IF($C15=\"TOTAL\",SUM($M$8:M14),SUM(E15-I15))))),\"\")","v":5746},{"$f":"IFERROR(IF(C15=\"\",\"\",IF(F15=\"\",\"\",IF(J15=\"\",\"\",IF($C15=\"TOTAL\",SUM($N$8:N14),SUM(F15-J15))))),\"\")","v":2704},18550,{"$f":"IFERROR(IF(C15=\"\",\"\",IF($C15=\"TOTAL\",SUM($P$8:P14),IF(AND(C15>$AL$1,$AC$3=$AL$2),BO16,IF($AO$18=$AO$20,SUM(BB16+BJ16),ROUND((D15+E15)*10%,0))))),\"\")","v":3955},{"$f":"IFERROR(IF(C15=\"\",\"\",IF(H15=\"\",\"\",IF(I15=\"\",\"\",IF($C15=\"TOTAL\",SUM($Q$8:Q14),IF(AND(C15>$AL$1,$AC$3=$AL$2),BO16,IF($AO$18=$AO$20,$AO$21,ROUND((H15+I15)*10%,0))))))),\"\")","v":2370},1585,{"$f":"IFERROR(IF(C15=\"\",\"\",IF($AO$16=$AO$17,0,IF($C15=\"TOTAL\",SUM($S$8:S14),IF($AO$19=$AO$31,0,IF(AND($AO$32=$AO$20,C15=$AO$33),$AO$34,S14))))),\"\")","v":0},{"$f":"IFERROR(IF(C15=\"\",\"\",IF($AO$16=$AO$17,0,IF($C15=\"TOTAL\",SUM($T$8:T14),IF($AO$19=$AO$20,$AO$24,0)))),\"\")","v":0},0,{"$f":"IF(C15=\"\",\"\",IF($C15=\"TOTAL\",SUM($V$8:V14),IF(AND($AO$2=$AO$20,C15=$AO$1),ROUND(D15/31*$AP$2,0),IF(C15=$AM$6,ROUND((G15)*1/30,0),IF(C15=$AN$6,ROUND((G15)*1/31,0),\"\")))))","v":""},{"$f":"IF(C15=\"\",\"\",IF($C15=\"TOTAL\",SUM($W$8:W14),IF(AND($AO$2=$AO$20,C15=$AO$1),ROUND(H15/31*$AP$2,0),IF(C15=$AM$6,ROUND((K15)*1/30,0),IF(C15=$AN$6,ROUND((K15)*1/31,0),\"\")))))","v":""},"",{"$f":"IFERROR(IF(C15=\"\",\"\",IF(AND(BH16=\"\",BO16=\"\"),\"\",IF($C15=\"TOTAL\",SUM($Y$8:Y14),BH16))),\"\")","v":""},{"$f":"IFERROR(IF(C15=\"\",\"\",IF($C15=\"TOTAL\",SUM($Z$8:Z14),ROUND(O15*$AO$7%,0))),\"\")","v":0},{"$f":"IFERROR(IF(C15=\"\",\"\",IF($C15=\"TOTAL\",SUM($AA$8:AA14),IF($AC$3=$AL$2,SUM(U15,X15,Y15,Z15),SUM(R15,U15,X15,Y15,Z15)))),\"\")","v":0},{"$f":"IFERROR(IF(C15=\"\",\"\",IF($C15=\"TOTAL\",SUM($AB$8:AB14),SUM(O15-AA15))),\"\")","v":18550},{"$nulls":8},17,17,null,"2017-07-01","Regular Pay","2021-04-01","2021-04-01","","2021-04-01","2021-04-01",33800,5746,2704,null,23700,0,0,0,null,null,18550,3675,"","",0,0,{"$nulls":4},""]
[9,9,"2021-06-01",{"$f":"IFERROR(IF($C15=\"TOTAL\",\"अक्षरें राशि :-\",IF($C16=\"TOTAL\",SUM($D$8:D15),IF(AU17=\"\",\"\",AU17))),\"\")","v":33800},{"$f":"IFERROR(IF($C16=\"TOTAL\",SUM($E$8:E15),IF(AV17=\"\",\"\",AV17)),\"\")","v":5746},{"$f":"IFERROR(IF($C16=\"TOTAL\",SUM($F$8:F15),IF(OR(C16=$AM$16,C16=$AM$17,C16=$AM$18,C16=$AM$19,C16=$AM$20,C16=$AM$21,C16=$AM$22,C16=$AM$23,C16=$AM$24),0,IF(AW17=\"\",\"\",AW17))),\"\")","v":2704},42250,{"$f":"IFERROR(IF($C16=\"TOTAL\",SUM($H$8:H15),IF(AY17=\"\",\"\",AY17)),\"\")","v":23700},{"$f":"IFERROR(IF($C16=\"TOTAL\",SUM($I$8:I15),IF(AZ17=\"\",\"\",AZ17)),\"\")","v":0},{"$f":"IFERROR(IF($C16=\"TOTAL\",SUM($J$8:J15),IF(OR(C16=$AM$16,C16=$AM$17,C16=$AM$18,C16=$AM$19,C16=$AM$20,C16=$AM$21,C16=$AM$22,C16=$AM$23,C16=$AM$24),0,IF(BA17=\"\",\"\",BA17))),\"\")","v":0},23700,{"$f":"IFERROR(IF(C16=\"\",\"\",IF(D16=\"\",\"\",IF(H16=\"\",\"\",IF($C16=\"TOTAL\",SUM($L$8:L15),SUM(D16-H16))))),\"\")","v":10100},{"$f":"IFERROR(IF(C16=\"\",\"\",IF(E16=\"\",\"\",IF(I16=\"\",\"\",IF($C16=\"TOTAL\",SUM($M$8:M15),SUM(E16-I16))))),\"\")","v":5746},{"$f":"IFERROR(IF(C16=\"\",\"\",IF(F16=\"\",\"\",IF(J16=\"\",\"\",IF($C16=\"TOTAL\",SUM($N$8:N15),SUM(F16-J16))))),\"\")","v":2704},18550,{"$f":"IFERROR(IF(C16=\"\",\"\",IF($C16=\"TOTAL\",SUM($P$8:P15),IF(AND(C16>$AL$1,$AC$3=$AL$2),BO17,IF($AO$18=$AO$20,SUM(BB17+BJ17),ROUND((D16+E16)*10%,0))))),\"\")","v":3955},{"$f":"IFERROR(IF(C16=\"\",\"\",IF(H16=\"\",\"\",IF(I16=\"\",\"\",IF($C16=\"TOTAL\",SUM($Q$8:Q15),IF(AND(C16>$AL$1,$AC$3=$AL$2),BO17,IF($AO$18=$AO$20,$AO$21,ROUND((H16+I16)*10%,0))))))),\"\")","v":2370},1585,{"$f":"IFERROR(IF(C16=\"\",\"\",IF($AO$16=$AO$17,0,IF($C16=\"TOTAL\",SUM($S$8:S15),IF($AO$19=$AO$31,0,IF(AND($AO$32=$AO$20,C16=$AO$33),$AO$34,S15))))),\"\")","v":0},{"$f":"IFERROR(IF(C16=\"\",\"\",IF($AO$16=$AO$17,0,IF($C16=\"TOTAL\",SUM($T$8:T15),IF($AO$19=$AO$20,$AO$24,0)))),\"\")","v":0},0,{"$f":"IF(C16=\"\",\"\",IF($C16=\"TOTAL\",SUM($V$8:V15),IF(AND($AO$2=$AO$20,C16=$AO$1),ROUND(D16/31*$AP$2,0),IF(C16=$AM$6,ROUND((G16)*1/30,0),IF(C16=$AN$6,ROUND((G16)*1/31,0),\"\")))))","v":""},{"$f":"IF(C16=\"\",\"\",IF($C16=\"TOTAL\",SUM($W$8:W15),IF(AND($AO$2=$AO$20,C16=$AO$1),ROUND(H16/31*$AP$2,0),IF(C16=$AM$6,ROUND((K16)*1/30,0),IF(C16=$AN$6,ROUND((K16)*1/31,0),\"\")))))","v":""},"",{"$f":"IFERROR(IF(C16=\"\",\"\",IF(AND(BH17=\"\",BO17=\"\"),\"\",IF($C16=\"TOTAL\",SUM($Y$8:Y15),BH17))),\"\")","v":""},{"$f":"IFERROR(IF(C16=\"\",\"\",IF($C16=\"TOTAL\",SUM($Z$8:Z15),ROUND(O16*$AO$7%,0))),\"\")","v":0},{"$f":"IFERROR(IF(C16=\"\",\"\",IF($C16=\"TOTAL\",SUM($AA$8:AA15),IF($AC$3=$AL$2,SUM(U16,X16,Y16,Z16),SUM(R16,U16,X16,Y16,Z16)))),\"\")","v":0},{"$f":"IFERROR(IF(C16=\"\",\"\",IF($C16=\"TOTAL\",SUM($AB$8:AB15),SUM(O16-AA16))),\"\")","v":18550},{"$nulls":8},17,17,"2017-01-01","2017-08-01",{"$f":"'Master Sheet'!D11","v":"Fix Pay"},"2021-05-01","2021-05-01","","2021-05-01","2021-05-01",33800,5746,2704,null,23700,0,0,0,null,null,18550,3675,"","",0,0,{"$nulls":4},""]
[10,10,"2021-07-01",{"$f":"IFERROR(IF($C16=\"TOTAL\",\"अक्षरें राशि :-\",IF($C17=\"TOTAL\",SUM($D$8:D16),IF(AU18=\"\",\"\",AU18))),\"\")","v":34800},{"$f":"IFERROR(IF($C17=\"TOTAL\",SUM($E$8:E16),IF(AV18=\"\",\"\",AV18)),\"\")","v":10788},{"$f":"IFERROR(IF($C17=\"TOTAL\",SUM($F$8:F16),IF(OR(C17=$AM$16,C17=$AM$17,C17=$AM$18,C17=$AM$19,C17=$AM$20,C17=$AM$21,C17=$AM$22,C17=$AM$23,C17=$AM$24),0,IF(AW18=\"\",\"\",AW18))),\"\")","v":3132},48720,{"$f":"IFERROR(IF($C17=\"TOTAL\",SUM($H$8:H16),IF(AY18=\"\",\"\",AY18)),\"\")","v":23700},{"$f":"IFERROR(IF($C17=\"TOTAL\",SUM($I$8:I16),IF(AZ18=\"\",\"\",AZ18)),\"\")","v":0},{"$f":"IFERROR(IF($C17=\"TOTAL\",SUM($J$8:J16),IF(OR(C17=$AM$16,C17=$AM$17,C17=$AM$18,C17=$AM$19,C17=$AM$20,C17=$AM$21,C17=$AM$22,C17=$AM$23,C17=$AM$24),0,IF(BA18=\"\",\"\",BA18))),\"\")","v":0},23700,{"$f":"IFERROR(IF(C17=\"\",\"\",IF(D17=\"\",\"\",IF(H17=\"\",\"\",IF($C17=\"TOTAL\",SUM($L$8:L16),SUM(D17-H17))))),\"\")","v":11100},{"$f":"IFERROR(IF(C17=\"\",\"\",IF(E17=\"\",\"\",IF(I17=\"\",\"\",IF($C17=\"TOTAL\",SUM($M$8:M16),SUM(E17-I17))))),\"\")","v":10788},{"$f":"IFERROR(IF(C17=\"\",\"\",IF(F17=\"\",\"\",IF(J17=\"\",\"\",IF($C17=\"TOTAL\",SUM($N$8:N16),SUM(F17-J17))))),\"\")","v":3132},25020,{"$f":"IFERROR(IF(C17=\"\",\"\",IF($C17=\"TOTAL\",SUM($P$8:P16),IF(AND(C17>$AL$1,$AC$3=$AL$2),BO18,IF($AO$18=$AO$20,SUM(BB18+BJ18),ROUND((D17+E17)*10%,0))))),\"\")","v":4559},{"$f":"IFERROR(IF(C17=\"\",\"\",IF(H17=\"\",\"\",IF(I17=\"\",\"\",IF($C17=\"TOTAL\",SUM($Q$8:Q16),IF(AND(C17>$AL$1,$AC$3=$AL$2),BO18,IF($AO$18=$AO$20,$AO$21,ROUND((H17+I17)*10%,0))))))),\"\")","v":2370},2189,{"$f":"IFERROR(IF(C17=\"\",\"\",IF($AO$16=$AO$17,0,IF($C17=\"TOTAL\",SUM($S$8:S16),IF($AO$19=$AO$31,0,IF(AND($AO$32=$AO$20,C17=$AO$33),$AO$34,S16))))),\"\")","v":0},{"$f":"IFERROR(IF(C17=\"\",\"\",IF($AO$16=$AO$17,0,IF($C17=\"TOTAL\",SUM($T$8:T16),IF($AO$19=$AO$20,$AO$24,0)))),\"\")","v":0},0,{"$f":"IF(C17=\"\",\"\",IF($C17=\"TOTAL\",SUM($V$8:V16),IF(AND($AO$2=$AO$20,C17=$AO$1),ROUND(D17/31*$AP$2,0),IF(C17=$AM$6,ROUND((G17)*1/30,0),IF(C17=$AN$6,ROUND((G17)*1/31,0),\"\")))))","v":""},{"$f":"IF(C17=\"\",\"\",IF($C17=\"TOTAL\",SUM($W$8:W16),IF(AND($AO$2=$AO$20,C17=$AO$1),ROUND(H17/31*$AP$2,0),IF(C17=$AM$6,ROUND((K17)*1/30,0),IF(C17=$AN$6,ROUND((K17)*1/31,0),\"\")))))","v":""},"",{"$f":"IFERROR(IF(C17=\"\",\"\",IF(AND(BH18=\"\",BO18=\"\"),\"\",IF($C17=\"TOTAL\",SUM($Y$8:Y16),BH18))),\"\")","v":1044},{"$f":"IFERROR(IF(C17=\"\",\"\",IF($C17=\"TOTAL\",SUM($Z$8:Z16),ROUND(O17*$AO$7%,0))),\"\")","v":0},{"$f":"IFERROR(IF(C17=\"\",\"\",IF($C17=\"TOTAL\",SUM($AA$8:AA16),IF($AC$3=$AL$2,SUM(U17,X17,Y17,Z17),SUM(R17,U17,X17,Y17,Z17)))),\"\")","v":1044},{"$f":"IFERROR(IF(C17=\"\",\"\",IF($C17=\"TOTAL\",SUM($AB$8:AB16),SUM(O17-AA17))),\"\")","v":23976},{"$nulls":8},17,17,"2017-02-01","2017-09-01","Fix Pay","2021-06-01","2021-06-01","","2021-06-01","2021-06-01",33800,5746,2704,null,23700,0,0,0,null,null,18550,3675,"","",0,0,{"$nulls":4},""]
[11,11,"2021-08-01",{"$f":"IFERROR(IF($C17=\"TOTAL\",\"अक्षरें राशि :-\",IF($C18=\"TOTAL\",SUM($D$8:D17),IF(AU19=\"\",\"\",AU19))),\"\")","v":34800},{"$f":"IFERROR(IF($C18=\"TOTAL\",SUM($E$8:E17),IF(AV19=\"\",\"\",AV19)),\"\")","v":10788},{"$f":"IFERROR(IF($C18=\"TOTAL\",SUM($F$8:F17),IF(OR(C18=$AM$16,C18=$AM$17,C18=$AM$18,C18=$AM$19,C18=$AM$20,C18=$AM$21,C18=$AM$22,C18=$AM$23,C18=$AM$24),0,IF(AW19=\"\",\"\",AW19))),\"\")","v":3132},48720,{"$f":"IFERROR(IF($C18=\"TOTAL\",SUM($H$8:H17),IF(AY19=\"\",\"\",AY19)),\"\")","v":23700},{"$f":"IFERROR(IF($C18=\"TOTAL\",SUM($I$8:I17),IF(AZ19=\"\",\"\",AZ19)),\"\")","v":0},{"$f":"IFERROR(IF($C18=\"TOTAL\",SUM($J$8:J17),IF(OR(C18=$AM$16,C18=$AM$17,C18=$AM$18,C18=$AM$19,C18=$AM$20,C18=$AM$21,C18=$AM$22,C18=$AM$23,C18=$AM$24),0,IF(BA19=\"\",\"\",BA19))),\"\")","v":0},23700,{"$f":"IFERROR(IF(C18=\"\",\"\",IF(D18=\"\",\"\",IF(H18=\"\",\"\",IF($C18=\"TOTAL\",SUM($L$8:L17),SUM(D18-H18))))),\"\")","v":11100},{"$f":"IFERROR(IF(C18=\"\",\"\",IF(E18=\"\",\"\",IF(I18=\"\",\"\",IF($C18=\"TOTAL\",SUM($M$8:M17),SUM(E18-I18))))),\"\")","v":10788},{"$f":"IFERROR(IF(C18=\"\",\"\",IF(F18=\"\",\"\",IF(J18=\"\",\"\",IF($C18=\"TOTAL\",SUM($N$8:N17),SUM(F18-J18))))),\"\")","v":3132},25020,{"$f":"IFERROR(IF(C18=\"\",\"\",IF($C18=\"TOTAL\",SUM($P$8:P17),IF(AND(C18>$AL$1,$AC$3=$AL$2),BO19,IF($AO$18=$AO$20,SUM(BB19+BJ19),ROUND((D18+E18)*10%,0))))),\"\")","v":4559},{"$f":"IFERROR(IF(C18=\"\",\"\",IF(H18=\"\",\"\",IF(I18=\"\",\"\",IF($C18=\"TOTAL\",SUM($Q$8:Q17),IF(AND(C18>$AL$1,$AC$3=$AL$2),BO19,IF($AO$18=$AO$20,$AO$21,ROUND((H18+I18)*10%,0))))))),\"\")","v":2370},2189,{"$f":"IFERROR(IF(C18=\"\",\"\",IF($AO$16=$AO$17,0,IF($C18=\"TOTAL\",SUM($S$8:S17),IF($AO$19=$AO$31,0,IF(AND($AO$32=$AO$20,C18=$AO$33),$AO$34,S17))))),\"\")","v":0},{"$f":"IFERROR(IF(C18=\"\",\"\",IF($AO$16=$AO$17,0,IF($C18=\"TOTAL\",SUM($T$8:T17),IF($AO$19=$AO$20,$AO$24,0)))),\"\")","v":0},0,{"$f":"IF(C18=\"\",\"\",IF($C18=\"TOTAL\",SUM($V$8:V17),IF(AND($AO$2=$AO$20,C18=$AO$1),ROUND(D18/31*$AP$2,0),IF(C18=$AM$6,ROUND((G18)*1/30,0),IF(C18=$AN$6,ROUND((G18)*1/31,0),\"\")))))","v":""},{"$f":"IF(C18=\"\",\"\",IF($C18=\"TOTAL\",SUM($W$8:W17),IF(AND($AO$2=$AO$20,C18=$AO$1),ROUND(H18/31*$AP$2,0),IF(C18=$AM$6,ROUND((K18)*1/30,0),IF(C18=$AN$6,ROUND((K18)*1/31,0),\"\")))))","v":""},"",{"$f":"IFERROR(IF(C18=\"\",\"\",IF(AND(BH19=\"\",BO19=\"\"),\"\",IF($C18=\"TOTAL\",SUM($Y$8:Y17),BH19))),\"\")","v":1044},{"$f":"IFERROR(IF(C18=\"\",\"\",IF($C18=\"TOTAL\",SUM($Z$8:Z17),ROUND(O18*$AO$7%,0))),\"\")","v":0},{"$f":"IFERROR(IF(C18=\"\",\"\",IF($C18=\"TOTAL\",SUM($AA$8:AA17),IF($AC$3=$AL$2,SUM(U18,X18,Y18,Z18),SUM(R18,U18,X18,Y18,Z18)))),\"\")","v":1044},{"$f":"IFERROR(IF(C18=\"\",\"\",IF($C18=\"TOTAL\",SUM($AB$8:AB17),SUM(O18-AA18))),\"\")","v":23976},{"$nulls":8},31,31,"2017-03-01","2017-10-01",{"$f":"'Master Sheet'!D21","v":"NO"},"2021-07-01","2021-07-01","","2021-07-01","2021-07-01",34800,10788,3132,null,23700,0,0,0,null,null,25020,3675,"YES",{"$f":"IF(BG18=\"\",\"\",IF($AO$16=$AO$17,ROUND((D17)*3%,0),IF(OR(AT18=$AN$63,AT18=$AN$64,AT18=$AN$65),SUM(ROUND((D17-H17)*3%,0)),IF(OR(AT18=$AN$69,AT18=$AN$70,AT18=$AN$71),SUM(ROUND((D17-H17)*3%,0)),\"\"))))","v":1044},104,1044,{"$nulls":4},""]
[12,12,"2021-09-01",{"$f":"IFERROR(IF($C18=\"TOTAL\",\"अक्षरें राशि :-\",IF($C19=\"TOTAL\",SUM($D$8:D18),IF(AU20=\"\",\"\",AU20))),\"\")","v":34800},{"$f":"IFERROR(IF($C19=\"TOTAL\",SUM($E$8:E18),IF(AV20=\"\",\"\",AV20)),\"\")","v":10788},{"$f":"IFERROR(IF($C19=\"TOTAL\",SUM($F$8:F18),IF(OR(C19=$AM$16,C19=$AM$17,C19=$AM$18,C19=$AM$19,C19=$AM$20,C19=$AM$21,C19=$AM$22,C19=$AM$23,C19=$AM$24),0,IF(AW20=\"\",\"\",AW20))),\"\")","v":3132},48720,{"$f":"IFERROR(IF($C19=\"TOTAL\",SUM($H$8:H18),IF(AY20=\"\",\"\",AY20)),\"\")","v":23700},{"$f":"IFERROR(IF($C19=\"TOTAL\",SUM($I$8:I18),IF(AZ20=\"\",\"\",AZ20)),\"\")","v":0},{"$f":"IFERROR(IF($C19=\"TOTAL\",SUM($J$8:J18),IF(OR(C19=$AM$16,C19=$AM$17,C19=$AM$18,C19=$AM$19,C19=$AM$20,C19=$AM$21,C19=$AM$22,C19=$AM$23,C19=$AM$24),0,IF(BA20=\"\",\"\",BA20))),\"\")","v":0},23700,{"$f":"IFERROR(IF(C19=\"\",\"\",IF(D19=\"\",\"\",IF(H19=\"\",\"\",IF($C19=\"TOTAL\",SUM($L$8:L18),SUM(D19-H19))))),\"\")","v":11100},{"$f":"IFERROR(IF(C19=\"\",\"\",IF(E19=\"\",\"\",IF(I19=\"\",\"\",IF($C19=\"TOTAL\",SUM($M$8:M18),SUM(E19-I19))))),\"\")","v":10788},{"$f":"IFERROR(IF(C19=\"\",\"\",IF(F19=\"\",\"\",IF(J19=\"\",\"\",IF($C19=\"TOTAL\",SUM($N$8:N18),SUM(F19-J19))))),\"\")","v":3132},25020,{"$f":"IFERROR(IF(C19=\"\",\"\",IF($C19=\"TOTAL\",SUM($P$8:P18),IF(AND(C19>$AL$1,$AC$3=$AL$2),BO20,IF($AO$18=$AO$20,SUM(BB20+BJ20),ROUND((D19+E19)*10%,0))))),\"\")","v":4559},{"$f":"IFERROR(IF(C19=\"\",\"\",IF(H19=\"\",\"\",IF(I19=\"\",\"\",IF($C19=\"TOTAL\",SUM($Q$8:Q18),IF(AND(C19>$AL$1,$AC$3=$AL$2),BO20,IF($AO$18=$AO$20,$AO$21,ROUND((H19+I19)*10%,0))))))),\"\")","v":2370},2189,{"$f":"IFERROR(IF(C19=\"\",\"\",IF($AO$16=$AO$17,0,IF($C19=\"TOTAL\",SUM($S$8:S18),IF($AO$19=$AO$31,0,IF(AND($AO$32=$AO$20,C19=$AO$33),$AO$34,S18))))),\"\")","v":0},{"$f":"IFERROR(IF(C19=\"\",\"\",IF($AO$16=$AO$17,0,IF($C19=\"TOTAL\",SUM($T$8:T18),IF($AO$19=$AO$20,$AO$24,0)))),\"\")","v":0},0,{"$f":"IF(C19=\"\",\"\",IF($C19=\"TOTAL\",SUM($V$8:V18),IF(AND($AO$2=$AO$20,C19=$AO$1),ROUND(D19/31*$AP$2,0),IF(C19=$AM$6,ROUND((G19)*1/30,0),IF(C19=$AN$6,ROUND((G19)*1/31,0),\"\")))))","v":""},{"$f":"IF(C19=\"\",\"\",IF($C19=\"TOTAL\",SUM($W$8:W18),IF(AND($AO$2=$AO$20,C19=$AO$1),ROUND(H19/31*$AP$2,0),IF(C19=$AM$6,ROUND((K19)*1/30,0),IF(C19=$AN$6,ROUND((K19)*1/31,0),\"\")))))","v":""},"",{"$f":"IFERROR(IF(C19=\"\",\"\",IF(AND(BH20=\"\",BO20=\"\"),\"\",IF($C19=\"TOTAL\",SUM($Y$8:Y18),BH20))),\"\")","v":1044},{"$f":"IFERROR(IF(C19=\"\",\"\",IF($C19=\"TOTAL\",SUM($Z$8:Z18),ROUND(O19*$AO$7%,0))),\"\")","v":0},{"$f":"IFERROR(IF(C19=\"\",\"\",IF($C19=\"TOTAL\",SUM($AA$8:AA18),IF($AC$3=$AL$2,SUM(U19,X19,Y19,Z19),SUM(R19,U19,X19,Y19,Z19)))),\"\")","v":1044},{"$f":"IFERROR(IF(C19=\"\",\"\",IF($C19=\"TOTAL\",SUM($AB$8:AB18),SUM(O19-AA19))),\"\")","v":23976},{"$nulls":8},31,31,"2017-04-01","2017-11-01",{"$f":"'Master Sheet'!D17","v":"NO"},"2021-08-01","2021-08-01","","2021-08-01","2021-08-01",34800,10788,3132,null,23700,0,0,0,null,null,25020,3675,"YES",1044,104,1044,{"$nulls":4},""]
[13,13,"2021-10-01",{"$f":"IFERROR(IF($C19=\"TOTAL\",\"अक्षरें राशि :-\",IF($C20=\"TOTAL\",SUM($D$8:D19),IF(AU21=\"\",\"\",AU21))),\"\")","v":34800},{"$f":"IFERROR(IF($C20=\"TOTAL\",SUM($E$8:E19),IF(AV21=\"\",\"\",AV21)),\"\")","v":10788},{"$f":"IFERROR(IF($C20=\"TOTAL\",SUM($F$8:F19),IF(OR(C20=$AM$16,C20=$AM$17,C20=$AM$18,C20=$AM$19,C20=$AM$20,C20=$AM$21,C20=$AM$22,C20=$AM$23,C20=$AM$24),0,IF(AW21=\"\",\"\",AW21))),\"\")","v":3132},48720,{"$f":"IFERROR(IF($C20=\"TOTAL\",SUM($H$8:H19),IF(AY21=\"\",\"\",AY21)),\"\")","v":23700},{"$f":"IFERROR(IF($C20=\"TOTAL\",SUM($I$8:I19),IF(AZ21=\"\",\"\",AZ21)),\"\")","v":0},{"$f":"IFERROR(IF($C20=\"TOTAL\",SUM($J$8:J19),IF(OR(C20=$AM$16,C20=$AM$17,C20=$AM$18,C20=$AM$19,C20=$AM$20,C20=$AM$21,C20=$AM$22,C20=$AM$23,C20=$AM$24),0,IF(BA21=\"\",\"\",BA21))),\"\")","v":0},23700,{"$f":"IFERROR(IF(C20=\"\",\"\",IF(D20=\"\",\"\",IF(H20=\"\",\"\",IF($C20=\"TOTAL\",SUM($L$8:L19),SUM(D20-H20))))),\"\")","v":11100},{"$f":"IFERROR(IF(C20=\"\",\"\",IF(E20=\"\",\"\",IF(I20=\"\",\"\",IF($C20=\"TOTAL\",SUM($M$8:M19),SUM(E20-I20))))),\"\")","v":10788},{"$f":"IFERROR(IF(C20=\"\",\"\",IF(F20=\"\",\"\",IF(J20=\"\",\"\",IF($C20=\"TOTAL\",SUM($N$8:N19),SUM(F20-J20))))),\"\")","v":3132},25020,{"$f":"IFERROR(IF(C20=\"\",\"\",IF($C20=\"TOTAL\",SUM($P$8:P19),IF(AND(C20>$AL$1,$AC$3=$AL$2),BO21,IF($AO$18=$AO$20,SUM(BB21+BJ21),ROUND((D20+E20)*10%,0))))),\"\")","v":4559},{"$f":"IFERROR(IF(C20=\"\",\"\",IF(H20=\"\",\"\",IF(I20=\"\",\"\",IF($C20=\"TOTAL\",SUM($Q$8:Q19),IF(AND(C20>$AL$1,$AC$3=$AL$2),BO21,IF($AO$18=$AO$20,$AO$21,ROUND((H20+I20)*10%,0))))))),\"\")","v":2370},2189,{"$f":"IFERROR(IF(C20=\"\",\"\",IF($AO$16=$AO$17,0,IF($C20=\"TOTAL\",SUM($S$8:S19),IF($AO$19=$AO$31,0,IF(AND($AO$32=$AO$20,C20=$AO$33),$AO$34,S19))))),\"\")","v":0},{"$f":"IFERROR(IF(C20=\"\",\"\",IF($AO$16=$AO$17,0,IF($C20=\"TOTAL\",SUM($T$8:T19),IF($AO$19=$AO$20,$AO$24,0)))),\"\")","v":0},0,{"$f":"IF(C20=\"\",\"\",IF($C20=\"TOTAL\",SUM($V$8:V19),IF(AND($AO$2=$AO$20,C20=$AO$1),ROUND(D20/31*$AP$2,0),IF(C20=$AM$6,ROUND((G20)*1/30,0),IF(C20=$AN$6,ROUND((G20)*1/31,0),\"\")))))","v":""},{"$f":"IF(C20=\"\",\"\",IF($C20=\"TOTAL\",SUM($W$8:W19),IF(AND($AO$2=$AO$20,C20=$AO$1),ROUND(H20/31*$AP$2,0),IF(C20=$AM$6,ROUND((K20)*1/30,0),IF(C20=$AN$6,ROUND((K20)*1/31,0),\"\")))))","v":""},"",{"$f":"IFERROR(IF(C20=\"\",\"\",IF(AND(BH21=\"\",BO21=\"\"),\"\",IF($C20=\"TOTAL\",SUM($Y$8:Y19),BH21))),\"\")","v":""},{"$f":"IFERROR(IF(C20=\"\",\"\",IF($C20=\"TOTAL\",SUM($Z$8:Z19),ROUND(O20*$AO$7%,0))),\"\")","v":0},{"$f":"IFERROR(IF(C20=\"\",\"\",IF($C20=\"TOTAL\",SUM($AA$8:AA19),IF($AC$3=$AL$2,SUM(U20,X20,Y20,Z20),SUM(R20,U20,X20,Y20,Z20)))),\"\")","v":0},{"$f":"IFERROR(IF(C20=\"\",\"\",IF($C20=\"TOTAL\",SUM($AB$8:AB19),SUM(O20-AA20))),\"\")","v":25020},{"$nulls":8},31,31,"2017-05-01","2017-12-01","YES",{"$f":"IF(AND($AO$6>$AP$6),\"\",DATE(YEAR(AP19),MONTH(AP19)+1,DAY(AP19)))","v":"2021-09-01"},"2021-09-01","","2021-09-01","2021-09-01",34800,10788,3132,null,23700,0,0,0,null,null,25020,3675,"YES",1044,104,1044,{"$nulls":4},""]
[14,14,"2021-11-01",{"$f":"IFERROR(IF($C20=\"TOTAL\",\"अक्षरें राशि :-\",IF($C21=\"TOTAL\",SUM($D$8:D20),IF(AU22=\"\",\"\",AU22))),\"\")","v":34800},{"$f":"IFERROR(IF($C21=\"TOTAL\",SUM($E$8:E20),IF(AV22=\"\",\"\",AV22)),\"\")","v":10788},{"$f":"IFERROR(IF($C21=\"TOTAL\",SUM($F$8:F20),IF(OR(C21=$AM$16,C21=$AM$17,C21=$AM$18,C21=$AM$19,C21=$AM$20,C21=$AM$21,C21=$AM$22,C21=$AM$23,C21=$AM$24),0,IF(AW22=\"\",\"\",AW22))),\"\")","v":3132},48720,{"$f":"IFERROR(IF($C21=\"TOTAL\",SUM($H$8:H20),IF(AY22=\"\",\"\",AY22)),\"\")","v":23700},{"$f":"IFERROR(IF($C21=\"TOTAL\",SUM($I$8:I20),IF(AZ22=\"\",\"\",AZ22)),\"\")","v":0},{"$f":"IFERROR(IF($C21=\"TOTAL\",SUM($J$8:J20),IF(OR(C21=$AM$16,C21=$AM$17,C21=$AM$18,C21=$AM$19,C21=$AM$20,C21=$AM$21,C21=$AM$22,C21=$AM$23,C21=$AM$24),0,IF(BA22=\"\",\"\",BA22))),\"\")","v":0},23700,{"$f":"IFERROR(IF(C21=\"\",\"\",IF(D21=\"\",\"\",IF(H21=\"\",\"\",IF($C21=\"TOTAL\",SUM($L$8:L20),SUM(D21-H21))))),\"\")","v":11100},{"$f":"IFERROR(IF(C21=\"\",\"\",IF(E21=\"\",\"\",IF(I21=\"\",\"\",IF($C21=\"TOTAL\",SUM($M$8:M20),SUM(E21-I21))))),\"\")","v":10788},{"$f":"IFERROR(IF(C21=\"\",\"\",IF(F21=\"\",\"\",IF(J21=\"\",\"\",IF($C21=\"TOTAL\",SUM($N$8:N20),SUM(F21-J21))))),\"\")","v":3132},25020,{"$f":"IFERROR(IF(C21=\"\",\"\",IF($C21=\"TOTAL\",SUM($P$8:P20),IF(AND(C21>$AL$1,$AC$3=$AL$2),BO22,IF($AO$18=$AO$20,SUM(BB22+BJ22),ROUND((D21+E21)*10%,0))))),\"\")","v":4559},{"$f":"IFERROR(IF(C21=\"\",\"\",IF(H21=\"\",\"\",IF(I21=\"\",\"\",IF($C21=\"TOTAL\",SUM($Q$8:Q20),IF(AND(C21>$AL$1,$AC$3=$AL$2),BO22,IF($AO$18=$AO$20,$AO$21,ROUND((H21+I21)*10%,0))))))),\"\")","v":2370},2189,{"$f":"IFERROR(IF(C21=\"\",\"\",IF($AO$16=$AO$17,0,IF($C21=\"TOTAL\",SUM($S$8:S20),IF($AO$19=$AO$31,0,IF(AND($AO$32=$AO$20,C21=$AO$33),$AO$34,S20))))),\"\")","v":0},{"$f":"IFERROR(IF(C21=\"\",\"\",IF($AO$16=$AO$17,0,IF($C21=\"TOTAL\",SUM($T$8:T20),IF($AO$19=$AO$20,$AO$24,0)))),\"\")","v":0},0,{"$f":"IF(C21=\"\",\"\",IF($C21=\"TOTAL\",SUM($V$8:V20),IF(AND($AO$2=$AO$20,C21=$AO$1),ROUND(D21/31*$AP$2,0),IF(C21=$AM$6,ROUND((G21)*1/30,0),IF(C21=$AN$6,ROUND((G21)*1/31,0),\"\")))))","v":""},{"$f":"IF(C21=\"\",\"\",IF($C21=\"TOTAL\",SUM($W$8:W20),IF(AND($AO$2=$AO$20,C21=$AO$1),ROUND(H21/31*$AP$2,0),IF(C21=$AM$6,ROUND((K21)*1/30,0),IF(C21=$AN$6,ROUND((K21)*1/31,0),\"\")))))","v":""},"",{"$f":"IFERROR(IF(C21=\"\",\"\",IF(AND(BH22=\"\",BO22=\"\"),\"\",IF($C21=\"TOTAL\",SUM($Y$8:Y20),BH22))),\"\")","v":""},{"$f":"IFERROR(IF(C21=\"\",\"\",IF($C21=\"TOTAL\",SUM($Z$8:Z20),ROUND(O21*$AO$7%,0))),\"\")","v":0},{"$f":"IFERROR(IF(C21=\"\",\"\",IF($C21=\"TOTAL\",SUM($AA$8:AA20),IF($AC$3=$AL$2,SUM(U21,X21,Y21,Z21),SUM(R21,U21,X21,Y21,Z21)))),\"\")","v":0},{"$f":"IFERROR(IF(C21=\"\",\"\",IF($C21=\"TOTAL\",SUM($AB$8:AB20),SUM(O21-AA21))),\"\")","v":25020},{"$nulls":8},31,31,"2017-06-01","2018-01-01",{"$f":"'Master Sheet'!G21","v":3675},"2021-10-01","2021-10-01","","2021-10-01","2021-10-01",34800,10788,3132,null,23700,0,0,0,null,null,25020,3675,"","",0,0,{"$nulls":4},""]
[15,15,"2021-12-01",{"$f":"IFERROR(IF($C21=\"TOTAL\",\"अक्षरें राशि :-\",IF($C22=\"TOTAL\",SUM($D$8:D21),IF(AU23=\"\",\"\",AU23))),\"\")","v":34800},{"$f":"IFERROR(IF($C22=\"TOTAL\",SUM($E$8:E21),IF(AV23=\"\",\"\",AV23)),\"\")","v":10788},{"$f":"IFERROR(IF($C22=\"TOTAL\",SUM($F$8:F21),IF(OR(C22=$AM$16,C22=$AM$17,C22=$AM$18,C22=$AM$19,C22=$AM$20,C22=$AM$21,C22=$AM$22,C22=$AM$23,C22=$AM$24),0,IF(AW23=\"\",\"\",AW23))),\"\")","v":3132},48720,{"$f":"IFERROR(IF($C22=\"TOTAL\",SUM($H$8:H21),IF(AY23=\"\",\"\",AY23)),\"\")","v":23700},{"$f":"IFERROR(IF($C22=\"TOTAL\",SUM($I$8:I21),IF(AZ23=\"\",\"\",AZ23)),\"\")","v":0},{"$f":"IFERROR(IF($C22=\"TOTAL\",SUM($J$8:J21),IF(OR(C22=$AM$16,C22=$AM$17,C22=$AM$18,C22=$AM$19,C22=$AM$20,C22=$AM$21,C22=$AM$22,C22=$AM$23,C22=$AM$24),0,IF(BA23=\"\",\"\",BA23))),\"\")","v":0},23700,{"$f":"IFERROR(IF(C22=\"\",\"\",IF(D22=\"\",\"\",IF(H22=\"\",\"\",IF($C22=\"TOTAL\",SUM($L$8:L21),SUM(D22-H22))))),\"\")","v":11100},{"$f":"IFERROR(IF(C22=\"\",\"\",IF(E22=\"\",\"\",IF(I22=\"\",\"\",IF($C22=\"TOTAL\",SUM($M$8:M21),SUM(E22-I22))))),\"\")","v":10788},{"$f":"IFERROR(IF(C22=\"\",\"\",IF(F22=\"\",\"\",IF(J22=\"\",\"\",IF($C22=\"TOTAL\",SUM($N$8:N21),SUM(F22-J22))))),\"\")","v":3132},25020,{"$f":"IFERROR(IF(C22=\"\",\"\",IF($C22=\"TOTAL\",SUM($P$8:P21),IF(AND(C22>$AL$1,$AC$3=$AL$2),BO23,IF($AO$18=$AO$20,SUM(BB23+BJ23),ROUND((D22+E22)*10%,0))))),\"\")","v":4559},{"$f":"IFERROR(IF(C22=\"\",\"\",IF(H22=\"\",\"\",IF(I22=\"\",\"\",IF($C22=\"TOTAL\",SUM($Q$8:Q21),IF(AND(C22>$AL$1,$AC$3=$AL$2),BO23,IF($AO$18=$AO$20,$AO$21,ROUND((H22+I22)*10%,0))))))),\"\")","v":2370},2189,{"$f":"IFERROR(IF(C22=\"\",\"\",IF($AO$16=$AO$17,0,IF($C22=\"TOTAL\",SUM($S$8:S21),IF($AO$19=$AO$31,0,IF(AND($AO$32=$AO$20,C22=$AO$33),$AO$34,S21))))),\"\")","v":0},{"$f":"IFERROR(IF(C22=\"\",\"\",IF($AO$16=$AO$17,0,IF($C22=\"TOTAL\",SUM($T$8:T21),IF($AO$19=$AO$20,$AO$24,0)))),\"\")","v":0},0,{"$f":"IF(C22=\"\",\"\",IF($C22=\"TOTAL\",SUM($V$8:V21),IF(AND($AO$2=$AO$20,C22=$AO$1),ROUND(D22/31*$AP$2,0),IF(C22=$AM$6,ROUND((G22)*1/30,0),IF(C22=$AN$6,ROUND((G22)*1/31,0),\"\")))))","v":""},{"$f":"IF(C22=\"\",\"\",IF($C22=\"TOTAL\",SUM($W$8:W21),IF(AND($AO$2=$AO$20,C22=$AO$1),ROUND(H22/31*$AP$2,0),IF(C22=$AM$6,ROUND((K22)*1/30,0),IF(C22=$AN$6,ROUND((K22)*1/31,0),\"\")))))","v":""},"",{"$f":"IFERROR(IF(C22=\"\",\"\",IF(AND(BH23=\"\",BO23=\"\"),\"\",IF($C22=\"TOTAL\",SUM($Y$8:Y21),BH23))),\"\")","v":""},{"$f":"IFERROR(IF(C22=\"\",\"\",IF($C22=\"TOTAL\",SUM($Z$8:Z21),ROUND(O22*$AO$7%,0))),\"\")","v":0},{"$f":"IFERROR(IF(C22=\"\",\"\",IF($C22=\"TOTAL\",SUM($AA$8:AA21),IF($AC$3=$AL$2,SUM(U22,X22,Y22,Z22),SUM(R22,U22,X22,Y22,Z22)))),\"\")","v":0},{"$f":"IFERROR(IF(C22=\"\",\"\",IF($C22=\"TOTAL\",SUM($AB$8:AB21),SUM(O22-AA22))),\"\")","v":25020},{"$nulls":8},31,31,"2017-07-01","2018-02-01",{"$f":"'Master Sheet'!K21","v":3675},"2021-11-01","2021-11-01","","2021-11-01","2021-11-01",34800,10788,3132,null,23700,0,0,0,null,null,25020,3675,"","",0,0,{"$nulls":4},""]
[16,16,"2022-01-01",{"$f":"IFERROR(IF($C22=\"TOTAL\",\"अक्षरें राशि :-\",IF($C23=\"TOTAL\",SUM($D$8:D22),IF(AU24=\"\",\"\",AU24))),\"\")","v":34800},{"$f":"IFERROR(IF($C23=\"TOTAL\",SUM($E$8:E22),IF(AV24=\"\",\"\",AV24)),\"\")","v":11832},{"$f":"IFERROR(IF($C23=\"TOTAL\",SUM($F$8:F22),IF(OR(C23=$AM$16,C23=$AM$17,C23=$AM$18,C23=$AM$19,C23=$AM$20,C23=$AM$21,C23=$AM$22,C23=$AM$23,C23=$AM$24),0,IF(AW24=\"\",\"\",AW24))),\"\")","v":3132},49764,{"$f":"IFERROR(IF($C23=\"TOTAL\",SUM($H$8:H22),IF(AY24=\"\",\"\",AY24)),\"\")","v":23700},{"$f":"IFERROR(IF($C23=\"TOTAL\",SUM($I$8:I22),IF(AZ24=\"\",\"\",AZ24)),\"\")","v":0},{"$f":"IFERROR(IF($C23=\"TOTAL\",SUM($J$8:J22),IF(OR(C23=$AM$16,C23=$AM$17,C23=$AM$18,C23=$AM$19,C23=$AM$20,C23=$AM$21,C23=$AM$22,C23=$AM$23,C23=$AM$24),0,IF(BA24=\"\",\"\",BA24))),\"\")","v":0},23700,{"$f":"IFERROR(IF(C23=\"\",\"\",IF(D23=\"\",\"\",IF(H23=\"\",\"\",IF($C23=\"TOTAL\",SUM($L$8:L22),SUM(D23-H23))))),\"\")","v":11100},{"$f":"IFERROR(IF(C23=\"\",\"\",IF(E23=\"\",\"\",IF(I23=\"\",\"\",IF($C23=\"TOTAL\",SUM($M$8:M22),SUM(E23-I23))))),\"\")","v":11832},{"$f":"IFERROR(IF(C23=\"\",\"\",IF(F23=\"\",\"\",IF(J23=\"\",\"\",IF($C23=\"TOTAL\",SUM($N$8:N22),SUM(F23-J23))))),\"\")","v":3132},26064,{"$f":"IFERROR(IF(C23=\"\",\"\",IF($C23=\"TOTAL\",SUM($P$8:P22),IF(AND(C23>$AL$1,$AC$3=$AL$2),BO24,IF($AO$18=$AO$20,SUM(BB24+BJ24),ROUND((D23+E23)*10%,0))))),\"\")","v":4663},{"$f":"IFERROR(IF(C23=\"\",\"\",IF(H23=\"\",\"\",IF(I23=\"\",\"\",IF($C23=\"TOTAL\",SUM($Q$8:Q22),IF(AND(C23>$AL$1,$AC$3=$AL$2),BO24,IF($AO$18=$AO$20,$AO$21,ROUND((H23+I23)*10%,0))))))),\"\")","v":2370},2293,{"$f":"IFERROR(IF(C23=\"\",\"\",IF($AO$16=$AO$17,0,IF($C23=\"TOTAL\",SUM($S$8:S22),IF($AO$19=$AO$31,0,IF(AND($AO$32=$AO$20,C23=$AO$33),$AO$34,S22))))),\"\")","v":0},{"$f":"IFERROR(IF(C23=\"\",\"\",IF($AO$16=$AO$17,0,IF($C23=\"TOTAL\",SUM($T$8:T22),IF($AO$19=$AO$20,$AO$24,0)))),\"\")","v":0},0,{"$f":"IF(C23=\"\",\"\",IF($C23=\"TOTAL\",SUM($V$8:V22),IF(AND($AO$2=$AO$20,C23=$AO$1),ROUND(D23/31*$AP$2,0),IF(C23=$AM$6,ROUND((G23)*1/30,0),IF(C23=$AN$6,ROUND((G23)*1/31,0),\"\")))))","v":""},{"$f":"IF(C23=\"\",\"\",IF($C23=\"TOTAL\",SUM($W$8:W22),IF(AND($AO$2=$AO$20,C23=$AO$1),ROUND(H23/31*$AP$2,0),IF(C23=$AM$6,ROUND((K23)*1/30,0),IF(C23=$AN$6,ROUND((K23)*1/31,0),\"\")))))","v":""},"",{"$f":"IFERROR(IF(C23=\"\",\"\",IF(AND(BH24=\"\",BO24=\"\"),\"\",IF($C23=\"TOTAL\",SUM($Y$8:Y22),BH24))),\"\")","v":""},{"$f":"IFERROR(IF(C23=\"\",\"\",IF($C23=\"TOTAL\",SUM($Z$8:Z22),ROUND(O23*$AO$7%,0))),\"\")","v":0},{"$f":"IFERROR(IF(C23=\"\",\"\",IF($C23=\"TOTAL\",SUM($AA$8:AA22),IF($AC$3=$AL$2,SUM(U23,X23,Y23,Z23),SUM(R23,U23,X23,Y23,Z23)))),\"\")","v":0},{"$f":"IFERROR(IF(C23=\"\",\"\",IF($C23=\"TOTAL\",SUM($AB$8:AB22),SUM(O23-AA23))),\"\")","v":26064},{"$nulls":8},31,31,"2017-08-01","2018-03-01",null,"2021-12-01","2021-12-01","","2021-12-01","2021-12-01",34800,10788,3132,null,23700,0,0,0,null,null,25020,3675,"","",0,0,{"$nulls":4},""]
[17,17,"2022-02-01",{"$f":"IFERROR(IF($C23=\"TOTAL\",\"अक्षरें राशि :-\",IF($C24=\"TOTAL\",SUM($D$8:D23),IF(AU25=\"\",\"\",AU25))),\"\")","v":34800},{"$f":"IFERROR(IF($C24=\"TOTAL\",SUM($E$8:E23),IF(AV25=\"\",\"\",AV25)),\"\")","v":11832},{"$f":"IFERROR(IF($C24=\"TOTAL\",SUM($F$8:F23),IF(OR(C24=$AM$16,C24=$AM$17,C24=$AM$18,C24=$AM$19,C24=$AM$20,C24=$AM$21,C24=$AM$22,C24=$AM$23,C24=$AM$24),0,IF(AW25=\"\",\"\",AW25))),\"\")","v":3132},49764,{"$f":"IFERROR(IF($C24=\"TOTAL\",SUM($H$8:H23),IF(AY25=\"\",\"\",AY25)),\"\")","v":23700},{"$f":"IFERROR(IF($C24=\"TOTAL\",SUM($I$8:I23),IF(AZ25=\"\",\"\",AZ25)),\"\")","v":0},{"$f":"IFERROR(IF($C24=\"TOTAL\",SUM($J$8:J23),IF(OR(C24=$AM$16,C24=$AM$17,C24=$AM$18,C24=$AM$19,C24=$AM$20,C24=$AM$21,C24=$AM$22,C24=$AM$23,C24=$AM$24),0,IF(BA25=\"\",\"\",BA25))),\"\")","v":0},23700,{"$f":"IFERROR(IF(C24=\"\",\"\",IF(D24=\"\",\"\",IF(H24=\"\",\"\",IF($C24=\"TOTAL\",SUM($L$8:L23),SUM(D24-H24))))),\"\")","v":11100},{"$f":"IFERROR(IF(C24=\"\",\"\",IF(E24=\"\",\"\",IF(I24=\"\",\"\",IF($C24=\"TOTAL\",SUM($M$8:M23),SUM(E24-I24))))),\"\")","v":11832},{"$f":"IFERROR(IF(C24=\"\",\"\",IF(F24=\"\",\"\",IF(J24=\"\",\"\",IF($C24=\"TOTAL\",SUM($N$8:N23),SUM(F24-J24))))),\"\")","v":3132},26064,{"$f":"IFERROR(IF(C24=\"\",\"\",IF($C24=\"TOTAL\",SUM($P$8:P23),IF(AND(C24>$AL$1,$AC$3=$AL$2),BO25,IF($AO$18=$AO$20,SUM(BB25+BJ25),ROUND((D24+E24)*10%,0))))),\"\")","v":4663},{"$f":"IFERROR(IF(C24=\"\",\"\",IF(H24=\"\",\"\",IF(I24=\"\",\"\",IF($C24=\"TOTAL\",SUM($Q$8:Q23),IF(AND(C24>$AL$1,$AC$3=$AL$2),BO25,IF($AO$18=$AO$20,$AO$21,ROUND((H24+I24)*10%,0))))))),\"\")","v":2370},2293,{"$f":"IFERROR(IF(C24=\"\",\"\",IF($AO$16=$AO$17,0,IF($C24=\"TOTAL\",SUM($S$8:S23),IF($AO$19=$AO$31,0,IF(AND($AO$32=$AO$20,C24=$AO$33),$AO$34,S23))))),\"\")","v":0},{"$f":"IFERROR(IF(C24=\"\",\"\",IF($AO$16=$AO$17,0,IF($C24=\"TOTAL\",SUM($T$8:T23),IF($AO$19=$AO$20,$AO$24,0)))),\"\")","v":0},0,{"$f":"IF(C24=\"\",\"\",IF($C24=\"TOTAL\",SUM($V$8:V23),IF(AND($AO$2=$AO$20,C24=$AO$1),ROUND(D24/31*$AP$2,0),IF(C24=$AM$6,ROUND((G24)*1/30,0),IF(C24=$AN$6,ROUND((G24)*1/31,0),\"\")))))","v":""},{"$f":"IF(C24=\"\",\"\",IF($C24=\"TOTAL\",SUM($W$8:W23),IF(AND($AO$2=$AO$20,C24=$AO$1),ROUND(H24/31*$AP$2,0),IF(C24=$AM$6,ROUND((K24)*1/30,0),IF(C24=$AN$6,ROUND((K24)*1/31,0),\"\")))))","v":""},"",{"$f":"IFERROR(IF(C24=\"\",\"\",IF(AND(BH25=\"\",BO25=\"\"),\"\",IF($C24=\"TOTAL\",SUM($Y$8:Y23),BH25))),\"\")","v":""},{"$f":"IFERROR(IF(C24=\"\",\"\",IF($C24=\"TOTAL\",SUM($Z$8:Z23),ROUND(O24*$AO$7%,0))),\"\")","v":0},{"$f":"IFERROR(IF(C24=\"\",\"\",IF($C24=\"TOTAL\",SUM($AA$8:AA23),IF($AC$3=$AL$2,SUM(U24,X24,Y24,Z24),SUM(R24,U24,X24,Y24,Z24)))),\"\")","v":0},{"$f":"IFERROR(IF(C24=\"\",\"\",IF($C24=\"TOTAL\",SUM($AB$8:AB23),SUM(O24-AA24))),\"\")","v":26064},{"$nulls":8},34,34,"2017-09-01","2018-04-01",{"$f":"'Master Sheet'!G17","v":2100},"2022-01-01","2022-01-01","","2022-01-01","2022-01-01",34800,11832,3132,null,23700,0,0,0,null,null,26064,3675,"","",0,0,{"$nulls":4},""]
[{"$f":"IF(C25=\"TOTAL\",\"\",IF(B24=\"\",\"\",IF(LEN(C25)>=2,B24+1,0)))","v":18},18,"2022-03-01",{"$f":"IFERROR(IF($C24=\"TOTAL\",\"अक्षरें राशि :-\",IF($C25=\"TOTAL\",SUM($D$8:D24),IF(AU26=\"\",\"\",AU26))),\"\")","v":34800},{"$f":"IFERROR(IF($C25=\"TOTAL\",SUM($E$8:E24),IF(AV26=\"\",\"\",AV26)),\"\")","v":11832},{"$f":"IFERROR(IF($C25=\"TOTAL\",SUM($F$8:F24),IF(OR(C25=$AM$16,C25=$AM$17,C25=$AM$18,C25=$AM$19,C25=$AM$20,C25=$AM$21,C25=$AM$22,C25=$AM$23,C25=$AM$24),0,IF(AW26=\"\",\"\",AW26))),\"\")","v":3132},49764,{"$f":"IFERROR(IF($C25=\"TOTAL\",SUM($H$8:H24),IF(AY26=\"\",\"\",AY26)),\"\")","v":23700},{"$f":"IFERROR(IF($C25=\"TOTAL\",SUM($I$8:I24),IF(AZ26=\"\",\"\",AZ26)),\"\")","v":0},{"$f":"IFERROR(IF($C25=\"TOTAL\",SUM($J$8:J24),IF(OR(C25=$AM$16,C25=$AM$17,C25=$AM$18,C25=$AM$19,C25=$AM$20,C25=$AM$21,C25=$AM$22,C25=$AM$23,C25=$AM$24),0,IF(BA26=\"\",\"\",BA26))),\"\")","v":0},23700,{"$f":"IFERROR(IF(C25=\"\",\"\",IF(D25=\"\",\"\",IF(H25=\"\",\"\",IF($C25=\"TOTAL\",SUM($L$8:L24),SUM(D25-H25))))),\"\")","v":11100},{"$f":"IFERROR(IF(C25=\"\",\"\",IF(E25=\"\",\"\",IF(I25=\"\",\"\",IF($C25=\"TOTAL\",SUM($M$8:M24),SUM(E25-I25))))),\"\")","v":11832},{"$f":"IFERROR(IF(C25=\"\",\"\",IF(F25=\"\",\"\",IF(J25=\"\",\"\",IF($C25=\"TOTAL\",SUM($N$8:N24),SUM(F25-J25))))),\"\")","v":3132},26064,{"$f":"IFERROR(IF(C25=\"\",\"\",IF($C25=\"TOTAL\",SUM($P$8:P24),IF(AND(C25>$AL$1,$AC$3=$AL$2),BO26,IF($AO$18=$AO$20,SUM(BB26+BJ26),ROUND((D25+E25)*10%,0))))),\"\")","v":4663},{"$f":"IFERROR(IF(C25=\"\",\"\",IF(H25=\"\",\"\",IF(I25=\"\",\"\",IF($C25=\"TOTAL\",SUM($Q$8:Q24),IF(AND(C25>$AL$1,$AC$3=$AL$2),BO26,IF($AO$18=$AO$20,$AO$21,ROUND((H25+I25)*10%,0))))))),\"\")","v":2370},2293,{"$f":"IFERROR(IF(C25=\"\",\"\",IF($AO$16=$AO$17,0,IF($C25=\"TOTAL\",SUM($S$8:S24),IF($AO$19=$AO$31,0,IF(AND($AO$32=$AO$20,C25=$AO$33),$AO$34,S24))))),\"\")","v":0},{"$f":"IFERROR(IF(C25=\"\",\"\",IF($AO$16=$AO$17,0,IF($C25=\"TOTAL\",SUM($T$8:T24),IF($AO$19=$AO$20,$AO$24,0)))),\"\")","v":0},0,{"$f":"IF(C25=\"\",\"\",IF($C25=\"TOTAL\",SUM($V$8:V24),IF(AND($AO$2=$AO$20,C25=$AO$1),ROUND(D25/31*$AP$2,0),IF(C25=$AM$6,ROUND((G25)*1/30,0),IF(C25=$AN$6,ROUND((G25)*1/31,0),\"\")))))","v":""},{"$f":"IF(C25=\"\",\"\",IF($C25=\"TOTAL\",SUM($W$8:W24),IF(AND($AO$2=$AO$20,C25=$AO$1),ROUND(H25/31*$AP$2,0),IF(C25=$AM$6,ROUND((K25)*1/30,0),IF(C25=$AN$6,ROUND((K25)*1/31,0),\"\")))))","v":""},"",{"$f":"IFERROR(IF(C25=\"\",\"\",IF(AND(BH26=\"\",BO26=\"\"),\"\",IF($C25=\"TOTAL\",SUM($Y$8:Y24),BH26))),\"\")","v":""},{"$f":"IFERROR(IF(C25=\"\",\"\",IF($C25=\"TOTAL\",SUM($Z$8:Z24),ROUND(O25*$AO$7%,0))),\"\")","v":0},{"$f":"IFERROR(IF(C25=\"\",\"\",IF($C25=\"TOTAL\",SUM($AA$8:AA24),IF($AC$3=$AL$2,SUM(U25,X25,Y25,Z25),SUM(R25,U25,X25,Y25,Z25)))),\"\")","v":0},{"$f":"IFERROR(IF(C25=\"\",\"\",IF($C25=\"TOTAL\",SUM($AB$8:AB24),SUM(O25-AA25))),\"\")","v":26064},{"$nulls":8},34,34,null,"2018-05-01",{"$f":"'Master Sheet'!K17","v":2100},"2022-02-01","2022-02-01","","2022-02-01","2022-02-01",34800,11832,3132,null,23700,0,0,0,null,null,26064,3675,"","",0,0,{"$nulls":4},""]
[{"$f":"IF(C26=\"TOTAL\",\"\",IF(B25=\"\",\"\",IF(LEN(C26)>=2,B25+1,0)))","v":19},19,"2022-04-01",{"$f":"IFERROR(IF($C25=\"TOTAL\",\"अक्षरें राशि :-\",IF($C26=\"TOTAL\",SUM($D$8:D25),IF(AU27=\"\",\"\",AU27))),\"\")","v":34800},{"$f":"IFERROR(IF($C26=\"TOTAL\",SUM($E$8:E25),IF(AV27=\"\",\"\",AV27)),\"\")","v":11832},{"$f":"IFERROR(IF($C26=\"TOTAL\",SUM($F$8:F25),IF(OR(C26=$AM$16,C26=$AM$17,C26=$AM$18,C26=$AM$19,C26=$AM$20,C26=$AM$21,C26=$AM$22,C26=$AM$23,C26=$AM$24),0,IF(AW27=\"\",\"\",AW27))),\"\")","v":3132},49764,{"$f":"IFERROR(IF($C26=\"TOTAL\",SUM($H$8:H25),IF(AY27=\"\",\"\",AY27)),\"\")","v":23700},{"$f":"IFERROR(IF($C26=\"TOTAL\",SUM($I$8:I25),IF(AZ27=\"\",\"\",AZ27)),\"\")","v":0},{"$f":"IFERROR(IF($C26=\"TOTAL\",SUM($J$8:J25),IF(OR(C26=$AM$16,C26=$AM$17,C26=$AM$18,C26=$AM$19,C26=$AM$20,C26=$AM$21,C26=$AM$22,C26=$AM$23,C26=$AM$24),0,IF(BA27=\"\",\"\",BA27))),\"\")","v":0},23700,{"$f":"IFERROR(IF(C26=\"\",\"\",IF(D26=\"\",\"\",IF(H26=\"\",\"\",IF($C26=\"TOTAL\",SUM($L$8:L25),SUM(D26-H26))))),\"\")","v":11100},{"$f":"IFERROR(IF(C26=\"\",\"\",IF(E26=\"\",\"\",IF(I26=\"\",\"\",IF($C26=\"TOTAL\",SUM($M$8:M25),SUM(E26-I26))))),\"\")","v":11832},{"$f":"IFERROR(IF(C26=\"\",\"\",IF(F26=\"\",\"\",IF(J26=\"\",\"\",IF($C26=\"TOTAL\",SUM($N$8:N25),SUM(F26-J26))))),\"\")","v":3132},26064,{"$f":"IFERROR(IF(C26=\"\",\"\",IF($C26=\"TOTAL\",SUM($P$8:P25),IF(AND(C26>$AL$1,$AC$3=$AL$2),BO27,IF($AO$18=$AO$20,SUM(BB27+BJ27),ROUND((D26+E26)*10%,0))))),\"\")","v":2100},{"$f":"IFERROR(IF(C26=\"\",\"\",IF(H26=\"\",\"\",IF(I26=\"\",\"\",IF($C26=\"TOTAL\",SUM($Q$8:Q25),IF(AND(C26>$AL$1,$AC$3=$AL$2),BO27,IF($AO$18=$AO$20,$AO$21,ROUND((H26+I26)*10%,0))))))),\"\")","v":2100},0,{"$f":"IFERROR(IF(C26=\"\",\"\",IF($AO$16=$AO$17,0,IF($C26=\"TOTAL\",SUM($S$8:S25),IF($AO$19=$AO$31,0,IF(AND($AO$32=$AO$20,C26=$AO$33),$AO$34,S25))))),\"\")","v":0},{"$f":"IFERROR(IF(C26=\"\",\"\",IF($AO$16=$AO$17,0,IF($C26=\"TOTAL\",SUM($T$8:T25),IF($AO$19=$AO$20,$AO$24,0)))),\"\")","v":0},0,{"$f":"IF(C26=\"\",\"\",IF($C26=\"TOTAL\",SUM($V$8:V25),IF(AND($AO$2=$AO$20,C26=$AO$1),ROUND(D26/31*$AP$2,0),IF(C26=$AM$6,ROUND((G26)*1/30,0),IF(C26=$AN$6,ROUND((G26)*1/31,0),\"\")))))","v":""},{"$f":"IF(C26=\"\",\"\",IF($C26=\"TOTAL\",SUM($W$8:W25),IF(AND($AO$2=$AO$20,C26=$AO$1),ROUND(H26/31*$AP$2,0),IF(C26=$AM$6,ROUND((K26)*1/30,0),IF(C26=$AN$6,ROUND((K26)*1/31,0),\"\")))))","v":""},"",{"$f":"IFERROR(IF(C26=\"\",\"\",IF(AND(BH27=\"\",BO27=\"\"),\"\",IF($C26=\"TOTAL\",SUM($Y$8:Y25),BH27))),\"\")","v":""},{"$f":"IFERROR(IF(C26=\"\",\"\",IF($C26=\"TOTAL\",SUM($Z$8:Z25),ROUND(O26*$AO$7%,0))),\"\")","v":0},{"$f":"IFERROR(IF(C26=\"\",\"\",IF($C26=\"TOTAL\",SUM($AA$8:AA25),IF($AC$3=$AL$2,SUM(U26,X26,Y26,Z26),SUM(R26,U26,X26,Y26,Z26)))),\"\")","v":0},{"$f":"IFERROR(IF(C26=\"\",\"\",IF($C26=\"TOTAL\",SUM($AB$8:AB25),SUM(O26-AA26))),\"\")","v":26064},{"$nulls":8},34,34,null,"2018-06-01",{"$f":"'Master Sheet'!G15","v":"NO"},"2022-03-01","2022-03-01",{"$f":"IF(AND(AP26=\"\"),\"\",IF(AND(AP26=$AN$72),$AP$72,IF(AND(AP26=$AN$73),$AN$73,IF(AND(AP26=$AN$74),$AN$74,IF(AND(AP26=$AN$75),$AN$75,IF(AND(AP26=$AN$76),$AN$76,IF(AND(AP26=$AN$77),$AN$77,IF(AND(AP26=$AN$78),$AN$78,IF(AND(AP26=$AN$79),$AN$79,IF(AND(AP26=$AN$80),$AN$80,IF(AND(AP26=$AN$81),$AN$81,IF(AND(AP26=$AN$82),$AN$82,IF(AND(AP26=$AN$83),$AN$83,IF(AND(AP26=$AN$84),$AN$84,IF(AND(AP26=$AN$85),$AN$85,IF(AND(AP26=$AN$86),$AN$86,IF(AND(AP26=$AN$87),$AN$87,IF(AND(AP26=$AN$88),$AN$88,IF(AND(AP26=$AN$89),$AN$89,IF(AND(AP26=$AN$90),$AN$90,IF(AND(AP26=$AN$91),$AN$91,\"\")))))))))))))))))))))","v":""},"2022-03-01",{"$f":"IFERROR(IF(AS26=\"\",\"\",IF(DATE(YEAR(AS26),MONTH(AS26),DAY(AS26))=DATE(YEAR($AP$6),MONTH($AP$6)+1,DAY($AP$6)),\"TOTAL\",IF(AS26>$AP$6,\"\",AS26))),\"\")","v":"2022-03-01"},34800,11832,3132,null,23700,0,0,0,null,null,26064,3675,"","",0,0,{"$nulls":4},""]
[20,20,"2022-05-01",{"$f":"IFERROR(IF($C26=\"TOTAL\",\"अक्षरें राशि :-\",IF($C27=\"TOTAL\",SUM($D$8:D26),IF(AU28=\"\",\"\",AU28))),\"\")","v":34800},{"$f":"IFERROR(IF($C27=\"TOTAL\",SUM($E$8:E26),IF(AV28=\"\",\"\",AV28)),\"\")","v":11832},{"$f":"IFERROR(IF($C27=\"TOTAL\",SUM($F$8:F26),IF(OR(C27=$AM$16,C27=$AM$17,C27=$AM$18,C27=$AM$19,C27=$AM$20,C27=$AM$21,C27=$AM$22,C27=$AM$23,C27=$AM$24),0,IF(AW28=\"\",\"\",AW28))),\"\")","v":3132},49764,{"$f":"IFERROR(IF($C27=\"TOTAL\",SUM($H$8:H26),IF(AY28=\"\",\"\",AY28)),\"\")","v":23700},{"$f":"IFERROR(IF($C27=\"TOTAL\",SUM($I$8:I26),IF(AZ28=\"\",\"\",AZ28)),\"\")","v":0},{"$f":"IFERROR(IF($C27=\"TOTAL\",SUM($J$8:J26),IF(OR(C27=$AM$16,C27=$AM$17,C27=$AM$18,C27=$AM$19,C27=$AM$20,C27=$AM$21,C27=$AM$22,C27=$AM$23,C27=$AM$24),0,IF(BA28=\"\",\"\",BA28))),\"\")","v":0},23700,{"$f":"IFERROR(IF(C27=\"\",\"\",IF(D27=\"\",\"\",IF(H27=\"\",\"\",IF($C27=\"TOTAL\",SUM($L$8:L26),SUM(D27-H27))))),\"\")","v":11100},{"$f":"IFERROR(IF(C27=\"\",\"\",IF(E27=\"\",\"\",IF(I27=\"\",\"\",IF($C27=\"TOTAL\",SUM($M$8:M26),SUM(E27-I27))))),\"\")","v":11832},{"$f":"IFERROR(IF(C27=\"\",\"\",IF(F27=\"\",\"\",IF(J27=\"\",\"\",IF($C27=\"TOTAL\",SUM($N$8:N26),SUM(F27-J27))))),\"\")","v":3132},26064,{"$f":"IFERROR(IF(C27=\"\",\"\",IF($C27=\"TOTAL\",SUM($P$8:P26),IF(AND(C27>$AL$1,$AC$3=$AL$2),BO28,IF($AO$18=$AO$20,SUM(BB28+BJ28),ROUND((D27+E27)*10%,0))))),\"\")","v":2100},{"$f":"IFERROR(IF(C27=\"\",\"\",IF(H27=\"\",\"\",IF(I27=\"\",\"\",IF($C27=\"TOTAL\",SUM($Q$8:Q26),IF(AND(C27>$AL$1,$AC$3=$AL$2),BO28,IF($AO$18=$AO$20,$AO$21,ROUND((H27+I27)*10%,0))))))),\"\")","v":2100},0,{"$f":"IFERROR(IF(C27=\"\",\"\",IF($AO$16=$AO$17,0,IF($C27=\"TOTAL\",SUM($S$8:S26),IF($AO$19=$AO$31,0,IF(AND($AO$32=$AO$20,C27=$AO$33),$AO$34,S26))))),\"\")","v":0},{"$f":"IFERROR(IF(C27=\"\",\"\",IF($AO$16=$AO$17,0,IF($C27=\"TOTAL\",SUM($T$8:T26),IF($AO$19=$AO$20,$AO$24,0)))),\"\")","v":0},0,{"$f":"IF(C27=\"\",\"\",IF($C27=\"TOTAL\",SUM($V$8:V26),IF(AND($AO$2=$AO$20,C27=$AO$1),ROUND(D27/31*$AP$2,0),IF(C27=$AM$6,ROUND((G27)*1/30,0),IF(C27=$AN$6,ROUND((G27)*1/31,0),\"\")))))","v":""},{"$f":"IF(C27=\"\",\"\",IF($C27=\"TOTAL\",SUM($W$8:W26),IF(AND($AO$2=$AO$20,C27=$AO$1),ROUND(H27/31*$AP$2,0),IF(C27=$AM$6,ROUND((K27)*1/30,0),IF(C27=$AN$6,ROUND((K27)*1/31,0),\"\")))))","v":""},"",{"$f":"IFERROR(IF(C27=\"\",\"\",IF(AND(BH28=\"\",BO28=\"\"),\"\",IF($C27=\"TOTAL\",SUM($Y$8:Y26),BH28))),\"\")","v":""},{"$f":"IFERROR(IF(C27=\"\",\"\",IF($C27=\"TOTAL\",SUM($Z$8:Z26),ROUND(O27*$AO$7%,0))),\"\")","v":0},{"$f":"IFERROR(IF(C27=\"\",\"\",IF($C27=\"TOTAL\",SUM($AA$8:AA26),IF($AC$3=$AL$2,SUM(U27,X27,Y27,Z27),SUM(R27,U27,X27,Y27,Z27)))),\"\")","v":0},{"$f":"IFERROR(IF(C27=\"\",\"\",IF($C27=\"TOTAL\",SUM($AB$8:AB26),SUM(O27-AA27))),\"\")","v":26064},{"$nulls":8},34,34,null,"2018-07-01",{"$f":"'Master Sheet'!K15","v":30500},"2022-04-01","",{"$f":"IF(AND(AP27=\"\"),\"\",IF(AND(AP27=$AN$72),$AN$72,IF(AND(AP27=$AN$73),$AN$73,IF(AND(AP27=$AN$74),$AN$74,IF(AND(AP27=$AN$75),$AN$75,IF(AND(AP27=$AN$76),$AN$76,IF(AND(AP27=$AN$77),$AN$77,IF(AND(AP27=$AN$78),$AN$78,IF(AND(AP27=$AN$79),$AN$79,IF(AND(AP27=$AN$80),$AN$80,IF(AND(AP27=$AN$81),$AN$81,IF(AND(AP27=$AN$82),$AN$82,IF(AND(AP27=$AN$83),$AN$83,IF(AND(AP27=$AN$84),$AN$84,IF(AND(AP27=$AN$85),$AN$85,IF(AND(AP27=$AN$86),$AN$86,IF(AND(AP27=$AN$87),$AN$87,IF(AND(AP27=$AN$88),$AN$88,IF(AND(AP27=$AN$89),$AN$89,IF(AND(AP27=$AN$90),$AN$90,IF(AND(AP27=$AN$91),$AN$91,\"\")))))))))))))))))))))","v":"2022-04-01"},"2022-04-01","2022-04-01",34800,11832,3132,null,23700,0,0,0,null,null,26064,3675,"","",0,0,{"$nulls":4},2100]
[21,21,"2022-06-01",{"$f":"IFERROR(IF($C27=\"TOTAL\",\"अक्षरें राशि :-\",IF($C28=\"TOTAL\",SUM($D$8:D27),IF(AU29=\"\",\"\",AU29))),\"\")","v":34800},{"$f":"IFERROR(IF($C28=\"TOTAL\",SUM($E$8:E27),IF(AV29=\"\",\"\",AV29)),\"\")","v":11832},{"$f":"IFERROR(IF($C28=\"TOTAL\",SUM($F$8:F27),IF(OR(C28=$AM$16,C28=$AM$17,C28=$AM$18,C28=$AM$19,C28=$AM$20,C28=$AM$21,C28=$AM$22,C28=$AM$23,C28=$AM$24),0,IF(AW29=\"\",\"\",AW29))),\"\")","v":3132},49764,{"$f":"IFERROR(IF($C28=\"TOTAL\",SUM($H$8:H27),IF(AY29=\"\",\"\",AY29)),\"\")","v":23700},{"$f":"IFERROR(IF($C28=\"TOTAL\",SUM($I$8:I27),IF(AZ29=\"\",\"\",AZ29)),\"\")","v":0},{"$f":"IFERROR(IF($C28=\"TOTAL\",SUM($J$8:J27),IF(OR(C28=$AM$16,C28=$AM$17,C28=$AM$18,C28=$AM$19,C28=$AM$20,C28=$AM$21,C28=$AM$22,C28=$AM$23,C28=$AM$24),0,IF(BA29=\"\",\"\",BA29))),\"\")","v":0},23700,{"$f":"IFERROR(IF(C28=\"\",\"\",IF(D28=\"\",\"\",IF(H28=\"\",\"\",IF($C28=\"TOTAL\",SUM($L$8:L27),SUM(D28-H28))))),\"\")","v":11100},{"$f":"IFERROR(IF(C28=\"\",\"\",IF(E28=\"\",\"\",IF(I28=\"\",\"\",IF($C28=\"TOTAL\",SUM($M$8:M27),SUM(E28-I28))))),\"\")","v":11832},{"$f":"IFERROR(IF(C28=\"\",\"\",IF(F28=\"\",\"\",IF(J28=\"\",\"\",IF($C28=\"TOTAL\",SUM($N$8:N27),SUM(F28-J28))))),\"\")","v":3132},26064,{"$f":"IFERROR(IF(C28=\"\",\"\",IF($C28=\"TOTAL\",SUM($P$8:P27),IF(AND(C28>$AL$1,$AC$3=$AL$2),BO29,IF($AO$18=$AO$20,SUM(BB29+BJ29),ROUND((D28+E28)*10%,0))))),\"\")","v":2100},{"$f":"IFERROR(IF(C28=\"\",\"\",IF(H28=\"\",\"\",IF(I28=\"\",\"\",IF($C28=\"TOTAL\",SUM($Q$8:Q27),IF(AND(C28>$AL$1,$AC$3=$AL$2),BO29,IF($AO$18=$AO$20,$AO$21,ROUND((H28+I28)*10%,0))))))),\"\")","v":2100},0,{"$f":"IFERROR(IF(C28=\"\",\"\",IF($AO$16=$AO$17,0,IF($C28=\"TOTAL\",SUM($S$8:S27),IF($AO$19=$AO$31,0,IF(AND($AO$32=$AO$20,C28=$AO$33),$AO$34,S27))))),\"\")","v":0},{"$f":"IFERROR(IF(C28=\"\",\"\",IF($AO$16=$AO$17,0,IF($C28=\"TOTAL\",SUM($T$8:T27),IF($AO$19=$AO$20,$AO$24,0)))),\"\")","v":0},0,{"$f":"IF(C28=\"\",\"\",IF($C28=\"TOTAL\",SUM($V$8:V27),IF(AND($AO$2=$AO$20,C28=$AO$1),ROUND(D28/31*$AP$2,0),IF(C28=$AM$6,ROUND((G28)*1/30,0),IF(C28=$AN$6,ROUND((G28)*1/31,0),\"\")))))","v":""},{"$f":"IF(C28=\"\",\"\",IF($C28=\"TOTAL\",SUM($W$8:W27),IF(AND($AO$2=$AO$20,C28=$AO$1),ROUND(H28/31*$AP$2,0),IF(C28=$AM$6,ROUND((K28)*1/30,0),IF(C28=$AN$6,ROUND((K28)*1/31,0),\"\")))))","v":""},"",{"$f":"IFERROR(IF(C28=\"\",\"\",IF(AND(BH29=\"\",BO29=\"\"),\"\",IF($C28=\"TOTAL\",SUM($Y$8:Y27),BH29))),\"\")","v":""},{"$f":"IFERROR(IF(C28=\"\",\"\",IF($C28=\"TOTAL\",SUM($Z$8:Z27),ROUND(O28*$AO$7%,0))),\"\")","v":0},{"$f":"IFERROR(IF(C28=\"\",\"\",IF($C28=\"TOTAL\",SUM($AA$8:AA27),IF($AC$3=$AL$2,SUM(U28,X28,Y28,Z28),SUM(R28,U28,X28,Y28,Z28)))),\"\")","v":0},{"$f":"IFERROR(IF(C28=\"\",\"\",IF($C28=\"TOTAL\",SUM($AB$8:AB27),SUM(O28-AA28))),\"\")","v":26064},{"$nulls":8},34,34,null,"2018-08-01",{"$f":"'Master Sheet'!D25","v":"NO"},"2022-05-01","",{"$f":"IF(AND(AP28=\"\"),\"\",IF(AND(AP28=$AN$72),$AN$72,IF(AND(AP28=$AN$73),$AN$73,IF(AND(AP28=$AN$74),$AN$74,IF(AND(AP28=$AN$75),$AN$75,IF(AND(AP28=$AN$76),$AN$76,IF(AND(AP28=$AN$77),$AN$77,IF(AND(AP28=$AN$78),$AN$78,IF(AND(AP28=$AN$79),$AN$79,IF(AND(AP28=$AN$80),$AN$80,IF(AND(AP28=$AN$81),$AN$81,IF(AND(AP28=$AN$82),$AN$82,IF(AND(AP28=$AN$83),$AN$83,IF(AND(AP28=$AN$84),$AN$84,IF(AND(AP28=$AN$85),$AN$85,IF(AND(AP28=$AN$86),$AN$86,IF(AND(AP28=$AN$87),$AN$87,IF(AND(AP28=$AN$88),$AN$88,IF(AND(AP28=$AN$89),$AN$89,IF(AND(AP28=$AN$90),$AN$90,IF(AND(AP28=$AN$91),$AN$91,\"\")))))))))))))))))))))","v":"2022-05-01"},"2022-05-01","2022-05-01",34800,11832,3132,null,23700,0,0,0,null,null,26064,3675,"","",0,0,{"$nulls":4},2100]
["","","TOTAL",{"$f":"IFERROR(IF($C28=\"TOTAL\",\"अक्षरें राशि :-\",IF($C29=\"TOTAL\",SUM($D$8:D28),IF(AU30=\"\",\"\",AU30))),\"\")","v":717439},{"$f":"IFERROR(IF($C29=\"TOTAL\",SUM($E$8:E28),IF(AV30=\"\",\"\",AV30)),\"\")","v":186693},{"$f":"IFERROR(IF($C29=\"TOTAL\",SUM($F$8:F28),IF(OR(C29=$AM$16,C29=$AM$17,C29=$AM$18,C29=$AM$19,C29=$AM$20,C29=$AM$21,C29=$AM$22,C29=$AM$23,C29=$AM$24),0,IF(AW30=\"\",\"\",AW30))),\"\")","v":61571},965703,{"$f":"IFERROR(IF($C29=\"TOTAL\",SUM($H$8:H28),IF(AY30=\"\",\"\",AY30)),\"\")","v":494642},{"$f":"IFERROR(IF($C29=\"TOTAL\",SUM($I$8:I28),IF(AZ30=\"\",\"\",AZ30)),\"\")","v":0},{"$f":"IFERROR(IF($C29=\"TOTAL\",SUM($J$8:J28),IF(OR(C29=$AM$16,C29=$AM$17,C29=$AM$18,C29=$AM$19,C29=$AM$20,C29=$AM$21,C29=$AM$22,C29=$AM$23,C29=$AM$24),0,IF(BA30=\"\",\"\",BA30))),\"\")","v":0},494642,{"$f":"IFERROR(IF(C29=\"\",\"\",IF(D29=\"\",\"\",IF(H29=\"\",\"\",IF($C29=\"TOTAL\",SUM($L$8:L28),SUM(D29-H29))))),\"\")","v":222797},{"$f":"IFERROR(IF(C29=\"\",\"\",IF(E29=\"\",\"\",IF(I29=\"\",\"\",IF($C29=\"TOTAL\",SUM($M$8:M28),SUM(E29-I29))))),\"\")","v":186693},{"$f":"IFERROR(IF(C29=\"\",\"\",IF(F29=\"\",\"\",IF(J29=\"\",\"\",IF($C29=\"TOTAL\",SUM($N$8:N28),SUM(F29-J29))))),\"\")","v":61571},471061,{"$f":"IFERROR(IF(C29=\"\",\"\",IF($C29=\"TOTAL\",SUM($P$8:P28),IF(AND(C29>$AL$1,$AC$3=$AL$2),BO30,IF($AO$18=$AO$20,SUM(BB30+BJ30),ROUND((D29+E29)*10%,0))))),\"\")","v":82727},{"$f":"IFERROR(IF(C29=\"\",\"\",IF(H29=\"\",\"\",IF(I29=\"\",\"\",IF($C29=\"TOTAL\",SUM($Q$8:Q28),IF(AND(C29>$AL$1,$AC$3=$AL$2),BO30,IF($AO$18=$AO$20,$AO$21,ROUND((H29+I29)*10%,0))))))),\"\")","v":48654},34073,{"$f":"IFERROR(IF(C29=\"\",\"\",IF($AO$16=$AO$17,0,IF($C29=\"TOTAL\",SUM($S$8:S28),IF($AO$19=$AO$31,0,IF(AND($AO$32=$AO$20,C29=$AO$33),$AO$34,S28))))),\"\")","v":0},{"$f":"IFERROR(IF(C29=\"\",\"\",IF($AO$16=$AO$17,0,IF($C29=\"TOTAL\",SUM($T$8:T28),IF($AO$19=$AO$20,$AO$24,0)))),\"\")","v":0},0,{"$f":"IF(C29=\"\",\"\",IF($C29=\"TOTAL\",SUM($V$8:V28),IF(AND($AO$2=$AO$20,C29=$AO$1),ROUND(D29/31*$AP$2,0),IF(C29=$AM$6,ROUND((G29)*1/30,0),IF(C29=$AN$6,ROUND((G29)*1/31,0),\"\")))))","v":1187},{"$f":"IF(C29=\"\",\"\",IF($C29=\"TOTAL\",SUM($W$8:W28),IF(AND($AO$2=$AO$20,C29=$AO$1),ROUND(H29/31*$AP$2,0),IF(C29=$AM$6,ROUND((K29)*1/30,0),IF(C29=$AN$6,ROUND((K29)*1/31,0),\"\")))))","v":666},521,{"$f":"IFERROR(IF(C29=\"\",\"\",IF(AND(BH30=\"\",BO30=\"\"),\"\",IF($C29=\"TOTAL\",SUM($Y$8:Y28),BH30))),\"\")","v":3132},{"$f":"IFERROR(IF(C29=\"\",\"\",IF($C29=\"TOTAL\",SUM($Z$8:Z28),ROUND(O29*$AO$7%,0))),\"\")","v":0},{"$f":"IFERROR(IF(C29=\"\",\"\",IF($C29=\"TOTAL\",SUM($AA$8:AA28),IF($AC$3=$AL$2,SUM(U29,X29,Y29,Z29),SUM(R29,U29,X29,Y29,Z29)))),\"\")","v":3653},{"$f":"IFERROR(IF(C29=\"\",\"\",IF($C29=\"TOTAL\",SUM($AB$8:AB28),SUM(O29-AA29))),\"\")","v":467408},{"$nulls":8},34,34,null,"2018-09-01",{"$f":"'Master Sheet'!K25","v":41100},"2022-06-01","","2022-06-01","2022-06-01","2022-06-01",34800,11832,3132,null,23700,0,0,0,null,null,26064,3675,"","",0,0,{"$nulls":4},2100]
["","","",{"$f":"IFERROR(IF($C29=\"TOTAL\",\"अक्षरें राशि :-\",IF($C30=\"TOTAL\",SUM($D$8:D29),IF(AU31=\"\",\"\",AU31))),\"\")","v":"अक्षरें राशि :-"},{"$f":"IFERROR(IF($C30=\"TOTAL\",SUM($E$8:E29),IF(AV31=\"\",\"\",AV31)),\"\")","v":""},{"$f":"IFERROR(IF($C30=\"TOTAL\",SUM($F$8:F29),IF(OR(C30=$AM$16,C30=$AM$17,C30=$AM$18,C30=$AM$19,C30=$AM$20,C30=$AM$21,C30=$AM$22,C30=$AM$23,C30=$AM$24),0,IF(AW31=\"\",\"\",AW31))),\"\")","v":""},"",{"$f":"IFERROR(IF($C30=\"TOTAL\",SUM($H$8:H29),IF(AY31=\"\",\"\",AY31)),\"\")","v":""},{"$f":"IFERROR(IF($C30=\"TOTAL\",SUM($I$8:I29),IF(AZ31=\"\",\"\",AZ31)),\"\")","v":""},{"$f":"IFERROR(IF($C30=\"TOTAL\",SUM($J$8:J29),IF(OR(C30=$AM$16,C30=$AM$17,C30=$AM$18,C30=$AM$19,C30=$AM$20,C30=$AM$21,C30=$AM$22,C30=$AM$23,C30=$AM$24),0,IF(BA31=\"\",\"\",BA31))),\"\")","v":""},"",{"$f":"IFERROR(IF(C30=\"\",\"\",IF(D30=\"\",\"\",IF(H30=\"\",\"\",IF($C30=\"TOTAL\",SUM($L$8:L29),SUM(D30-H30))))),\"\")","v":""},{"$f":"IFERROR(IF(C30=\"\",\"\",IF(E30=\"\",\"\",IF(I30=\"\",\"\",IF($C30=\"TOTAL\",SUM($M$8:M29),SUM(E30-I30))))),\"\")","v":""},{"$f":"IFERROR(IF(C30=\"\",\"\",IF(F30=\"\",\"\",IF(J30=\"\",\"\",IF($C30=\"TOTAL\",SUM($N$8:N29),SUM(F30-J30))))),\"\")","v":""},"",{"$f":"IFERROR(IF(C30=\"\",\"\",IF($C30=\"TOTAL\",SUM($P$8:P29),IF(AND(C30>$AL$1,$AC$3=$AL$2),BO31,IF($AO$18=$AO$20,SUM(BB31+BJ31),ROUND((D30+E30)*10%,0))))),\"\")","v":""},{"$f":"IFERROR(IF(C30=\"\",\"\",IF(H30=\"\",\"\",IF(I30=\"\",\"\",IF($C30=\"TOTAL\",SUM($Q$8:Q29),IF(AND(C30>$AL$1,$AC$3=$AL$2),BO31,IF($AO$18=$AO$20,$AO$21,ROUND((H30+I30)*10%,0))))))),\"\")","v":""},"",{"$f":"IFERROR(IF(C30=\"\",\"\",IF($AO$16=$AO$17,0,IF($C30=\"TOTAL\",SUM($S$8:S29),IF($AO$19=$AO$31,0,IF(AND($AO$32=$AO$20,C30=$AO$33),$AO$34,S29))))),\"\")","v":""},{"$f":"IFERROR(IF(C30=\"\",\"\",IF($AO$16=$AO$17,0,IF($C30=\"TOTAL\",SUM($T$8:T29),IF($AO$19=$AO$20,$AO$24,0)))),\"\")","v":""},"",{"$f":"IF(C30=\"\",\"\",IF($C30=\"TOTAL\",SUM($V$8:V29),IF(AND($AO$2=$AO$20,C30=$AO$1),ROUND(D30/31*$AP$2,0),IF(C30=$AM$6,ROUND((G30)*1/30,0),IF(C30=$AN$6,ROUND((G30)*1/31,0),\"\")))))","v":""},{"$f":"IF(C30=\"\",\"\",IF($C30=\"TOTAL\",SUM($W$8:W29),IF(AND($AO$2=$AO$20,C30=$AO$1),ROUND(H30/31*$AP$2,0),IF(C30=$AM$6,ROUND((K30)*1/30,0),IF(C30=$AN$6,ROUND((K30)*1/31,0),\"\")))))","v":""},"",{"$f":"IFERROR(IF(C30=\"\",\"\",IF(AND(BH31=\"\",BO31=\"\"),\"\",IF($C30=\"TOTAL\",SUM($Y$8:Y29),BH31))),\"\")","v":""},{"$f":"IFERROR(IF(C30=\"\",\"\",IF($C30=\"TOTAL\",SUM($Z$8:Z29),ROUND(O30*$AO$7%,0))),\"\")","v":""},{"$f":"IFERROR(IF(C30=\"\",\"\",IF($C30=\"TOTAL\",SUM($AA$8:AA29),IF($AC$3=$AL$2,SUM(U30,X30,Y30,Z30),SUM(R30,U30,X30,Y30,Z30)))),\"\")","v":""},{"$f":"IFERROR(IF(C30=\"\",\"\",IF($C30=\"TOTAL\",SUM($AB$8:AB29),SUM(O30-AA30))),\"\")","v":""},{"$nulls":8},34,34,null,"2018-10-01",{"$f":"'Master Sheet'!G25","v":"2021-04-01"},"2022-07-01","","2022-07-01","2022-07-01","TOTAL",34800,"","",null,"","","","",null,null,"",3675,"","",0,0,{"$nulls":4},2100]
["","","",{"$f":"IFERROR(IF($C30=\"TOTAL\",\"अक्षरें राशि :-\",IF($C31=\"TOTAL\",SUM($D$8:D30),IF(AU32=\"\",\"\",AU32))),\"\")","v":""},{"$f":"IFERROR(IF($C31=\"TOTAL\",SUM($E$8:E30),IF(AV32=\"\",\"\",AV32)),\"\")","v":""},{"$f":"IFERROR(IF($C31=\"TOTAL\",SUM($F$8:F30),IF(OR(C31=$AM$16,C31=$AM$17,C31=$AM$18,C31=$AM$19,C31=$AM$20,C31=$AM$21,C31=$AM$22,C31=$AM$23,C31=$AM$24),0,IF(AW32=\"\",\"\",AW32))),\"\")","v":""},"",{"$f":"IFERROR(IF($C31=\"TOTAL\",SUM($H$8:H30),IF(AY32=\"\",\"\",AY32)),\"\")","v":""},{"$f":"IFERROR(IF($C31=\"TOTAL\",SUM($I$8:I30),IF(AZ32=\"\",\"\",AZ32)),\"\")","v":""},{"$f":"IFERROR(IF($C31=\"TOTAL\",SUM($J$8:J30),IF(OR(C31=$AM$16,C31=$AM$17,C31=$AM$18,C31=$AM$19,C31=$AM$20,C31=$AM$21,C31=$AM$22,C31=$AM$23,C31=$AM$24),0,IF(BA32=\"\",\"\",BA32))),\"\")","v":""},"",{"$f":"IFERROR(IF(C31=\"\",\"\",IF(D31=\"\",\"\",IF(H31=\"\",\"\",IF($C31=\"TOTAL\",SUM($L$8:L30),SUM(D31-H31))))),\"\")","v":""},{"$f":"IFERROR(IF(C31=\"\",\"\",IF(E31=\"\",\"\",IF(I31=\"\",\"\",IF($C31=\"TOTAL\",SUM($M$8:M30),SUM(E31-I31))))),\"\")","v":""},{"$f":"IFERROR(IF(C31=\"\",\"\",IF(F31=\"\",\"\",IF(J31=\"\",\"\",IF($C31=\"TOTAL\",SUM($N$8:N30),SUM(F31-J31))))),\"\")","v":""},"",{"$f":"IFERROR(IF(C31=\"\",\"\",IF($C31=\"TOTAL\",SUM($P$8:P30),IF(AND(C31>$AL$1,$AC$3=$AL$2),BO32,IF($AO$18=$AO$20,SUM(BB32+BJ32),ROUND((D31+E31)*10%,0))))),\"\")","v":""},{"$f":"IFERROR(IF(C31=\"\",\"\",IF(H31=\"\",\"\",IF(I31=\"\",\"\",IF($C31=\"TOTAL\",SUM($Q$8:Q30),IF(AND(C31>$AL$1,$AC$3=$AL$2),BO32,IF($AO$18=$AO$20,$AO$21,ROUND((H31+I31)*10%,0))))))),\"\")","v":""},"",{"$f":"IFERROR(IF(C31=\"\",\"\",IF($AO$16=$AO$17,0,IF($C31=\"TOTAL\",SUM($S$8:S30),IF($AO$19=$AO$31,0,IF(AND($AO$32=$AO$20,C31=$AO$33),$AO$34,S30))))),\"\")","v":""},{"$f":"IFERROR(IF(C31=\"\",\"\",IF($AO$16=$AO$17,0,IF($C31=\"TOTAL\",SUM($T$8:T30),IF($AO$19=$AO$20,$AO$24,0)))),\"\")","v":""},"",{"$f":"IF(C31=\"\",\"\",IF($C31=\"TOTAL\",SUM($V$8:V30),IF(AND($AO$2=$AO$20,C31=$AO$1),ROUND(D31/31*$AP$2,0),IF(C31=$AM$6,ROUND((G31)*1/30,0),IF(C31=$AN$6,ROUND((G31)*1/31,0),\"\")))))","v":""},{"$f":"IF(C31=\"\",\"\",IF($C31=\"TOTAL\",SUM($W$8:W30),IF(AND($AO$2=$AO$20,C31=$AO$1),ROUND(H31/31*$AP$2,0),IF(C31=$AM$6,ROUND((K31)*1/30,0),IF(C31=$AN$6,ROUND((K31)*1/31,0),\"\")))))","v":""},"",{"$f":"IFERROR(IF(C31=\"\",\"\",IF(AND(BH32=\"\",BO32=\"\"),\"\",IF($C31=\"TOTAL\",SUM($Y$8:Y30),BH32))),\"\")","v":""},{"$f":"IFERROR(IF(C31=\"\",\"\",IF($C31=\"TOTAL\",SUM($Z$8:Z30),ROUND(O31*$AO$7%,0))),\"\")","v":""},{"$f":"IFERROR(IF(C31=\"\",\"\",IF($C31=\"TOTAL\",SUM($AA$8:AA30),IF($AC$3=$AL$2,SUM(U31,X31,Y31,Z31),SUM(R31,U31,X31,Y31,Z31)))),\"\")","v":""},{"$f":"IFERROR(IF(C31=\"\",\"\",IF($C31=\"TOTAL\",SUM($AB$8:AB30),SUM(O31-AA31))),\"\")","v":""},{"$nulls":8},34,34,null,"2018-11-01","NO","2022-08-01","","2022-08-01","2022-08-01","","","","",null,"","","","",null,null,"","","","",0,0,{"$nulls":4},2100]
["","","",{"$f":"IFERROR(IF($C31=\"TOTAL\",\"अक्षरें राशि :-\",IF($C32=\"TOTAL\",SUM($D$8:D31),IF(AU33=\"\",\"\",AU33))),\"\")","v":""},{"$f":"IFERROR(IF($C32=\"TOTAL\",SUM($E$8:E31),IF(AV33=\"\",\"\",AV33)),\"\")","v":""},{"$f":"IFERROR(IF($C32=\"TOTAL\",SUM($F$8:F31),IF(OR(C32=$AM$16,C32=$AM$17,C32=$AM$18,C32=$AM$19,C32=$AM$20,C32=$AM$21,C32=$AM$22,C32=$AM$23,C32=$AM$24),0,IF(AW33=\"\",\"\",AW33))),\"\")","v":""},"",{"$f":"IFERROR(IF($C32=\"TOTAL\",SUM($H$8:H31),IF(AY33=\"\",\"\",AY33)),\"\")","v":""},{"$f":"IFERROR(IF($C32=\"TOTAL\",SUM($I$8:I31),IF(AZ33=\"\",\"\",AZ33)),\"\")","v":""},{"$f":"IFERROR(IF($C32=\"TOTAL\",SUM($J$8:J31),IF(OR(C32=$AM$16,C32=$AM$17,C32=$AM$18,C32=$AM$19,C32=$AM$20,C32=$AM$21,C32=$AM$22,C32=$AM$23,C32=$AM$24),0,IF(BA33=\"\",\"\",BA33))),\"\")","v":""},"",{"$f":"IFERROR(IF(C32=\"\",\"\",IF(D32=\"\",\"\",IF(H32=\"\",\"\",IF($C32=\"TOTAL\",SUM($L$8:L31),SUM(D32-H32))))),\"\")","v":""},{"$f":"IFERROR(IF(C32=\"\",\"\",IF(E32=\"\",\"\",IF(I32=\"\",\"\",IF($C32=\"TOTAL\",SUM($M$8:M31),SUM(E32-I32))))),\"\")","v":""},{"$f":"IFERROR(IF(C32=\"\",\"\",IF(F32=\"\",\"\",IF(J32=\"\",\"\",IF($C32=\"TOTAL\",SUM($N$8:N31),SUM(F32-J32))))),\"\")","v":""},"",{"$f":"IFERROR(IF(C32=\"\",\"\",IF($C32=\"TOTAL\",SUM($P$8:P31),IF(AND(C32>$AL$1,$AC$3=$AL$2),BO33,IF($AO$18=$AO$20,SUM(BB33+BJ33),ROUND((D32+E32)*10%,0))))),\"\")","v":""},{"$f":"IFERROR(IF(C32=\"\",\"\",IF(H32=\"\",\"\",IF(I32=\"\",\"\",IF($C32=\"TOTAL\",SUM($Q$8:Q31),IF(AND(C32>$AL$1,$AC$3=$AL$2),BO33,IF($AO$18=$AO$20,$AO$21,ROUND((H32+I32)*10%,0))))))),\"\")","v":""},"",{"$f":"IFERROR(IF(C32=\"\",\"\",IF($AO$16=$AO$17,0,IF($C32=\"TOTAL\",SUM($S$8:S31),IF($AO$19=$AO$31,0,IF(AND($AO$32=$AO$20,C32=$AO$33),$AO$34,S31))))),\"\")","v":""},{"$f":"IFERROR(IF(C32=\"\",\"\",IF($AO$16=$AO$17,0,IF($C32=\"TOTAL\",SUM($T$8:T31),IF($AO$19=$AO$20,$AO$24,0)))),\"\")","v":""},"",{"$f":"IF(C32=\"\",\"\",IF($C32=\"TOTAL\",SUM($V$8:V31),IF(AND($AO$2=$AO$20,C32=$AO$1),ROUND(D32/31*$AP$2,0),IF(C32=$AM$6,ROUND((G32)*1/30,0),IF(C32=$AN$6,ROUND((G32)*1/31,0),\"\")))))","v":""},{"$f":"IF(C32=\"\",\"\",IF($C32=\"TOTAL\",SUM($W$8:W31),IF(AND($AO$2=$AO$20,C32=$AO$1),ROUND(H32/31*$AP$2,0),IF(C32=$AM$6,ROUND((K32)*1/30,0),IF(C32=$AN$6,ROUND((K32)*1/31,0),\"\")))))","v":""},"",{"$f":"IFERROR(IF(C32=\"\",\"\",IF(AND(BH33=\"\",BO33=\"\"),\"\",IF($C32=\"TOTAL\",SUM($Y$8:Y31),BH33))),\"\")","v":""},{"$f":"IFERROR(IF(C32=\"\",\"\",IF($C32=\"TOTAL\",SUM($Z$8:Z31),ROUND(O32*$AO$7%,0))),\"\")","v":""},{"$f":"IFERROR(IF(C32=\"\",\"\",IF($C32=\"TOTAL\",SUM($AA$8:AA31),IF($AC$3=$AL$2,SUM(U32,X32,Y32,Z32),SUM(R32,U32,X32,Y32,Z32)))),\"\")","v":""},{"$f":"IFERROR(IF(C32=\"\",\"\",IF($C32=\"TOTAL\",SUM($AB$8:AB31),SUM(O32-AA32))),\"\")","v":""},{"$nulls":8},34,34,null,"2018-12-01",{"$f":"'Master Sheet'!D19","v":"NO"},"2022-09-01","","2022-09-01","2022-09-01","","","","",null,"","","","",null,null,"","","","",0,0,{"$nulls":4},2100]
["","","",{"$f":"IFERROR(IF($C32=\"TOTAL\",\"अक्षरें राशि :-\",IF($C33=\"TOTAL\",SUM($D$8:D32),IF(AU34=\"\",\"\",AU34))),\"\")","v":""},{"$f":"IFERROR(IF($C33=\"TOTAL\",SUM($E$8:E32),IF(AV34=\"\",\"\",AV34)),\"\")","v":""},{"$f":"IFERROR(IF($C33=\"TOTAL\",SUM($F$8:F32),IF(OR(C33=$AM$16,C33=$AM$17,C33=$AM$18,C33=$AM$19,C33=$AM$20,C33=$AM$21,C33=$AM$22,C33=$AM$23,C33=$AM$24),0,IF(AW34=\"\",\"\",AW34))),\"\")","v":""},"",{"$f":"IFERROR(IF($C33=\"TOTAL\",SUM($H$8:H32),IF(AY34=\"\",\"\",AY34)),\"\")","v":""},{"$f":"IFERROR(IF($C33=\"TOTAL\",SUM($I$8:I32),IF(AZ34=\"\",\"\",AZ34)),\"\")","v":""},{"$f":"IFERROR(IF($C33=\"TOTAL\",SUM($J$8:J32),IF(OR(C33=$AM$16,C33=$AM$17,C33=$AM$18,C33=$AM$19,C33=$AM$20,C33=$AM$21,C33=$AM$22,C33=$AM$23,C33=$AM$24),0,IF(BA34=\"\",\"\",BA34))),\"\")","v":""},"",{"$f":"IFERROR(IF(C33=\"\",\"\",IF(D33=\"\",\"\",IF(H33=\"\",\"\",IF($C33=\"TOTAL\",SUM($L$8:L32),SUM(D33-H33))))),\"\")","v":""},{"$f":"IFERROR(IF(C33=\"\",\"\",IF(E33=\"\",\"\",IF(I33=\"\",\"\",IF($C33=\"TOTAL\",SUM($M$8:M32),SUM(E33-I33))))),\"\")","v":""},{"$f":"IFERROR(IF(C33=\"\",\"\",IF(F33=\"\",\"\",IF(J33=\"\",\"\",IF($C33=\"TOTAL\",SUM($N$8:N32),SUM(F33-J33))))),\"\")","v":""},"",{"$f":"IFERROR(IF(C33=\"\",\"\",IF($C33=\"TOTAL\",SUM($P$8:P32),IF(AND(C33>$AL$1,$AC$3=$AL$2),BO34,IF($AO$18=$AO$20,SUM(BB34+BJ34),ROUND((D33+E33)*10%,0))))),\"\")","v":""},{"$f":"IFERROR(IF(C33=\"\",\"\",IF(H33=\"\",\"\",IF(I33=\"\",\"\",IF($C33=\"TOTAL\",SUM($Q$8:Q32),IF(AND(C33>$AL$1,$AC$3=$AL$2),BO34,IF($AO$18=$AO$20,$AO$21,ROUND((H33+I33)*10%,0))))))),\"\")","v":""},"",{"$f":"IFERROR(IF(C33=\"\",\"\",IF($AO$16=$AO$17,0,IF($C33=\"TOTAL\",SUM($S$8:S32),IF($AO$19=$AO$31,0,IF(AND($AO$32=$AO$20,C33=$AO$33),$AO$34,S32))))),\"\")","v":""},{"$f":"IFERROR(IF(C33=\"\",\"\",IF($AO$16=$AO$17,0,IF($C33=\"TOTAL\",SUM($T$8:T32),IF($AO$19=$AO$20,$AO$24,0)))),\"\")","v":""},"",{"$f":"IF(C33=\"\",\"\",IF($C33=\"TOTAL\",SUM($V$8:V32),IF(AND($AO$2=$AO$20,C33=$AO$1),ROUND(D33/31*$AP$2,0),IF(C33=$AM$6,ROUND((G33)*1/30,0),IF(C33=$AN$6,ROUND((G33)*1/31,0),\"\")))))","v":""},{"$f":"IF(C33=\"\",\"\",IF($C33=\"TOTAL\",SUM($W$8:W32),IF(AND($AO$2=$AO$20,C33=$AO$1),ROUND(H33/31*$AP$2,0),IF(C33=$AM$6,ROUND((K33)*1/30,0),IF(C33=$AN$6,ROUND((K33)*1/31,0),\"\")))))","v":""},"",{"$f":"IFERROR(IF(C33=\"\",\"\",IF(AND(BH34=\"\",BO34=\"\"),\"\",IF($C33=\"TOTAL\",SUM($Y$8:Y32),BH34))),\"\")","v":""},{"$f":"IFERROR(IF(C33=\"\",\"\",IF($C33=\"TOTAL\",SUM($Z$8:Z32),ROUND(O33*$AO$7%,0))),\"\")","v":""},{"$f":"IFERROR(IF(C33=\"\",\"\",IF($C33=\"TOTAL\",SUM($AA$8:AA32),IF($AC$3=$AL$2,SUM(U33,X33,Y33,Z33),SUM(R33,U33,X33,Y33,Z33)))),\"\")","v":""},{"$f":"IFERROR(IF(C33=\"\",\"\",IF($C33=\"TOTAL\",SUM($AB$8:AB32),SUM(O33-AA33))),\"\")","v":""},{"$nulls":8},34,34,null,"2019-01-01",{"$f":"'Master Sheet'!G19","v":43525},"2022-10-01","","2022-10-01","2022-10-01","","","","",null,"","","","",null,null,"","","","",0,0,{"$nulls":4},2100]
["","","",{"$f":"IFERROR(IF($C33=\"TOTAL\",\"अक्षरें राशि :-\",IF($C34=\"TOTAL\",SUM($D$8:D33),IF(AU35=\"\",\"\",AU35))),\"\")","v":""},{"$f":"IFERROR(IF($C34=\"TOTAL\",SUM($E$8:E33),IF(AV35=\"\",\"\",AV35)),\"\")","v":""},{"$f":"IFERROR(IF($C34=\"TOTAL\",SUM($F$8:F33),IF(OR(C34=$AM$16,C34=$AM$17,C34=$AM$18,C34=$AM$19,C34=$AM$20,C34=$AM$21,C34=$AM$22,C34=$AM$23,C34=$AM$24),0,IF(AW35=\"\",\"\",AW35))),\"\")","v":""},"",{"$f":"IFERROR(IF($C34=\"TOTAL\",SUM($H$8:H33),IF(AY35=\"\",\"\",AY35)),\"\")","v":""},{"$f":"IFERROR(IF($C34=\"TOTAL\",SUM($I$8:I33),IF(AZ35=\"\",\"\",AZ35)),\"\")","v":""},{"$f":"IFERROR(IF($C34=\"TOTAL\",SUM($J$8:J33),IF(OR(C34=$AM$16,C34=$AM$17,C34=$AM$18,C34=$AM$19,C34=$AM$20,C34=$AM$21,C34=$AM$22,C34=$AM$23,C34=$AM$24),0,IF(BA35=\"\",\"\",BA35))),\"\")","v":""},"",{"$f":"IFERROR(IF(C34=\"\",\"\",IF(D34=\"\",\"\",IF(H34=\"\",\"\",IF($C34=\"TOTAL\",SUM($L$8:L33),SUM(D34-H34))))),\"\")","v":""},{"$f":"IFERROR(IF(C34=\"\",\"\",IF(E34=\"\",\"\",IF(I34=\"\",\"\",IF($C34=\"TOTAL\",SUM($M$8:M33),SUM(E34-I34))))),\"\")","v":""},{"$f":"IFERROR(IF(C34=\"\",\"\",IF(F34=\"\",\"\",IF(J34=\"\",\"\",IF($C34=\"TOTAL\",SUM($N$8:N33),SUM(F34-J34))))),\"\")","v":""},"",{"$f":"IFERROR(IF(C34=\"\",\"\",IF($C34=\"TOTAL\",SUM($P$8:P33),IF(AND(C34>$AL$1,$AC$3=$AL$2),BO35,IF($AO$18=$AO$20,SUM(BB35+BJ35),ROUND((D34+E34)*10%,0))))),\"\")","v":""},{"$f":"IFERROR(IF(C34=\"\",\"\",IF(H34=\"\",\"\",IF(I34=\"\",\"\",IF($C34=\"TOTAL\",SUM($Q$8:Q33),IF(AND(C34>$AL$1,$AC$3=$AL$2),BO35,IF($AO$18=$AO$20,$AO$21,ROUND((H34+I34)*10%,0))))))),\"\")","v":""},"",{"$f":"IFERROR(IF(C34=\"\",\"\",IF($AO$16=$AO$17,0,IF($C34=\"TOTAL\",SUM($S$8:S33),IF($AO$19=$AO$31,0,IF(AND($AO$32=$AO$20,C34=$AO$33),$AO$34,S33))))),\"\")","v":""},{"$f":"IFERROR(IF(C34=\"\",\"\",IF($AO$16=$AO$17,0,IF($C34=\"TOTAL\",SUM($T$8:T33),IF($AO$19=$AO$20,$AO$24,0)))),\"\")","v":""},"",{"$f":"IF(C34=\"\",\"\",IF($C34=\"TOTAL\",SUM($V$8:V33),IF(AND($AO$2=$AO$20,C34=$AO$1),ROUND(D34/31*$AP$2,0),IF(C34=$AM$6,ROUND((G34)*1/30,0),IF(C34=$AN$6,ROUND((G34)*1/31,0),\"\")))))","v":""},{"$f":"IF(C34=\"\",\"\",IF($C34=\"TOTAL\",SUM($W$8:W33),IF(AND($AO$2=$AO$20,C34=$AO$1),ROUND(H34/31*$AP$2,0),IF(C34=$AM$6,ROUND((K34)*1/30,0),IF(C34=$AN$6,ROUND((K34)*1/31,0),\"\")))))","v":""},"",{"$f":"IFERROR(IF(C34=\"\",\"\",IF(AND(BH35=\"\",BO35=\"\"),\"\",IF($C34=\"TOTAL\",SUM($Y$8:Y33),BH35))),\"\")","v":""},{"$f":"IFERROR(IF(C34=\"\",\"\",IF($C34=\"TOTAL\",SUM($Z$8:Z33),ROUND(O34*$AO$7%,0))),\"\")","v":""},{"$f":"IFERROR(IF(C34=\"\",\"\",IF($C34=\"TOTAL\",SUM($AA$8:AA33),IF($AC$3=$AL$2,SUM(U34,X34,Y34,Z34),SUM(R34,U34,X34,Y34,Z34)))),\"\")","v":""},{"$f":"IFERROR(IF(C34=\"\",\"\",IF($C34=\"TOTAL\",SUM($AB$8:AB33),SUM(O34-AA34))),\"\")","v":""},{"$nulls":8},34,34,null,"2019-02-01",{"$f":"'Master Sheet'!K19","v":3000},"2022-11-01","","2022-11-01","2022-11-01","","","","",null,"","","","",null,null,"","","","",0,0,{"$nulls":4},2100]
["","","",{"$f":"IFERROR(IF($C34=\"TOTAL\",\"अक्षरें राशि :-\",IF($C35=\"TOTAL\",SUM($D$8:D34),IF(AU36=\"\",\"\",AU36))),\"\")","v":""},{"$f":"IFERROR(IF($C35=\"TOTAL\",SUM($E$8:E34),IF(AV36=\"\",\"\",AV36)),\"\")","v":""},{"$f":"IFERROR(IF($C35=\"TOTAL\",SUM($F$8:F34),IF(OR(C35=$AM$16,C35=$AM$17,C35=$AM$18,C35=$AM$19,C35=$AM$20,C35=$AM$21,C35=$AM$22,C35=$AM$23,C35=$AM$24),0,IF(AW36=\"\",\"\",AW36))),\"\")","v":""},"",{"$f":"IFERROR(IF($C35=\"TOTAL\",SUM($H$8:H34),IF(AY36=\"\",\"\",AY36)),\"\")","v":""},{"$f":"IFERROR(IF($C35=\"TOTAL\",SUM($I$8:I34),IF(AZ36=\"\",\"\",AZ36)),\"\")","v":""},{"$f":"IFERROR(IF($C35=\"TOTAL\",SUM($J$8:J34),IF(OR(C35=$AM$16,C35=$AM$17,C35=$AM$18,C35=$AM$19,C35=$AM$20,C35=$AM$21,C35=$AM$22,C35=$AM$23,C35=$AM$24),0,IF(BA36=\"\",\"\",BA36))),\"\")","v":""},"",{"$f":"IFERROR(IF(C35=\"\",\"\",IF(D35=\"\",\"\",IF(H35=\"\",\"\",IF($C35=\"TOTAL\",SUM($L$8:L34),SUM(D35-H35))))),\"\")","v":""},{"$f":"IFERROR(IF(C35=\"\",\"\",IF(E35=\"\",\"\",IF(I35=\"\",\"\",IF($C35=\"TOTAL\",SUM($M$8:M34),SUM(E35-I35))))),\"\")","v":""},{"$f":"IFERROR(IF(C35=\"\",\"\",IF(F35=\"\",\"\",IF(J35=\"\",\"\",IF($C35=\"TOTAL\",SUM($N$8:N34),SUM(F35-J35))))),\"\")","v":""},"",{"$f":"IFERROR(IF(C35=\"\",\"\",IF($C35=\"TOTAL\",SUM($P$8:P34),IF(AND(C35>$AL$1,$AC$3=$AL$2),BO36,IF($AO$18=$AO$20,SUM(BB36+BJ36),ROUND((D35+E35)*10%,0))))),\"\")","v":""},{"$f":"IFERROR(IF(C35=\"\",\"\",IF(H35=\"\",\"\",IF(I35=\"\",\"\",IF($C35=\"TOTAL\",SUM($Q$8:Q34),IF(AND(C35>$AL$1,$AC$3=$AL$2),BO36,IF($AO$18=$AO$20,$AO$21,ROUND((H35+I35)*10%,0))))))),\"\")","v":""},"",{"$f":"IFERROR(IF(C35=\"\",\"\",IF($AO$16=$AO$17,0,IF($C35=\"TOTAL\",SUM($S$8:S34),IF($AO$19=$AO$31,0,IF(AND($AO$32=$AO$20,C35=$AO$33),$AO$34,S34))))),\"\")","v":""},{"$f":"IFERROR(IF(C35=\"\",\"\",IF($AO$16=$AO$17,0,IF($C35=\"TOTAL\",SUM($T$8:T34),IF($AO$19=$AO$20,$AO$24,0)))),\"\")","v":""},"",{"$f":"IF(C35=\"\",\"\",IF($C35=\"TOTAL\",SUM($V$8:V34),IF(AND($AO$2=$AO$20,C35=$AO$1),ROUND(D35/31*$AP$2,0),IF(C35=$AM$6,ROUND((G35)*1/30,0),IF(C35=$AN$6,ROUND((G35)*1/31,0),\"\")))))","v":""},{"$f":"IF(C35=\"\",\"\",IF($C35=\"TOTAL\",SUM($W$8:W34),IF(AND($AO$2=$AO$20,C35=$AO$1),ROUND(H35/31*$AP$2,0),IF(C35=$AM$6,ROUND((K35)*1/30,0),IF(C35=$AN$6,ROUND((K35)*1/31,0),\"\")))))","v":""},"",{"$f":"IFERROR(IF(C35=\"\",\"\",IF(AND(BH36=\"\",BO36=\"\"),\"\",IF($C35=\"TOTAL\",SUM($Y$8:Y34),BH36))),\"\")","v":""},{"$f":"IFERROR(IF(C35=\"\",\"\",IF($C35=\"TOTAL\",SUM($Z$8:Z34),ROUND(O35*$AO$7%,0))),\"\")","v":""},{"$f":"IFERROR(IF(C35=\"\",\"\",IF($C35=\"TOTAL\",SUM($AA$8:AA34),IF($AC$3=$AL$2,SUM(U35,X35,Y35,Z35),SUM(R35,U35,X35,Y35,Z35)))),\"\")","v":""},{"$f":"IFERROR(IF(C35=\"\",\"\",IF($C35=\"TOTAL\",SUM($AB$8:AB34),SUM(O35-AA35))),\"\")","v":""},{"$nulls":8},34,34,null,"2019-03-01",null,"2022-12-01","","2022-12-01","2022-12-01","","","","",null,"","","","",null,null,"","","","",0,0,{"$nulls":4},2100]
["","","",{"$f":"IFERROR(IF($C35=\"TOTAL\",\"अक्षरें राशि :-\",IF($C36=\"TOTAL\",SUM($D$8:D35),IF(AU37=\"\",\"\",AU37))),\"\")","v":""},{"$f":"IFERROR(IF($C36=\"TOTAL\",SUM($E$8:E35),IF(AV37=\"\",\"\",AV37)),\"\")","v":""},{"$f":"IFERROR(IF($C36=\"TOTAL\",SUM($F$8:F35),IF(OR(C36=$AM$16,C36=$AM$17,C36=$AM$18,C36=$AM$19,C36=$AM$20,C36=$AM$21,C36=$AM$22,C36=$AM$23,C36=$AM$24),0,IF(AW37=\"\",\"\",AW37))),\"\")","v":""},"",{"$f":"IFERROR(IF($C36=\"TOTAL\",SUM($H$8:H35),IF(AY37=\"\",\"\",AY37)),\"\")","v":""},{"$f":"IFERROR(IF($C36=\"TOTAL\",SUM($I$8:I35),IF(AZ37=\"\",\"\",AZ37)),\"\")","v":""},{"$f":"IFERROR(IF($C36=\"TOTAL\",SUM($J$8:J35),IF(OR(C36=$AM$16,C36=$AM$17,C36=$AM$18,C36=$AM$19,C36=$AM$20,C36=$AM$21,C36=$AM$22,C36=$AM$23,C36=$AM$24),0,IF(BA37=\"\",\"\",BA37))),\"\")","v":""},"",{"$f":"IFERROR(IF(C36=\"\",\"\",IF(D36=\"\",\"\",IF(H36=\"\",\"\",IF($C36=\"TOTAL\",SUM($L$8:L35),SUM(D36-H36))))),\"\")","v":""},{"$f":"IFERROR(IF(C36=\"\",\"\",IF(E36=\"\",\"\",IF(I36=\"\",\"\",IF($C36=\"TOTAL\",SUM($M$8:M35),SUM(E36-I36))))),\"\")","v":""},{"$f":"IFERROR(IF(C36=\"\",\"\",IF(F36=\"\",\"\",IF(J36=\"\",\"\",IF($C36=\"TOTAL\",SUM($N$8:N35),SUM(F36-J36))))),\"\")","v":""},"",{"$f":"IFERROR(IF(C36=\"\",\"\",IF($C36=\"TOTAL\",SUM($P$8:P35),IF(AND(C36>$AL$1,$AC$3=$AL$2),BO37,IF($AO$18=$AO$20,SUM(BB37+BJ37),ROUND((D36+E36)*10%,0))))),\"\")","v":""},{"$f":"IFERROR(IF(C36=\"\",\"\",IF(H36=\"\",\"\",IF(I36=\"\",\"\",IF($C36=\"TOTAL\",SUM($Q$8:Q35),IF(AND(C36>$AL$1,$AC$3=$AL$2),BO37,IF($AO$18=$AO$20,$AO$21,ROUND((H36+I36)*10%,0))))))),\"\")","v":""},"",{"$f":"IFERROR(IF(C36=\"\",\"\",IF($AO$16=$AO$17,0,IF($C36=\"TOTAL\",SUM($S$8:S35),IF($AO$19=$AO$31,0,IF(AND($AO$32=$AO$20,C36=$AO$33),$AO$34,S35))))),\"\")","v":""},{"$f":"IFERROR(IF(C36=\"\",\"\",IF($AO$16=$AO$17,0,IF($C36=\"TOTAL\",SUM($T$8:T35),IF($AO$19=$AO$20,$AO$24,0)))),\"\")","v":""},"",{"$f":"IF(C36=\"\",\"\",IF($C36=\"TOTAL\",SUM($V$8:V35),IF(AND($AO$2=$AO$20,C36=$AO$1),ROUND(D36/31*$AP$2,0),IF(C36=$AM$6,ROUND((G36)*1/30,0),IF(C36=$AN$6,ROUND((G36)*1/31,0),\"\")))))","v":""},{"$f":"IF(C36=\"\",\"\",IF($C36=\"TOTAL\",SUM($W$8:W35),IF(AND($AO$2=$AO$20,C36=$AO$1),ROUND(H36/31*$AP$2,0),IF(C36=$AM$6,ROUND((K36)*1/30,0),IF(C36=$AN$6,ROUND((K36)*1/31,0),\"\")))))","v":""},"",{"$f":"IFERROR(IF(C36=\"\",\"\",IF(AND(BH37=\"\",BO37=\"\"),\"\",IF($C36=\"TOTAL\",SUM($Y$8:Y35),BH37))),\"\")","v":""},{"$f":"IFERROR(IF(C36=\"\",\"\",IF($C36=\"TOTAL\",SUM($Z$8:Z35),ROUND(O36*$AO$7%,0))),\"\")","v":""},{"$f":"IFERROR(IF(C36=\"\",\"\",IF($C36=\"TOTAL\",SUM($AA$8:AA35),IF($AC$3=$AL$2,SUM(U36,X36,Y36,Z36),SUM(R36,U36,X36,Y36,Z36)))),\"\")","v":""},{"$f":"IFERROR(IF(C36=\"\",\"\",IF($C36=\"TOTAL\",SUM($AB$8:AB35),SUM(O36-AA36))),\"\")","v":""},{"$nulls":8},34,34,null,"2019-04-01",{"$f":"'Master Sheet'!D23","v":"NO"},"2023-01-01","","2023-01-01","2023-01-01","","","","",null,"","","","",null,null,"","","","",0,0,{"$nulls":4},2100]
["","","",{"$f":"IFERROR(IF($C36=\"TOTAL\",\"अक्षरें राशि :-\",IF($C37=\"TOTAL\",SUM($D$8:D36),IF(AU38=\"\",\"\",AU38))),\"\")","v":""},{"$f":"IFERROR(IF($C37=\"TOTAL\",SUM($E$8:E36),IF(AV38=\"\",\"\",AV38)),\"\")","v":""},{"$f":"IFERROR(IF($C37=\"TOTAL\",SUM($F$8:F36),IF(OR(C37=$AM$16,C37=$AM$17,C37=$AM$18,C37=$AM$19,C37=$AM$20,C37=$AM$21,C37=$AM$22,C37=$AM$23,C37=$AM$24),0,IF(AW38=\"\",\"\",AW38))),\"\")","v":""},"",{"$f":"IFERROR(IF($C37=\"TOTAL\",SUM($H$8:H36),IF(AY38=\"\",\"\",AY38)),\"\")","v":""},{"$f":"IFERROR(IF($C37=\"TOTAL\",SUM($I$8:I36),IF(AZ38=\"\",\"\",AZ38)),\"\")","v":""},{"$f":"IFERROR(IF($C37=\"TOTAL\",SUM($J$8:J36),IF(OR(C37=$AM$16,C37=$AM$17,C37=$AM$18,C37=$AM$19,C37=$AM$20,C37=$AM$21,C37=$AM$22,C37=$AM$23,C37=$AM$24),0,IF(BA38=\"\",\"\",BA38))),\"\")","v":""},"",{"$f":"IFERROR(IF(C37=\"\",\"\",IF(D37=\"\",\"\",IF(H37=\"\",\"\",IF($C37=\"TOTAL\",SUM($L$8:L36),SUM(D37-H37))))),\"\")","v":""},{"$f":"IFERROR(IF(C37=\"\",\"\",IF(E37=\"\",\"\",IF(I37=\"\",\"\",IF($C37=\"TOTAL\",SUM($M$8:M36),SUM(E37-I37))))),\"\")","v":""},{"$f":"IFERROR(IF(C37=\"\",\"\",IF(F37=\"\",\"\",IF(J37=\"\",\"\",IF($C37=\"TOTAL\",SUM($N$8:N36),SUM(F37-J37))))),\"\")","v":""},"",{"$f":"IFERROR(IF(C37=\"\",\"\",IF($C37=\"TOTAL\",SUM($P$8:P36),IF(AND(C37>$AL$1,$AC$3=$AL$2),BO38,IF($AO$18=$AO$20,SUM(BB38+BJ38),ROUND((D37+E37)*10%,0))))),\"\")","v":""},{"$f":"IFERROR(IF(C37=\"\",\"\",IF(H37=\"\",\"\",IF(I37=\"\",\"\",IF($C37=\"TOTAL\",SUM($Q$8:Q36),IF(AND(C37>$AL$1,$AC$3=$AL$2),BO38,IF($AO$18=$AO$20,$AO$21,ROUND((H37+I37)*10%,0))))))),\"\")","v":""},"",{"$f":"IFERROR(IF(C37=\"\",\"\",IF($AO$16=$AO$17,0,IF($C37=\"TOTAL\",SUM($S$8:S36),IF($AO$19=$AO$31,0,IF(AND($AO$32=$AO$20,C37=$AO$33),$AO$34,S36))))),\"\")","v":""},{"$f":"IFERROR(IF(C37=\"\",\"\",IF($AO$16=$AO$17,0,IF($C37=\"TOTAL\",SUM($T$8:T36),IF($AO$19=$AO$20,$AO$24,0)))),\"\")","v":""},"",{"$f":"IF(C37=\"\",\"\",IF($C37=\"TOTAL\",SUM($V$8:V36),IF(AND($AO$2=$AO$20,C37=$AO$1),ROUND(D37/31*$AP$2,0),IF(C37=$AM$6,ROUND((G37)*1/30,0),IF(C37=$AN$6,ROUND((G37)*1/31,0),\"\")))))","v":""},{"$f":"IF(C37=\"\",\"\",IF($C37=\"TOTAL\",SUM($W$8:W36),IF(AND($AO$2=$AO$20,C37=$AO$1),ROUND(H37/31*$AP$2,0),IF(C37=$AM$6,ROUND((K37)*1/30,0),IF(C37=$AN$6,ROUND((K37)*1/31,0),\"\")))))","v":""},"",{"$f":"IFERROR(IF(C37=\"\",\"\",IF(AND(BH38=\"\",BO38=\"\"),\"\",IF($C37=\"TOTAL\",SUM($Y$8:Y36),BH38))),\"\")","v":""},{"$f":"IFERROR(IF(C37=\"\",\"\",IF($C37=\"TOTAL\",SUM($Z$8:Z36),ROUND(O37*$AO$7%,0))),\"\")","v":""},{"$f":"IFERROR(IF(C37=\"\",\"\",IF($C37=\"TOTAL\",SUM($AA$8:AA36),IF($AC$3=$AL$2,SUM(U37,X37,Y37,Z37),SUM(R37,U37,X37,Y37,Z37)))),\"\")","v":""},{"$f":"IFERROR(IF(C37=\"\",\"\",IF($C37=\"TOTAL\",SUM($AB$8:AB36),SUM(O37-AA37))),\"\")","v":""},{"$nulls":8},34,34,null,"2019-05-01",{"$f":"'Master Sheet'!G23","v":44287},"2023-02-01","","2023-02-01","2023-02-01","","","","",null,"","","","",null,null,"","","","",0,0,{"$nulls":4},2100]
["","","",{"$f":"IFERROR(IF($C37=\"TOTAL\",\"अक्षरें राशि :-\",IF($C38=\"TOTAL\",SUM($D$8:D37),IF(AU39=\"\",\"\",AU39))),\"\")","v":""},{"$f":"IFERROR(IF($C38=\"TOTAL\",SUM($E$8:E37),IF(AV39=\"\",\"\",AV39)),\"\")","v":""},{"$f":"IFERROR(IF($C38=\"TOTAL\",SUM($F$8:F37),IF(OR(C38=$AM$16,C38=$AM$17,C38=$AM$18,C38=$AM$19,C38=$AM$20,C38=$AM$21,C38=$AM$22,C38=$AM$23,C38=$AM$24),0,IF(AW39=\"\",\"\",AW39))),\"\")","v":""},"",{"$f":"IFERROR(IF($C38=\"TOTAL\",SUM($H$8:H37),IF(AY39=\"\",\"\",AY39)),\"\")","v":""},{"$f":"IFERROR(IF($C38=\"TOTAL\",SUM($I$8:I37),IF(AZ39=\"\",\"\",AZ39)),\"\")","v":""},{"$f":"IFERROR(IF($C38=\"TOTAL\",SUM($J$8:J37),IF(OR(C38=$AM$16,C38=$AM$17,C38=$AM$18,C38=$AM$19,C38=$AM$20,C38=$AM$21,C38=$AM$22,C38=$AM$23,C38=$AM$24),0,IF(BA39=\"\",\"\",BA39))),\"\")","v":""},"",{"$f":"IFERROR(IF(C38=\"\",\"\",IF(D38=\"\",\"\",IF(H38=\"\",\"\",IF($C38=\"TOTAL\",SUM($L$8:L37),SUM(D38-H38))))),\"\")","v":""},{"$f":"IFERROR(IF(C38=\"\",\"\",IF(E38=\"\",\"\",IF(I38=\"\",\"\",IF($C38=\"TOTAL\",SUM($M$8:M37),SUM(E38-I38))))),\"\")","v":""},{"$f":"IFERROR(IF(C38=\"\",\"\",IF(F38=\"\",\"\",IF(J38=\"\",\"\",IF($C38=\"TOTAL\",SUM($N$8:N37),SUM(F38-J38))))),\"\")","v":""},"",{"$f":"IFERROR(IF(C38=\"\",\"\",IF($C38=\"TOTAL\",SUM($P$8:P37),IF(AND(C38>$AL$1,$AC$3=$AL$2),BO39,IF($AO$18=$AO$20,SUM(BB39+BJ39),ROUND((D38+E38)*10%,0))))),\"\")","v":""},{"$f":"IFERROR(IF(C38=\"\",\"\",IF(H38=\"\",\"\",IF(I38=\"\",\"\",IF($C38=\"TOTAL\",SUM($Q$8:Q37),IF(AND(C38>$AL$1,$AC$3=$AL$2),BO39,IF($AO$18=$AO$20,$AO$21,ROUND((H38+I38)*10%,0))))))),\"\")","v":""},"",{"$f":"IFERROR(IF(C38=\"\",\"\",IF($AO$16=$AO$17,0,IF($C38=\"TOTAL\",SUM($S$8:S37),IF($AO$19=$AO$31,0,IF(AND($AO$32=$AO$20,C38=$AO$33),$AO$34,S37))))),\"\")","v":""},{"$f":"IFERROR(IF(C38=\"\",\"\",IF($AO$16=$AO$17,0,IF($C38=\"TOTAL\",SUM($T$8:T37),IF($AO$19=$AO$20,$AO$24,0)))),\"\")","v":""},"",{"$f":"IF(C38=\"\",\"\",IF($C38=\"TOTAL\",SUM($V$8:V37),IF(AND($AO$2=$AO$20,C38=$AO$1),ROUND(D38/31*$AP$2,0),IF(C38=$AM$6,ROUND((G38)*1/30,0),IF(C38=$AN$6,ROUND((G38)*1/31,0),\"\")))))","v":""},{"$f":"IF(C38=\"\",\"\",IF($C38=\"TOTAL\",SUM($W$8:W37),IF(AND($AO$2=$AO$20,C38=$AO$1),ROUND(H38/31*$AP$2,0),IF(C38=$AM$6,ROUND((K38)*1/30,0),IF(C38=$AN$6,ROUND((K38)*1/31,0),\"\")))))","v":""},"",{"$f":"IFERROR(IF(C38=\"\",\"\",IF(AND(BH39=\"\",BO39=\"\"),\"\",IF($C38=\"TOTAL\",SUM($Y$8:Y37),BH39))),\"\")","v":""},{"$f":"IFERROR(IF(C38=\"\",\"\",IF($C38=\"TOTAL\",SUM($Z$8:Z37),ROUND(O38*$AO$7%,0))),\"\")","v":""},{"$f":"IFERROR(IF(C38=\"\",\"\",IF($C38=\"TOTAL\",SUM($AA$8:AA37),IF($AC$3=$AL$2,SUM(U38,X38,Y38,Z38),SUM(R38,U38,X38,Y38,Z38)))),\"\")","v":""},{"$f":"IFERROR(IF(C38=\"\",\"\",IF($C38=\"TOTAL\",SUM($AB$8:AB37),SUM(O38-AA38))),\"\")","v":""},{"$nulls":8},34,34,null,"2019-06-01",{"$f":"'Master Sheet'!K23","v":5000},"2023-03-01","","2023-03-01","2023-03-01","","","","",null,"","","","",null,null,"","","","",0,0,{"$nulls":4},2100]
["","","",{"$f":"IFERROR(IF($C38=\"TOTAL\",\"अक्षरें राशि :-\",IF($C39=\"TOTAL\",SUM($D$8:D38),IF(AU40=\"\",\"\",AU40))),\"\")","v":""},{"$f":"IFERROR(IF($C39=\"TOTAL\",SUM($E$8:E38),IF(AV40=\"\",\"\",AV40)),\"\")","v":""},{"$f":"IFERROR(IF($C39=\"TOTAL\",SUM($F$8:F38),IF(OR(C39=$AM$16,C39=$AM$17,C39=$AM$18,C39=$AM$19,C39=$AM$20,C39=$AM$21,C39=$AM$22,C39=$AM$23,C39=$AM$24),0,IF(AW40=\"\",\"\",AW40))),\"\")","v":""},"",{"$f":"IFERROR(IF($C39=\"TOTAL\",SUM($H$8:H38),IF(AY40=\"\",\"\",AY40)),\"\")","v":""},{"$f":"IFERROR(IF($C39=\"TOTAL\",SUM($I$8:I38),IF(AZ40=\"\",\"\",AZ40)),\"\")","v":""},{"$f":"IFERROR(IF($C39=\"TOTAL\",SUM($J$8:J38),IF(OR(C39=$AM$16,C39=$AM$17,C39=$AM$18,C39=$AM$19,C39=$AM$20,C39=$AM$21,C39=$AM$22,C39=$AM$23,C39=$AM$24),0,IF(BA40=\"\",\"\",BA40))),\"\")","v":""},"",{"$f":"IFERROR(IF(C39=\"\",\"\",IF(D39=\"\",\"\",IF(H39=\"\",\"\",IF($C39=\"TOTAL\",SUM($L$8:L38),SUM(D39-H39))))),\"\")","v":""},{"$f":"IFERROR(IF(C39=\"\",\"\",IF(E39=\"\",\"\",IF(I39=\"\",\"\",IF($C39=\"TOTAL\",SUM($M$8:M38),SUM(E39-I39))))),\"\")","v":""},{"$f":"IFERROR(IF(C39=\"\",\"\",IF(F39=\"\",\"\",IF(J39=\"\",\"\",IF($C39=\"TOTAL\",SUM($N$8:N38),SUM(F39-J39))))),\"\")","v":""},"",{"$f":"IFERROR(IF(C39=\"\",\"\",IF($C39=\"TOTAL\",SUM($P$8:P38),IF(AND(C39>$AL$1,$AC$3=$AL$2),BO40,IF($AO$18=$AO$20,SUM(BB40+BJ40),ROUND((D39+E39)*10%,0))))),\"\")","v":""},{"$f":"IFERROR(IF(C39=\"\",\"\",IF(H39=\"\",\"\",IF(I39=\"\",\"\",IF($C39=\"TOTAL\",SUM($Q$8:Q38),IF(AND(C39>$AL$1,$AC$3=$AL$2),BO40,IF($AO$18=$AO$20,$AO$21,ROUND((H39+I39)*10%,0))))))),\"\")","v":""},"",{"$f":"IFERROR(IF(C39=\"\",\"\",IF($AO$16=$AO$17,0,IF($C39=\"TOTAL\",SUM($S$8:S38),IF($AO$19=$AO$31,0,IF(AND($AO$32=$AO$20,C39=$AO$33),$AO$34,S38))))),\"\")","v":""},{"$f":"IFERROR(IF(C39=\"\",\"\",IF($AO$16=$AO$17,0,IF($C39=\"TOTAL\",SUM($T$8:T38),IF($AO$19=$AO$20,$AO$24,0)))),\"\")","v":""},"",{"$f":"IF(C39=\"\",\"\",IF($C39=\"TOTAL\",SUM($V$8:V38),IF(AND($AO$2=$AO$20,C39=$AO$1),ROUND(D39/31*$AP$2,0),IF(C39=$AM$6,ROUND((G39)*1/30,0),IF(C39=$AN$6,ROUND((G39)*1/31,0),\"\")))))","v":""},{"$f":"IF(C39=\"\",\"\",IF($C39=\"TOTAL\",SUM($W$8:W38),IF(AND($AO$2=$AO$20,C39=$AO$1),ROUND(H39/31*$AP$2,0),IF(C39=$AM$6,ROUND((K39)*1/30,0),IF(C39=$AN$6,ROUND((K39)*1/31,0),\"\")))))","v":""},"",{"$f":"IFERROR(IF(C39=\"\",\"\",IF(AND(BH40=\"\",BO40=\"\"),\"\",IF($C39=\"TOTAL\",SUM($Y$8:Y38),BH40))),\"\")","v":""},{"$f":"IFERROR(IF(C39=\"\",\"\",IF($C39=\"TOTAL\",SUM($Z$8:Z38),ROUND(O39*$AO$7%,0))),\"\")","v":""},{"$f":"IFERROR(IF(C39=\"\",\"\",IF($C39=\"TOTAL\",SUM($AA$8:AA38),IF($AC$3=$AL$2,SUM(U39,X39,Y39,Z39),SUM(R39,U39,X39,Y39,Z39)))),\"\")","v":""},{"$f":"IFERROR(IF(C39=\"\",\"\",IF($C39=\"TOTAL\",SUM($AB$8:AB38),SUM(O39-AA39))),\"\")","v":""},{"$nulls":8},34,34,null,"2019-07-01",null,"2023-04-01","","2023-04-01","2023-04-01","","","","",null,"","","","",null,null,"","","","",0,0,{"$nulls":4},2100]
["","","",{"$f":"IFERROR(IF($C39=\"TOTAL\",\"अक्षरें राशि :-\",IF($C40=\"TOTAL\",SUM($D$8:D39),IF(AU41=\"\",\"\",AU41))),\"\")","v":""},{"$f":"IFERROR(IF($C40=\"TOTAL\",SUM($E$8:E39),IF(AV41=\"\",\"\",AV41)),\"\")","v":""},{"$f":"IFERROR(IF($C40=\"TOTAL\",SUM($F$8:F39),IF(OR(C40=$AM$16,C40=$AM$17,C40=$AM$18,C40=$AM$19,C40=$AM$20,C40=$AM$21,C40=$AM$22,C40=$AM$23,C40=$AM$24),0,IF(AW41=\"\",\"\",AW41))),\"\")","v":""},"",{"$f":"IFERROR(IF($C40=\"TOTAL\",SUM($H$8:H39),IF(AY41=\"\",\"\",AY41)),\"\")","v":""},{"$f":"IFERROR(IF($C40=\"TOTAL\",SUM($I$8:I39),IF(AZ41=\"\",\"\",AZ41)),\"\")","v":""},{"$f":"IFERROR(IF($C40=\"TOTAL\",SUM($J$8:J39),IF(OR(C40=$AM$16,C40=$AM$17,C40=$AM$18,C40=$AM$19,C40=$AM$20,C40=$AM$21,C40=$AM$22,C40=$AM$23,C40=$AM$24),0,IF(BA41=\"\",\"\",BA41))),\"\")","v":""},"",{"$f":"IFERROR(IF(C40=\"\",\"\",IF(D40=\"\",\"\",IF(H40=\"\",\"\",IF($C40=\"TOTAL\",SUM($L$8:L39),SUM(D40-H40))))),\"\")","v":""},{"$f":"IFERROR(IF(C40=\"\",\"\",IF(E40=\"\",\"\",IF(I40=\"\",\"\",IF($C40=\"TOTAL\",SUM($M$8:M39),SUM(E40-I40))))),\"\")","v":""},{"$f":"IFERROR(IF(C40=\"\",\"\",IF(F40=\"\",\"\",IF(J40=\"\",\"\",IF($C40=\"TOTAL\",SUM($N$8:N39),SUM(F40-J40))))),\"\")","v":""},"",{"$f":"IFERROR(IF(C40=\"\",\"\",IF($C40=\"TOTAL\",SUM($P$8:P39),IF(AND(C40>$AL$1,$AC$3=$AL$2),BO41,IF($AO$18=$AO$20,SUM(BB41+BJ41),ROUND((D40+E40)*10%,0))))),\"\")","v":""},{"$f":"IFERROR(IF(C40=\"\",\"\",IF(H40=\"\",\"\",IF(I40=\"\",\"\",IF($C40=\"TOTAL\",SUM($Q$8:Q39),IF(AND(C40>$AL$1,$AC$3=$AL$2),BO41,IF($AO$18=$AO$20,$AO$21,ROUND((H40+I40)*10%,0))))))),\"\")","v":""},"",{"$f":"IFERROR(IF(C40=\"\",\"\",IF($AO$16=$AO$17,0,IF($C40=\"TOTAL\",SUM($S$8:S39),IF($AO$19=$AO$31,0,IF(AND($AO$32=$AO$20,C40=$AO$33),$AO$34,S39))))),\"\")","v":""},{"$f":"IFERROR(IF(C40=\"\",\"\",IF($AO$16=$AO$17,0,IF($C40=\"TOTAL\",SUM($T$8:T39),IF($AO$19=$AO$20,$AO$24,0)))),\"\")","v":""},"",{"$f":"IF(C40=\"\",\"\",IF($C40=\"TOTAL\",SUM($V$8:V39),IF(AND($AO$2=$AO$20,C40=$AO$1),ROUND(D40/31*$AP$2,0),IF(C40=$AM$6,ROUND((G40)*1/30,0),IF(C40=$AN$6,ROUND((G40)*1/31,0),\"\")))))","v":""},{"$f":"IF(C40=\"\",\"\",IF($C40=\"TOTAL\",SUM($W$8:W39),IF(AND($AO$2=$AO$20,C40=$AO$1),ROUND(H40/31*$AP$2,0),IF(C40=$AM$6,ROUND((K40)*1/30,0),IF(C40=$AN$6,ROUND((K40)*1/31,0),\"\")))))","v":""},"",{"$f":"IFERROR(IF(C40=\"\",\"\",IF(AND(BH41=\"\",BO41=\"\"),\"\",IF($C40=\"TOTAL\",SUM($Y$8:Y39),BH41))),\"\")","v":""},{"$f":"IFERROR(IF(C40=\"\",\"\",IF($C40=\"TOTAL\",SUM($Z$8:Z39),ROUND(O40*$AO$7%,0))),\"\")","v":""},{"$f":"IFERROR(IF(C40=\"\",\"\",IF($C40=\"TOTAL\",SUM($AA$8:AA39),IF($AC$3=$AL$2,SUM(U40,X40,Y40,Z40),SUM(R40,U40,X40,Y40,Z40)))),\"\")","v":""},{"$f":"IFERROR(IF(C40=\"\",\"\",IF($C40=\"TOTAL\",SUM($AB$8:AB39),SUM(O40-AA40))),\"\")","v":""},{"$nulls":8},34,34,null,"2019-08-01",null,"2023-05-01","","2023-05-01","2023-05-01","","","","",null,"","","","",null,null,"","","","",0,0,{"$nulls":4},2100]
["","","",{"$f":"IFERROR(IF($C40=\"TOTAL\",\"अक्षरें राशि :-\",IF($C41=\"TOTAL\",SUM($D$8:D40),IF(AU42=\"\",\"\",AU42))),\"\")","v":""},{"$f":"IFERROR(IF($C41=\"TOTAL\",SUM($E$8:E40),IF(AV42=\"\",\"\",AV42)),\"\")","v":""},{"$f":"IFERROR(IF($C41=\"TOTAL\",SUM($F$8:F40),IF(OR(C41=$AM$16,C41=$AM$17,C41=$AM$18,C41=$AM$19,C41=$AM$20,C41=$AM$21,C41=$AM$22,C41=$AM$23,C41=$AM$24),0,IF(AW42=\"\",\"\",AW42))),\"\")","v":""},"",{"$f":"IFERROR(IF($C41=\"TOTAL\",SUM($H$8:H40),IF(AY42=\"\",\"\",AY42)),\"\")","v":""},{"$f":"IFERROR(IF($C41=\"TOTAL\",SUM($I$8:I40),IF(AZ42=\"\",\"\",AZ42)),\"\")","v":""},{"$f":"IFERROR(IF($C41=\"TOTAL\",SUM($J$8:J40),IF(OR(C41=$AM$16,C41=$AM$17,C41=$AM$18,C41=$AM$19,C41=$AM$20,C41=$AM$21,C41=$AM$22,C41=$AM$23,C41=$AM$24),0,IF(BA42=\"\",\"\",BA42))),\"\")","v":""},"",{"$f":"IFERROR(IF(C41=\"\",\"\",IF(D41=\"\",\"\",IF(H41=\"\",\"\",IF($C41=\"TOTAL\",SUM($L$8:L40),SUM(D41-H41))))),\"\")","v":""},{"$f":"IFERROR(IF(C41=\"\",\"\",IF(E41=\"\",\"\",IF(I41=\"\",\"\",IF($C41=\"TOTAL\",SUM($M$8:M40),SUM(E41-I41))))),\"\")","v":""},{"$f":"IFERROR(IF(C41=\"\",\"\",IF(F41=\"\",\"\",IF(J41=\"\",\"\",IF($C41=\"TOTAL\",SUM($N$8:N40),SUM(F41-J41))))),\"\")","v":""},"",{"$f":"IFERROR(IF(C41=\"\",\"\",IF($C41=\"TOTAL\",SUM($P$8:P40),IF(AND(C41>$AL$1,$AC$3=$AL$2),BO42,IF($AO$18=$AO$20,SUM(BB42+BJ42),ROUND((D41+E41)*10%,0))))),\"\")","v":""},{"$f":"IFERROR(IF(C41=\"\",\"\",IF(H41=\"\",\"\",IF(I41=\"\",\"\",IF($C41=\"TOTAL\",SUM($Q$8:Q40),IF(AND(C41>$AL$1,$AC$3=$AL$2),BO42,IF($AO$18=$AO$20,$AO$21,ROUND((H41+I41)*10%,0))))))),\"\")","v":""},"",{"$f":"IFERROR(IF(C41=\"\",\"\",IF($AO$16=$AO$17,0,IF($C41=\"TOTAL\",SUM($S$8:S40),IF($AO$19=$AO$31,0,IF(AND($AO$32=$AO$20,C41=$AO$33),$AO$34,S40))))),\"\")","v":""},{"$f":"IFERROR(IF(C41=\"\",\"\",IF($AO$16=$AO$17,0,IF($C41=\"TOTAL\",SUM($T$8:T40),IF($AO$19=$AO$20,$AO$24,0)))),\"\")","v":""},"",{"$f":"IF(C41=\"\",\"\",IF($C41=\"TOTAL\",SUM($V$8:V40),IF(AND($AO$2=$AO$20,C41=$AO$1),ROUND(D41/31*$AP$2,0),IF(C41=$AM$6,ROUND((G41)*1/30,0),IF(C41=$AN$6,ROUND((G41)*1/31,0),\"\")))))","v":""},{"$f":"IF(C41=\"\",\"\",IF($C41=\"TOTAL\",SUM($W$8:W40),IF(AND($AO$2=$AO$20,C41=$AO$1),ROUND(H41/31*$AP$2,0),IF(C41=$AM$6,ROUND((K41)*1/30,0),IF(C41=$AN$6,ROUND((K41)*1/31,0),\"\")))))","v":""},"",{"$f":"IFERROR(IF(C41=\"\",\"\",IF(AND(BH42=\"\",BO42=\"\"),\"\",IF($C41=\"TOTAL\",SUM($Y$8:Y40),BH42))),\"\")","v":""},{"$f":"IFERROR(IF(C41=\"\",\"\",IF($C41=\"TOTAL\",SUM($Z$8:Z40),ROUND(O41*$AO$7%,0))),\"\")","v":""},{"$f":"IFERROR(IF(C41=\"\",\"\",IF($C41=\"TOTAL\",SUM($AA$8:AA40),IF($AC$3=$AL$2,SUM(U41,X41,Y41,Z41),SUM(R41,U41,X41,Y41,Z41)))),\"\")","v":""},{"$f":"IFERROR(IF(C41=\"\",\"\",IF($C41=\"TOTAL\",SUM($AB$8:AB40),SUM(O41-AA41))),\"\")","v":""},{"$nulls":8},34,34,null,"2019-09-01",null,"2023-06-01","","2023-06-01","2023-06-01","","","","",null,"","","","",null,null,"","","","",0,0,{"$nulls":4},2100]
["","","",{"$f":"IFERROR(IF($C41=\"TOTAL\",\"अक्षरें राशि :-\",IF($C42=\"TOTAL\",SUM($D$8:D41),IF(AU43=\"\",\"\",AU43))),\"\")","v":""},{"$f":"IFERROR(IF($C42=\"TOTAL\",SUM($E$8:E41),IF(AV43=\"\",\"\",AV43)),\"\")","v":""},{"$f":"IFERROR(IF($C42=\"TOTAL\",SUM($F$8:F41),IF(OR(C42=$AM$16,C42=$AM$17,C42=$AM$18,C42=$AM$19,C42=$AM$20,C42=$AM$21,C42=$AM$22,C42=$AM$23,C42=$AM$24),0,IF(AW43=\"\",\"\",AW43))),\"\")","v":""},"",{"$f":"IFERROR(IF($C42=\"TOTAL\",SUM($H$8:H41),IF(AY43=\"\",\"\",AY43)),\"\")","v":""},{"$f":"IFERROR(IF($C42=\"TOTAL\",SUM($I$8:I41),IF(AZ43=\"\",\"\",AZ43)),\"\")","v":""},{"$f":"IFERROR(IF($C42=\"TOTAL\",SUM($J$8:J41),IF(OR(C42=$AM$16,C42=$AM$17,C42=$AM$18,C42=$AM$19,C42=$AM$20,C42=$AM$21,C42=$AM$22,C42=$AM$23,C42=$AM$24),0,IF(BA43=\"\",\"\",BA43))),\"\")","v":""},"",{"$f":"IFERROR(IF(C42=\"\",\"\",IF(D42=\"\",\"\",IF(H42=\"\",\"\",IF($C42=\"TOTAL\",SUM($L$8:L41),SUM(D42-H42))))),\"\")","v":""},{"$f":"IFERROR(IF(C42=\"\",\"\",IF(E42=\"\",\"\",IF(I42=\"\",\"\",IF($C42=\"TOTAL\",SUM($M$8:M41),SUM(E42-I42))))),\"\")","v":""},{"$f":"IFERROR(IF(C42=\"\",\"\",IF(F42=\"\",\"\",IF(J42=\"\",\"\",IF($C42=\"TOTAL\",SUM($N$8:N41),SUM(F42-J42))))),\"\")","v":""},"",{"$f":"IFERROR(IF(C42=\"\",\"\",IF($C42=\"TOTAL\",SUM($P$8:P41),IF(AND(C42>$AL$1,$AC$3=$AL$2),BO43,IF($AO$18=$AO$20,SUM(BB43+BJ43),ROUND((D42+E42)*10%,0))))),\"\")","v":""},{"$f":"IFERROR(IF(C42=\"\",\"\",IF(H42=\"\",\"\",IF(I42=\"\",\"\",IF($C42=\"TOTAL\",SUM($Q$8:Q41),IF(AND(C42>$AL$1,$AC$3=$AL$2),BO43,IF($AO$18=$AO$20,$AO$21,ROUND((H42+I42)*10%,0))))))),\"\")","v":""},"",{"$f":"IFERROR(IF(C42=\"\",\"\",IF($AO$16=$AO$17,0,IF($C42=\"TOTAL\",SUM($S$8:S41),IF($AO$19=$AO$31,0,IF(AND($AO$32=$AO$20,C42=$AO$33),$AO$34,S41))))),\"\")","v":""},{"$f":"IFERROR(IF(C42=\"\",\"\",IF($AO$16=$AO$17,0,IF($C42=\"TOTAL\",SUM($T$8:T41),IF($AO$19=$AO$20,$AO$24,0)))),\"\")","v":""},"",{"$f":"IF(C42=\"\",\"\",IF($C42=\"TOTAL\",SUM($V$8:V41),IF(AND($AO$2=$AO$20,C42=$AO$1),ROUND(D42/31*$AP$2,0),IF(C42=$AM$6,ROUND((G42)*1/30,0),IF(C42=$AN$6,ROUND((G42)*1/31,0),\"\")))))","v":""},{"$f":"IF(C42=\"\",\"\",IF($C42=\"TOTAL\",SUM($W$8:W41),IF(AND($AO$2=$AO$20,C42=$AO$1),ROUND(H42/31*$AP$2,0),IF(C42=$AM$6,ROUND((K42)*1/30,0),IF(C42=$AN$6,ROUND((K42)*1/31,0),\"\")))))","v":""},"",{"$f":"IFERROR(IF(C42=\"\",\"\",IF(AND(BH43=\"\",BO43=\"\"),\"\",IF($C42=\"TOTAL\",SUM($Y$8:Y41),BH43))),\"\")","v":""},{"$f":"IFERROR(IF(C42=\"\",\"\",IF($C42=\"TOTAL\",SUM($Z$8:Z41),ROUND(O42*$AO$7%,0))),\"\")","v":""},{"$f":"IFERROR(IF(C42=\"\",\"\",IF($C42=\"TOTAL\",SUM($AA$8:AA41),IF($AC$3=$AL$2,SUM(U42,X42,Y42,Z42),SUM(R42,U42,X42,Y42,Z42)))),\"\")","v":""},{"$f":"IFERROR(IF(C42=\"\",\"\",IF($C42=\"TOTAL\",SUM($AB$8:AB41),SUM(O42-AA42))),\"\")","v":""},{"$nulls":8},34,34,null,"2019-10-01",null,"2023-07-01","","2023-07-01","2023-07-01","","","","",null,"","","","",null,null,"","","","",0,0,{"$nulls":4},2100]
["","","",{"$f":"IFERROR(IF($C42=\"TOTAL\",\"अक्षरें राशि :-\",IF($C43=\"TOTAL\",SUM($D$8:D42),IF(AU44=\"\",\"\",AU44))),\"\")","v":""},{"$f":"IFERROR(IF($C43=\"TOTAL\",SUM($E$8:E42),IF(AV44=\"\",\"\",AV44)),\"\")","v":""},{"$f":"IFERROR(IF($C43=\"TOTAL\",SUM($F$8:F42),IF(OR(C43=$AM$16,C43=$AM$17,C43=$AM$18,C43=$AM$19,C43=$AM$20,C43=$AM$21,C43=$AM$22,C43=$AM$23,C43=$AM$24),0,IF(AW44=\"\",\"\",AW44))),\"\")","v":""},"",{"$f":"IFERROR(IF($C43=\"TOTAL\",SUM($H$8:H42),IF(AY44=\"\",\"\",AY44)),\"\")","v":""},{"$f":"IFERROR(IF($C43=\"TOTAL\",SUM($I$8:I42),IF(AZ44=\"\",\"\",AZ44)),\"\")","v":""},{"$f":"IFERROR(IF($C43=\"TOTAL\",SUM($J$8:J42),IF(OR(C43=$AM$16,C43=$AM$17,C43=$AM$18,C43=$AM$19,C43=$AM$20,C43=$AM$21,C43=$AM$22,C43=$AM$23,C43=$AM$24),0,IF(BA44=\"\",\"\",BA44))),\"\")","v":""},"",{"$f":"IFERROR(IF(C43=\"\",\"\",IF(D43=\"\",\"\",IF(H43=\"\",\"\",IF($C43=\"TOTAL\",SUM($L$8:L42),SUM(D43-H43))))),\"\")","v":""},{"$f":"IFERROR(IF(C43=\"\",\"\",IF(E43=\"\",\"\",IF(I43=\"\",\"\",IF($C43=\"TOTAL\",SUM($M$8:M42),SUM(E43-I43))))),\"\")","v":""},{"$f":"IFERROR(IF(C43=\"\",\"\",IF(F43=\"\",\"\",IF(J43=\"\",\"\",IF($C43=\"TOTAL\",SUM($N$8:N42),SUM(F43-J43))))),\"\")","v":""},"",{"$f":"IFERROR(IF(C43=\"\",\"\",IF($C43=\"TOTAL\",SUM($P$8:P42),IF(AND(C43>$AL$1,$AC$3=$AL$2),BO44,IF($AO$18=$AO$20,SUM(BB44+BJ44),ROUND((D43+E43)*10%,0))))),\"\")","v":""},{"$f":"IFERROR(IF(C43=\"\",\"\",IF(H43=\"\",\"\",IF(I43=\"\",\"\",IF($C43=\"TOTAL\",SUM($Q$8:Q42),IF(AND(C43>$AL$1,$AC$3=$AL$2),BO44,IF($AO$18=$AO$20,$AO$21,ROUND((H43+I43)*10%,0))))))),\"\")","v":""},"",{"$f":"IFERROR(IF(C43=\"\",\"\",IF($AO$16=$AO$17,0,IF($C43=\"TOTAL\",SUM($S$8:S42),IF($AO$19=$AO$31,0,IF(AND($AO$32=$AO$20,C43=$AO$33),$AO$34,S42))))),\"\")","v":""},{"$f":"IFERROR(IF(C43=\"\",\"\",IF($AO$16=$AO$17,0,IF($C43=\"TOTAL\",SUM($T$8:T42),IF($AO$19=$AO$20,$AO$24,0)))),\"\")","v":""},"",{"$f":"IF(C43=\"\",\"\",IF($C43=\"TOTAL\",SUM($V$8:V42),IF(AND($AO$2=$AO$20,C43=$AO$1),ROUND(D43/31*$AP$2,0),IF(C43=$AM$6,ROUND((G43)*1/30,0),IF(C43=$AN$6,ROUND((G43)*1/31,0),\"\")))))","v":""},{"$f":"IF(C43=\"\",\"\",IF($C43=\"TOTAL\",SUM($W$8:W42),IF(AND($AO$2=$AO$20,C43=$AO$1),ROUND(H43/31*$AP$2,0),IF(C43=$AM$6,ROUND((K43)*1/30,0),IF(C43=$AN$6,ROUND((K43)*1/31,0),\"\")))))","v":""},"",{"$f":"IFERROR(IF(C43=\"\",\"\",IF(AND(BH44=\"\",BO44=\"\"),\"\",IF($C43=\"TOTAL\",SUM($Y$8:Y42),BH44))),\"\")","v":""},{"$f":"IFERROR(IF(C43=\"\",\"\",IF($C43=\"TOTAL\",SUM($Z$8:Z42),ROUND(O43*$AO$7%,0))),\"\")","v":""},{"$f":"IFERROR(IF(C43=\"\",\"\",IF($C43=\"TOTAL\",SUM($AA$8:AA42),IF($AC$3=$AL$2,SUM(U43,X43,Y43,Z43),SUM(R43,U43,X43,Y43,Z43)))),\"\")","v":""},{"$f":"IFERROR(IF(C43=\"\",\"\",IF($C43=\"TOTAL\",SUM($AB$8:AB42),SUM(O43-AA43))),\"\")","v":""},{"$nulls":8},34,34,null,"2019-11-01",null,"2023-08-01","","2023-08-01","2023-08-01","","","","",null,"","","","",null,null,"","","","",0,0,{"$nulls":4},2100]
["","","",{"$f":"IFERROR(IF($C43=\"TOTAL\",\"अक्षरें राशि :-\",IF($C44=\"TOTAL\",SUM($D$8:D43),IF(AU45=\"\",\"\",AU45))),\"\")","v":""},{"$f":"IFERROR(IF($C44=\"TOTAL\",SUM($E$8:E43),IF(AV45=\"\",\"\",AV45)),\"\")","v":""},{"$f":"IFERROR(IF($C44=\"TOTAL\",SUM($F$8:F43),IF(OR(C44=$AM$16,C44=$AM$17,C44=$AM$18,C44=$AM$19,C44=$AM$20,C44=$AM$21,C44=$AM$22,C44=$AM$23,C44=$AM$24),0,IF(AW45=\"\",\"\",AW45))),\"\")","v":""},"",{"$f":"IFERROR(IF($C44=\"TOTAL\",SUM($H$8:H43),IF(AY45=\"\",\"\",AY45)),\"\")","v":""},{"$f":"IFERROR(IF($C44=\"TOTAL\",SUM($I$8:I43),IF(AZ45=\"\",\"\",AZ45)),\"\")","v":""},{"$f":"IFERROR(IF($C44=\"TOTAL\",SUM($J$8:J43),IF(OR(C44=$AM$16,C44=$AM$17,C44=$AM$18,C44=$AM$19,C44=$AM$20,C44=$AM$21,C44=$AM$22,C44=$AM$23,C44=$AM$24),0,IF(BA45=\"\",\"\",BA45))),\"\")","v":""},"",{"$f":"IFERROR(IF(C44=\"\",\"\",IF(D44=\"\",\"\",IF(H44=\"\",\"\",IF($C44=\"TOTAL\",SUM($L$8:L43),SUM(D44-H44))))),\"\")","v":""},{"$f":"IFERROR(IF(C44=\"\",\"\",IF(E44=\"\",\"\",IF(I44=\"\",\"\",IF($C44=\"TOTAL\",SUM($M$8:M43),SUM(E44-I44))))),\"\")","v":""},{"$f":"IFERROR(IF(C44=\"\",\"\",IF(F44=\"\",\"\",IF(J44=\"\",\"\",IF($C44=\"TOTAL\",SUM($N$8:N43),SUM(F44-J44))))),\"\")","v":""},"",{"$f":"IFERROR(IF(C44=\"\",\"\",IF($C44=\"TOTAL\",SUM($P$8:P43),IF(AND(C44>$AL$1,$AC$3=$AL$2),BO45,IF($AO$18=$AO$20,SUM(BB45+BJ45),ROUND((D44+E44)*10%,0))))),\"\")","v":""},{"$f":"IFERROR(IF(C44=\"\",\"\",IF(H44=\"\",\"\",IF(I44=\"\",\"\",IF($C44=\"TOTAL\",SUM($Q$8:Q43),IF(AND(C44>$AL$1,$AC$3=$AL$2),BO45,IF($AO$18=$AO$20,$AO$21,ROUND((H44+I44)*10%,0))))))),\"\")","v":""},"",{"$f":"IFERROR(IF(C44=\"\",\"\",IF($AO$16=$AO$17,0,IF($C44=\"TOTAL\",SUM($S$8:S43),IF($AO$19=$AO$31,0,IF(AND($AO$32=$AO$20,C44=$AO$33),$AO$34,S43))))),\"\")","v":""},{"$f":"IFERROR(IF(C44=\"\",\"\",IF($AO$16=$AO$17,0,IF($C44=\"TOTAL\",SUM($T$8:T43),IF($AO$19=$AO$20,$AO$24,0)))),\"\")","v":""},"",{"$f":"IF(C44=\"\",\"\",IF($C44=\"TOTAL\",SUM($V$8:V43),IF(AND($AO$2=$AO$20,C44=$AO$1),ROUND(D44/31*$AP$2,0),IF(C44=$AM$6,ROUND((G44)*1/30,0),IF(C44=$AN$6,ROUND((G44)*1/31,0),\"\")))))","v":""},{"$f":"IF(C44=\"\",\"\",IF($C44=\"TOTAL\",SUM($W$8:W43),IF(AND($AO$2=$AO$20,C44=$AO$1),ROUND(H44/31*$AP$2,0),IF(C44=$AM$6,ROUND((K44)*1/30,0),IF(C44=$AN$6,ROUND((K44)*1/31,0),\"\")))))","v":""},"",{"$f":"IFERROR(IF(C44=\"\",\"\",IF(AND(BH45=\"\",BO45=\"\"),\"\",IF($C44=\"TOTAL\",SUM($Y$8:Y43),BH45))),\"\")","v":""},{"$f":"IFERROR(IF(C44=\"\",\"\",IF($C44=\"TOTAL\",SUM($Z$8:Z43),ROUND(O44*$AO$7%,0))),\"\")","v":""},{"$f":"IFERROR(IF(C44=\"\",\"\",IF($C44=\"TOTAL\",SUM($AA$8:AA43),IF($AC$3=$AL$2,SUM(U44,X44,Y44,Z44),SUM(R44,U44,X44,Y44,Z44)))),\"\")","v":""},{"$f":"IFERROR(IF(C44=\"\",\"\",IF($C44=\"TOTAL\",SUM($AB$8:AB43),SUM(O44-AA44))),\"\")","v":""},{"$nulls":8},34,34,null,"2019-12-01",null,"2023-09-01","","2023-09-01","2023-09-01","","","","",null,"","","","",null,null,"","","","",0,0,{"$nulls":4},2100]
["","","",{"$f":"IFERROR(IF($C44=\"TOTAL\",\"अक्षरें राशि :-\",IF($C45=\"TOTAL\",SUM($D$8:D44),IF(AU46=\"\",\"\",AU46))),\"\")","v":""},{"$f":"IFERROR(IF($C45=\"TOTAL\",SUM($E$8:E44),IF(AV46=\"\",\"\",AV46)),\"\")","v":""},{"$f":"IFERROR(IF($C45=\"TOTAL\",SUM($F$8:F44),IF(OR(C45=$AM$16,C45=$AM$17,C45=$AM$18,C45=$AM$19,C45=$AM$20,C45=$AM$21,C45=$AM$22,C45=$AM$23,C45=$AM$24),0,IF(AW46=\"\",\"\",AW46))),\"\")","v":""},"",{"$f":"IFERROR(IF($C45=\"TOTAL\",SUM($H$8:H44),IF(AY46=\"\",\"\",AY46)),\"\")","v":""},{"$f":"IFERROR(IF($C45=\"TOTAL\",SUM($I$8:I44),IF(AZ46=\"\",\"\",AZ46)),\"\")","v":""},{"$f":"IFERROR(IF($C45=\"TOTAL\",SUM($J$8:J44),IF(OR(C45=$AM$16,C45=$AM$17,C45=$AM$18,C45=$AM$19,C45=$AM$20,C45=$AM$21,C45=$AM$22,C45=$AM$23,C45=$AM$24),0,IF(BA46=\"\",\"\",BA46))),\"\")","v":""},"",{"$f":"IFERROR(IF(C45=\"\",\"\",IF(D45=\"\",\"\",IF(H45=\"\",\"\",IF($C45=\"TOTAL\",SUM($L$8:L44),SUM(D45-H45))))),\"\")","v":""},{"$f":"IFERROR(IF(C45=\"\",\"\",IF(E45=\"\",\"\",IF(I45=\"\",\"\",IF($C45=\"TOTAL\",SUM($M$8:M44),SUM(E45-I45))))),\"\")","v":""},{"$f":"IFERROR(IF(C45=\"\",\"\",IF(F45=\"\",\"\",IF(J45=\"\",\"\",IF($C45=\"TOTAL\",SUM($N$8:N44),SUM(F45-J45))))),\"\")","v":""},"",{"$f":"IFERROR(IF(C45=\"\",\"\",IF($C45=\"TOTAL\",SUM($P$8:P44),IF(AND(C45>$AL$1,$AC$3=$AL$2),BO46,IF($AO$18=$AO$20,SUM(BB46+BJ46),ROUND((D45+E45)*10%,0))))),\"\")","v":""},{"$f":"IFERROR(IF(C45=\"\",\"\",IF(H45=\"\",\"\",IF(I45=\"\",\"\",IF($C45=\"TOTAL\",SUM($Q$8:Q44),IF(AND(C45>$AL$1,$AC$3=$AL$2),BO46,IF($AO$18=$AO$20,$AO$21,ROUND((H45+I45)*10%,0))))))),\"\")","v":""},"",{"$f":"IFERROR(IF(C45=\"\",\"\",IF($AO$16=$AO$17,0,IF($C45=\"TOTAL\",SUM($S$8:S44),IF($AO$19=$AO$31,0,IF(AND($AO$32=$AO$20,C45=$AO$33),$AO$34,S44))))),\"\")","v":""},{"$f":"IFERROR(IF(C45=\"\",\"\",IF($AO$16=$AO$17,0,IF($C45=\"TOTAL\",SUM($T$8:T44),IF($AO$19=$AO$20,$AO$24,0)))),\"\")","v":""},"",{"$f":"IF(C45=\"\",\"\",IF($C45=\"TOTAL\",SUM($V$8:V44),IF(AND($AO$2=$AO$20,C45=$AO$1),ROUND(D45/31*$AP$2,0),IF(C45=$AM$6,ROUND((G45)*1/30,0),IF(C45=$AN$6,ROUND((G45)*1/31,0),\"\")))))","v":""},{"$f":"IF(C45=\"\",\"\",IF($C45=\"TOTAL\",SUM($W$8:W44),IF(AND($AO$2=$AO$20,C45=$AO$1),ROUND(H45/31*$AP$2,0),IF(C45=$AM$6,ROUND((K45)*1/30,0),IF(C45=$AN$6,ROUND((K45)*1/31,0),\"\")))))","v":""},"",{"$f":"IFERROR(IF(C45=\"\",\"\",IF(AND(BH46=\"\",BO46=\"\"),\"\",IF($C45=\"TOTAL\",SUM($Y$8:Y44),BH46))),\"\")","v":""},{"$f":"IFERROR(IF(C45=\"\",\"\",IF($C45=\"TOTAL\",SUM($Z$8:Z44),ROUND(O45*$AO$7%,0))),\"\")","v":""},{"$f":"IFERROR(IF(C45=\"\",\"\",IF($C45=\"TOTAL\",SUM($AA$8:AA44),IF($AC$3=$AL$2,SUM(U45,X45,Y45,Z45),SUM(R45,U45,X45,Y45,Z45)))),\"\")","v":""},{"$f":"IFERROR(IF(C45=\"\",\"\",IF($C45=\"TOTAL\",SUM($AB$8:AB44),SUM(O45-AA45))),\"\")","v":""},{"$nulls":8},34,34,null,"2020-01-01",null,"2023-10-01","","2023-10-01","2023-10-01","","","","",null,"","","","",null,null,"","","","",0,0,{"$nulls":4},2100]
["","","",{"$f":"IFERROR(IF($C45=\"TOTAL\",\"अक्षरें राशि :-\",IF($C46=\"TOTAL\",SUM($D$8:D45),IF(AU47=\"\",\"\",AU47))),\"\")","v":""},{"$f":"IFERROR(IF($C46=\"TOTAL\",SUM($E$8:E45),IF(AV47=\"\",\"\",AV47)),\"\")","v":""},{"$f":"IFERROR(IF($C46=\"TOTAL\",SUM($F$8:F45),IF(OR(C46=$AM$16,C46=$AM$17,C46=$AM$18,C46=$AM$19,C46=$AM$20,C46=$AM$21,C46=$AM$22,C46=$AM$23,C46=$AM$24),0,IF(AW47=\"\",\"\",AW47))),\"\")","v":""},"",{"$f":"IFERROR(IF($C46=\"TOTAL\",SUM($H$8:H45),IF(AY47=\"\",\"\",AY47)),\"\")","v":""},{"$f":"IFERROR(IF($C46=\"TOTAL\",SUM($I$8:I45),IF(AZ47=\"\",\"\",AZ47)),\"\")","v":""},{"$f":"IFERROR(IF($C46=\"TOTAL\",SUM($J$8:J45),IF(OR(C46=$AM$16,C46=$AM$17,C46=$AM$18,C46=$AM$19,C46=$AM$20,C46=$AM$21,C46=$AM$22,C46=$AM$23,C46=$AM$24),0,IF(BA47=\"\",\"\",BA47))),\"\")","v":""},"",{"$f":"IFERROR(IF(C46=\"\",\"\",IF(D46=\"\",\"\",IF(H46=\"\",\"\",IF($C46=\"TOTAL\",SUM($L$8:L45),SUM(D46-H46))))),\"\")","v":""},{"$f":"IFERROR(IF(C46=\"\",\"\",IF(E46=\"\",\"\",IF(I46=\"\",\"\",IF($C46=\"TOTAL\",SUM($M$8:M45),SUM(E46-I46))))),\"\")","v":""},{"$f":"IFERROR(IF(C46=\"\",\"\",IF(F46=\"\",\"\",IF(J46=\"\",\"\",IF($C46=\"TOTAL\",SUM($N$8:N45),SUM(F46-J46))))),\"\")","v":""},"",{"$f":"IFERROR(IF(C46=\"\",\"\",IF($C46=\"TOTAL\",SUM($P$8:P45),IF(AND(C46>$AL$1,$AC$3=$AL$2),BO47,IF($AO$18=$AO$20,SUM(BB47+BJ47),ROUND((D46+E46)*10%,0))))),\"\")","v":""},{"$f":"IFERROR(IF(C46=\"\",\"\",IF(H46=\"\",\"\",IF(I46=\"\",\"\",IF($C46=\"TOTAL\",SUM($Q$8:Q45),IF(AND(C46>$AL$1,$AC$3=$AL$2),BO47,IF($AO$18=$AO$20,$AO$21,ROUND((H46+I46)*10%,0))))))),\"\")","v":""},"",{"$f":"IFERROR(IF(C46=\"\",\"\",IF($AO$16=$AO$17,0,IF($C46=\"TOTAL\",SUM($S$8:S45),IF($AO$19=$AO$31,0,IF(AND($AO$32=$AO$20,C46=$AO$33),$AO$34,S45))))),\"\")","v":""},{"$f":"IFERROR(IF(C46=\"\",\"\",IF($AO$16=$AO$17,0,IF($C46=\"TOTAL\",SUM($T$8:T45),IF($AO$19=$AO$20,$AO$24,0)))),\"\")","v":""},"",{"$f":"IF(C46=\"\",\"\",IF($C46=\"TOTAL\",SUM($V$8:V45),IF(AND($AO$2=$AO$20,C46=$AO$1),ROUND(D46/31*$AP$2,0),IF(C46=$AM$6,ROUND((G46)*1/30,0),IF(C46=$AN$6,ROUND((G46)*1/31,0),\"\")))))","v":""},{"$f":"IF(C46=\"\",\"\",IF($C46=\"TOTAL\",SUM($W$8:W45),IF(AND($AO$2=$AO$20,C46=$AO$1),ROUND(H46/31*$AP$2,0),IF(C46=$AM$6,ROUND((K46)*1/30,0),IF(C46=$AN$6,ROUND((K46)*1/31,0),\"\")))))","v":""},"",{"$f":"IFERROR(IF(C46=\"\",\"\",IF(AND(BH47=\"\",BO47=\"\"),\"\",IF($C46=\"TOTAL\",SUM($Y$8:Y45),BH47))),\"\")","v":""},{"$f":"IFERROR(IF(C46=\"\",\"\",IF($C46=\"TOTAL\",SUM($Z$8:Z45),ROUND(O46*$AO$7%,0))),\"\")","v":""},{"$f":"IFERROR(IF(C46=\"\",\"\",IF($C46=\"TOTAL\",SUM($AA$8:AA45),IF($AC$3=$AL$2,SUM(U46,X46,Y46,Z46),SUM(R46,U46,X46,Y46,Z46)))),\"\")","v":""},{"$f":"IFERROR(IF(C46=\"\",\"\",IF($C46=\"TOTAL\",SUM($AB$8:AB45),SUM(O46-AA46))),\"\")","v":""},{"$nulls":8},34,34,null,"2020-02-01",null,"2023-11-01","","2023-11-01","2023-11-01","","","","",null,"","","","",null,null,"","","","",0,0,{"$nulls":4},2100]
["","","",{"$f":"IFERROR(IF($C46=\"TOTAL\",\"अक्षरें राशि :-\",IF($C47=\"TOTAL\",SUM($D$8:D46),IF(AU48=\"\",\"\",AU48))),\"\")","v":""},{"$f":"IFERROR(IF($C47=\"TOTAL\",SUM($E$8:E46),IF(AV48=\"\",\"\",AV48)),\"\")","v":""},{"$f":"IFERROR(IF($C47=\"TOTAL\",SUM($F$8:F46),IF(OR(C47=$AM$16,C47=$AM$17,C47=$AM$18,C47=$AM$19,C47=$AM$20,C47=$AM$21,C47=$AM$22,C47=$AM$23,C47=$AM$24),0,IF(AW48=\"\",\"\",AW48))),\"\")","v":""},"",{"$f":"IFERROR(IF($C47=\"TOTAL\",SUM($H$8:H46),IF(AY48=\"\",\"\",AY48)),\"\")","v":""},{"$f":"IFERROR(IF($C47=\"TOTAL\",SUM($I$8:I46),IF(AZ48=\"\",\"\",AZ48)),\"\")","v":""},{"$f":"IFERROR(IF($C47=\"TOTAL\",SUM($J$8:J46),IF(OR(C47=$AM$16,C47=$AM$17,C47=$AM$18,C47=$AM$19,C47=$AM$20,C47=$AM$21,C47=$AM$22,C47=$AM$23,C47=$AM$24),0,IF(BA48=\"\",\"\",BA48))),\"\")","v":""},"",{"$f":"IFERROR(IF(C47=\"\",\"\",IF(D47=\"\",\"\",IF(H47=\"\",\"\",IF($C47=\"TOTAL\",SUM($L$8:L46),SUM(D47-H47))))),\"\")","v":""},{"$f":"IFERROR(IF(C47=\"\",\"\",IF(E47=\"\",\"\",IF(I47=\"\",\"\",IF($C47=\"TOTAL\",SUM($M$8:M46),SUM(E47-I47))))),\"\")","v":""},{"$f":"IFERROR(IF(C47=\"\",\"\",IF(F47=\"\",\"\",IF(J47=\"\",\"\",IF($C47=\"TOTAL\",SUM($N$8:N46),SUM(F47-J47))))),\"\")","v":""},"",{"$f":"IFERROR(IF(C47=\"\",\"\",IF($C47=\"TOTAL\",SUM($P$8:P46),IF(AND(C47>$AL$1,$AC$3=$AL$2),BO48,IF($AO$18=$AO$20,SUM(BB48+BJ48),ROUND((D47+E47)*10%,0))))),\"\")","v":""},{"$f":"IFERROR(IF(C47=\"\",\"\",IF(H47=\"\",\"\",IF(I47=\"\",\"\",IF($C47=\"TOTAL\",SUM($Q$8:Q46),IF(AND(C47>$AL$1,$AC$3=$AL$2),BO48,IF($AO$18=$AO$20,$AO$21,ROUND((H47+I47)*10%,0))))))),\"\")","v":""},"",{"$f":"IFERROR(IF(C47=\"\",\"\",IF($AO$16=$AO$17,0,IF($C47=\"TOTAL\",SUM($S$8:S46),IF($AO$19=$AO$31,0,IF(AND($AO$32=$AO$20,C47=$AO$33),$AO$34,S46))))),\"\")","v":""},{"$f":"IFERROR(IF(C47=\"\",\"\",IF($AO$16=$AO$17,0,IF($C47=\"TOTAL\",SUM($T$8:T46),IF($AO$19=$AO$20,$AO$24,0)))),\"\")","v":""},"",{"$f":"IF(C47=\"\",\"\",IF($C47=\"TOTAL\",SUM($V$8:V46),IF(AND($AO$2=$AO$20,C47=$AO$1),ROUND(D47/31*$AP$2,0),IF(C47=$AM$6,ROUND((G47)*1/30,0),IF(C47=$AN$6,ROUND((G47)*1/31,0),\"\")))))","v":""},{"$f":"IF(C47=\"\",\"\",IF($C47=\"TOTAL\",SUM($W$8:W46),IF(AND($AO$2=$AO$20,C47=$AO$1),ROUND(H47/31*$AP$2,0),IF(C47=$AM$6,ROUND((K47)*1/30,0),IF(C47=$AN$6,ROUND((K47)*1/31,0),\"\")))))","v":""},"",{"$f":"IFERROR(IF(C47=\"\",\"\",IF(AND(BH48=\"\",BO48=\"\"),\"\",IF($C47=\"TOTAL\",SUM($Y$8:Y46),BH48))),\"\")","v":""},{"$f":"IFERROR(IF(C47=\"\",\"\",IF($C47=\"TOTAL\",SUM($Z$8:Z46),ROUND(O47*$AO$7%,0))),\"\")","v":""},{"$f":"IFERROR(IF(C47=\"\",\"\",IF($C47=\"TOTAL\",SUM($AA$8:AA46),IF($AC$3=$AL$2,SUM(U47,X47,Y47,Z47),SUM(R47,U47,X47,Y47,Z47)))),\"\")","v":""},{"$f":"IFERROR(IF(C47=\"\",\"\",IF($C47=\"TOTAL\",SUM($AB$8:AB46),SUM(O47-AA47))),\"\")","v":""},{"$nulls":8},34,34,null,"2020-03-01",null,"2023-12-01","","","","","","","",null,"","","","",null,null,"","","","",0,0,{"$nulls":4},2100]
["","","",{"$f":"IFERROR(IF($C47=\"TOTAL\",\"अक्षरें राशि :-\",IF($C48=\"TOTAL\",SUM($D$8:D47),IF(AU49=\"\",\"\",AU49))),\"\")","v":""},{"$f":"IFERROR(IF($C48=\"TOTAL\",SUM($E$8:E47),IF(AV49=\"\",\"\",AV49)),\"\")","v":""},{"$f":"IFERROR(IF($C48=\"TOTAL\",SUM($F$8:F47),IF(OR(C48=$AM$16,C48=$AM$17,C48=$AM$18,C48=$AM$19,C48=$AM$20,C48=$AM$21,C48=$AM$22,C48=$AM$23,C48=$AM$24),0,IF(AW49=\"\",\"\",AW49))),\"\")","v":""},"",{"$f":"IFERROR(IF($C48=\"TOTAL\",SUM($H$8:H47),IF(AY49=\"\",\"\",AY49)),\"\")","v":""},{"$f":"IFERROR(IF($C48=\"TOTAL\",SUM($I$8:I47),IF(AZ49=\"\",\"\",AZ49)),\"\")","v":""},{"$f":"IFERROR(IF($C48=\"TOTAL\",SUM($J$8:J47),IF(OR(C48=$AM$16,C48=$AM$17,C48=$AM$18,C48=$AM$19,C48=$AM$20,C48=$AM$21,C48=$AM$22,C48=$AM$23,C48=$AM$24),0,IF(BA49=\"\",\"\",BA49))),\"\")","v":""},"",{"$f":"IFERROR(IF(C48=\"\",\"\",IF(D48=\"\",\"\",IF(H48=\"\",\"\",IF($C48=\"TOTAL\",SUM($L$8:L47),SUM(D48-H48))))),\"\")","v":""},{"$f":"IFERROR(IF(C48=\"\",\"\",IF(E48=\"\",\"\",IF(I48=\"\",\"\",IF($C48=\"TOTAL\",SUM($M$8:M47),SUM(E48-I48))))),\"\")","v":""},{"$f":"IFERROR(IF(C48=\"\",\"\",IF(F48=\"\",\"\",IF(J48=\"\",\"\",IF($C48=\"TOTAL\",SUM($N$8:N47),SUM(F48-J48))))),\"\")","v":""},"",{"$f":"IFERROR(IF(C48=\"\",\"\",IF($C48=\"TOTAL\",SUM($P$8:P47),IF(AND(C48>$AL$1,$AC$3=$AL$2),BO49,IF($AO$18=$AO$20,SUM(BB49+BJ49),ROUND((D48+E48)*10%,0))))),\"\")","v":""},{"$f":"IFERROR(IF(C48=\"\",\"\",IF(H48=\"\",\"\",IF(I48=\"\",\"\",IF($C48=\"TOTAL\",SUM($Q$8:Q47),IF(AND(C48>$AL$1,$AC$3=$AL$2),BO49,IF($AO$18=$AO$20,$AO$21,ROUND((H48+I48)*10%,0))))))),\"\")","v":""},"",{"$f":"IFERROR(IF(C48=\"\",\"\",IF($AO$16=$AO$17,0,IF($C48=\"TOTAL\",SUM($S$8:S47),IF($AO$19=$AO$31,0,IF(AND($AO$32=$AO$20,C48=$AO$33),$AO$34,S47))))),\"\")","v":""},{"$f":"IFERROR(IF(C48=\"\",\"\",IF($AO$16=$AO$17,0,IF($C48=\"TOTAL\",SUM($T$8:T47),IF($AO$19=$AO$20,$AO$24,0)))),\"\")","v":""},"",{"$f":"IF(C48=\"\",\"\",IF($C48=\"TOTAL\",SUM($V$8:V47),IF(AND($AO$2=$AO$20,C48=$AO$1),ROUND(D48/31*$AP$2,0),IF(C48=$AM$6,ROUND((G48)*1/30,0),IF(C48=$AN$6,ROUND((G48)*1/31,0),\"\")))))","v":""},{"$f":"IF(C48=\"\",\"\",IF($C48=\"TOTAL\",SUM($W$8:W47),IF(AND($AO$2=$AO$20,C48=$AO$1),ROUND(H48/31*$AP$2,0),IF(C48=$AM$6,ROUND((K48)*1/30,0),IF(C48=$AN$6,ROUND((K48)*1/31,0),\"\")))))","v":""},"",{"$f":"IFERROR(IF(C48=\"\",\"\",IF(AND(BH49=\"\",BO49=\"\"),\"\",IF($C48=\"TOTAL\",SUM($Y$8:Y47),BH49))),\"\")","v":""},{"$f":"IFERROR(IF(C48=\"\",\"\",IF($C48=\"TOTAL\",SUM($Z$8:Z47),ROUND(O48*$AO$7%,0))),\"\")","v":""},{"$f":"IFERROR(IF(C48=\"\",\"\",IF($C48=\"TOTAL\",SUM($AA$8:AA47),IF($AC$3=$AL$2,SUM(U48,X48,Y48,Z48),SUM(R48,U48,X48,Y48,Z48)))),\"\")","v":""},{"$f":"IFERROR(IF(C48=\"\",\"\",IF($C48=\"TOTAL\",SUM($AB$8:AB47),SUM(O48-AA48))),\"\")","v":""},{"$nulls":8},34,34,null,"2020-04-01",null,"2024-01-01","","","","","","","",null,"","","","",null,null,"","","","",0,0,{"$nulls":4},2100]
["","","",{"$f":"IFERROR(IF($C48=\"TOTAL\",\"अक्षरें राशि :-\",IF($C49=\"TOTAL\",SUM($D$8:D48),IF(AU50=\"\",\"\",AU50))),\"\")","v":""},{"$f":"IFERROR(IF($C49=\"TOTAL\",SUM($E$8:E48),IF(AV50=\"\",\"\",AV50)),\"\")","v":""},{"$f":"IFERROR(IF($C49=\"TOTAL\",SUM($F$8:F48),IF(OR(C49=$AM$16,C49=$AM$17,C49=$AM$18,C49=$AM$19,C49=$AM$20,C49=$AM$21,C49=$AM$22,C49=$AM$23,C49=$AM$24),0,IF(AW50=\"\",\"\",AW50))),\"\")","v":""},"",{"$f":"IFERROR(IF($C49=\"TOTAL\",SUM($H$8:H48),IF(AY50=\"\",\"\",AY50)),\"\")","v":""},{"$f":"IFERROR(IF($C49=\"TOTAL\",SUM($I$8:I48),IF(AZ50=\"\",\"\",AZ50)),\"\")","v":""},{"$f":"IFERROR(IF($C49=\"TOTAL\",SUM($J$8:J48),IF(OR(C49=$AM$16,C49=$AM$17,C49=$AM$18,C49=$AM$19,C49=$AM$20,C49=$AM$21,C49=$AM$22,C49=$AM$23,C49=$AM$24),0,IF(BA50=\"\",\"\",BA50))),\"\")","v":""},"",{"$f":"IFERROR(IF(C49=\"\",\"\",IF(D49=\"\",\"\",IF(H49=\"\",\"\",IF($C49=\"TOTAL\",SUM($L$8:L48),SUM(D49-H49))))),\"\")","v":""},{"$f":"IFERROR(IF(C49=\"\",\"\",IF(E49=\"\",\"\",IF(I49=\"\",\"\",IF($C49=\"TOTAL\",SUM($M$8:M48),SUM(E49-I49))))),\"\")","v":""},{"$f":"IFERROR(IF(C49=\"\",\"\",IF(F49=\"\",\"\",IF(J49=\"\",\"\",IF($C49=\"TOTAL\",SUM($N$8:N48),SUM(F49-J49))))),\"\")","v":""},"",{"$f":"IFERROR(IF(C49=\"\",\"\",IF($C49=\"TOTAL\",SUM($P$8:P48),IF(AND(C49>$AL$1,$AC$3=$AL$2),BO50,IF($AO$18=$AO$20,SUM(BB50+BJ50),ROUND((D49+E49)*10%,0))))),\"\")","v":""},{"$f":"IFERROR(IF(C49=\"\",\"\",IF(H49=\"\",\"\",IF(I49=\"\",\"\",IF($C49=\"TOTAL\",SUM($Q$8:Q48),IF(AND(C49>$AL$1,$AC$3=$AL$2),BO50,IF($AO$18=$AO$20,$AO$21,ROUND((H49+I49)*10%,0))))))),\"\")","v":""},"",{"$f":"IFERROR(IF(C49=\"\",\"\",IF($AO$16=$AO$17,0,IF($C49=\"TOTAL\",SUM($S$8:S48),IF($AO$19=$AO$31,0,IF(AND($AO$32=$AO$20,C49=$AO$33),$AO$34,S48))))),\"\")","v":""},{"$f":"IFERROR(IF(C49=\"\",\"\",IF($AO$16=$AO$17,0,IF($C49=\"TOTAL\",SUM($T$8:T48),IF($AO$19=$AO$20,$AO$24,0)))),\"\")","v":""},"",{"$f":"IF(C49=\"\",\"\",IF($C49=\"TOTAL\",SUM($V$8:V48),IF(AND($AO$2=$AO$20,C49=$AO$1),ROUND(D49/31*$AP$2,0),IF(C49=$AM$6,ROUND((G49)*1/30,0),IF(C49=$AN$6,ROUND((G49)*1/31,0),\"\")))))","v":""},{"$f":"IF(C49=\"\",\"\",IF($C49=\"TOTAL\",SUM($W$8:W48),IF(AND($AO$2=$AO$20,C49=$AO$1),ROUND(H49/31*$AP$2,0),IF(C49=$AM$6,ROUND((K49)*1/30,0),IF(C49=$AN$6,ROUND((K49)*1/31,0),\"\")))))","v":""},"",{"$f":"IFERROR(IF(C49=\"\",\"\",IF(AND(BH50=\"\",BO50=\"\"),\"\",IF($C49=\"TOTAL\",SUM($Y$8:Y48),BH50))),\"\")","v":""},{"$f":"IFERROR(IF(C49=\"\",\"\",IF($C49=\"TOTAL\",SUM($Z$8:Z48),ROUND(O49*$AO$7%,0))),\"\")","v":""},{"$f":"IFERROR(IF(C49=\"\",\"\",IF($C49=\"TOTAL\",SUM($AA$8:AA48),IF($AC$3=$AL$2,SUM(U49,X49,Y49,Z49),SUM(R49,U49,X49,Y49,Z49)))),\"\")","v":""},{"$f":"IFERROR(IF(C49=\"\",\"\",IF($C49=\"TOTAL\",SUM($AB$8:AB48),SUM(O49-AA49))),\"\")","v":""},{"$nulls":8},34,34,null,"2020-05-01",null,"2024-02-01","","","","","","","",null,"","","","",null,null,"","","","",0,0,{"$nulls":4},2100]
["","","",{"$f":"IFERROR(IF($C49=\"TOTAL\",\"अक्षरें राशि :-\",IF($C50=\"TOTAL\",SUM($D$8:D49),IF(AU51=\"\",\"\",AU51))),\"\")","v":""},{"$f":"IFERROR(IF($C50=\"TOTAL\",SUM($E$8:E49),IF(AV51=\"\",\"\",AV51)),\"\")","v":""},{"$f":"IFERROR(IF($C50=\"TOTAL\",SUM($F$8:F49),IF(OR(C50=$AM$16,C50=$AM$17,C50=$AM$18,C50=$AM$19,C50=$AM$20,C50=$AM$21,C50=$AM$22,C50=$AM$23,C50=$AM$24),0,IF(AW51=\"\",\"\",AW51))),\"\")","v":""},"",{"$f":"IFERROR(IF($C50=\"TOTAL\",SUM($H$8:H49),IF(AY51=\"\",\"\",AY51)),\"\")","v":""},{"$f":"IFERROR(IF($C50=\"TOTAL\",SUM($I$8:I49),IF(AZ51=\"\",\"\",AZ51)),\"\")","v":""},{"$f":"IFERROR(IF($C50=\"TOTAL\",SUM($J$8:J49),IF(OR(C50=$AM$16,C50=$AM$17,C50=$AM$18,C50=$AM$19,C50=$AM$20,C50=$AM$21,C50=$AM$22,C50=$AM$23,C50=$AM$24),0,IF(BA51=\"\",\"\",BA51))),\"\")","v":""},"",{"$f":"IFERROR(IF(C50=\"\",\"\",IF(D50=\"\",\"\",IF(H50=\"\",\"\",IF($C50=\"TOTAL\",SUM($L$8:L49),SUM(D50-H50))))),\"\")","v":""},{"$f":"IFERROR(IF(C50=\"\",\"\",IF(E50=\"\",\"\",IF(I50=\"\",\"\",IF($C50=\"TOTAL\",SUM($M$8:M49),SUM(E50-I50))))),\"\")","v":""},{"$f":"IFERROR(IF(C50=\"\",\"\",IF(F50=\"\",\"\",IF(J50=\"\",\"\",IF($C50=\"TOTAL\",SUM($N$8:N49),SUM(F50-J50))))),\"\")","v":""},"",{"$f":"IFERROR(IF(C50=\"\",\"\",IF($C50=\"TOTAL\",SUM($P$8:P49),IF(AND(C50>$AL$1,$AC$3=$AL$2),BO51,IF($AO$18=$AO$20,SUM(BB51+BJ51),ROUND((D50+E50)*10%,0))))),\"\")","v":""},{"$f":"IFERROR(IF(C50=\"\",\"\",IF(H50=\"\",\"\",IF(I50=\"\",\"\",IF($C50=\"TOTAL\",SUM($Q$8:Q49),IF(AND(C50>$AL$1,$AC$3=$AL$2),BO51,IF($AO$18=$AO$20,$AO$21,ROUND((H50+I50)*10%,0))))))),\"\")","v":""},"",{"$f":"IFERROR(IF(C50=\"\",\"\",IF($AO$16=$AO$17,0,IF($C50=\"TOTAL\",SUM($S$8:S49),IF($AO$19=$AO$31,0,IF(AND($AO$32=$AO$20,C50=$AO$33),$AO$34,S49))))),\"\")","v":""},{"$f":"IFERROR(IF(C50=\"\",\"\",IF($AO$16=$AO$17,0,IF($C50=\"TOTAL\",SUM($T$8:T49),IF($AO$19=$AO$20,$AO$24,0)))),\"\")","v":""},"",{"$f":"IF(C50=\"\",\"\",IF($C50=\"TOTAL\",SUM($V$8:V49),IF(AND($AO$2=$AO$20,C50=$AO$1),ROUND(D50/31*$AP$2,0),IF(C50=$AM$6,ROUND((G50)*1/30,0),IF(C50=$AN$6,ROUND((G50)*1/31,0),\"\")))))","v":""},{"$f":"IF(C50=\"\",\"\",IF($C50=\"TOTAL\",SUM($W$8:W49),IF(AND($AO$2=$AO$20,C50=$AO$1),ROUND(H50/31*$AP$2,0),IF(C50=$AM$6,ROUND((K50)*1/30,0),IF(C50=$AN$6,ROUND((K50)*1/31,0),\"\")))))","v":""},"",{"$f":"IFERROR(IF(C50=\"\",\"\",IF(AND(BH51=\"\",BO51=\"\"),\"\",IF($C50=\"TOTAL\",SUM($Y$8:Y49),BH51))),\"\")","v":""},{"$f":"IFERROR(IF(C50=\"\",\"\",IF($C50=\"TOTAL\",SUM($Z$8:Z49),ROUND(O50*$AO$7%,0))),\"\")","v":""},{"$f":"IFERROR(IF(C50=\"\",\"\",IF($C50=\"TOTAL\",SUM($AA$8:AA49),IF($AC$3=$AL$2,SUM(U50,X50,Y50,Z50),SUM(R50,U50,X50,Y50,Z50)))),\"\")","v":""},{"$f":"IFERROR(IF(C50=\"\",\"\",IF($C50=\"TOTAL\",SUM($AB$8:AB49),SUM(O50-AA50))),\"\")","v":""},{"$nulls":8},34,34,null,"2020-06-01",null,"2024-03-01","","","","","","","",null,"","","","",null,null,"","","","",0,0,{"$nulls":4},2100]
["","","",{"$f":"IFERROR(IF($C50=\"TOTAL\",\"अक्षरें राशि :-\",IF($C51=\"TOTAL\",SUM($D$8:D50),IF(AU52=\"\",\"\",AU52))),\"\")","v":""},{"$f":"IFERROR(IF($C51=\"TOTAL\",SUM($E$8:E50),IF(AV52=\"\",\"\",AV52)),\"\")","v":""},{"$f":"IFERROR(IF($C51=\"TOTAL\",SUM($F$8:F50),IF(OR(C51=$AM$16,C51=$AM$17,C51=$AM$18,C51=$AM$19,C51=$AM$20,C51=$AM$21,C51=$AM$22,C51=$AM$23,C51=$AM$24),0,IF(AW52=\"\",\"\",AW52))),\"\")","v":""},"",{"$f":"IFERROR(IF($C51=\"TOTAL\",SUM($H$8:H50),IF(AY52=\"\",\"\",AY52)),\"\")","v":""},{"$f":"IFERROR(IF($C51=\"TOTAL\",SUM($I$8:I50),IF(AZ52=\"\",\"\",AZ52)),\"\")","v":""},{"$f":"IFERROR(IF($C51=\"TOTAL\",SUM($J$8:J50),IF(OR(C51=$AM$16,C51=$AM$17,C51=$AM$18,C51=$AM$19,C51=$AM$20,C51=$AM$21,C51=$AM$22,C51=$AM$23,C51=$AM$24),0,IF(BA52=\"\",\"\",BA52))),\"\")","v":""},"",{"$f":"IFERROR(IF(C51=\"\",\"\",IF(D51=\"\",\"\",IF(H51=\"\",\"\",IF($C51=\"TOTAL\",SUM($L$8:L50),SUM(D51-H51))))),\"\")","v":""},{"$f":"IFERROR(IF(C51=\"\",\"\",IF(E51=\"\",\"\",IF(I51=\"\",\"\",IF($C51=\"TOTAL\",SUM($M$8:M50),SUM(E51-I51))))),\"\")","v":""},{"$f":"IFERROR(IF(C51=\"\",\"\",IF(F51=\"\",\"\",IF(J51=\"\",\"\",IF($C51=\"TOTAL\",SUM($N$8:N50),SUM(F51-J51))))),\"\")","v":""},"",{"$f":"IFERROR(IF(C51=\"\",\"\",IF($C51=\"TOTAL\",SUM($P$8:P50),IF(AND(C51>$AL$1,$AC$3=$AL$2),BO52,IF($AO$18=$AO$20,SUM(BB52+BJ52),ROUND((D51+E51)*10%,0))))),\"\")","v":""},{"$f":"IFERROR(IF(C51=\"\",\"\",IF(H51=\"\",\"\",IF(I51=\"\",\"\",IF($C51=\"TOTAL\",SUM($Q$8:Q50),IF(AND(C51>$AL$1,$AC$3=$AL$2),BO52,IF($AO$18=$AO$20,$AO$21,ROUND((H51+I51)*10%,0))))))),\"\")","v":""},"",{"$f":"IFERROR(IF(C51=\"\",\"\",IF($AO$16=$AO$17,0,IF($C51=\"TOTAL\",SUM($S$8:S50),IF($AO$19=$AO$31,0,IF(AND($AO$32=$AO$20,C51=$AO$33),$AO$34,S50))))),\"\")","v":""},{"$f":"IFERROR(IF(C51=\"\",\"\",IF($AO$16=$AO$17,0,IF($C51=\"TOTAL\",SUM($T$8:T50),IF($AO$19=$AO$20,$AO$24,0)))),\"\")","v":""},"",{"$f":"IF(C51=\"\",\"\",IF($C51=\"TOTAL\",SUM($V$8:V50),IF(AND($AO$2=$AO$20,C51=$AO$1),ROUND(D51/31*$AP$2,0),IF(C51=$AM$6,ROUND((G51)*1/30,0),IF(C51=$AN$6,ROUND((G51)*1/31,0),\"\")))))","v":""},{"$f":"IF(C51=\"\",\"\",IF($C51=\"TOTAL\",SUM($W$8:W50),IF(AND($AO$2=$AO$20,C51=$AO$1),ROUND(H51/31*$AP$2,0),IF(C51=$AM$6,ROUND((K51)*1/30,0),IF(C51=$AN$6,ROUND((K51)*1/31,0),\"\")))))","v":""},"",{"$f":"IFERROR(IF(C51=\"\",\"\",IF(AND(BH52=\"\",BO52=\"\"),\"\",IF($C51=\"TOTAL\",SUM($Y$8:Y50),BH52))),\"\")","v":""},{"$f":"IFERROR(IF(C51=\"\",\"\",IF($C51=\"TOTAL\",SUM($Z$8:Z50),ROUND(O51*$AO$7%,0))),\"\")","v":""},{"$f":"IFERROR(IF(C51=\"\",\"\",IF($C51=\"TOTAL\",SUM($AA$8:AA50),IF($AC$3=$AL$2,SUM(U51,X51,Y51,Z51),SUM(R51,U51,X51,Y51,Z51)))),\"\")","v":""},{"$f":"IFERROR(IF(C51=\"\",\"\",IF($C51=\"TOTAL\",SUM($AB$8:AB50),SUM(O51-AA51))),\"\")","v":""},{"$nulls":8},34,34,null,"2020-07-01",null,"2024-04-01","","","","","","","",null,"","","","",null,null,"","","","",0,0,{"$nulls":4},2100]
["","","",{"$f":"IFERROR(IF($C51=\"TOTAL\",\"अक्षरें राशि :-\",IF($C52=\"TOTAL\",SUM($D$8:D51),IF(AU53=\"\",\"\",AU53))),\"\")","v":""},{"$f":"IFERROR(IF($C52=\"TOTAL\",SUM($E$8:E51),IF(AV53=\"\",\"\",AV53)),\"\")","v":""},{"$f":"IFERROR(IF($C52=\"TOTAL\",SUM($F$8:F51),IF(OR(C52=$AM$16,C52=$AM$17,C52=$AM$18,C52=$AM$19,C52=$AM$20,C52=$AM$21,C52=$AM$22,C52=$AM$23,C52=$AM$24),0,IF(AW53=\"\",\"\",AW53))),\"\")","v":""},"",{"$f":"IFERROR(IF($C52=\"TOTAL\",SUM($H$8:H51),IF(AY53=\"\",\"\",AY53)),\"\")","v":""},{"$f":"IFERROR(IF($C52=\"TOTAL\",SUM($I$8:I51),IF(AZ53=\"\",\"\",AZ53)),\"\")","v":""},{"$f":"IFERROR(IF($C52=\"TOTAL\",SUM($J$8:J51),IF(OR(C52=$AM$16,C52=$AM$17,C52=$AM$18,C52=$AM$19,C52=$AM$20,C52=$AM$21,C52=$AM$22,C52=$AM$23,C52=$AM$24),0,IF(BA53=\"\",\"\",BA53))),\"\")","v":""},"",{"$f":"IFERROR(IF(C52=\"\",\"\",IF(D52=\"\",\"\",IF(H52=\"\",\"\",IF($C52=\"TOTAL\",SUM($L$8:L51),SUM(D52-H52))))),\"\")","v":""},{"$f":"IFERROR(IF(C52=\"\",\"\",IF(E52=\"\",\"\",IF(I52=\"\",\"\",IF($C52=\"TOTAL\",SUM($M$8:M51),SUM(E52-I52))))),\"\")","v":""},{"$f":"IFERROR(IF(C52=\"\",\"\",IF(F52=\"\",\"\",IF(J52=\"\",\"\",IF($C52=\"TOTAL\",SUM($N$8:N51),SUM(F52-J52))))),\"\")","v":""},"",{"$f":"IFERROR(IF(C52=\"\",\"\",IF($C52=\"TOTAL\",SUM($P$8:P51),IF(AND(C52>$AL$1,$AC$3=$AL$2),BO53,IF($AO$18=$AO$20,SUM(BB53+BJ53),ROUND((D52+E52)*10%,0))))),\"\")","v":""},{"$f":"IFERROR(IF(C52=\"\",\"\",IF(H52=\"\",\"\",IF(I52=\"\",\"\",IF($C52=\"TOTAL\",SUM($Q$8:Q51),IF(AND(C52>$AL$1,$AC$3=$AL$2),BO53,IF($AO$18=$AO$20,$AO$21,ROUND((H52+I52)*10%,0))))))),\"\")","v":""},"",{"$f":"IFERROR(IF(C52=\"\",\"\",IF($AO$16=$AO$17,0,IF($C52=\"TOTAL\",SUM($S$8:S51),IF($AO$19=$AO$31,0,IF(AND($AO$32=$AO$20,C52=$AO$33),$AO$34,S51))))),\"\")","v":""},{"$f":"IFERROR(IF(C52=\"\",\"\",IF($AO$16=$AO$17,0,IF($C52=\"TOTAL\",SUM($T$8:T51),IF($AO$19=$AO$20,$AO$24,0)))),\"\")","v":""},"",{"$f":"IF(C52=\"\",\"\",IF($C52=\"TOTAL\",SUM($V$8:V51),IF(AND($AO$2=$AO$20,C52=$AO$1),ROUND(D52/31*$AP$2,0),IF(C52=$AM$6,ROUND((G52)*1/30,0),IF(C52=$AN$6,ROUND((G52)*1/31,0),\"\")))))","v":""},{"$f":"IF(C52=\"\",\"\",IF($C52=\"TOTAL\",SUM($W$8:W51),IF(AND($AO$2=$AO$20,C52=$AO$1),ROUND(H52/31*$AP$2,0),IF(C52=$AM$6,ROUND((K52)*1/30,0),IF(C52=$AN$6,ROUND((K52)*1/31,0),\"\")))))","v":""},"",{"$f":"IFERROR(IF(C52=\"\",\"\",IF(AND(BH53=\"\",BO53=\"\"),\"\",IF($C52=\"TOTAL\",SUM($Y$8:Y51),BH53))),\"\")","v":""},{"$f":"IFERROR(IF(C52=\"\",\"\",IF($C52=\"TOTAL\",SUM($Z$8:Z51),ROUND(O52*$AO$7%,0))),\"\")","v":""},{"$f":"IFERROR(IF(C52=\"\",\"\",IF($C52=\"TOTAL\",SUM($AA$8:AA51),IF($AC$3=$AL$2,SUM(U52,X52,Y52,Z52),SUM(R52,U52,X52,Y52,Z52)))),\"\")","v":""},{"$f":"IFERROR(IF(C52=\"\",\"\",IF($C52=\"TOTAL\",SUM($AB$8:AB51),SUM(O52-AA52))),\"\")","v":""},{"$nulls":8},34,34,null,"2020-08-01",null,"2024-05-01","","","","","","","",null,"","","","",null,null,"","","","",0,0,{"$nulls":4},2100]
["","","",{"$f":"IFERROR(IF($C52=\"TOTAL\",\"अक्षरें राशि :-\",IF($C53=\"TOTAL\",SUM($D$8:D52),IF(AU54=\"\",\"\",AU54))),\"\")","v":""},{"$f":"IFERROR(IF($C53=\"TOTAL\",SUM($E$8:E52),IF(AV54=\"\",\"\",AV54)),\"\")","v":""},{"$f":"IFERROR(IF($C53=\"TOTAL\",SUM($F$8:F52),IF(OR(C53=$AM$16,C53=$AM$17,C53=$AM$18,C53=$AM$19,C53=$AM$20,C53=$AM$21,C53=$AM$22,C53=$AM$23,C53=$AM$24),0,IF(AW54=\"\",\"\",AW54))),\"\")","v":""},"",{"$f":"IFERROR(IF($C53=\"TOTAL\",SUM($H$8:H52),IF(AY54=\"\",\"\",AY54)),\"\")","v":""},{"$f":"IFERROR(IF($C53=\"TOTAL\",SUM($I$8:I52),IF(AZ54=\"\",\"\",AZ54)),\"\")","v":""},{"$f":"IFERROR(IF($C53=\"TOTAL\",SUM($J$8:J52),IF(OR(C53=$AM$16,C53=$AM$17,C53=$AM$18,C53=$AM$19,C53=$AM$20,C53=$AM$21,C53=$AM$22,C53=$AM$23,C53=$AM$24),0,IF(BA54=\"\",\"\",BA54))),\"\")","v":""},"",{"$f":"IFERROR(IF(C53=\"\",\"\",IF(D53=\"\",\"\",IF(H53=\"\",\"\",IF($C53=\"TOTAL\",SUM($L$8:L52),SUM(D53-H53))))),\"\")","v":""},{"$f":"IFERROR(IF(C53=\"\",\"\",IF(E53=\"\",\"\",IF(I53=\"\",\"\",IF($C53=\"TOTAL\",SUM($M$8:M52),SUM(E53-I53))))),\"\")","v":""},{"$f":"IFERROR(IF(C53=\"\",\"\",IF(F53=\"\",\"\",IF(J53=\"\",\"\",IF($C53=\"TOTAL\",SUM($N$8:N52),SUM(F53-J53))))),\"\")","v":""},"",{"$f":"IFERROR(IF(C53=\"\",\"\",IF($C53=\"TOTAL\",SUM($P$8:P52),IF(AND(C53>$AL$1,$AC$3=$AL$2),BO54,IF($AO$18=$AO$20,SUM(BB54+BJ54),ROUND((D53+E53)*10%,0))))),\"\")","v":""},{"$f":"IFERROR(IF(C53=\"\",\"\",IF(H53=\"\",\"\",IF(I53=\"\",\"\",IF($C53=\"TOTAL\",SUM($Q$8:Q52),IF(AND(C53>$AL$1,$AC$3=$AL$2),BO54,IF($AO$18=$AO$20,$AO$21,ROUND((H53+I53)*10%,0))))))),\"\")","v":""},"",{"$f":"IFERROR(IF(C53=\"\",\"\",IF($AO$16=$AO$17,0,IF($C53=\"TOTAL\",SUM($S$8:S52),IF($AO$19=$AO$31,0,IF(AND($AO$32=$AO$20,C53=$AO$33),$AO$34,S52))))),\"\")","v":""},{"$f":"IFERROR(IF(C53=\"\",\"\",IF($AO$16=$AO$17,0,IF($C53=\"TOTAL\",SUM($T$8:T52),IF($AO$19=$AO$20,$AO$24,0)))),\"\")","v":""},"",{"$f":"IF(C53=\"\",\"\",IF($C53=\"TOTAL\",SUM($V$8:V52),IF(AND($AO$2=$AO$20,C53=$AO$1),ROUND(D53/31*$AP$2,0),IF(C53=$AM$6,ROUND((G53)*1/30,0),IF(C53=$AN$6,ROUND((G53)*1/31,0),\"\")))))","v":""},{"$f":"IF(C53=\"\",\"\",IF($C53=\"TOTAL\",SUM($W$8:W52),IF(AND($AO$2=$AO$20,C53=$AO$1),ROUND(H53/31*$AP$2,0),IF(C53=$AM$6,ROUND((K53)*1/30,0),IF(C53=$AN$6,ROUND((K53)*1/31,0),\"\")))))","v":""},"",{"$f":"IFERROR(IF(C53=\"\",\"\",IF(AND(BH54=\"\",BO54=\"\"),\"\",IF($C53=\"TOTAL\",SUM($Y$8:Y52),BH54))),\"\")","v":""},{"$f":"IFERROR(IF(C53=\"\",\"\",IF($C53=\"TOTAL\",SUM($Z$8:Z52),ROUND(O53*$AO$7%,0))),\"\")","v":""},{"$f":"IFERROR(IF(C53=\"\",\"\",IF($C53=\"TOTAL\",SUM($AA$8:AA52),IF($AC$3=$AL$2,SUM(U53,X53,Y53,Z53),SUM(R53,U53,X53,Y53,Z53)))),\"\")","v":""},{"$f":"IFERROR(IF(C53=\"\",\"\",IF($C53=\"TOTAL\",SUM($AB$8:AB52),SUM(O53-AA53))),\"\")","v":""},{"$nulls":8},34,34,null,"2020-09-01",null,"2024-06-01","","","","","","","",null,"","","","",null,null,"","","","",0,0,{"$nulls":4},2100]
["","","",{"$f":"IFERROR(IF($C53=\"TOTAL\",\"अक्षरें राशि :-\",IF($C54=\"TOTAL\",SUM($D$8:D53),IF(AU55=\"\",\"\",AU55))),\"\")","v":""},{"$f":"IFERROR(IF($C54=\"TOTAL\",SUM($E$8:E53),IF(AV55=\"\",\"\",AV55)),\"\")","v":""},{"$f":"IFERROR(IF($C54=\"TOTAL\",SUM($F$8:F53),IF(OR(C54=$AM$16,C54=$AM$17,C54=$AM$18,C54=$AM$19,C54=$AM$20,C54=$AM$21,C54=$AM$22,C54=$AM$23,C54=$AM$24),0,IF(AW55=\"\",\"\",AW55))),\"\")","v":""},"",{"$f":"IFERROR(IF($C54=\"TOTAL\",SUM($H$8:H53),IF(AY55=\"\",\"\",AY55)),\"\")","v":""},{"$f":"IFERROR(IF($C54=\"TOTAL\",SUM($I$8:I53),IF(AZ55=\"\",\"\",AZ55)),\"\")","v":""},{"$f":"IFERROR(IF($C54=\"TOTAL\",SUM($J$8:J53),IF(OR(C54=$AM$16,C54=$AM$17,C54=$AM$18,C54=$AM$19,C54=$AM$20,C54=$AM$21,C54=$AM$22,C54=$AM$23,C54=$AM$24),0,IF(BA55=\"\",\"\",BA55))),\"\")","v":""},"",{"$f":"IFERROR(IF(C54=\"\",\"\",IF(D54=\"\",\"\",IF(H54=\"\",\"\",IF($C54=\"TOTAL\",SUM($L$8:L53),SUM(D54-H54))))),\"\")","v":""},{"$f":"IFERROR(IF(C54=\"\",\"\",IF(E54=\"\",\"\",IF(I54=\"\",\"\",IF($C54=\"TOTAL\",SUM($M$8:M53),SUM(E54-I54))))),\"\")","v":""},{"$f":"IFERROR(IF(C54=\"\",\"\",IF(F54=\"\",\"\",IF(J54=\"\",\"\",IF($C54=\"TOTAL\",SUM($N$8:N53),SUM(F54-J54))))),\"\")","v":""},"",{"$f":"IFERROR(IF(C54=\"\",\"\",IF($C54=\"TOTAL\",SUM($P$8:P53),IF(AND(C54>$AL$1,$AC$3=$AL$2),BO55,IF($AO$18=$AO$20,SUM(BB55+BJ55),ROUND((D54+E54)*10%,0))))),\"\")","v":""},{"$f":"IFERROR(IF(C54=\"\",\"\",IF(H54=\"\",\"\",IF(I54=\"\",\"\",IF($C54=\"TOTAL\",SUM($Q$8:Q53),IF(AND(C54>$AL$1,$AC$3=$AL$2),BO55,IF($AO$18=$AO$20,$AO$21,ROUND((H54+I54)*10%,0))))))),\"\")","v":""},"",{"$f":"IFERROR(IF(C54=\"\",\"\",IF($AO$16=$AO$17,0,IF($C54=\"TOTAL\",SUM($S$8:S53),IF($AO$19=$AO$31,0,IF(AND($AO$32=$AO$20,C54=$AO$33),$AO$34,S53))))),\"\")","v":""},{"$f":"IFERROR(IF(C54=\"\",\"\",IF($AO$16=$AO$17,0,IF($C54=\"TOTAL\",SUM($T$8:T53),IF($AO$19=$AO$20,$AO$24,0)))),\"\")","v":""},"",{"$f":"IF(C54=\"\",\"\",IF($C54=\"TOTAL\",SUM($V$8:V53),IF(AND($AO$2=$AO$20,C54=$AO$1),ROUND(D54/31*$AP$2,0),IF(C54=$AM$6,ROUND((G54)*1/30,0),IF(C54=$AN$6,ROUND((G54)*1/31,0),\"\")))))","v":""},{"$f":"IF(C54=\"\",\"\",IF($C54=\"TOTAL\",SUM($W$8:W53),IF(AND($AO$2=$AO$20,C54=$AO$1),ROUND(H54/31*$AP$2,0),IF(C54=$AM$6,ROUND((K54)*1/30,0),IF(C54=$AN$6,ROUND((K54)*1/31,0),\"\")))))","v":""},"",{"$f":"IFERROR(IF(C54=\"\",\"\",IF(AND(BH55=\"\",BO55=\"\"),\"\",IF($C54=\"TOTAL\",SUM($Y$8:Y53),BH55))),\"\")","v":""},{"$f":"IFERROR(IF(C54=\"\",\"\",IF($C54=\"TOTAL\",SUM($Z$8:Z53),ROUND(O54*$AO$7%,0))),\"\")","v":""},{"$f":"IFERROR(IF(C54=\"\",\"\",IF($C54=\"TOTAL\",SUM($AA$8:AA53),IF($AC$3=$AL$2,SUM(U54,X54,Y54,Z54),SUM(R54,U54,X54,Y54,Z54)))),\"\")","v":""},{"$f":"IFERROR(IF(C54=\"\",\"\",IF($C54=\"TOTAL\",SUM($AB$8:AB53),SUM(O54-AA54))),\"\")","v":""},{"$nulls":8},34,34,null,"2020-10-01",null,"2024-07-01","","","","","","","",null,"","","","",null,null,"","","","",0,0,{"$nulls":4},2100]
["","","",{"$f":"IFERROR(IF($C54=\"TOTAL\",\"अक्षरें राशि :-\",IF($C55=\"TOTAL\",SUM($D$8:D54),IF(AU56=\"\",\"\",AU56))),\"\")","v":""},{"$f":"IFERROR(IF($C55=\"TOTAL\",SUM($E$8:E54),IF(AV56=\"\",\"\",AV56)),\"\")","v":""},{"$f":"IFERROR(IF($C55=\"TOTAL\",SUM($F$8:F54),IF(OR(C55=$AM$16,C55=$AM$17,C55=$AM$18,C55=$AM$19,C55=$AM$20,C55=$AM$21,C55=$AM$22,C55=$AM$23,C55=$AM$24),0,IF(AW56=\"\",\"\",AW56))),\"\")","v":""},"",{"$f":"IFERROR(IF($C55=\"TOTAL\",SUM($H$8:H54),IF(AY56=\"\",\"\",AY56)),\"\")","v":""},{"$f":"IFERROR(IF($C55=\"TOTAL\",SUM($I$8:I54),IF(AZ56=\"\",\"\",AZ56)),\"\")","v":""},{"$f":"IFERROR(IF($C55=\"TOTAL\",SUM($J$8:J54),IF(OR(C55=$AM$16,C55=$AM$17,C55=$AM$18,C55=$AM$19,C55=$AM$20,C55=$AM$21,C55=$AM$22,C55=$AM$23,C55=$AM$24),0,IF(BA56=\"\",\"\",BA56))),\"\")","v":""},"",{"$f":"IFERROR(IF(C55=\"\",\"\",IF(D55=\"\",\"\",IF(H55=\"\",\"\",IF($C55=\"TOTAL\",SUM($L$8:L54),SUM(D55-H55))))),\"\")","v":""},{"$f":"IFERROR(IF(C55=\"\",\"\",IF(E55=\"\",\"\",IF(I55=\"\",\"\",IF($C55=\"TOTAL\",SUM($M$8:M54),SUM(E55-I55))))),\"\")","v":""},{"$f":"IFERROR(IF(C55=\"\",\"\",IF(F55=\"\",\"\",IF(J55=\"\",\"\",IF($C55=\"TOTAL\",SUM($N$8:N54),SUM(F55-J55))))),\"\")","v":""},"",{"$f":"IFERROR(IF(C55=\"\",\"\",IF($C55=\"TOTAL\",SUM($P$8:P54),IF(AND(C55>$AL$1,$AC$3=$AL$2),BO56,IF($AO$18=$AO$20,SUM(BB56+BJ56),ROUND((D55+E55)*10%,0))))),\"\")","v":""},{"$f":"IFERROR(IF(C55=\"\",\"\",IF(H55=\"\",\"\",IF(I55=\"\",\"\",IF($C55=\"TOTAL\",SUM($Q$8:Q54),IF(AND(C55>$AL$1,$AC$3=$AL$2),BO56,IF($AO$18=$AO$20,$AO$21,ROUND((H55+I55)*10%,0))))))),\"\")","v":""},"",{"$f":"IFERROR(IF(C55=\"\",\"\",IF($AO$16=$AO$17,0,IF($C55=\"TOTAL\",SUM($S$8:S54),IF($AO$19=$AO$31,0,IF(AND($AO$32=$AO$20,C55=$AO$33),$AO$34,S54))))),\"\")","v":""},{"$f":"IFERROR(IF(C55=\"\",\"\",IF($AO$16=$AO$17,0,IF($C55=\"TOTAL\",SUM($T$8:T54),IF($AO$19=$AO$20,$AO$24,0)))),\"\")","v":""},"",{"$f":"IF(C55=\"\",\"\",IF($C55=\"TOTAL\",SUM($V$8:V54),IF(AND($AO$2=$AO$20,C55=$AO$1),ROUND(D55/31*$AP$2,0),IF(C55=$AM$6,ROUND((G55)*1/30,0),IF(C55=$AN$6,ROUND((G55)*1/31,0),\"\")))))","v":""},{"$f":"IF(C55=\"\",\"\",IF($C55=\"TOTAL\",SUM($W$8:W54),IF(AND($AO$2=$AO$20,C55=$AO$1),ROUND(H55/31*$AP$2,0),IF(C55=$AM$6,ROUND((K55)*1/30,0),IF(C55=$AN$6,ROUND((K55)*1/31,0),\"\")))))","v":""},"",{"$f":"IFERROR(IF(C55=\"\",\"\",IF(AND(BH56=\"\",BO56=\"\"),\"\",IF($C55=\"TOTAL\",SUM($Y$8:Y54),BH56))),\"\")","v":""},{"$f":"IFERROR(IF(C55=\"\",\"\",IF($C55=\"TOTAL\",SUM($Z$8:Z54),ROUND(O55*$AO$7%,0))),\"\")","v":""},{"$f":"IFERROR(IF(C55=\"\",\"\",IF($C55=\"TOTAL\",SUM($AA$8:AA54),IF($AC$3=$AL$2,SUM(U55,X55,Y55,Z55),SUM(R55,U55,X55,Y55,Z55)))),\"\")","v":""},{"$f":"IFERROR(IF(C55=\"\",\"\",IF($C55=\"TOTAL\",SUM($AB$8:AB54),SUM(O55-AA55))),\"\")","v":""},{"$nulls":8},34,34,null,"2020-11-01",null,"2024-08-01","","","","","","","",null,"","","","",null,null,"","","","",0,0,{"$nulls":4},2100]
["","","",{"$f":"IFERROR(IF($C55=\"TOTAL\",\"अक्षरें राशि :-\",IF($C56=\"TOTAL\",SUM($D$8:D55),IF(AU57=\"\",\"\",AU57))),\"\")","v":""},{"$f":"IFERROR(IF($C56=\"TOTAL\",SUM($E$8:E55),IF(AV57=\"\",\"\",AV57)),\"\")","v":""},{"$f":"IFERROR(IF($C56=\"TOTAL\",SUM($F$8:F55),IF(OR(C56=$AM$16,C56=$AM$17,C56=$AM$18,C56=$AM$19,C56=$AM$20,C56=$AM$21,C56=$AM$22,C56=$AM$23,C56=$AM$24),0,IF(AW57=\"\",\"\",AW57))),\"\")","v":""},"",{"$f":"IFERROR(IF($C56=\"TOTAL\",SUM($H$8:H55),IF(AY57=\"\",\"\",AY57)),\"\")","v":""},{"$f":"IFERROR(IF($C56=\"TOTAL\",SUM($I$8:I55),IF(AZ57=\"\",\"\",AZ57)),\"\")","v":""},{"$f":"IFERROR(IF($C56=\"TOTAL\",SUM($J$8:J55),IF(OR(C56=$AM$16,C56=$AM$17,C56=$AM$18,C56=$AM$19,C56=$AM$20,C56=$AM$21,C56=$AM$22,C56=$AM$23,C56=$AM$24),0,IF(BA57=\"\",\"\",BA57))),\"\")","v":""},"",{"$f":"IFERROR(IF(C56=\"\",\"\",IF(D56=\"\",\"\",IF(H56=\"\",\"\",IF($C56=\"TOTAL\",SUM($L$8:L55),SUM(D56-H56))))),\"\")","v":""},{"$f":"IFERROR(IF(C56=\"\",\"\",IF(E56=\"\",\"\",IF(I56=\"\",\"\",IF($C56=\"TOTAL\",SUM($M$8:M55),SUM(E56-I56))))),\"\")","v":""},{"$f":"IFERROR(IF(C56=\"\",\"\",IF(F56=\"\",\"\",IF(J56=\"\",\"\",IF($C56=\"TOTAL\",SUM($N$8:N55),SUM(F56-J56))))),\"\")","v":""},"",{"$f":"IFERROR(IF(C56=\"\",\"\",IF($C56=\"TOTAL\",SUM($P$8:P55),IF(AND(C56>$AL$1,$AC$3=$AL$2),BO57,IF($AO$18=$AO$20,SUM(BB57+BJ57),ROUND((D56+E56)*10%,0))))),\"\")","v":""},{"$f":"IFERROR(IF(C56=\"\",\"\",IF(H56=\"\",\"\",IF(I56=\"\",\"\",IF($C56=\"TOTAL\",SUM($Q$8:Q55),IF(AND(C56>$AL$1,$AC$3=$AL$2),BO57,IF($AO$18=$AO$20,$AO$21,ROUND((H56+I56)*10%,0))))))),\"\")","v":""},"",{"$f":"IFERROR(IF(C56=\"\",\"\",IF($AO$16=$AO$17,0,IF($C56=\"TOTAL\",SUM($S$8:S55),IF($AO$19=$AO$31,0,IF(AND($AO$32=$AO$20,C56=$AO$33),$AO$34,S55))))),\"\")","v":""},{"$f":"IFERROR(IF(C56=\"\",\"\",IF($AO$16=$AO$17,0,IF($C56=\"TOTAL\",SUM($T$8:T55),IF($AO$19=$AO$20,$AO$24,0)))),\"\")","v":""},"",{"$f":"IF(C56=\"\",\"\",IF($C56=\"TOTAL\",SUM($V$8:V55),IF(AND($AO$2=$AO$20,C56=$AO$1),ROUND(D56/31*$AP$2,0),IF(C56=$AM$6,ROUND((G56)*1/30,0),IF(C56=$AN$6,ROUND((G56)*1/31,0),\"\")))))","v":""},{"$f":"IF(C56=\"\",\"\",IF($C56=\"TOTAL\",SUM($W$8:W55),IF(AND($AO$2=$AO$20,C56=$AO$1),ROUND(H56/31*$AP$2,0),IF(C56=$AM$6,ROUND((K56)*1/30,0),IF(C56=$AN$6,ROUND((K56)*1/31,0),\"\")))))","v":""},"",{"$f":"IFERROR(IF(C56=\"\",\"\",IF(AND(BH57=\"\",BO57=\"\"),\"\",IF($C56=\"TOTAL\",SUM($Y$8:Y55),BH57))),\"\")","v":""},{"$f":"IFERROR(IF(C56=\"\",\"\",IF($C56=\"TOTAL\",SUM($Z$8:Z55),ROUND(O56*$AO$7%,0))),\"\")","v":""},{"$f":"IFERROR(IF(C56=\"\",\"\",IF($C56=\"TOTAL\",SUM($AA$8:AA55),IF($AC$3=$AL$2,SUM(U56,X56,Y56,Z56),SUM(R56,U56,X56,Y56,Z56)))),\"\")","v":""},{"$f":"IFERROR(IF(C56=\"\",\"\",IF($C56=\"TOTAL\",SUM($AB$8:AB55),SUM(O56-AA56))),\"\")","v":""},{"$nulls":8},34,34,null,"2020-12-01",null,"2024-09-01","","","","","","","",null,"","","","",null,null,"","","","",0,0,{"$nulls":4},2100]
["","","",{"$f":"IFERROR(IF($C56=\"TOTAL\",\"अक्षरें राशि :-\",IF($C57=\"TOTAL\",SUM($D$8:D56),IF(AU58=\"\",\"\",AU58))),\"\")","v":""},{"$f":"IFERROR(IF($C57=\"TOTAL\",SUM($E$8:E56),IF(AV58=\"\",\"\",AV58)),\"\")","v":""},{"$f":"IFERROR(IF($C57=\"TOTAL\",SUM($F$8:F56),IF(OR(C57=$AM$16,C57=$AM$17,C57=$AM$18,C57=$AM$19,C57=$AM$20,C57=$AM$21,C57=$AM$22,C57=$AM$23,C57=$AM$24),0,IF(AW58=\"\",\"\",AW58))),\"\")","v":""},"",{"$f":"IFERROR(IF($C57=\"TOTAL\",SUM($H$8:H56),IF(AY58=\"\",\"\",AY58)),\"\")","v":""},{"$f":"IFERROR(IF($C57=\"TOTAL\",SUM($I$8:I56),IF(AZ58=\"\",\"\",AZ58)),\"\")","v":""},{"$f":"IFERROR(IF($C57=\"TOTAL\",SUM($J$8:J56),IF(OR(C57=$AM$16,C57=$AM$17,C57=$AM$18,C57=$AM$19,C57=$AM$20,C57=$AM$21,C57=$AM$22,C57=$AM$23,C57=$AM$24),0,IF(BA58=\"\",\"\",BA58))),\"\")","v":""},"",{"$f":"IFERROR(IF(C57=\"\",\"\",IF(D57=\"\",\"\",IF(H57=\"\",\"\",IF($C57=\"TOTAL\",SUM($L$8:L56),SUM(D57-H57))))),\"\")","v":""},{"$f":"IFERROR(IF(C57=\"\",\"\",IF(E57=\"\",\"\",IF(I57=\"\",\"\",IF($C57=\"TOTAL\",SUM($M$8:M56),SUM(E57-I57))))),\"\")","v":""},{"$f":"IFERROR(IF(C57=\"\",\"\",IF(F57=\"\",\"\",IF(J57=\"\",\"\",IF($C57=\"TOTAL\",SUM($N$8:N56),SUM(F57-J57))))),\"\")","v":""},"",{"$f":"IFERROR(IF(C57=\"\",\"\",IF($C57=\"TOTAL\",SUM($P$8:P56),IF(AND(C57>$AL$1,$AC$3=$AL$2),BO58,IF($AO$18=$AO$20,SUM(BB58+BJ58),ROUND((D57+E57)*10%,0))))),\"\")","v":""},{"$f":"IFERROR(IF(C57=\"\",\"\",IF(H57=\"\",\"\",IF(I57=\"\",\"\",IF($C57=\"TOTAL\",SUM($Q$8:Q56),IF(AND(C57>$AL$1,$AC$3=$AL$2),BO58,IF($AO$18=$AO$20,$AO$21,ROUND((H57+I57)*10%,0))))))),\"\")","v":""},"",{"$f":"IFERROR(IF(C57=\"\",\"\",IF($AO$16=$AO$17,0,IF($C57=\"TOTAL\",SUM($S$8:S56),IF($AO$19=$AO$31,0,IF(AND($AO$32=$AO$20,C57=$AO$33),$AO$34,S56))))),\"\")","v":""},{"$f":"IFERROR(IF(C57=\"\",\"\",IF($AO$16=$AO$17,0,IF($C57=\"TOTAL\",SUM($T$8:T56),IF($AO$19=$AO$20,$AO$24,0)))),\"\")","v":""},"",{"$f":"IF(C57=\"\",\"\",IF($C57=\"TOTAL\",SUM($V$8:V56),IF(AND($AO$2=$AO$20,C57=$AO$1),ROUND(D57/31*$AP$2,0),IF(C57=$AM$6,ROUND((G57)*1/30,0),IF(C57=$AN$6,ROUND((G57)*1/31,0),\"\")))))","v":""},{"$f":"IF(C57=\"\",\"\",IF($C57=\"TOTAL\",SUM($W$8:W56),IF(AND($AO$2=$AO$20,C57=$AO$1),ROUND(H57/31*$AP$2,0),IF(C57=$AM$6,ROUND((K57)*1/30,0),IF(C57=$AN$6,ROUND((K57)*1/31,0),\"\")))))","v":""},"",{"$f":"IFERROR(IF(C57=\"\",\"\",IF(AND(BH58=\"\",BO58=\"\"),\"\",IF($C57=\"TOTAL\",SUM($Y$8:Y56),BH58))),\"\")","v":""},{"$f":"IFERROR(IF(C57=\"\",\"\",IF($C57=\"TOTAL\",SUM($Z$8:Z56),ROUND(O57*$AO$7%,0))),\"\")","v":""},{"$f":"IFERROR(IF(C57=\"\",\"\",IF($C57=\"TOTAL\",SUM($AA$8:AA56),IF($AC$3=$AL$2,SUM(U57,X57,Y57,Z57),SUM(R57,U57,X57,Y57,Z57)))),\"\")","v":""},{"$f":"IFERROR(IF(C57=\"\",\"\",IF($C57=\"TOTAL\",SUM($AB$8:AB56),SUM(O57-AA57))),\"\")","v":""},{"$nulls":8},34,34,null,"2021-01-01",null,"2024-10-01","","","","","","","",null,"","","","",null,null,"","","","",0,0,{"$nulls":4},2100]
["","","",{"$f":"IFERROR(IF($C57=\"TOTAL\",\"अक्षरें राशि :-\",IF($C58=\"TOTAL\",SUM($D$8:D57),IF(AU59=\"\",\"\",AU59))),\"\")","v":""},{"$f":"IFERROR(IF($C58=\"TOTAL\",SUM($E$8:E57),IF(AV59=\"\",\"\",AV59)),\"\")","v":""},{"$f":"IFERROR(IF($C58=\"TOTAL\",SUM($F$8:F57),IF(OR(C58=$AM$16,C58=$AM$17,C58=$AM$18,C58=$AM$19,C58=$AM$20,C58=$AM$21,C58=$AM$22,C58=$AM$23,C58=$AM$24),0,IF(AW59=\"\",\"\",AW59))),\"\")","v":""},"",{"$f":"IFERROR(IF($C58=\"TOTAL\",SUM($H$8:H57),IF(AY59=\"\",\"\",AY59)),\"\")","v":""},{"$f":"IFERROR(IF($C58=\"TOTAL\",SUM($I$8:I57),IF(AZ59=\"\",\"\",AZ59)),\"\")","v":""},{"$f":"IFERROR(IF($C58=\"TOTAL\",SUM($J$8:J57),IF(OR(C58=$AM$16,C58=$AM$17,C58=$AM$18,C58=$AM$19,C58=$AM$20,C58=$AM$21,C58=$AM$22,C58=$AM$23,C58=$AM$24),0,IF(BA59=\"\",\"\",BA59))),\"\")","v":""},"",{"$f":"IFERROR(IF(C58=\"\",\"\",IF(D58=\"\",\"\",IF(H58=\"\",\"\",IF($C58=\"TOTAL\",SUM($L$8:L57),SUM(D58-H58))))),\"\")","v":""},{"$f":"IFERROR(IF(C58=\"\",\"\",IF(E58=\"\",\"\",IF(I58=\"\",\"\",IF($C58=\"TOTAL\",SUM($M$8:M57),SUM(E58-I58))))),\"\")","v":""},{"$f":"IFERROR(IF(C58=\"\",\"\",IF(F58=\"\",\"\",IF(J58=\"\",\"\",IF($C58=\"TOTAL\",SUM($N$8:N57),SUM(F58-J58))))),\"\")","v":""},"",{"$f":"IFERROR(IF(C58=\"\",\"\",IF($C58=\"TOTAL\",SUM($P$8:P57),IF(AND(C58>$AL$1,$AC$3=$AL$2),BO59,IF($AO$18=$AO$20,SUM(BB59+BJ59),ROUND((D58+E58)*10%,0))))),\"\")","v":""},{"$f":"IFERROR(IF(C58=\"\",\"\",IF(H58=\"\",\"\",IF(I58=\"\",\"\",IF($C58=\"TOTAL\",SUM($Q$8:Q57),IF(AND(C58>$AL$1,$AC$3=$AL$2),BO59,IF($AO$18=$AO$20,$AO$21,ROUND((H58+I58)*10%,0))))))),\"\")","v":""},"",{"$f":"IFERROR(IF(C58=\"\",\"\",IF($AO$16=$AO$17,0,IF($C58=\"TOTAL\",SUM($S$8:S57),IF($AO$19=$AO$31,0,IF(AND($AO$32=$AO$20,C58=$AO$33),$AO$34,S57))))),\"\")","v":""},{"$f":"IFERROR(IF(C58=\"\",\"\",IF($AO$16=$AO$17,0,IF($C58=\"TOTAL\",SUM($T$8:T57),IF($AO$19=$AO$20,$AO$24,0)))),\"\")","v":""},"",{"$f":"IF(C58=\"\",\"\",IF($C58=\"TOTAL\",SUM($V$8:V57),IF(AND($AO$2=$AO$20,C58=$AO$1),ROUND(D58/31*$AP$2,0),IF(C58=$AM$6,ROUND((G58)*1/30,0),IF(C58=$AN$6,ROUND((G58)*1/31,0),\"\")))))","v":""},{"$f":"IF(C58=\"\",\"\",IF($C58=\"TOTAL\",SUM($W$8:W57),IF(AND($AO$2=$AO$20,C58=$AO$1),ROUND(H58/31*$AP$2,0),IF(C58=$AM$6,ROUND((K58)*1/30,0),IF(C58=$AN$6,ROUND((K58)*1/31,0),\"\")))))","v":""},"",{"$f":"IFERROR(IF(C58=\"\",\"\",IF(AND(BH59=\"\",BO59=\"\"),\"\",IF($C58=\"TOTAL\",SUM($Y$8:Y57),BH59))),\"\")","v":""},{"$f":"IFERROR(IF(C58=\"\",\"\",IF($C58=\"TOTAL\",SUM($Z$8:Z57),ROUND(O58*$AO$7%,0))),\"\")","v":""},{"$f":"IFERROR(IF(C58=\"\",\"\",IF($C58=\"TOTAL\",SUM($AA$8:AA57),IF($AC$3=$AL$2,SUM(U58,X58,Y58,Z58),SUM(R58,U58,X58,Y58,Z58)))),\"\")","v":""},{"$f":"IFERROR(IF(C58=\"\",\"\",IF($C58=\"TOTAL\",SUM($AB$8:AB57),SUM(O58-AA58))),\"\")","v":""},{"$nulls":8},34,34,null,"2021-02-01",null,"2024-11-01","","","","","","","",null,"","","","",null,null,"","","","",0,0,{"$nulls":4},2100]
["","","",{"$f":"IFERROR(IF($C58=\"TOTAL\",\"अक्षरें राशि :-\",IF($C59=\"TOTAL\",SUM($D$8:D58),IF(AU60=\"\",\"\",AU60))),\"\")","v":""},{"$f":"IFERROR(IF($C59=\"TOTAL\",SUM($E$8:E58),IF(AV60=\"\",\"\",AV60)),\"\")","v":""},{"$f":"IFERROR(IF($C59=\"TOTAL\",SUM($F$8:F58),IF(OR(C59=$AM$16,C59=$AM$17,C59=$AM$18,C59=$AM$19,C59=$AM$20,C59=$AM$21,C59=$AM$22,C59=$AM$23,C59=$AM$24),0,IF(AW60=\"\",\"\",AW60))),\"\")","v":""},"",{"$f":"IFERROR(IF($C59=\"TOTAL\",SUM($H$8:H58),IF(AY60=\"\",\"\",AY60)),\"\")","v":""},{"$f":"IFERROR(IF($C59=\"TOTAL\",SUM($I$8:I58),IF(AZ60=\"\",\"\",AZ60)),\"\")","v":""},{"$f":"IFERROR(IF($C59=\"TOTAL\",SUM($J$8:J58),IF(OR(C59=$AM$16,C59=$AM$17,C59=$AM$18,C59=$AM$19,C59=$AM$20,C59=$AM$21,C59=$AM$22,C59=$AM$23,C59=$AM$24),0,IF(BA60=\"\",\"\",BA60))),\"\")","v":""},"",{"$f":"IFERROR(IF(C59=\"\",\"\",IF(D59=\"\",\"\",IF(H59=\"\",\"\",IF($C59=\"TOTAL\",SUM($L$8:L58),SUM(D59-H59))))),\"\")","v":""},{"$f":"IFERROR(IF(C59=\"\",\"\",IF(E59=\"\",\"\",IF(I59=\"\",\"\",IF($C59=\"TOTAL\",SUM($M$8:M58),SUM(E59-I59))))),\"\")","v":""},{"$f":"IFERROR(IF(C59=\"\",\"\",IF(F59=\"\",\"\",IF(J59=\"\",\"\",IF($C59=\"TOTAL\",SUM($N$8:N58),SUM(F59-J59))))),\"\")","v":""},"",{"$f":"IFERROR(IF(C59=\"\",\"\",IF($C59=\"TOTAL\",SUM($P$8:P58),IF(AND(C59>$AL$1,$AC$3=$AL$2),BO60,IF($AO$18=$AO$20,SUM(BB60+BJ60),ROUND((D59+E59)*10%,0))))),\"\")","v":""},{"$f":"IFERROR(IF(C59=\"\",\"\",IF(H59=\"\",\"\",IF(I59=\"\",\"\",IF($C59=\"TOTAL\",SUM($Q$8:Q58),IF(AND(C59>$AL$1,$AC$3=$AL$2),BO60,IF($AO$18=$AO$20,$AO$21,ROUND((H59+I59)*10%,0))))))),\"\")","v":""},"",{"$f":"IFERROR(IF(C59=\"\",\"\",IF($AO$16=$AO$17,0,IF($C59=\"TOTAL\",SUM($S$8:S58),IF($AO$19=$AO$31,0,IF(AND($AO$32=$AO$20,C59=$AO$33),$AO$34,S58))))),\"\")","v":""},{"$f":"IFERROR(IF(C59=\"\",\"\",IF($AO$16=$AO$17,0,IF($C59=\"TOTAL\",SUM($T$8:T58),IF($AO$19=$AO$20,$AO$24,0)))),\"\")","v":""},"",{"$f":"IF(C59=\"\",\"\",IF($C59=\"TOTAL\",SUM($V$8:V58),IF(AND($AO$2=$AO$20,C59=$AO$1),ROUND(D59/31*$AP$2,0),IF(C59=$AM$6,ROUND((G59)*1/30,0),IF(C59=$AN$6,ROUND((G59)*1/31,0),\"\")))))","v":""},{"$f":"IF(C59=\"\",\"\",IF($C59=\"TOTAL\",SUM($W$8:W58),IF(AND($AO$2=$AO$20,C59=$AO$1),ROUND(H59/31*$AP$2,0),IF(C59=$AM$6,ROUND((K59)*1/30,0),IF(C59=$AN$6,ROUND((K59)*1/31,0),\"\")))))","v":""},"",{"$f":"IFERROR(IF(C59=\"\",\"\",IF(AND(BH60=\"\",BO60=\"\"),\"\",IF($C59=\"TOTAL\",SUM($Y$8:Y58),BH60))),\"\")","v":""},{"$f":"IFERROR(IF(C59=\"\",\"\",IF($C59=\"TOTAL\",SUM($Z$8:Z58),ROUND(O59*$AO$7%,0))),\"\")","v":""},{"$f":"IFERROR(IF(C59=\"\",\"\",IF($C59=\"TOTAL\",SUM($AA$8:AA58),IF($AC$3=$AL$2,SUM(U59,X59,Y59,Z59),SUM(R59,U59,X59,Y59,Z59)))),\"\")","v":""},{"$f":"IFERROR(IF(C59=\"\",\"\",IF($C59=\"TOTAL\",SUM($AB$8:AB58),SUM(O59-AA59))),\"\")","v":""},{"$nulls":8},34,34,null,"2021-03-01",null,"2024-12-01","","","","","","","",null,"","","","",null,null,"","","","",0,0,{"$nulls":4},2100]
["","","",{"$f":"IFERROR(IF($C59=\"TOTAL\",\"अक्षरें राशि :-\",IF($C60=\"TOTAL\",SUM($D$8:D59),IF(AU61=\"\",\"\",AU61))),\"\")","v":""},{"$f":"IFERROR(IF($C60=\"TOTAL\",SUM($E$8:E59),IF(AV61=\"\",\"\",AV61)),\"\")","v":""},{"$f":"IFERROR(IF($C60=\"TOTAL\",SUM($F$8:F59),IF(OR(C60=$AM$16,C60=$AM$17,C60=$AM$18,C60=$AM$19,C60=$AM$20,C60=$AM$21,C60=$AM$22,C60=$AM$23,C60=$AM$24),0,IF(AW61=\"\",\"\",AW61))),\"\")","v":""},"",{"$f":"IFERROR(IF($C60=\"TOTAL\",SUM($H$8:H59),IF(AY61=\"\",\"\",AY61)),\"\")","v":""},{"$f":"IFERROR(IF($C60=\"TOTAL\",SUM($I$8:I59),IF(AZ61=\"\",\"\",AZ61)),\"\")","v":""},{"$f":"IFERROR(IF($C60=\"TOTAL\",SUM($J$8:J59),IF(OR(C60=$AM$16,C60=$AM$17,C60=$AM$18,C60=$AM$19,C60=$AM$20,C60=$AM$21,C60=$AM$22,C60=$AM$23,C60=$AM$24),0,IF(BA61=\"\",\"\",BA61))),\"\")","v":""},"",{"$f":"IFERROR(IF(C60=\"\",\"\",IF(D60=\"\",\"\",IF(H60=\"\",\"\",IF($C60=\"TOTAL\",SUM($L$8:L59),SUM(D60-H60))))),\"\")","v":""},{"$f":"IFERROR(IF(C60=\"\",\"\",IF(E60=\"\",\"\",IF(I60=\"\",\"\",IF($C60=\"TOTAL\",SUM($M$8:M59),SUM(E60-I60))))),\"\")","v":""},{"$f":"IFERROR(IF(C60=\"\",\"\",IF(F60=\"\",\"\",IF(J60=\"\",\"\",IF($C60=\"TOTAL\",SUM($N$8:N59),SUM(F60-J60))))),\"\")","v":""},"",{"$f":"IFERROR(IF(C60=\"\",\"\",IF($C60=\"TOTAL\",SUM($P$8:P59),IF(AND(C60>$AL$1,$AC$3=$AL$2),BO61,IF($AO$18=$AO$20,SUM(BB61+BJ61),ROUND((D60+E60)*10%,0))))),\"\")","v":""},{"$f":"IFERROR(IF(C60=\"\",\"\",IF(H60=\"\",\"\",IF(I60=\"\",\"\",IF($C60=\"TOTAL\",SUM($Q$8:Q59),IF(AND(C60>$AL$1,$AC$3=$AL$2),BO61,IF($AO$18=$AO$20,$AO$21,ROUND((H60+I60)*10%,0))))))),\"\")","v":""},"",{"$f":"IFERROR(IF(C60=\"\",\"\",IF($AO$16=$AO$17,0,IF($C60=\"TOTAL\",SUM($S$8:S59),IF($AO$19=$AO$31,0,IF(AND($AO$32=$AO$20,C60=$AO$33),$AO$34,S59))))),\"\")","v":""},{"$f":"IFERROR(IF(C60=\"\",\"\",IF($AO$16=$AO$17,0,IF($C60=\"TOTAL\",SUM($T$8:T59),IF($AO$19=$AO$20,$AO$24,0)))),\"\")","v":""},"",{"$f":"IF(C60=\"\",\"\",IF($C60=\"TOTAL\",SUM($V$8:V59),IF(AND($AO$2=$AO$20,C60=$AO$1),ROUND(D60/31*$AP$2,0),IF(C60=$AM$6,ROUND((G60)*1/30,0),IF(C60=$AN$6,ROUND((G60)*1/31,0),\"\")))))","v":""},{"$f":"IF(C60=\"\",\"\",IF($C60=\"TOTAL\",SUM($W$8:W59),IF(AND($AO$2=$AO$20,C60=$AO$1),ROUND(H60/31*$AP$2,0),IF(C60=$AM$6,ROUND((K60)*1/30,0),IF(C60=$AN$6,ROUND((K60)*1/31,0),\"\")))))","v":""},"",{"$f":"IFERROR(IF(C60=\"\",\"\",IF(AND(BH61=\"\",BO61=\"\"),\"\",IF($C60=\"TOTAL\",SUM($Y$8:Y59),BH61))),\"\")","v":""},{"$f":"IFERROR(IF(C60=\"\",\"\",IF($C60=\"TOTAL\",SUM($Z$8:Z59),ROUND(O60*$AO$7%,0))),\"\")","v":""},{"$f":"IFERROR(IF(C60=\"\",\"\",IF($C60=\"TOTAL\",SUM($AA$8:AA59),IF($AC$3=$AL$2,SUM(U60,X60,Y60,Z60),SUM(R60,U60,X60,Y60,Z60)))),\"\")","v":""},{"$f":"IFERROR(IF(C60=\"\",\"\",IF($C60=\"TOTAL\",SUM($AB$8:AB59),SUM(O60-AA60))),\"\")","v":""},{"$nulls":8},34,34,null,"2021-04-01",null,"2025-01-01","","","","","","","",null,"","","","",null,null,"","","","",0,0,{"$nulls":4},2100]
["","","",{"$f":"IFERROR(IF($C60=\"TOTAL\",\"अक्षरें राशि :-\",IF($C61=\"TOTAL\",SUM($D$8:D60),IF(AU62=\"\",\"\",AU62))),\"\")","v":""},{"$f":"IFERROR(IF($C61=\"TOTAL\",SUM($E$8:E60),IF(AV62=\"\",\"\",AV62)),\"\")","v":""},{"$f":"IFERROR(IF($C61=\"TOTAL\",SUM($F$8:F60),IF(OR(C61=$AM$16,C61=$AM$17,C61=$AM$18,C61=$AM$19,C61=$AM$20,C61=$AM$21,C61=$AM$22,C61=$AM$23,C61=$AM$24),0,IF(AW62=\"\",\"\",AW62))),\"\")","v":""},"",{"$f":"IFERROR(IF($C61=\"TOTAL\",SUM($H$8:H60),IF(AY62=\"\",\"\",AY62)),\"\")","v":""},{"$f":"IFERROR(IF($C61=\"TOTAL\",SUM($I$8:I60),IF(AZ62=\"\",\"\",AZ62)),\"\")","v":""},{"$f":"IFERROR(IF($C61=\"TOTAL\",SUM($J$8:J60),IF(OR(C61=$AM$16,C61=$AM$17,C61=$AM$18,C61=$AM$19,C61=$AM$20,C61=$AM$21,C61=$AM$22,C61=$AM$23,C61=$AM$24),0,IF(BA62=\"\",\"\",BA62))),\"\")","v":""},"",{"$f":"IFERROR(IF(C61=\"\",\"\",IF(D61=\"\",\"\",IF(H61=\"\",\"\",IF($C61=\"TOTAL\",SUM($L$8:L60),SUM(D61-H61))))),\"\")","v":""},{"$f":"IFERROR(IF(C61=\"\",\"\",IF(E61=\"\",\"\",IF(I61=\"\",\"\",IF($C61=\"TOTAL\",SUM($M$8:M60),SUM(E61-I61))))),\"\")","v":""},{"$f":"IFERROR(IF(C61=\"\",\"\",IF(F61=\"\",\"\",IF(J61=\"\",\"\",IF($C61=\"TOTAL\",SUM($N$8:N60),SUM(F61-J61))))),\"\")","v":""},"",{"$f":"IFERROR(IF(C61=\"\",\"\",IF($C61=\"TOTAL\",SUM($P$8:P60),IF(AND(C61>$AL$1,$AC$3=$AL$2),BO62,IF($AO$18=$AO$20,SUM(BB62+BJ62),ROUND((D61+E61)*10%,0))))),\"\")","v":""},{"$f":"IFERROR(IF(C61=\"\",\"\",IF(H61=\"\",\"\",IF(I61=\"\",\"\",IF($C61=\"TOTAL\",SUM($Q$8:Q60),IF(AND(C61>$AL$1,$AC$3=$AL$2),BO62,IF($AO$18=$AO$20,$AO$21,ROUND((H61+I61)*10%,0))))))),\"\")","v":""},"",{"$f":"IFERROR(IF(C61=\"\",\"\",IF($AO$16=$AO$17,0,IF($C61=\"TOTAL\",SUM($S$8:S60),IF($AO$19=$AO$31,0,IF(AND($AO$32=$AO$20,C61=$AO$33),$AO$34,S60))))),\"\")","v":""},{"$f":"IFERROR(IF(C61=\"\",\"\",IF($AO$16=$AO$17,0,IF($C61=\"TOTAL\",SUM($T$8:T60),IF($AO$19=$AO$20,$AO$24,0)))),\"\")","v":""},"",{"$f":"IF(C61=\"\",\"\",IF($C61=\"TOTAL\",SUM($V$8:V60),IF(AND($AO$2=$AO$20,C61=$AO$1),ROUND(D61/31*$AP$2,0),IF(C61=$AM$6,ROUND((G61)*1/30,0),IF(C61=$AN$6,ROUND((G61)*1/31,0),\"\")))))","v":""},{"$f":"IF(C61=\"\",\"\",IF($C61=\"TOTAL\",SUM($W$8:W60),IF(AND($AO$2=$AO$20,C61=$AO$1),ROUND(H61/31*$AP$2,0),IF(C61=$AM$6,ROUND((K61)*1/30,0),IF(C61=$AN$6,ROUND((K61)*1/31,0),\"\")))))","v":""},"",{"$f":"IFERROR(IF(C61=\"\",\"\",IF(AND(BH62=\"\",BO62=\"\"),\"\",IF($C61=\"TOTAL\",SUM($Y$8:Y60),BH62))),\"\")","v":""},{"$f":"IFERROR(IF(C61=\"\",\"\",IF($C61=\"TOTAL\",SUM($Z$8:Z60),ROUND(O61*$AO$7%,0))),\"\")","v":""},{"$f":"IFERROR(IF(C61=\"\",\"\",IF($C61=\"TOTAL\",SUM($AA$8:AA60),IF($AC$3=$AL$2,SUM(U61,X61,Y61,Z61),SUM(R61,U61,X61,Y61,Z61)))),\"\")","v":""},{"$f":"IFERROR(IF(C61=\"\",\"\",IF($C61=\"TOTAL\",SUM($AB$8:AB60),SUM(O61-AA61))),\"\")","v":""},{"$nulls":8},34,34,null,"2021-05-01",null,"2025-02-01","","","","","","","",null,"","","","",null,null,"","","","",0,0,null,{"$f":"SUM(ROUND(D62*34%,0))-SUM(ROUND(D62*31%,0))","v":{"$error":"#VALUE!"}},null,null,2100]
["","","",{"$f":"IFERROR(IF($C61=\"TOTAL\",\"अक्षरें राशि :-\",IF($C62=\"TOTAL\",SUM($D$8:D61),IF(AU63=\"\",\"\",AU63))),\"\")","v":""},{"$f":"IFERROR(IF($C62=\"TOTAL\",SUM($E$8:E61),IF(AV63=\"\",\"\",AV63)),\"\")","v":""},{"$f":"IFERROR(IF($C62=\"TOTAL\",SUM($F$8:F61),IF(OR(C62=$AM$16,C62=$AM$17,C62=$AM$18,C62=$AM$19,C62=$AM$20,C62=$AM$21,C62=$AM$22,C62=$AM$23,C62=$AM$24),0,IF(AW63=\"\",\"\",AW63))),\"\")","v":""},"",{"$f":"IFERROR(IF($C62=\"TOTAL\",SUM($H$8:H61),IF(AY63=\"\",\"\",AY63)),\"\")","v":""},{"$f":"IFERROR(IF($C62=\"TOTAL\",SUM($I$8:I61),IF(AZ63=\"\",\"\",AZ63)),\"\")","v":""},{"$f":"IFERROR(IF($C62=\"TOTAL\",SUM($J$8:J61),IF(OR(C62=$AM$16,C62=$AM$17,C62=$AM$18,C62=$AM$19,C62=$AM$20,C62=$AM$21,C62=$AM$22,C62=$AM$23,C62=$AM$24),0,IF(BA63=\"\",\"\",BA63))),\"\")","v":""},"",{"$f":"IFERROR(IF(C62=\"\",\"\",IF(D62=\"\",\"\",IF(H62=\"\",\"\",IF($C62=\"TOTAL\",SUM($L$8:L61),SUM(D62-H62))))),\"\")","v":""},{"$f":"IFERROR(IF(C62=\"\",\"\",IF(E62=\"\",\"\",IF(I62=\"\",\"\",IF($C62=\"TOTAL\",SUM($M$8:M61),SUM(E62-I62))))),\"\")","v":""},{"$f":"IFERROR(IF(C62=\"\",\"\",IF(F62=\"\",\"\",IF(J62=\"\",\"\",IF($C62=\"TOTAL\",SUM($N$8:N61),SUM(F62-J62))))),\"\")","v":""},"",{"$f":"IFERROR(IF(C62=\"\",\"\",IF($C62=\"TOTAL\",SUM($P$8:P61),IF(AND(C62>$AL$1,$AC$3=$AL$2),BO63,IF($AO$18=$AO$20,SUM(BB63+BJ63),ROUND((D62+E62)*10%,0))))),\"\")","v":""},{"$f":"IFERROR(IF(C62=\"\",\"\",IF(H62=\"\",\"\",IF(I62=\"\",\"\",IF($C62=\"TOTAL\",SUM($Q$8:Q61),IF(AND(C62>$AL$1,$AC$3=$AL$2),BO63,IF($AO$18=$AO$20,$AO$21,ROUND((H62+I62)*10%,0))))))),\"\")","v":""},{"$f":"IFERROR(IF(C62=\"\",\"\",SUM(P62-Q62)),\"\")","v":""},{"$f":"IFERROR(IF(C62=\"\",\"\",IF($AO$16=$AO$17,0,IF($C62=\"TOTAL\",SUM($S$8:S61),IF($AO$19=$AO$31,0,IF(AND($AO$32=$AO$20,C62=$AO$33),$AO$34,S61))))),\"\")","v":""},{"$f":"IFERROR(IF(C62=\"\",\"\",IF($AO$16=$AO$17,0,IF($C62=\"TOTAL\",SUM($T$8:T61),IF($AO$19=$AO$20,$AO$24,0)))),\"\")","v":""},"",{"$f":"IF(C62=\"\",\"\",IF($C62=\"TOTAL\",SUM($V$8:V61),IF(AND($AO$2=$AO$20,C62=$AO$1),ROUND(D62/31*$AP$2,0),IF(C62=$AM$6,ROUND((G62)*1/30,0),IF(C62=$AN$6,ROUND((G62)*1/31,0),\"\")))))","v":""},{"$f":"IF(C62=\"\",\"\",IF($C62=\"TOTAL\",SUM($W$8:W61),IF(AND($AO$2=$AO$20,C62=$AO$1),ROUND(H62/31*$AP$2,0),IF(C62=$AM$6,ROUND((K62)*1/30,0),IF(C62=$AN$6,ROUND((K62)*1/31,0),\"\")))))","v":""},"",{"$f":"IFERROR(IF(C62=\"\",\"\",IF(AND(BH63=\"\",BO63=\"\"),\"\",IF($C62=\"TOTAL\",SUM($Y$8:Y61),BH63))),\"\")","v":""},{"$f":"IFERROR(IF(C62=\"\",\"\",IF($C62=\"TOTAL\",SUM($Z$8:Z61),ROUND(O62*$AO$7%,0))),\"\")","v":""},{"$f":"IFERROR(IF(C62=\"\",\"\",IF($C62=\"TOTAL\",SUM($AA$8:AA61),IF($AC$3=$AL$2,SUM(U62,X62,Y62,Z62),SUM(R62,U62,X62,Y62,Z62)))),\"\")","v":""},{"$f":"IFERROR(IF(C62=\"\",\"\",IF($C62=\"TOTAL\",SUM($AB$8:AB61),SUM(O62-AA62))),\"\")","v":""},{"$nulls":8},34,34,null,"2021-06-01",null,"2025-03-01","","","","","","","",null,"","","","",null,null,"","","","",0,0,{"$nulls":4},2100]
["","","",{"$f":"IFERROR(IF($C62=\"TOTAL\",\"अक्षरें राशि :-\",IF($C63=\"TOTAL\",SUM($D$8:D62),IF(AU64=\"\",\"\",AU64))),\"\")","v":""},{"$f":"IFERROR(IF($C63=\"TOTAL\",SUM($E$8:E62),IF(AV64=\"\",\"\",AV64)),\"\")","v":""},{"$f":"IFERROR(IF($C63=\"TOTAL\",SUM($F$8:F62),IF(OR(C63=$AM$16,C63=$AM$17,C63=$AM$18,C63=$AM$19,C63=$AM$20,C63=$AM$21,C63=$AM$22,C63=$AM$23,C63=$AM$24),0,IF(AW64=\"\",\"\",AW64))),\"\")","v":""},"",{"$f":"IFERROR(IF($C63=\"TOTAL\",SUM($H$8:H62),IF(AY64=\"\",\"\",AY64)),\"\")","v":""},{"$f":"IFERROR(IF($C63=\"TOTAL\",SUM($I$8:I62),IF(AZ64=\"\",\"\",AZ64)),\"\")","v":""},{"$f":"IFERROR(IF($C63=\"TOTAL\",SUM($J$8:J62),IF(OR(C63=$AM$16,C63=$AM$17,C63=$AM$18,C63=$AM$19,C63=$AM$20,C63=$AM$21,C63=$AM$22,C63=$AM$23,C63=$AM$24),0,IF(BA64=\"\",\"\",BA64))),\"\")","v":""},"",{"$f":"IFERROR(IF(C63=\"\",\"\",IF(D63=\"\",\"\",IF(H63=\"\",\"\",IF($C63=\"TOTAL\",SUM($L$8:L62),SUM(D63-H63))))),\"\")","v":""},{"$f":"IFERROR(IF(C63=\"\",\"\",IF(E63=\"\",\"\",IF(I63=\"\",\"\",IF($C63=\"TOTAL\",SUM($M$8:M62),SUM(E63-I63))))),\"\")","v":""},{"$f":"IFERROR(IF(C63=\"\",\"\",IF(F63=\"\",\"\",IF(J63=\"\",\"\",IF($C63=\"TOTAL\",SUM($N$8:N62),SUM(F63-J63))))),\"\")","v":""},"",{"$f":"IFERROR(IF(C63=\"\",\"\",IF($C63=\"TOTAL\",SUM($P$8:P62),IF(AND(C63>$AL$1,$AC$3=$AL$2),BO64,IF($AO$18=$AO$20,SUM(BB64+BJ64),ROUND((D63+E63)*10%,0))))),\"\")","v":""},{"$f":"IFERROR(IF(C63=\"\",\"\",IF(H63=\"\",\"\",IF(I63=\"\",\"\",IF($C63=\"TOTAL\",SUM($Q$8:Q62),IF(AND(C63>$AL$1,$AC$3=$AL$2),BO64,IF($AO$18=$AO$20,$AO$21,ROUND((H63+I63)*10%,0))))))),\"\")","v":""},"",{"$f":"IFERROR(IF(C63=\"\",\"\",IF($AO$16=$AO$17,0,IF($C63=\"TOTAL\",SUM($S$8:S62),IF($AO$19=$AO$31,0,IF(AND($AO$32=$AO$20,C63=$AO$33),$AO$34,S62))))),\"\")","v":""},{"$f":"IFERROR(IF(C63=\"\",\"\",IF($AO$16=$AO$17,0,IF($C63=\"TOTAL\",SUM($T$8:T62),IF($AO$19=$AO$20,$AO$24,0)))),\"\")","v":""},"",{"$f":"IF(C63=\"\",\"\",IF($C63=\"TOTAL\",SUM($V$8:V62),IF(AND($AO$2=$AO$20,C63=$AO$1),ROUND(D63/31*$AP$2,0),IF(C63=$AM$6,ROUND((G63)*1/30,0),IF(C63=$AN$6,ROUND((G63)*1/31,0),\"\")))))","v":""},{"$f":"IF(C63=\"\",\"\",IF($C63=\"TOTAL\",SUM($W$8:W62),IF(AND($AO$2=$AO$20,C63=$AO$1),ROUND(H63/31*$AP$2,0),IF(C63=$AM$6,ROUND((K63)*1/30,0),IF(C63=$AN$6,ROUND((K63)*1/31,0),\"\")))))","v":""},"",{"$f":"IFERROR(IF(C63=\"\",\"\",IF(AND(BH64=\"\",BO64=\"\"),\"\",IF($C63=\"TOTAL\",SUM($Y$8:Y62),BH64))),\"\")","v":""},{"$f":"IFERROR(IF(C63=\"\",\"\",IF($C63=\"TOTAL\",SUM($Z$8:Z62),ROUND(O63*$AO$7%,0))),\"\")","v":""},{"$f":"IFERROR(IF(C63=\"\",\"\",IF($C63=\"TOTAL\",SUM($AA$8:AA62),IF($AC$3=$AL$2,SUM(U63,X63,Y63,Z63),SUM(R63,U63,X63,Y63,Z63)))),\"\")","v":""},{"$f":"IFERROR(IF(C63=\"\",\"\",IF($C63=\"TOTAL\",SUM($AB$8:AB62),SUM(O63-AA63))),\"\")","v":""},{"$nulls":8},34,34,null,"2021-07-01",null,"2025-04-01","","","","","","","",null,"","","","",null,null,"","",{"$f":"IF(OR(AT63=$AN$63,AT63=$AN$64,AT63=$AN$65),\"YES\",\"\")","v":""},"",0,0,{"$f":"SUM(ROUND(D62*3%,0))","v":{"$error":"#VALUE!"}},{"$f":"IF($AM$7=\"NO\",ROUND((H62+L62)*3%,0)-ROUND(ROUND((L62+H62)*3%,0)*10%,0),ROUND((L62+M62)*3%,0)-ROUND(ROUND((L62+M62)*3%,0)*10%,0))","v":{"$error":"#VALUE!"}},{"$f":"ROUND((L62+M62)*3%,0)-ROUND(ROUND((L62+M62)*3%,0)*10%,0)","v":{"$error":"#VALUE!"}},{"$f":"IF(AND($AO$16=$AO$17,BG63=\"YES\"),SUM(ROUND(D62*3%,0))-ROUND(ROUND(D62*3%,0)*10%,0),IF(AND($AO$16=$AO$15,BG63=\"YES\",$AM$7=\"NO\"),ROUND((H62+L62)*3%,0)-ROUND(ROUND((L62+H62)*3%,0)*10%,0),IF(AND($AO$16=$AO$15,BG63=\"YES\",$AM$7=\"YES\"),ROUND((L62+M62)*3%,0)-ROUND(ROUND((L62+M62)*3%,0)*10%,0),\"\")))","v":""},2100,{"$f":"IF(C62=\"\",\"\",IF($C62=\"TOTAL\",1,2))","v":""}]
["","","",{"$f":"IFERROR(IF($C63=\"TOTAL\",\"अक्षरें राशि :-\",IF($C64=\"TOTAL\",SUM($D$8:D63),IF(AU65=\"\",\"\",AU65))),\"\")","v":""},{"$f":"IFERROR(IF($C64=\"TOTAL\",SUM($E$8:E63),IF(AV65=\"\",\"\",AV65)),\"\")","v":""},{"$f":"IFERROR(IF($C64=\"TOTAL\",SUM($F$8:F63),IF(OR(C64=$AM$16,C64=$AM$17,C64=$AM$18,C64=$AM$19,C64=$AM$20,C64=$AM$21,C64=$AM$22,C64=$AM$23,C64=$AM$24),0,IF(AW65=\"\",\"\",AW65))),\"\")","v":""},"",{"$f":"IFERROR(IF($C64=\"TOTAL\",SUM($H$8:H63),IF(AY65=\"\",\"\",AY65)),\"\")","v":""},{"$f":"IFERROR(IF($C64=\"TOTAL\",SUM($I$8:I63),IF(AZ65=\"\",\"\",AZ65)),\"\")","v":""},{"$f":"IFERROR(IF($C64=\"TOTAL\",SUM($J$8:J63),IF(OR(C64=$AM$16,C64=$AM$17,C64=$AM$18,C64=$AM$19,C64=$AM$20,C64=$AM$21,C64=$AM$22,C64=$AM$23,C64=$AM$24),0,IF(BA65=\"\",\"\",BA65))),\"\")","v":""},"",{"$f":"IFERROR(IF(C64=\"\",\"\",IF(D64=\"\",\"\",IF(H64=\"\",\"\",IF($C64=\"TOTAL\",SUM($L$8:L63),SUM(D64-H64))))),\"\")","v":""},{"$f":"IFERROR(IF(C64=\"\",\"\",IF(E64=\"\",\"\",IF(I64=\"\",\"\",IF($C64=\"TOTAL\",SUM($M$8:M63),SUM(E64-I64))))),\"\")","v":""},{"$f":"IFERROR(IF(C64=\"\",\"\",IF(F64=\"\",\"\",IF(J64=\"\",\"\",IF($C64=\"TOTAL\",SUM($N$8:N63),SUM(F64-J64))))),\"\")","v":""},"",{"$f":"IFERROR(IF(C64=\"\",\"\",IF($C64=\"TOTAL\",SUM($P$8:P63),IF(AND(C64>$AL$1,$AC$3=$AL$2),BO65,IF($AO$18=$AO$20,SUM(BB65+BJ65),ROUND((D64+E64)*10%,0))))),\"\")","v":""},{"$f":"IFERROR(IF(C64=\"\",\"\",IF(H64=\"\",\"\",IF(I64=\"\",\"\",IF($C64=\"TOTAL\",SUM($Q$8:Q63),IF(AND(C64>$AL$1,$AC$3=$AL$2),BO65,IF($AO$18=$AO$20,$AO$21,ROUND((H64+I64)*10%,0))))))),\"\")","v":""},"",{"$f":"IFERROR(IF(C64=\"\",\"\",IF($AO$16=$AO$17,0,IF($C64=\"TOTAL\",SUM($S$8:S63),IF($AO$19=$AO$31,0,IF(AND($AO$32=$AO$20,C64=$AO$33),$AO$34,S63))))),\"\")","v":""},{"$f":"IFERROR(IF(C64=\"\",\"\",IF($AO$16=$AO$17,0,IF($C64=\"TOTAL\",SUM($T$8:T63),IF($AO$19=$AO$20,$AO$24,0)))),\"\")","v":""},"",{"$f":"IF(C64=\"\",\"\",IF($C64=\"TOTAL\",SUM($V$8:V63),IF(AND($AO$2=$AO$20,C64=$AO$1),ROUND(D64/31*$AP$2,0),IF(C64=$AM$6,ROUND((G64)*1/30,0),IF(C64=$AN$6,ROUND((G64)*1/31,0),\"\")))))","v":""},{"$f":"IF(C64=\"\",\"\",IF($C64=\"TOTAL\",SUM($W$8:W63),IF(AND($AO$2=$AO$20,C64=$AO$1),ROUND(H64/31*$AP$2,0),IF(C64=$AM$6,ROUND((K64)*1/30,0),IF(C64=$AN$6,ROUND((K64)*1/31,0),\"\")))))","v":""},"",{"$f":"IFERROR(IF(C64=\"\",\"\",IF(AND(BH65=\"\",BO65=\"\"),\"\",IF($C64=\"TOTAL\",SUM($Y$8:Y63),BH65))),\"\")","v":""},{"$f":"IFERROR(IF(C64=\"\",\"\",IF($C64=\"TOTAL\",SUM($Z$8:Z63),ROUND(O64*$AO$7%,0))),\"\")","v":""},{"$f":"IFERROR(IF(C64=\"\",\"\",IF($C64=\"TOTAL\",SUM($AA$8:AA63),IF($AC$3=$AL$2,SUM(U64,X64,Y64,Z64),SUM(R64,U64,X64,Y64,Z64)))),\"\")","v":""},{"$f":"IFERROR(IF(C64=\"\",\"\",IF($C64=\"TOTAL\",SUM($AB$8:AB63),SUM(O64-AA64))),\"\")","v":""},{"$nulls":8},34,34,null,"2021-08-01",null,"2025-05-01","","","","","","","",null,"","","","",null,null,"","","","",0,0,{"$f":"ROUND(ROUND(L63*3%,0)*10%,0)","v":{"$error":"#VALUE!"}},null,{"$f":"ROUND(ROUND((L64+H64)*3%,0)*10%,0)","v":{"$error":"#VALUE!"}},{"$f":"ROUND((H62+L62)*3%,0)-ROUND(ROUND((L62+H62)*3%,0)*10%,0)","v":{"$error":"#VALUE!"}},2100]
["","","",{"$f":"IFERROR(IF($C64=\"TOTAL\",\"अक्षरें राशि :-\",IF($C65=\"TOTAL\",SUM($D$8:D64),IF(AU66=\"\",\"\",AU66))),\"\")","v":""},{"$f":"IFERROR(IF($C65=\"TOTAL\",SUM($E$8:E64),IF(AV66=\"\",\"\",AV66)),\"\")","v":""},{"$f":"IFERROR(IF($C65=\"TOTAL\",SUM($F$8:F64),IF(OR(C65=$AM$16,C65=$AM$17,C65=$AM$18,C65=$AM$19,C65=$AM$20,C65=$AM$21,C65=$AM$22,C65=$AM$23,C65=$AM$24),0,IF(AW66=\"\",\"\",AW66))),\"\")","v":""},"",{"$f":"IFERROR(IF($C65=\"TOTAL\",SUM($H$8:H64),IF(AY66=\"\",\"\",AY66)),\"\")","v":""},{"$f":"IFERROR(IF($C65=\"TOTAL\",SUM($I$8:I64),IF(AZ66=\"\",\"\",AZ66)),\"\")","v":""},{"$f":"IFERROR(IF($C65=\"TOTAL\",SUM($J$8:J64),IF(OR(C65=$AM$16,C65=$AM$17,C65=$AM$18,C65=$AM$19,C65=$AM$20,C65=$AM$21,C65=$AM$22,C65=$AM$23,C65=$AM$24),0,IF(BA66=\"\",\"\",BA66))),\"\")","v":""},"",{"$f":"IFERROR(IF(C65=\"\",\"\",IF(D65=\"\",\"\",IF(H65=\"\",\"\",IF($C65=\"TOTAL\",SUM($L$8:L64),SUM(D65-H65))))),\"\")","v":""},{"$f":"IFERROR(IF(C65=\"\",\"\",IF(E65=\"\",\"\",IF(I65=\"\",\"\",IF($C65=\"TOTAL\",SUM($M$8:M64),SUM(E65-I65))))),\"\")","v":""},{"$f":"IFERROR(IF(C65=\"\",\"\",IF(F65=\"\",\"\",IF(J65=\"\",\"\",IF($C65=\"TOTAL\",SUM($N$8:N64),SUM(F65-J65))))),\"\")","v":""},"",{"$f":"IFERROR(IF(C65=\"\",\"\",IF($C65=\"TOTAL\",SUM($P$8:P64),IF(AND(C65>$AL$1,$AC$3=$AL$2),BO66,IF($AO$18=$AO$20,SUM(BB66+BJ66),ROUND((D65+E65)*10%,0))))),\"\")","v":""},{"$f":"IFERROR(IF(C65=\"\",\"\",IF(H65=\"\",\"\",IF(I65=\"\",\"\",IF($C65=\"TOTAL\",SUM($Q$8:Q64),IF(AND(C65>$AL$1,$AC$3=$AL$2),BO66,IF($AO$18=$AO$20,$AO$21,ROUND((H65+I65)*10%,0))))))),\"\")","v":""},"",{"$f":"IFERROR(IF(C65=\"\",\"\",IF($AO$16=$AO$17,0,IF($C65=\"TOTAL\",SUM($S$8:S64),IF($AO$19=$AO$31,0,IF(AND($AO$32=$AO$20,C65=$AO$33),$AO$34,S64))))),\"\")","v":""},{"$f":"IFERROR(IF(C65=\"\",\"\",IF($AO$16=$AO$17,0,IF($C65=\"TOTAL\",SUM($T$8:T64),IF($AO$19=$AO$20,$AO$24,0)))),\"\")","v":""},"",{"$f":"IF(C65=\"\",\"\",IF($C65=\"TOTAL\",SUM($V$8:V64),IF(AND($AO$2=$AO$20,C65=$AO$1),ROUND(D65/31*$AP$2,0),IF(C65=$AM$6,ROUND((G65)*1/30,0),IF(C65=$AN$6,ROUND((G65)*1/31,0),\"\")))))","v":""},{"$f":"IF(C65=\"\",\"\",IF($C65=\"TOTAL\",SUM($W$8:W64),IF(AND($AO$2=$AO$20,C65=$AO$1),ROUND(H65/31*$AP$2,0),IF(C65=$AM$6,ROUND((K65)*1/30,0),IF(C65=$AN$6,ROUND((K65)*1/31,0),\"\")))))","v":""},"",{"$f":"IFERROR(IF(C65=\"\",\"\",IF(AND(BH66=\"\",BO66=\"\"),\"\",IF($C65=\"TOTAL\",SUM($Y$8:Y64),BH66))),\"\")","v":""},{"$f":"IFERROR(IF(C65=\"\",\"\",IF($C65=\"TOTAL\",SUM($Z$8:Z64),ROUND(O65*$AO$7%,0))),\"\")","v":""},{"$f":"IFERROR(IF(C65=\"\",\"\",IF($C65=\"TOTAL\",SUM($AA$8:AA64),IF($AC$3=$AL$2,SUM(U65,X65,Y65,Z65),SUM(R65,U65,X65,Y65,Z65)))),\"\")","v":""},{"$f":"IFERROR(IF(C65=\"\",\"\",IF($C65=\"TOTAL\",SUM($AB$8:AB64),SUM(O65-AA65))),\"\")","v":""},{"$nulls":8},34,34,null,"2021-09-01",null,"2025-06-01","","","","","","","",null,"","","","",null,null,"","","","",0,0,{"$f":"SUM(ROUND(L64*3%,0))-ROUND(ROUND(L64*3%,0)*10%,0)","v":{"$error":"#VALUE!"}},{"$f":"SUM(ROUND(L64*3%,0))-ROUND(ROUND(L64*3%,0)*10%,0)","v":{"$error":"#VALUE!"}},null,null,2100]
["","",{"$f":"IFERROR(IF(AT67=\"\",\"\",AT67),\"\")","v":""},{"$f":"IFERROR(IF($C65=\"TOTAL\",\"अक्षरें राशि :-\",IF($C66=\"TOTAL\",SUM($D$8:D65),IF(AU67=\"\",\"\",AU67))),\"\")","v":""},{"$f":"IFERROR(IF($C66=\"TOTAL\",SUM($E$8:E65),IF(AV67=\"\",\"\",AV67)),\"\")","v":""},{"$f":"IFERROR(IF($C66=\"TOTAL\",SUM($F$8:F65),IF(OR(C66=$AM$16,C66=$AM$17,C66=$AM$18,C66=$AM$19,C66=$AM$20,C66=$AM$21,C66=$AM$22,C66=$AM$23,C66=$AM$24),0,IF(AW67=\"\",\"\",AW67))),\"\")","v":""},{"$f":"IF(C66=\"\",\"\",SUM(D66:F66))","v":""},{"$f":"IFERROR(IF($C66=\"TOTAL\",SUM($H$8:H65),IF(AY67=\"\",\"\",AY67)),\"\")","v":""},{"$f":"IFERROR(IF($C66=\"TOTAL\",SUM($I$8:I65),IF(AZ67=\"\",\"\",AZ67)),\"\")","v":""},{"$f":"IFERROR(IF($C66=\"TOTAL\",SUM($J$8:J65),IF(OR(C66=$AM$16,C66=$AM$17,C66=$AM$18,C66=$AM$19,C66=$AM$20,C66=$AM$21,C66=$AM$22,C66=$AM$23,C66=$AM$24),0,IF(BA67=\"\",\"\",BA67))),\"\")","v":""},"",{"$f":"IFERROR(IF(C66=\"\",\"\",IF(D66=\"\",\"\",IF(H66=\"\",\"\",IF($C66=\"TOTAL\",SUM($L$8:L65),SUM(D66-H66))))),\"\")","v":""},{"$f":"IFERROR(IF(C66=\"\",\"\",IF(E66=\"\",\"\",IF(I66=\"\",\"\",IF($C66=\"TOTAL\",SUM($M$8:M65),SUM(E66-I66))))),\"\")","v":""},{"$f":"IFERROR(IF(C66=\"\",\"\",IF(F66=\"\",\"\",IF(J66=\"\",\"\",IF($C66=\"TOTAL\",SUM($N$8:N65),SUM(F66-J66))))),\"\")","v":""},"",{"$f":"IFERROR(IF(C66=\"\",\"\",IF($C66=\"TOTAL\",SUM($P$8:P65),IF(AND(C66>$AL$1,$AC$3=$AL$2),BO67,IF($AO$18=$AO$20,SUM(BB67+BJ67),ROUND((D66+E66)*10%,0))))),\"\")","v":""},{"$f":"IFERROR(IF(C66=\"\",\"\",IF(H66=\"\",\"\",IF(I66=\"\",\"\",IF($C66=\"TOTAL\",SUM($Q$8:Q65),IF(AND(C66>$AL$1,$AC$3=$AL$2),BO67,IF($AO$18=$AO$20,$AO$21,ROUND((H66+I66)*10%,0))))))),\"\")","v":""},"",{"$f":"IFERROR(IF(C66=\"\",\"\",IF($AO$16=$AO$17,0,IF($C66=\"TOTAL\",SUM($S$8:S65),IF($AO$19=$AO$31,0,IF(AND($AO$32=$AO$20,C66=$AO$33),$AO$34,S65))))),\"\")","v":""},{"$f":"IFERROR(IF(C66=\"\",\"\",IF($AO$16=$AO$17,0,IF($C66=\"TOTAL\",SUM($T$8:T65),IF($AO$19=$AO$20,$AO$24,0)))),\"\")","v":""},"",{"$f":"IF(C66=\"\",\"\",IF($C66=\"TOTAL\",SUM($V$8:V65),IF(AND($AO$2=$AO$20,C66=$AO$1),ROUND(D66/31*$AP$2,0),IF(C66=$AM$6,ROUND((G66)*1/30,0),IF(C66=$AN$6,ROUND((G66)*1/31,0),\"\")))))","v":""},{"$f":"IF(C66=\"\",\"\",IF($C66=\"TOTAL\",SUM($W$8:W65),IF(AND($AO$2=$AO$20,C66=$AO$1),ROUND(H66/31*$AP$2,0),IF(C66=$AM$6,ROUND((K66)*1/30,0),IF(C66=$AN$6,ROUND((K66)*1/31,0),\"\")))))","v":""},"",{"$f":"IFERROR(IF(C66=\"\",\"\",IF(AND(BH67=\"\",BO67=\"\"),\"\",IF($C66=\"TOTAL\",SUM($Y$8:Y65),BH67))),\"\")","v":""},{"$f":"IFERROR(IF(C66=\"\",\"\",IF($C66=\"TOTAL\",SUM($Z$8:Z65),ROUND(O66*$AO$7%,0))),\"\")","v":""},{"$f":"IFERROR(IF(C66=\"\",\"\",IF($C66=\"TOTAL\",SUM($AA$8:AA65),IF($AC$3=$AL$2,SUM(U66,X66,Y66,Z66),SUM(R66,U66,X66,Y66,Z66)))),\"\")","v":""},{"$f":"IFERROR(IF(C66=\"\",\"\",IF($C66=\"TOTAL\",SUM($AB$8:AB65),SUM(O66-AA66))),\"\")","v":""},{"$nulls":8},34,34,null,"2021-10-01",null,"2025-07-01","","","","","","","",null,"","","","",null,null,"","","","",0,0,{"$nulls":4},2100]
["","",{"$f":"IFERROR(IF(AT68=\"\",\"\",AT68),\"\")","v":""},{"$f":"IFERROR(IF($C66=\"TOTAL\",\"अक्षरें राशि :-\",IF($C67=\"TOTAL\",SUM($D$8:D66),IF(AU68=\"\",\"\",AU68))),\"\")","v":""},{"$f":"IFERROR(IF($C67=\"TOTAL\",SUM($E$8:E66),IF(AV68=\"\",\"\",AV68)),\"\")","v":""},{"$f":"IFERROR(IF($C67=\"TOTAL\",SUM($F$8:F66),IF(OR(C67=$AM$16,C67=$AM$17,C67=$AM$18,C67=$AM$19,C67=$AM$20,C67=$AM$21,C67=$AM$22,C67=$AM$23,C67=$AM$24),0,IF(AW68=\"\",\"\",AW68))),\"\")","v":""},"",{"$f":"IFERROR(IF($C67=\"TOTAL\",SUM($H$8:H66),IF(AY68=\"\",\"\",AY68)),\"\")","v":""},{"$f":"IFERROR(IF($C67=\"TOTAL\",SUM($I$8:I66),IF(AZ68=\"\",\"\",AZ68)),\"\")","v":""},{"$f":"IFERROR(IF($C67=\"TOTAL\",SUM($J$8:J66),IF(OR(C67=$AM$16,C67=$AM$17,C67=$AM$18,C67=$AM$19,C67=$AM$20,C67=$AM$21,C67=$AM$22,C67=$AM$23,C67=$AM$24),0,IF(BA68=\"\",\"\",BA68))),\"\")","v":""},"",{"$f":"IFERROR(IF(C67=\"\",\"\",IF(D67=\"\",\"\",IF(H67=\"\",\"\",IF($C67=\"TOTAL\",SUM($L$8:L66),SUM(D67-H67))))),\"\")","v":""},{"$f":"IFERROR(IF(C67=\"\",\"\",IF(E67=\"\",\"\",IF(I67=\"\",\"\",IF($C67=\"TOTAL\",SUM($M$8:M66),SUM(E67-I67))))),\"\")","v":""},{"$f":"IFERROR(IF(C67=\"\",\"\",IF(F67=\"\",\"\",IF(J67=\"\",\"\",IF($C67=\"TOTAL\",SUM($N$8:N66),SUM(F67-J67))))),\"\")","v":""},"",{"$f":"IFERROR(IF(C67=\"\",\"\",IF($C67=\"TOTAL\",SUM($P$8:P66),IF(AND(C67>$AL$1,$AC$3=$AL$2),BO68,IF($AO$18=$AO$20,SUM(BB68+BJ68),ROUND((D67+E67)*10%,0))))),\"\")","v":""},{"$f":"IFERROR(IF(C67=\"\",\"\",IF(H67=\"\",\"\",IF(I67=\"\",\"\",IF($C67=\"TOTAL\",SUM($Q$8:Q66),IF(AND(C67>$AL$1,$AC$3=$AL$2),BO68,IF($AO$18=$AO$20,$AO$21,ROUND((H67+I67)*10%,0))))))),\"\")","v":""},"",{"$f":"IFERROR(IF(C67=\"\",\"\",IF($AO$16=$AO$17,0,IF($C67=\"TOTAL\",SUM($S$8:S66),IF($AO$19=$AO$31,0,IF(AND($AO$32=$AO$20,C67=$AO$33),$AO$34,S66))))),\"\")","v":""},{"$f":"IFERROR(IF(C67=\"\",\"\",IF($AO$16=$AO$17,0,IF($C67=\"TOTAL\",SUM($T$8:T66),IF($AO$19=$AO$20,$AO$24,0)))),\"\")","v":""},"",{"$f":"IF(C67=\"\",\"\",IF($C67=\"TOTAL\",SUM($V$8:V66),IF(AND($AO$2=$AO$20,C67=$AO$1),ROUND(D67/31*$AP$2,0),IF(C67=$AM$6,ROUND((G67)*1/30,0),IF(C67=$AN$6,ROUND((G67)*1/31,0),\"\")))))","v":""},{"$f":"IF(C67=\"\",\"\",IF($C67=\"TOTAL\",SUM($W$8:W66),IF(AND($AO$2=$AO$20,C67=$AO$1),ROUND(H67/31*$AP$2,0),IF(C67=$AM$6,ROUND((K67)*1/30,0),IF(C67=$AN$6,ROUND((K67)*1/31,0),\"\")))))","v":""},"",{"$f":"IFERROR(IF(C67=\"\",\"\",IF(AND(BH68=\"\",BO68=\"\"),\"\",IF($C67=\"TOTAL\",SUM($Y$8:Y66),BH68))),\"\")","v":""},{"$f":"IFERROR(IF(C67=\"\",\"\",IF($C67=\"TOTAL\",SUM($Z$8:Z66),ROUND(O67*$AO$7%,0))),\"\")","v":""},{"$f":"IFERROR(IF(C67=\"\",\"\",IF($C67=\"TOTAL\",SUM($AA$8:AA66),IF($AC$3=$AL$2,SUM(U67,X67,Y67,Z67),SUM(R67,U67,X67,Y67,Z67)))),\"\")","v":""},{"$f":"IFERROR(IF(C67=\"\",\"\",IF($C67=\"TOTAL\",SUM($AB$8:AB66),SUM(O67-AA67))),\"\")","v":""},{"$nulls":8},34,34,null,"2021-11-01",null,"2025-08-01","","","","","","","",null,"","","","",null,null,"","","","",0,0,{"$nulls":4},2100]
["","","",{"$f":"IFERROR(IF($C67=\"TOTAL\",\"अक्षरें राशि :-\",IF($C68=\"TOTAL\",SUM($D$8:D67),IF(AU69=\"\",\"\",AU69))),\"\")","v":""},{"$f":"IFERROR(IF($C68=\"TOTAL\",SUM($E$8:E67),IF(AV69=\"\",\"\",AV69)),\"\")","v":""},{"$f":"IFERROR(IF($C68=\"TOTAL\",SUM($F$8:F67),IF(AW69=\"\",\"\",AW69)),\"\")","v":""},"",{"$f":"IFERROR(IF($C68=\"TOTAL\",SUM($H$8:H67),IF(AY69=\"\",\"\",AY69)),\"\")","v":""},{"$f":"IFERROR(IF($C68=\"TOTAL\",SUM($I$8:I67),IF(AZ69=\"\",\"\",AZ69)),\"\")","v":""},{"$f":"IFERROR(IF($C68=\"TOTAL\",SUM($J$8:J67),IF(BA69=\"\",\"\",BA69)),\"\")","v":""},"",{"$f":"IFERROR(IF(C68=\"\",\"\",IF(D68=\"\",\"\",IF(H68=\"\",\"\",IF($C68=\"TOTAL\",SUM($L$8:L67),SUM(D68-H68))))),\"\")","v":""},{"$f":"IFERROR(IF(C68=\"\",\"\",IF(E68=\"\",\"\",IF(I68=\"\",\"\",IF($C68=\"TOTAL\",SUM($M$8:M67),SUM(E68-I68))))),\"\")","v":""},{"$f":"IFERROR(IF(C68=\"\",\"\",IF(F68=\"\",\"\",IF(J68=\"\",\"\",IF($C68=\"TOTAL\",SUM($N$8:N67),SUM(F68-J68))))),\"\")","v":""},"",{"$f":"IFERROR(IF(C68=\"\",\"\",IF($C68=\"TOTAL\",SUM($P$8:P67),IF(AND(C68>$AL$1,$AC$3=$AL$2),BO69,IF($AO$18=$AO$20,SUM(BB69+BJ69),ROUND((D68+E68)*10%,0))))),\"\")","v":""},{"$f":"IFERROR(IF(C68=\"\",\"\",IF(H68=\"\",\"\",IF(I68=\"\",\"\",IF($C68=\"TOTAL\",SUM($Q$8:Q67),IF(AND(C68>$AL$1,$AC$3=$AL$2),BO69,IF($AO$18=$AO$20,$AO$21,ROUND((H68+I68)*10%,0))))))),\"\")","v":""},"",{"$f":"IFERROR(IF(C68=\"\",\"\",IF($AO$16=$AO$17,0,IF($C68=\"TOTAL\",SUM($S$8:S67),IF($AO$19=$AO$20,$AO$25,0)))),\"\")","v":""},{"$f":"IFERROR(IF(C68=\"\",\"\",IF($AO$16=$AO$17,0,IF($C68=\"TOTAL\",SUM($T$8:T67),IF($AO$19=$AO$20,$AO$24,0)))),\"\")","v":""},"",{"$f":"IF(C68=\"\",\"\",IF($C68=\"TOTAL\",SUM($V$8:V67),IF(AND($AO$2=$AO$20,C68=$AO$1),ROUND(D68/31*$AP$2,0),IF(C68=$AM$6,ROUND((G68)*1/30,0),IF(C68=$AN$6,ROUND((G68)*1/31,0),\"\")))))","v":""},{"$f":"IF(C68=\"\",\"\",IF($C68=\"TOTAL\",SUM($W$8:W67),IF(AND($AO$2=$AO$20,C68=$AO$1),ROUND(H68/31*$AP$2,0),IF(C68=$AM$6,ROUND((K68)*1/30,0),IF(C68=$AN$6,ROUND((K68)*1/31,0),\"\")))))","v":""},"",{"$f":"IFERROR(IF(C68=\"\",\"\",IF(AND(BH69=\"\",BO69=\"\"),\"\",IF($C68=\"TOTAL\",SUM($Y$8:Y67),BH69))),\"\")","v":""},{"$f":"IFERROR(IF(C68=\"\",\"\",IF($C68=\"TOTAL\",SUM($Z$8:Z67),ROUND(O68*$AO$7%,0))),\"\")","v":""},{"$f":"IFERROR(IF(C68=\"\",\"\",IF($C68=\"TOTAL\",SUM($AA$8:AA67),IF($AC$3=$AL$2,SUM(U68,X68,Y68,Z68),SUM(R68,U68,X68,Y68,Z68)))),\"\")","v":""},{"$f":"IFERROR(IF(C68=\"\",\"\",IF($C68=\"TOTAL\",SUM($AB$8:AB67),SUM(O68-AA68))),\"\")","v":""},{"$nulls":8},34,34,null,"2021-12-01",null,"2025-09-01","","","","","","","",null,"","","","",null,null,"","","","",0,0,{"$nulls":4},2100]
["","",{"$f":"IFERROR(IF(AT70=\"\",\"\",AT70),\"\")","v":""},{"$f":"IFERROR(IF($C68=\"TOTAL\",\"अक्षरें राशि :-\",IF($C69=\"TOTAL\",SUM($D$8:D68),IF(AU70=\"\",\"\",AU70))),\"\")","v":""},{"$f":"IFERROR(IF($C69=\"TOTAL\",SUM($E$8:E68),IF(AV70=\"\",\"\",AV70)),\"\")","v":""},{"$f":"IFERROR(IF($C69=\"TOTAL\",SUM($F$8:F68),IF(AW70=\"\",\"\",AW70)),\"\")","v":""},{"$f":"IF(C69=\"\",\"\",SUM(D69:F69))","v":""},{"$f":"IFERROR(IF($C69=\"TOTAL\",SUM($H$8:H68),IF(AY70=\"\",\"\",AY70)),\"\")","v":""},{"$f":"IFERROR(IF($C69=\"TOTAL\",SUM($I$8:I68),IF(AZ70=\"\",\"\",AZ70)),\"\")","v":""},{"$f":"IFERROR(IF($C69=\"TOTAL\",SUM($J$8:J68),IF(BA70=\"\",\"\",BA70)),\"\")","v":""},{"$f":"IF(C69=\"\",\"\",SUM(H69:J69))","v":""},{"$f":"IFERROR(IF(C69=\"\",\"\",IF(D69=\"\",\"\",IF(H69=\"\",\"\",IF($C69=\"TOTAL\",SUM($L$8:L68),SUM(D69-H69))))),\"\")","v":""},{"$f":"IFERROR(IF(C69=\"\",\"\",IF(E69=\"\",\"\",IF(I69=\"\",\"\",IF($C69=\"TOTAL\",SUM($M$8:M68),SUM(E69-I69))))),\"\")","v":""},{"$f":"IFERROR(IF(C69=\"\",\"\",IF(F69=\"\",\"\",IF(J69=\"\",\"\",IF($C69=\"TOTAL\",SUM($N$8:N68),SUM(F69-J69))))),\"\")","v":""},{"$f":"IFERROR(IF(C69=\"\",\"\",IF(G69=\"\",\"\",IF(K69=\"\",\"\",SUM(G69-K69)))),\"\")","v":""},{"$f":"IFERROR(IF(C69=\"\",\"\",IF($C69=\"TOTAL\",SUM($P$8:P68),IF(AND(C69>$AL$1,$AC$3=$AL$2),BO70,IF($AO$18=$AO$20,SUM(BB70+BJ70),ROUND((D69+E69)*10%,0))))),\"\")","v":""},{"$f":"IFERROR(IF(C69=\"\",\"\",IF(H69=\"\",\"\",IF(I69=\"\",\"\",IF($C69=\"TOTAL\",SUM($Q$8:Q68),IF(AND(C69>$AL$1,$AC$3=$AL$2),BO70,IF($AO$18=$AO$20,$AO$21,ROUND((H69+I69)*10%,0))))))),\"\")","v":""},{"$f":"IFERROR(IF(C69=\"\",\"\",SUM(P69-Q69)),\"\")","v":""},{"$f":"IFERROR(IF(C69=\"\",\"\",IF($AO$16=$AO$17,0,IF($C69=\"TOTAL\",SUM($S$8:S68),IF($AO$19=$AO$20,$AO$25,0)))),\"\")","v":""},{"$f":"IFERROR(IF(C69=\"\",\"\",IF($AO$16=$AO$17,0,IF($C69=\"TOTAL\",SUM($T$8:T68),IF($AO$19=$AO$20,$AO$24,0)))),\"\")","v":""},{"$f":"IFERROR(IF(C69=\"\",\"\",SUM(S69-T69)),\"\")","v":""},{"$f":"IF(C69=\"\",\"\",IF($C69=\"TOTAL\",SUM($V$8:V68),IF(AND($AO$2=$AO$20,C69=$AO$1),ROUND(D69/31*$AP$2,0),IF(C69=$AM$6,ROUND((G69)*1/30,0),IF(C69=$AN$6,ROUND((G69)*1/31,0),\"\")))))","v":""},{"$f":"IF(C69=\"\",\"\",IF($C69=\"TOTAL\",SUM($W$8:W68),IF(AND($AO$2=$AO$20,C69=$AO$1),ROUND(H69/31*$AP$2,0),IF(C69=$AM$6,ROUND((K69)*1/30,0),IF(C69=$AN$6,ROUND((K69)*1/31,0),\"\")))))","v":""},{"$f":"IFERROR(IF(C69=\"\",\"\",SUM(V69-W69)),\"\")","v":""},{"$f":"IFERROR(IF(C69=\"\",\"\",IF(AND(BH70=\"\",BO70=\"\"),\"\",IF($C69=\"TOTAL\",SUM($Y$8:Y68),BH70))),\"\")","v":""},{"$f":"IFERROR(IF(C69=\"\",\"\",IF($C69=\"TOTAL\",SUM($Z$8:Z68),ROUND(O69*$AO$7%,0))),\"\")","v":""},{"$f":"IFERROR(IF(C69=\"\",\"\",IF($C69=\"TOTAL\",SUM($AA$8:AA68),IF($AC$3=$AL$2,SUM(U69,X69,Y69,Z69),SUM(R69,U69,X69,Y69,Z69)))),\"\")","v":""},{"$f":"IFERROR(IF(C69=\"\",\"\",IF($C69=\"TOTAL\",SUM($AB$8:AB68),SUM(O69-AA69))),\"\")","v":""},{"$nulls":8},34,34,null,"2022-01-01",null,"2025-10-01","","","","","","","",null,"","","","",null,null,"","","","",0,0,{"$nulls":4},2100]
["","","",{"$f":"IFERROR(IF($C69=\"TOTAL\",\"अक्षरें राशि :-\",IF($C70=\"TOTAL\",SUM($D$8:D69),IF(AU71=\"\",\"\",AU71))),\"\")","v":""},{"$f":"IFERROR(IF($C70=\"TOTAL\",SUM($E$8:E69),IF(AV71=\"\",\"\",AV71)),\"\")","v":""},{"$f":"IFERROR(IF($C70=\"TOTAL\",SUM($F$8:F69),IF(AW71=\"\",\"\",AW71)),\"\")","v":""},"",{"$f":"IFERROR(IF($C70=\"TOTAL\",SUM($H$8:H69),IF(AY71=\"\",\"\",AY71)),\"\")","v":""},{"$f":"IFERROR(IF($C70=\"TOTAL\",SUM($I$8:I69),IF(AZ71=\"\",\"\",AZ71)),\"\")","v":""},{"$f":"IFERROR(IF($C70=\"TOTAL\",SUM($J$8:J69),IF(BA71=\"\",\"\",BA71)),\"\")","v":""},"",{"$f":"IFERROR(IF(C70=\"\",\"\",IF(D70=\"\",\"\",IF(H70=\"\",\"\",IF($C70=\"TOTAL\",SUM($L$8:L69),SUM(D70-H70))))),\"\")","v":""},{"$f":"IFERROR(IF(C70=\"\",\"\",IF(E70=\"\",\"\",IF(I70=\"\",\"\",IF($C70=\"TOTAL\",SUM($M$8:M69),SUM(E70-I70))))),\"\")","v":""},{"$f":"IFERROR(IF(C70=\"\",\"\",IF(F70=\"\",\"\",IF(J70=\"\",\"\",IF($C70=\"TOTAL\",SUM($N$8:N69),SUM(F70-J70))))),\"\")","v":""},"",{"$f":"IFERROR(IF(C70=\"\",\"\",IF($C70=\"TOTAL\",SUM($P$8:P69),IF(AND(C70>$AL$1,$AC$3=$AL$2),BO71,IF($AO$18=$AO$20,SUM(BB71+BJ71),ROUND((D70+E70)*10%,0))))),\"\")","v":""},{"$f":"IFERROR(IF(C70=\"\",\"\",IF(H70=\"\",\"\",IF(I70=\"\",\"\",IF($C70=\"TOTAL\",SUM($Q$8:Q69),IF(AND(C70>$AL$1,$AC$3=$AL$2),BO71,IF($AO$18=$AO$20,$AO$21,ROUND((H70+I70)*10%,0))))))),\"\")","v":""},"",{"$f":"IFERROR(IF(C70=\"\",\"\",IF($AO$16=$AO$17,0,IF($C70=\"TOTAL\",SUM($S$8:S69),IF($AO$19=$AO$20,$AO$25,0)))),\"\")","v":""},{"$f":"IFERROR(IF(C70=\"\",\"\",IF($AO$16=$AO$17,0,IF($C70=\"TOTAL\",SUM($T$8:T69),IF($AO$19=$AO$20,$AO$24,0)))),\"\")","v":""},"",{"$f":"IF(C70=\"\",\"\",IF($C70=\"TOTAL\",SUM($V$8:V69),IF(AND($AO$2=$AO$20,C70=$AO$1),ROUND(D70/31*$AP$2,0),IF(C70=$AM$6,ROUND((G70)*1/30,0),IF(C70=$AN$6,ROUND((G70)*1/31,0),\"\")))))","v":""},{"$f":"IF(C70=\"\",\"\",IF($C70=\"TOTAL\",SUM($W$8:W69),IF(AND($AO$2=$AO$20,C70=$AO$1),ROUND(H70/31*$AP$2,0),IF(C70=$AM$6,ROUND((K70)*1/30,0),IF(C70=$AN$6,ROUND((K70)*1/31,0),\"\")))))","v":""},"",{"$f":"IFERROR(IF(C70=\"\",\"\",IF(AND(BH71=\"\",BO71=\"\"),\"\",IF($C70=\"TOTAL\",SUM($Y$8:Y69),BH71))),\"\")","v":""},{"$f":"IFERROR(IF(C70=\"\",\"\",IF($C70=\"TOTAL\",SUM($Z$8:Z69),ROUND(O70*$AO$7%,0))),\"\")","v":""},{"$f":"IFERROR(IF(C70=\"\",\"\",IF($C70=\"TOTAL\",SUM($AA$8:AA69),IF($AC$3=$AL$2,SUM(U70,X70,Y70,Z70),SUM(R70,U70,X70,Y70,Z70)))),\"\")","v":""},{"$f":"IFERROR(IF(C70=\"\",\"\",IF($C70=\"TOTAL\",SUM($AB$8:AB69),SUM(O70-AA70))),\"\")","v":""},{"$nulls":8},34,34,null,"2022-02-01",null,"2025-11-01","","","","","","","",null,"","","","",null,null,"","","","",0,0,{"$nulls":4},2100]
["","","",{"$f":"IFERROR(IF($C70=\"TOTAL\",\"अक्षरें राशि :-\",IF($C71=\"TOTAL\",SUM($D$8:D70),IF(AU72=\"\",\"\",AU72))),\"\")","v":""},{"$f":"IFERROR(IF($C71=\"TOTAL\",SUM($E$8:E70),IF(AV72=\"\",\"\",AV72)),\"\")","v":""},{"$f":"IFERROR(IF($C71=\"TOTAL\",SUM($F$8:F70),IF(AW72=\"\",\"\",AW72)),\"\")","v":""},"",{"$f":"IFERROR(IF($C71=\"TOTAL\",SUM($H$8:H70),IF(AY72=\"\",\"\",AY72)),\"\")","v":""},{"$f":"IFERROR(IF($C71=\"TOTAL\",SUM($I$8:I70),IF(AZ72=\"\",\"\",AZ72)),\"\")","v":""},{"$f":"IFERROR(IF($C71=\"TOTAL\",SUM($J$8:J70),IF(BA72=\"\",\"\",BA72)),\"\")","v":""},"",{"$f":"IFERROR(IF(C71=\"\",\"\",IF(D71=\"\",\"\",IF(H71=\"\",\"\",IF($C71=\"TOTAL\",SUM($L$8:L70),SUM(D71-H71))))),\"\")","v":""},{"$f":"IFERROR(IF(C71=\"\",\"\",IF(E71=\"\",\"\",IF(I71=\"\",\"\",IF($C71=\"TOTAL\",SUM($M$8:M70),SUM(E71-I71))))),\"\")","v":""},{"$f":"IFERROR(IF(C71=\"\",\"\",IF(F71=\"\",\"\",IF(J71=\"\",\"\",IF($C71=\"TOTAL\",SUM($N$8:N70),SUM(F71-J71))))),\"\")","v":""},"",{"$f":"IFERROR(IF(C71=\"\",\"\",IF($C71=\"TOTAL\",SUM($P$8:P70),IF(AND(C71>$AL$1,$AC$3=$AL$2),BO72,IF($AO$18=$AO$20,SUM(BB72+BJ72),ROUND((D71+E71)*10%,0))))),\"\")","v":""},{"$f":"IFERROR(IF(C71=\"\",\"\",IF(H71=\"\",\"\",IF(I71=\"\",\"\",IF($C71=\"TOTAL\",SUM($Q$8:Q70),IF(AND(C71>$AL$1,$AC$3=$AL$2),BO72,IF($AO$18=$AO$20,$AO$21,ROUND((H71+I71)*10%,0))))))),\"\")","v":""},"",{"$f":"IFERROR(IF(C71=\"\",\"\",IF($AO$16=$AO$17,0,IF($C71=\"TOTAL\",SUM($S$8:S70),IF($AO$19=$AO$20,$AO$25,0)))),\"\")","v":""},{"$f":"IFERROR(IF(C71=\"\",\"\",IF($AO$16=$AO$17,0,IF($C71=\"TOTAL\",SUM($T$8:T70),IF($AO$19=$AO$20,$AO$24,0)))),\"\")","v":""},"",{"$f":"IF(C71=\"\",\"\",IF($C71=\"TOTAL\",SUM($V$8:V70),IF(AND($AO$2=$AO$20,C71=$AO$1),ROUND(D71/31*$AP$2,0),IF(C71=$AM$6,ROUND((G71)*1/30,0),IF(C71=$AN$6,ROUND((G71)*1/31,0),\"\")))))","v":""},{"$f":"IF(C71=\"\",\"\",IF($C71=\"TOTAL\",SUM($W$8:W70),IF(AND($AO$2=$AO$20,C71=$AO$1),ROUND(H71/31*$AP$2,0),IF(C71=$AM$6,ROUND((K71)*1/30,0),IF(C71=$AN$6,ROUND((K71)*1/31,0),\"\")))))","v":""},"",{"$f":"IFERROR(IF(C71=\"\",\"\",IF(AND(BH72=\"\",BO72=\"\"),\"\",IF($C71=\"TOTAL\",SUM($Y$8:Y70),BH72))),\"\")","v":""},{"$f":"IFERROR(IF(C71=\"\",\"\",IF($C71=\"TOTAL\",SUM($Z$8:Z70),ROUND(O71*$AO$7%,0))),\"\")","v":""},{"$f":"IFERROR(IF(C71=\"\",\"\",IF($C71=\"TOTAL\",SUM($AA$8:AA70),IF($AC$3=$AL$2,SUM(U71,X71,Y71,Z71),SUM(R71,U71,X71,Y71,Z71)))),\"\")","v":""},{"$f":"IFERROR(IF(C71=\"\",\"\",IF($C71=\"TOTAL\",SUM($AB$8:AB70),SUM(O71-AA71))),\"\")","v":""},{"$nulls":8},34,34,null,"2022-03-01",null,"2025-12-01",{"$f":"IF(AND(AP71=\"\"),\"\",IF(AND(AP71=$AN$9),$AN$9,IF(AND(AP71=$AN$10),$AN$10,IF(AND(AP71=$AN$11),$AN$11,IF(AND(AP71=$AN$12),$AN$12,IF(AND(AP71=$AN$13),$AN$13,IF(AND(AP71=$AN$14),$AN$14,IF(AND(AP71=$AN$15),$AN$15,IF(AND(AP71=$AN$16),$AN$16,IF(AND(AP71=$AN$17),$AN$17,IF(AND(AP71=$AN$18),$AN$18,IF(AND(AP71=$AN$19),$AN$19,IF(AND(AP71=$AN$20),$AN$20,IF(AND(AP71=$AN$21),$AN$21,IF(AND(AP71=$AN$22),$AN$22,IF(AND(AP71=$AN$23),$AN$23,IF(AND(AP71=$AN$24),$AN$24,IF(AND(AP71=$AN$25),$AN$25,IF(AND(AP71=$AN$26),$AN$26,IF(AND(AP71=$AN$27),$AN$27,IF(AND(AP71=$AN$28),$AN$28,IF(AND(AP71=$AN$29),$AN$29,IF(AND(AP71=$AN$30),$AN$30,IF(AND(AP71=$AN$31),$AN$31,IF(AND(AP71=$AN$32),$AN$32,IF(AND(AP71=$AN$33),$AN$33,IF(AND(AP71=$AN$34),$AN$34,IF(AND(AP71=$AN$35),$AN$35,IF(AND(AP71=$AN$36),$AN$36,IF(AND(AP71=$AN$37),$AN$37,IF(AND(AP71=$AN$38),$AN$38,IF(AND(AP71=$AN$39),$AN$39,IF(AND(AP71=$AN$40),$AN$40,IF(AND(AP71=$AN$41),$AN$41,IF(AND(AP71=$AN$42),$AN$42,IF(AND(AP71=$AN$43),$AN$43,IF(AND(AP71=$AN$44),$AN$44,IF(AND(AP71=$AN$45),$AN$45,IF(AND(AP71=$AN$46),$AN$46,IF(AND(AP71=$AN$47),$AN$47,IF(AND(AP71=$AN$48),$AN$48,IF(AND(AP71=$AN$49),$AN$49,IF(AND(AP71=$AN$50),$AN$50,IF(AND(AP71=$AN$51),$AN$51,IF(AND(AP71=$AN$52),$AN$52,IF(AND(AP71=$AN$53),$AN$53,IF(AND(AP71=$AN$54),$AN$54,IF(AND(AP71=$AN$55),$AN$55,IF(AND(AP71=$AN$56),$AN$56,IF(AND(AP71=$AN$57),$AN$57,IF(AND(AP71=$AN$58),$AN$58,IF(AND(AP71=$AN$59),$AN$59,IF(AND(AP71=$AN$60),$AN$60,IF(AND(AP71=$AN$61),$AN$61,IF(AND(AP71=$AN$62),$AN$62,IF(AND(AP71=$AN$63),$AN$63,IF(AND(AP71=$AN$64),$AN$64,IF(AND(AP71=$AN$65),$AN$65,IF(AND(AP71=$AN$66),$AN$66,IF(AND(AP71=$AN$67),$AN$67,IF(AND(AP71=$AN$68),$AN$68,IF(AND(AP71=$AN$69),$AN$69,IF(AND(AP71=$AN$70),$AN$70,IF(AND(AP71=$AN$71),$AN$71,\"\"))))))))))))))))))))))))))))))))))))))))))))))))))))))))))))))))","v":""},"","","","","","",null,"","","","",null,null,"","","","",0,0,{"$nulls":4},2100]
["","","",{"$f":"IFERROR(IF($C71=\"TOTAL\",\"अक्षरें राशि :-\",IF($C72=\"TOTAL\",SUM($D$8:D71),IF(AU73=\"\",\"\",AU73))),\"\")","v":""},{"$f":"IFERROR(IF($C72=\"TOTAL\",SUM($E$8:E71),IF(AV73=\"\",\"\",AV73)),\"\")","v":""},{"$f":"IFERROR(IF($C72=\"TOTAL\",SUM($F$8:F71),IF(AW73=\"\",\"\",AW73)),\"\")","v":""},"",{"$f":"IFERROR(IF($C72=\"TOTAL\",SUM($H$8:H71),IF(AY73=\"\",\"\",AY73)),\"\")","v":""},{"$f":"IFERROR(IF($C72=\"TOTAL\",SUM($I$8:I71),IF(AZ73=\"\",\"\",AZ73)),\"\")","v":""},{"$f":"IFERROR(IF($C72=\"TOTAL\",SUM($J$8:J71),IF(BA73=\"\",\"\",BA73)),\"\")","v":""},"",{"$f":"IFERROR(IF(C72=\"\",\"\",IF(D72=\"\",\"\",IF(H72=\"\",\"\",IF($C72=\"TOTAL\",SUM($L$8:L71),SUM(D72-H72))))),\"\")","v":""},{"$f":"IFERROR(IF(C72=\"\",\"\",IF(E72=\"\",\"\",IF(I72=\"\",\"\",IF($C72=\"TOTAL\",SUM($M$8:M71),SUM(E72-I72))))),\"\")","v":""},{"$f":"IFERROR(IF(C72=\"\",\"\",IF(F72=\"\",\"\",IF(J72=\"\",\"\",IF($C72=\"TOTAL\",SUM($N$8:N71),SUM(F72-J72))))),\"\")","v":""},"",{"$f":"IFERROR(IF(C72=\"\",\"\",IF($C72=\"TOTAL\",SUM($P$8:P71),IF(AND(C72>$AL$1,$AC$3=$AL$2),BO73,IF($AO$18=$AO$20,SUM(BB73+BJ73),ROUND((D72+E72)*10%,0))))),\"\")","v":""},{"$f":"IFERROR(IF(C72=\"\",\"\",IF(H72=\"\",\"\",IF(I72=\"\",\"\",IF($C72=\"TOTAL\",SUM($Q$8:Q71),IF(AND(C72>$AL$1,$AC$3=$AL$2),BO73,IF($AO$18=$AO$20,$AO$21,ROUND((H72+I72)*10%,0))))))),\"\")","v":""},"",{"$f":"IFERROR(IF(C72=\"\",\"\",IF($AO$16=$AO$17,0,IF($C72=\"TOTAL\",SUM($S$8:S71),IF($AO$19=$AO$20,$AO$25,0)))),\"\")","v":""},{"$f":"IFERROR(IF(C72=\"\",\"\",IF($AO$16=$AO$17,0,IF($C72=\"TOTAL\",SUM($T$8:T71),IF($AO$19=$AO$20,$AO$24,0)))),\"\")","v":""},"",{"$f":"IF(C72=\"\",\"\",IF($C72=\"TOTAL\",SUM($V$8:V71),IF(AND($AO$2=$AO$20,C72=$AO$1),ROUND(D72/31*$AP$2,0),IF(C72=$AM$6,ROUND((G72)*1/30,0),IF(C72=$AN$6,ROUND((G72)*1/31,0),\"\")))))","v":""},{"$f":"IF(C72=\"\",\"\",IF($C72=\"TOTAL\",SUM($W$8:W71),IF(AND($AO$2=$AO$20,C72=$AO$1),ROUND(H72/31*$AP$2,0),IF(C72=$AM$6,ROUND((K72)*1/30,0),IF(C72=$AN$6,ROUND((K72)*1/31,0),\"\")))))","v":""},"",{"$f":"IFERROR(IF(C72=\"\",\"\",IF(AND(BH73=\"\",BO73=\"\"),\"\",IF($C72=\"TOTAL\",SUM($Y$8:Y71),BH73))),\"\")","v":""},{"$f":"IFERROR(IF(C72=\"\",\"\",IF($C72=\"TOTAL\",SUM($Z$8:Z71),ROUND(O72*$AO$7%,0))),\"\")","v":""},{"$f":"IFERROR(IF(C72=\"\",\"\",IF($C72=\"TOTAL\",SUM($AA$8:AA71),IF($AC$3=$AL$2,SUM(U72,X72,Y72,Z72),SUM(R72,U72,X72,Y72,Z72)))),\"\")","v":""},{"$f":"IFERROR(IF(C72=\"\",\"\",IF($C72=\"TOTAL\",SUM($AB$8:AB71),SUM(O72-AA72))),\"\")","v":""},{"$nulls":8},34,34,null,"2022-04-01",null,"2026-01-01",{"$f":"IF(AND(AP72=\"\"),\"\",IF(AND(AP72=$AN$9),$AN$9,IF(AND(AP72=$AN$10),$AN$10,IF(AND(AP72=$AN$11),$AN$11,IF(AND(AP72=$AN$12),$AN$12,IF(AND(AP72=$AN$13),$AN$13,IF(AND(AP72=$AN$14),$AN$14,IF(AND(AP72=$AN$15),$AN$15,IF(AND(AP72=$AN$16),$AN$16,IF(AND(AP72=$AN$17),$AN$17,IF(AND(AP72=$AN$18),$AN$18,IF(AND(AP72=$AN$19),$AN$19,IF(AND(AP72=$AN$20),$AN$20,IF(AND(AP72=$AN$21),$AN$21,IF(AND(AP72=$AN$22),$AN$22,IF(AND(AP72=$AN$23),$AN$23,IF(AND(AP72=$AN$24),$AN$24,IF(AND(AP72=$AN$25),$AN$25,IF(AND(AP72=$AN$26),$AN$26,IF(AND(AP72=$AN$27),$AN$27,IF(AND(AP72=$AN$28),$AN$28,IF(AND(AP72=$AN$29),$AN$29,IF(AND(AP72=$AN$30),$AN$30,IF(AND(AP72=$AN$31),$AN$31,IF(AND(AP72=$AN$32),$AN$32,IF(AND(AP72=$AN$33),$AN$33,IF(AND(AP72=$AN$34),$AN$34,IF(AND(AP72=$AN$35),$AN$35,IF(AND(AP72=$AN$36),$AN$36,IF(AND(AP72=$AN$37),$AN$37,IF(AND(AP72=$AN$38),$AN$38,IF(AND(AP72=$AN$39),$AN$39,IF(AND(AP72=$AN$40),$AN$40,IF(AND(AP72=$AN$41),$AN$41,IF(AND(AP72=$AN$42),$AN$42,IF(AND(AP72=$AN$43),$AN$43,IF(AND(AP72=$AN$44),$AN$44,IF(AND(AP72=$AN$45),$AN$45,IF(AND(AP72=$AN$46),$AN$46,IF(AND(AP72=$AN$47),$AN$47,IF(AND(AP72=$AN$48),$AN$48,IF(AND(AP72=$AN$49),$AN$49,IF(AND(AP72=$AN$50),$AN$50,IF(AND(AP72=$AN$51),$AN$51,IF(AND(AP72=$AN$52),$AN$52,IF(AND(AP72=$AN$53),$AN$53,IF(AND(AP72=$AN$54),$AN$54,IF(AND(AP72=$AN$55),$AN$55,IF(AND(AP72=$AN$56),$AN$56,IF(AND(AP72=$AN$57),$AN$57,IF(AND(AP72=$AN$58),$AN$58,IF(AND(AP72=$AN$59),$AN$59,IF(AND(AP72=$AN$60),$AN$60,IF(AND(AP72=$AN$61),$AN$61,IF(AND(AP72=$AN$62),$AN$62,IF(AND(AP72=$AN$63),$AN$63,IF(AND(AP72=$AN$64),$AN$64,IF(AND(AP72=$AN$65),$AN$65,IF(AND(AP72=$AN$66),$AN$66,IF(AND(AP72=$AN$67),$AN$67,IF(AND(AP72=$AN$68),$AN$68,IF(AND(AP72=$AN$69),$AN$69,IF(AND(AP72=$AN$70),$AN$70,IF(AND(AP72=$AN$71),$AN$71,\"\"))))))))))))))))))))))))))))))))))))))))))))))))))))))))))))))))","v":""},{"$f":"IF(AND(AP72=\"\"),\"\",IF(AND(AP72=$AN$72),$AP$72,IF(AND(AP72=$AN$73),$AN$73,IF(AND(AP72=$AN$74),$AN$74,IF(AND(AP72=$AN$75),$AN$75,IF(AND(AP72=$AN$76),$AN$76,IF(AND(AP72=$AN$77),$AN$77,IF(AND(AP72=$AN$78),$AN$78,IF(AND(AP72=$AN$79),$AN$79,IF(AND(AP72=$AN$80),$AN$80,IF(AND(AP72=$AN$81),$AN$81,IF(AND(AP72=$AN$82),$AN$82,IF(AND(AP72=$AN$83),$AN$83,IF(AND(AP72=$AN$84),$AN$84,IF(AND(AP72=$AN$85),$AN$85,IF(AND(AP72=$AN$86),$AN$86,IF(AND(AP72=$AN$87),$AN$87,IF(AND(AP72=$AN$88),$AN$88,IF(AND(AP72=$AN$89),$AN$89,IF(AND(AP72=$AN$90),$AN$90,IF(AND(AP72=$AN$91),$AN$91,IF(AND(AP72=$AN$92),$AN$92,\"\"))))))))))))))))))))))","v":""},"","","","","",null,"","","","",null,null,"","","","",0,0,{"$nulls":4},2100]
["",{"$f":"IFERROR(IF(A73=\"\",\"\",IF(A73=0,\"\",A73)),\"\")","v":""},{"$f":"IFERROR(IF(AT74=\"\",\"\",AT74),\"\")","v":""},{"$f":"IFERROR(IF($C72=\"TOTAL\",\"अक्षरें राशि :-\",IF($C73=\"TOTAL\",SUM($D$8:D72),IF(AU74=\"\",\"\",AU74))),\"\")","v":""},{"$f":"IFERROR(IF($C73=\"TOTAL\",SUM($E$8:E72),IF(AV74=\"\",\"\",AV74)),\"\")","v":""},{"$f":"IFERROR(IF($C73=\"TOTAL\",SUM($F$8:F72),IF(AW74=\"\",\"\",AW74)),\"\")","v":""},{"$f":"IF(C73=\"\",\"\",SUM(D73:F73))","v":""},{"$f":"IFERROR(IF($C73=\"TOTAL\",SUM($H$8:H72),IF(AY74=\"\",\"\",AY74)),\"\")","v":""},{"$f":"IFERROR(IF($C73=\"TOTAL\",SUM($I$8:I72),IF(AZ74=\"\",\"\",AZ74)),\"\")","v":""},{"$f":"IFERROR(IF($C73=\"TOTAL\",SUM($J$8:J72),IF(BA74=\"\",\"\",BA74)),\"\")","v":""},{"$f":"IF(C73=\"\",\"\",SUM(H73:J73))","v":""},{"$f":"IFERROR(IF(C73=\"\",\"\",IF(D73=\"\",\"\",IF(H73=\"\",\"\",IF($C73=\"TOTAL\",SUM($L$8:L72),SUM(D73-H73))))),\"\")","v":""},{"$f":"IFERROR(IF(C73=\"\",\"\",IF(E73=\"\",\"\",IF(I73=\"\",\"\",IF($C73=\"TOTAL\",SUM($M$8:M72),SUM(E73-I73))))),\"\")","v":""},{"$f":"IFERROR(IF(C73=\"\",\"\",IF(F73=\"\",\"\",IF(J73=\"\",\"\",IF($C73=\"TOTAL\",SUM($N$8:N72),SUM(F73-J73))))),\"\")","v":""},{"$f":"IFERROR(IF(C73=\"\",\"\",IF(G73=\"\",\"\",IF(K73=\"\",\"\",SUM(G73-K73)))),\"\")","v":""},{"$f":"IFERROR(IF(C73=\"\",\"\",IF($C73=\"TOTAL\",SUM($P$8:P72),IF(AND(C73>$AL$1,$AC$3=$AL$2),BO74,IF($AO$18=$AO$20,SUM(BB74+BJ74),ROUND((D73+E73)*10%,0))))),\"\")","v":""},{"$f":"IFERROR(IF(C73=\"\",\"\",IF(H73=\"\",\"\",IF(I73=\"\",\"\",IF($C73=\"TOTAL\",SUM($Q$8:Q72),IF(AND(C73>$AL$1,$AC$3=$AL$2),BO74,IF($AO$18=$AO$20,$AO$21,ROUND((H73+I73)*10%,0))))))),\"\")","v":""},{"$f":"IFERROR(IF(C73=\"\",\"\",SUM(P73-Q73)),\"\")","v":""},{"$f":"IFERROR(IF(C73=\"\",\"\",IF($AO$16=$AO$17,0,IF($C73=\"TOTAL\",SUM($S$8:S72),IF($AO$19=$AO$20,$AO$25,0)))),\"\")","v":""},{"$f":"IFERROR(IF(C73=\"\",\"\",IF($AO$16=$AO$17,0,IF($C73=\"TOTAL\",SUM($T$8:T72),IF($AO$19=$AO$20,$AO$24,0)))),\"\")","v":""},{"$f":"IFERROR(IF(C73=\"\",\"\",SUM(S73-T73)),\"\")","v":""},{"$f":"IF(C73=\"\",\"\",IF($C73=\"TOTAL\",SUM($V$8:V72),IF(AND($AO$2=$AO$20,C73=$AO$1),ROUND(D73/31*$AP$2,0),IF(C73=$AM$6,ROUND((G73)*1/30,0),IF(C73=$AN$6,ROUND((G73)*1/31,0),\"\")))))","v":""},{"$f":"IF(C73=\"\",\"\",IF($C73=\"TOTAL\",SUM($W$8:W72),IF(AND($AO$2=$AO$20,C73=$AO$1),ROUND(H73/31*$AP$2,0),IF(C73=$AM$6,ROUND((K73)*1/30,0),IF(C73=$AN$6,ROUND((K73)*1/31,0),\"\")))))","v":""},{"$f":"IFERROR(IF(C73=\"\",\"\",SUM(V73-W73)),\"\")","v":""},{"$f":"IFERROR(IF(C73=\"\",\"\",IF(AND(BH74=\"\",BO74=\"\"),\"\",IF($C73=\"TOTAL\",SUM($Y$8:Y72),BH74))),\"\")","v":""},{"$f":"IFERROR(IF(C73=\"\",\"\",IF($C73=\"TOTAL\",SUM($Z$8:Z72),ROUND(O73*$AO$7%,0))),\"\")","v":""},{"$f":"IFERROR(IF(C73=\"\",\"\",IF($C73=\"TOTAL\",SUM($AA$8:AA72),IF($AC$3=$AL$2,SUM(U73,X73,Y73,Z73),SUM(R73,U73,X73,Y73,Z73)))),\"\")","v":""},{"$f":"IFERROR(IF(C73=\"\",\"\",IF($C73=\"TOTAL\",SUM($AB$8:AB72),SUM(O73-AA73))),\"\")","v":""},{"$nulls":8},34,34,null,"2022-05-01",null,"2026-02-01","",{"$f":"IF(AND(AP73=\"\"),\"\",IF(AND(AP73=$AN$72),$AP$72,IF(AND(AP73=$AN$73),$AN$73,IF(AND(AP73=$AN$74),$AN$74,IF(AND(AP73=$AN$75),$AN$75,IF(AND(AP73=$AN$76),$AN$76,IF(AND(AP73=$AN$77),$AN$77,IF(AND(AP73=$AN$78),$AN$78,IF(AND(AP73=$AN$79),$AN$79,IF(AND(AP73=$AN$80),$AN$80,IF(AND(AP73=$AN$81),$AN$81,IF(AND(AP73=$AN$82),$AN$82,IF(AND(AP73=$AN$83),$AN$83,IF(AND(AP73=$AN$84),$AN$84,IF(AND(AP73=$AN$85),$AN$85,IF(AND(AP73=$AN$86),$AN$86,IF(AND(AP73=$AN$87),$AN$87,IF(AND(AP73=$AN$88),$AN$88,IF(AND(AP73=$AN$89),$AN$89,IF(AND(AP73=$AN$90),$AN$90,IF(AND(AP73=$AN$91),$AN$91,IF(AND(AP73=$AN$92),$AN$92,\"\"))))))))))))))))))))))","v":""},"",{"$f":"IFERROR(IF(AS73=\"\",\"\",IF(DATE(YEAR(AS73),MONTH(AS73),DAY(AS73))=DATE(YEAR($AP$6),MONTH($AP$6)+1,DAY($AP$6)),\"TOTAL\",IF(AS73>$AP$6,\"\",AS73))),\"\")","v":""},"","","",null,"","","","",null,null,"","","","",0,0,{"$nulls":4},2100]
["","","",{"$f":"IFERROR(IF($C73=\"TOTAL\",\"अक्षरें राशि :-\",IF($C74=\"TOTAL\",SUM($D$8:D73),IF(AU75=\"\",\"\",AU75))),\"\")","v":""},{"$f":"IFERROR(IF($C74=\"TOTAL\",SUM($E$8:E73),IF(AV75=\"\",\"\",AV75)),\"\")","v":""},{"$f":"IFERROR(IF($C74=\"TOTAL\",SUM($F$8:F73),IF(AW75=\"\",\"\",AW75)),\"\")","v":""},"",{"$f":"IFERROR(IF($C74=\"TOTAL\",SUM($H$8:H73),IF(AY75=\"\",\"\",AY75)),\"\")","v":""},{"$f":"IFERROR(IF($C74=\"TOTAL\",SUM($I$8:I73),IF(AZ75=\"\",\"\",AZ75)),\"\")","v":""},{"$f":"IFERROR(IF($C74=\"TOTAL\",SUM($J$8:J73),IF(BA75=\"\",\"\",BA75)),\"\")","v":""},"",{"$f":"IFERROR(IF(C74=\"\",\"\",IF(D74=\"\",\"\",IF(H74=\"\",\"\",IF($C74=\"TOTAL\",SUM($L$8:L73),SUM(D74-H74))))),\"\")","v":""},{"$f":"IFERROR(IF(C74=\"\",\"\",IF(E74=\"\",\"\",IF(I74=\"\",\"\",IF($C74=\"TOTAL\",SUM($M$8:M73),SUM(E74-I74))))),\"\")","v":""},{"$f":"IFERROR(IF(C74=\"\",\"\",IF(F74=\"\",\"\",IF(J74=\"\",\"\",IF($C74=\"TOTAL\",SUM($N$8:N73),SUM(F74-J74))))),\"\")","v":""},"",{"$f":"IFERROR(IF(C74=\"\",\"\",IF($C74=\"TOTAL\",SUM($P$8:P73),IF(AND(C74>$AL$1,$AC$3=$AL$2),BO75,IF($AO$18=$AO$20,SUM(BB75+BJ75),ROUND((D74+E74)*10%,0))))),\"\")","v":""},{"$f":"IFERROR(IF(C74=\"\",\"\",IF(H74=\"\",\"\",IF(I74=\"\",\"\",IF($C74=\"TOTAL\",SUM($Q$8:Q73),IF(AND(C74>$AL$1,$AC$3=$AL$2),BO75,IF($AO$18=$AO$20,$AO$21,ROUND((H74+I74)*10%,0))))))),\"\")","v":""},"",{"$f":"IFERROR(IF(C74=\"\",\"\",IF($AO$16=$AO$17,0,IF($C74=\"TOTAL\",SUM($S$8:S73),IF($AO$19=$AO$20,$AO$25,0)))),\"\")","v":""},{"$f":"IFERROR(IF(C74=\"\",\"\",IF($AO$16=$AO$17,0,IF($C74=\"TOTAL\",SUM($T$8:T73),IF($AO$19=$AO$20,$AO$24,0)))),\"\")","v":""},"",{"$f":"IF(C74=\"\",\"\",IF($C74=\"TOTAL\",SUM($V$8:V73),IF(AND($AO$2=$AO$20,C74=$AO$1),ROUND(D74/31*$AP$2,0),IF(C74=$AM$6,ROUND((G74)*1/30,0),IF(C74=$AN$6,ROUND((G74)*1/31,0),\"\")))))","v":""},{"$f":"IF(C74=\"\",\"\",IF($C74=\"TOTAL\",SUM($W$8:W73),IF(AND($AO$2=$AO$20,C74=$AO$1),ROUND(H74/31*$AP$2,0),IF(C74=$AM$6,ROUND((K74)*1/30,0),IF(C74=$AN$6,ROUND((K74)*1/31,0),\"\")))))","v":""},"",{"$f":"IFERROR(IF(C74=\"\",\"\",IF(AND(BH75=\"\",BO75=\"\"),\"\",IF($C74=\"TOTAL\",SUM($Y$8:Y73),BH75))),\"\")","v":""},{"$f":"IFERROR(IF(C74=\"\",\"\",IF($C74=\"TOTAL\",SUM($Z$8:Z73),ROUND(O74*$AO$7%,0))),\"\")","v":""},{"$f":"IFERROR(IF(C74=\"\",\"\",IF($C74=\"TOTAL\",SUM($AA$8:AA73),IF($AC$3=$AL$2,SUM(U74,X74,Y74,Z74),SUM(R74,U74,X74,Y74,Z74)))),\"\")","v":""},{"$f":"IFERROR(IF(C74=\"\",\"\",IF($C74=\"TOTAL\",SUM($AB$8:AB73),SUM(O74-AA74))),\"\")","v":""},{"$nulls":8},{"$f":"IF(OR(AT74=$AN$9,AT74=$AN$10,AT74=$AN$11,AT74=$AN$12,AT74=$AN$13,AT74=$AN$14),4,IF(OR(AT74=$AN$15,AT74=$AN$16,AT74=$AN$17,AT74=$AN$18,AT74=$AN$19,AT74=$AN$20),5,IF(OR(AT74=$AN$21,AT74=$AN$22,AT74=$AN$23,AT74=$AN$24,AT74=$AN$25,AT74=$AN$26),7,IF(OR(AT74=$AN$27,AT74=$AN$28,AT74=$AN$29,AT74=$AN$30,AT74=$AN$31,AT74=$AN$32),9,IF(OR(AT74=$AN$33,AT74=$AN$34,AT74=$AN$35,AT74=$AN$36,AT74=$AN$37,AT74=$AN$38),12,IF(OR(AT74=$AN$39,AT74=$AN$40,AT74=$AN$41,AT74=$AN$42,AT74=$AN$43,AT74=$AN$44,AT74=$AN$45,AT74=$AN$46,AT74=$AN$47,AT74=$AN$48,AT74=$AN$49,AT74=$AN$50,AT74=$AN$51,AT74=$AN$52,AT74=$AN$53,AT74=$AN$54,AT74=$AN$55,AT74=$AN$56,AT74=$AN$57,AT74=$AN$58,AT74=$AN$59,AT74=$AN$60,AT74=$AN$61,AT74=$AN$62),17,IF(OR(AT74=$AN$63,AT74=$AN$64,AT74=$AN$65,AT74=$AN$66,AT74=$AN$67,AT74=$AN$68),31,34)))))))","v":34},{"$f":"IF(OR(AT74=$AN$9,AT74=$AN$10,AT74=$AN$11,AT74=$AN$12,AT74=$AN$13,AT74=$AN$14),4,IF(OR(AT74=$AN$15,AT74=$AN$16,AT74=$AN$17,AT74=$AN$18,AT74=$AN$19,AT74=$AN$20),5,IF(OR(AT74=$AN$21,AT74=$AN$22,AT74=$AN$23,AT74=$AN$24,AT74=$AN$25,AT74=$AN$26),7,IF(OR(AT74=$AN$27,AT74=$AN$28,AT74=$AN$29,AT74=$AN$30,AT74=$AN$31,AT74=$AN$32),9,IF(OR(AT74=$AN$33,AT74=$AN$34,AT74=$AN$35,AT74=$AN$36,AT74=$AN$37,AT74=$AN$38),12,IF(OR(AT74=$AN$39,AT74=$AN$40,AT74=$AN$41,AT74=$AN$42,AT74=$AN$43,AT74=$AN$44,AT74=$AN$45,AT74=$AN$46,AT74=$AN$47,AT74=$AN$48,AT74=$AN$49,AT74=$AN$50,AT74=$AN$51,AT74=$AN$52,AT74=$AN$53,AT74=$AN$54,AT74=$AN$55,AT74=$AN$56,AT74=$AN$57,AT74=$AN$58,AT74=$AN$59,AT74=$AN$60,AT74=$AN$61,AT74=$AN$62),17,IF(OR(AT74=$AN$63,AT74=$AN$64,AT74=$AN$65,AT74=$AN$66,AT74=$AN$67,AT74=$AN$68),31,34)))))))","v":34},null,"2022-06-01",null,"2026-03-01",{"$f":"IF(AND(AP74=\"\"),\"\",IF(AND(AP74=$AN$9),$AN$9,IF(AND(AP74=$AN$10),$AN$10,IF(AND(AP74=$AN$11),$AN$11,IF(AND(AP74=$AN$12),$AN$12,IF(AND(AP74=$AN$13),$AN$13,IF(AND(AP74=$AN$14),$AN$14,IF(AND(AP74=$AN$15),$AN$15,IF(AND(AP74=$AN$16),$AN$16,IF(AND(AP74=$AN$17),$AN$17,IF(AND(AP74=$AN$18),$AN$18,IF(AND(AP74=$AN$19),$AN$19,IF(AND(AP74=$AN$20),$AN$20,IF(AND(AP74=$AN$21),$AN$21,IF(AND(AP74=$AN$22),$AN$22,IF(AND(AP74=$AN$23),$AN$23,IF(AND(AP74=$AN$24),$AN$24,IF(AND(AP74=$AN$25),$AN$25,IF(AND(AP74=$AN$26),$AN$26,IF(AND(AP74=$AN$27),$AN$27,IF(AND(AP74=$AN$28),$AN$28,IF(AND(AP74=$AN$29),$AN$29,IF(AND(AP74=$AN$30),$AN$30,IF(AND(AP74=$AN$31),$AN$31,IF(AND(AP74=$AN$32),$AN$32,IF(AND(AP74=$AN$33),$AN$33,IF(AND(AP74=$AN$34),$AN$34,IF(AND(AP74=$AN$35),$AN$35,IF(AND(AP74=$AN$36),$AN$36,IF(AND(AP74=$AN$37),$AN$37,IF(AND(AP74=$AN$38),$AN$38,IF(AND(AP74=$AN$39),$AN$39,IF(AND(AP74=$AN$40),$AN$40,IF(AND(AP74=$AN$41),$AN$41,IF(AND(AP74=$AN$42),$AN$42,IF(AND(AP74=$AN$43),$AN$43,IF(AND(AP74=$AN$44),$AN$44,IF(AND(AP74=$AN$45),$AN$45,IF(AND(AP74=$AN$46),$AN$46,IF(AND(AP74=$AN$47),$AN$47,IF(AND(AP74=$AN$48),$AN$48,IF(AND(AP74=$AN$49),$AN$49,IF(AND(AP74=$AN$50),$AN$50,IF(AND(AP74=$AN$51),$AN$51,IF(AND(AP74=$AN$52),$AN$52,IF(AND(AP74=$AN$53),$AN$53,IF(AND(AP74=$AN$54),$AN$54,IF(AND(AP74=$AN$55),$AN$55,IF(AND(AP74=$AN$56),$AN$56,IF(AND(AP74=$AN$57),$AN$57,IF(AND(AP74=$AN$58),$AN$58,IF(AND(AP74=$AN$59),$AN$59,IF(AND(AP74=$AN$60),$AN$60,IF(AND(AP74=$AN$61),$AN$61,IF(AND(AP74=$AN$62),$AN$62,IF(AND(AP74=$AN$63),$AN$63,IF(AND(AP74=$AN$64),$AN$64,IF(AND(AP74=$AN$65),$AN$65,IF(AND(AP74=$AN$66),$AN$66,IF(AND(AP74=$AN$67),$AN$67,IF(AND(AP74=$AN$68),$AN$68,IF(AND(AP74=$AN$69),$AN$69,IF(AND(AP74=$AN$70),$AN$70,IF(AND(AP74=$AN$71),$AN$71,\"\"))))))))))))))))))))))))))))))))))))))))))))))))))))))))))))))))","v":""},"",{"$f":"IFERROR(IF(AND(AQ74=\"\",AR74=\"\"),\"\",IF(AQ74=\"\",AR74,AQ74)),\"\")","v":""},{"$f":"IFERROR(IF(AS74=\"\",\"\",IF(DATE(YEAR(AS74),MONTH(AS74),DAY(AS74))=DATE(YEAR($AP$6),MONTH($AP$6)+1,DAY($AP$6)),\"TOTAL\",IF(AS74>$AP$6,\"\",AS74))),\"\")","v":""},"","","",null,"",{"$f":"IF(AT74=\"\",\"\",IF(AT74=\"TOTAL\",\"\",IF(AY74=\"\",\"\",IF($AO$16=$AO$17,0,ROUND(AY74*AL74%,0)))))","v":""},"",{"$f":"IF(AT74=\"\",\"\",IF(AT74=\"TOTAL\",\"\",IF(AY74=\"\",\"\",IF($AO$16=$AO$17,0,IF(OR(C73=$AM$16,C73=$AM$17,C73=$AM$18,C73=$AM$19,C73=$AM$20,C73=$AM$21,C73=$AM$22,C73=$AM$23,C73=$AM$24),SUM(BE74+BF74),BF74)))))","v":""},null,null,"","",{"$f":"IF(OR(AT74=$AN$63,AT74=$AN$64,AT74=$AN$65),\"YES\",\"\")","v":""},{"$f":"IF(BG74=\"\",\"\",IF($AO$16=$AO$17,ROUND((D73)*3%,0),IF(OR(AT74=$AN$63,AT74=$AN$64,AT74=$AN$65),SUM(ROUND((D73-H73)*3%,0)),IF(OR(AT74=$AN$69,AT74=$AN$70,AT74=$AN$71),SUM(ROUND((D73-H73)*3%,0)),\"\"))))","v":""},0,0,{"$nulls":4},{"$f":"IF(AND(AT74>$AL$1,$AC$3=$AL$2),$AS$1,\"\")","v":2100}]
["","","",{"$f":"IFERROR(IF($C74=\"TOTAL\",\"अक्षरें राशि :-\",IF($C75=\"TOTAL\",SUM($D$8:D74),IF(AU76=\"\",\"\",AU76))),\"\")","v":""},{"$f":"IFERROR(IF($C75=\"TOTAL\",SUM($E$8:E74),IF(AV76=\"\",\"\",AV76)),\"\")","v":""},{"$f":"IFERROR(IF($C75=\"TOTAL\",SUM($F$8:F74),IF(AW76=\"\",\"\",AW76)),\"\")","v":""},"",{"$f":"IFERROR(IF($C75=\"TOTAL\",SUM($H$8:H74),IF(AY76=\"\",\"\",AY76)),\"\")","v":""},{"$f":"IFERROR(IF($C75=\"TOTAL\",SUM($I$8:I74),IF(AZ76=\"\",\"\",AZ76)),\"\")","v":""},{"$f":"IFERROR(IF($C75=\"TOTAL\",SUM($J$8:J74),IF(BA76=\"\",\"\",BA76)),\"\")","v":""},"",{"$f":"IFERROR(IF(C75=\"\",\"\",IF(D75=\"\",\"\",IF(H75=\"\",\"\",IF($C75=\"TOTAL\",SUM($L$8:L74),SUM(D75-H75))))),\"\")","v":""},{"$f":"IFERROR(IF(C75=\"\",\"\",IF(E75=\"\",\"\",IF(I75=\"\",\"\",IF($C75=\"TOTAL\",SUM($M$8:M74),SUM(E75-I75))))),\"\")","v":""},{"$f":"IFERROR(IF(C75=\"\",\"\",IF(F75=\"\",\"\",IF(J75=\"\",\"\",IF($C75=\"TOTAL\",SUM($N$8:N74),SUM(F75-J75))))),\"\")","v":""},"",{"$f":"IFERROR(IF(C75=\"\",\"\",IF($C75=\"TOTAL\",SUM($P$8:P74),IF(AND(C75>$AL$1,$AC$3=$AL$2),BO76,IF($AO$18=$AO$20,SUM(BB76+BJ76),ROUND((D75+E75)*10%,0))))),\"\")","v":""},{"$f":"IFERROR(IF(C75=\"\",\"\",IF(H75=\"\",\"\",IF(I75=\"\",\"\",IF($C75=\"TOTAL\",SUM($Q$8:Q74),IF(AND(C75>$AL$1,$AC$3=$AL$2),BO76,IF($AO$18=$AO$20,$AO$21,ROUND((H75+I75)*10%,0))))))),\"\")","v":""},"",{"$f":"IFERROR(IF(C75=\"\",\"\",IF($AO$16=$AO$17,0,IF($C75=\"TOTAL\",SUM($S$8:S74),IF($AO$19=$AO$20,$AO$25,0)))),\"\")","v":""},{"$f":"IFERROR(IF(C75=\"\",\"\",IF($AO$16=$AO$17,0,IF($C75=\"TOTAL\",SUM($T$8:T74),IF($AO$19=$AO$20,$AO$24,0)))),\"\")","v":""},"",{"$f":"IF(C75=\"\",\"\",IF($C75=\"TOTAL\",SUM($V$8:V74),IF(AND($AO$2=$AO$20,C75=$AO$1),ROUND(D75/31*$AP$2,0),IF(C75=$AM$6,ROUND((G75)*1/30,0),IF(C75=$AN$6,ROUND((G75)*1/31,0),\"\")))))","v":""},{"$f":"IF(C75=\"\",\"\",IF($C75=\"TOTAL\",SUM($W$8:W74),IF(AND($AO$2=$AO$20,C75=$AO$1),ROUND(H75/31*$AP$2,0),IF(C75=$AM$6,ROUND((K75)*1/30,0),IF(C75=$AN$6,ROUND((K75)*1/31,0),\"\")))))","v":""},"",{"$f":"IFERROR(IF(C75=\"\",\"\",IF(AND(BH76=\"\",BO76=\"\"),\"\",IF($C75=\"TOTAL\",SUM($Y$8:Y74),BH76))),\"\")","v":""},{"$f":"IFERROR(IF(C75=\"\",\"\",IF($C75=\"TOTAL\",SUM($Z$8:Z74),ROUND(O75*$AO$7%,0))),\"\")","v":""},{"$f":"IFERROR(IF(C75=\"\",\"\",IF($C75=\"TOTAL\",SUM($AA$8:AA74),IF($AC$3=$AL$2,SUM(U75,X75,Y75,Z75),SUM(R75,U75,X75,Y75,Z75)))),\"\")","v":""},{"$f":"IFERROR(IF(C75=\"\",\"\",IF($C75=\"TOTAL\",SUM($AB$8:AB74),SUM(O75-AA75))),\"\")","v":""},{"$nulls":8},34,34,null,"2022-07-01",null,"2026-04-01","","","",{"$f":"IFERROR(IF(AS75=\"\",\"\",IF(DATE(YEAR(AS75),MONTH(AS75),DAY(AS75))=DATE(YEAR($AP$6),MONTH($AP$6)+1,DAY($AP$6)),\"TOTAL\",IF(AS75>$AP$6,\"\",AS75))),\"\")","v":""},"","","",null,"","","","",null,null,"","","","",0,0,{"$nulls":4},2100]
[{"$f":"IF(C76=\"TOTAL\",\"\",IF(B75=\"\",\"\",IF(LEN(C76)>=2,B75+1,0)))","v":""},"","",{"$f":"IFERROR(IF($C75=\"TOTAL\",\"अक्षरें राशि :-\",IF($C76=\"TOTAL\",SUM($D$8:D75),IF(AU77=\"\",\"\",AU77))),\"\")","v":""},{"$f":"IFERROR(IF($C76=\"TOTAL\",SUM($E$8:E75),IF(AV77=\"\",\"\",AV77)),\"\")","v":""},{"$f":"IFERROR(IF($C76=\"TOTAL\",SUM($F$8:F75),IF(AW77=\"\",\"\",AW77)),\"\")","v":""},"",{"$f":"IFERROR(IF($C76=\"TOTAL\",SUM($H$8:H75),IF(AY77=\"\",\"\",AY77)),\"\")","v":""},{"$f":"IFERROR(IF($C76=\"TOTAL\",SUM($I$8:I75),IF(AZ77=\"\",\"\",AZ77)),\"\")","v":""},{"$f":"IFERROR(IF($C76=\"TOTAL\",SUM($J$8:J75),IF(BA77=\"\",\"\",BA77)),\"\")","v":""},"",{"$f":"IFERROR(IF(C76=\"\",\"\",IF(D76=\"\",\"\",IF(H76=\"\",\"\",IF($C76=\"TOTAL\",SUM($L$8:L75),SUM(D76-H76))))),\"\")","v":""},{"$f":"IFERROR(IF(C76=\"\",\"\",IF(E76=\"\",\"\",IF(I76=\"\",\"\",IF($C76=\"TOTAL\",SUM($M$8:M75),SUM(E76-I76))))),\"\")","v":""},{"$f":"IFERROR(IF(C76=\"\",\"\",IF(F76=\"\",\"\",IF(J76=\"\",\"\",IF($C76=\"TOTAL\",SUM($N$8:N75),SUM(F76-J76))))),\"\")","v":""},"",{"$f":"IFERROR(IF(C76=\"\",\"\",IF($C76=\"TOTAL\",SUM($P$8:P75),IF(AND(C76>$AL$1,$AC$3=$AL$2),BO77,IF($AO$18=$AO$20,SUM(BB77+BJ77),ROUND((D76+E76)*10%,0))))),\"\")","v":""},{"$f":"IFERROR(IF(C76=\"\",\"\",IF(H76=\"\",\"\",IF(I76=\"\",\"\",IF($C76=\"TOTAL\",SUM($Q$8:Q75),IF(AND(C76>$AL$1,$AC$3=$AL$2),BO77,IF($AO$18=$AO$20,$AO$21,ROUND((H76+I76)*10%,0))))))),\"\")","v":""},"",{"$f":"IFERROR(IF(C76=\"\",\"\",IF($AO$16=$AO$17,0,IF($C76=\"TOTAL\",SUM($S$8:S75),IF($AO$19=$AO$20,$AO$25,0)))),\"\")","v":""},{"$f":"IFERROR(IF(C76=\"\",\"\",IF($AO$16=$AO$17,0,IF($C76=\"TOTAL\",SUM($T$8:T75),IF($AO$19=$AO$20,$AO$24,0)))),\"\")","v":""},"",{"$f":"IF(C76=\"\",\"\",IF($C76=\"TOTAL\",SUM($V$8:V75),IF(AND($AO$2=$AO$20,C76=$AO$1),ROUND(D76/31*$AP$2,0),IF(C76=$AM$6,ROUND((G76)*1/30,0),IF(C76=$AN$6,ROUND((G76)*1/31,0),\"\")))))","v":""},{"$f":"IF(C76=\"\",\"\",IF($C76=\"TOTAL\",SUM($W$8:W75),IF(AND($AO$2=$AO$20,C76=$AO$1),ROUND(H76/31*$AP$2,0),IF(C76=$AM$6,ROUND((K76)*1/30,0),IF(C76=$AN$6,ROUND((K76)*1/31,0),\"\")))))","v":""},"",{"$f":"IFERROR(IF(C76=\"\",\"\",IF(AND(BH77=\"\",BO77=\"\"),\"\",IF($C76=\"TOTAL\",SUM($Y$8:Y75),BH77))),\"\")","v":""},{"$f":"IFERROR(IF(C76=\"\",\"\",IF($C76=\"TOTAL\",SUM($Z$8:Z75),ROUND(O76*$AO$7%,0))),\"\")","v":""},{"$f":"IFERROR(IF(C76=\"\",\"\",IF($C76=\"TOTAL\",SUM($AA$8:AA75),IF($AC$3=$AL$2,SUM(U76,X76,Y76,Z76),SUM(R76,U76,X76,Y76,Z76)))),\"\")","v":""},{"$f":"IFERROR(IF(C76=\"\",\"\",IF($C76=\"TOTAL\",SUM($AB$8:AB75),SUM(O76-AA76))),\"\")","v":""},{"$nulls":8},34,34,null,"2022-08-01",null,"2026-05-01","","","","",{"$f":"IFERROR(IF(AT76=\"\",\"\",IF(AND($AO$20=$AO$28,$AO$30=AT76),$AO$29,IF(OR(AT76=$AW$2,AT76=$AW$3,AT76=$AW$4,AT76=$AW$5,AT76=$AW$6,AT76=$AW$7,AT76=$AX$2),MROUND(AU75*1.03,100),AU75))),\"\")","v":""},"",{"$f":"IF(AT76=\"\",\"\",IF(AT76=\"TOTAL\",\"\",IF(AT76>=$AV$7,ROUND(AU76*$AU$7%,0),ROUND(AU76*$AQ$7%,0))))","v":""},null,{"$f":"IFERROR(IF(AT76=\"\",\"\",IF(AT76=\"TOTAL\",\"\",IF($AO$16=$AO$17,$AO$10,IF(OR(AT76=$AW$2,AT76=$AW$3,AT76=$AW$4,AT76=$AW$5,AT76=$AW$6,AT76=$AW$7,AT76=$AX$2),MROUND(AY75*1.03,100),AY75)))),\"\")","v":""},"",{"$f":"IF(AT76=\"\",\"\",IF(AT76=\"TOTAL\",\"\",IF(AY76=\"\",\"\",IF($AO$16=$AO$17,0,IF(AT76>=$AV$7,ROUND(AY76*$AU$7%,0),ROUND(AY76*$AQ$7%,0))))))","v":""},"",null,null,"","","","",0,0,{"$nulls":4},2100]
["","","",{"$f":"IFERROR(IF($C76=\"TOTAL\",\"अक्षरें राशि :-\",IF($C77=\"TOTAL\",SUM($D$8:D76),IF(AU78=\"\",\"\",AU78))),\"\")","v":""},{"$f":"IFERROR(IF($C77=\"TOTAL\",SUM($E$8:E76),IF(AV78=\"\",\"\",AV78)),\"\")","v":""},{"$f":"IFERROR(IF($C77=\"TOTAL\",SUM($F$8:F76),IF(AW78=\"\",\"\",AW78)),\"\")","v":""},"",{"$f":"IFERROR(IF($C77=\"TOTAL\",SUM($H$8:H76),IF(AY78=\"\",\"\",AY78)),\"\")","v":""},{"$f":"IFERROR(IF($C77=\"TOTAL\",SUM($I$8:I76),IF(AZ78=\"\",\"\",AZ78)),\"\")","v":""},{"$f":"IFERROR(IF($C77=\"TOTAL\",SUM($J$8:J76),IF(BA78=\"\",\"\",BA78)),\"\")","v":""},"",{"$f":"IFERROR(IF(C77=\"\",\"\",IF(D77=\"\",\"\",IF(H77=\"\",\"\",IF($C77=\"TOTAL\",SUM($L$8:L76),SUM(D77-H77))))),\"\")","v":""},{"$f":"IFERROR(IF(C77=\"\",\"\",IF(E77=\"\",\"\",IF(I77=\"\",\"\",IF($C77=\"TOTAL\",SUM($M$8:M76),SUM(E77-I77))))),\"\")","v":""},{"$f":"IFERROR(IF(C77=\"\",\"\",IF(F77=\"\",\"\",IF(J77=\"\",\"\",IF($C77=\"TOTAL\",SUM($N$8:N76),SUM(F77-J77))))),\"\")","v":""},"",{"$f":"IFERROR(IF(C77=\"\",\"\",IF($C77=\"TOTAL\",SUM($P$8:P76),IF(AND(C77>$AL$1,$AC$3=$AL$2),BO78,IF($AO$18=$AO$20,SUM(BB78+BJ78),ROUND((D77+E77)*10%,0))))),\"\")","v":""},{"$f":"IFERROR(IF(C77=\"\",\"\",IF(H77=\"\",\"\",IF(I77=\"\",\"\",IF($C77=\"TOTAL\",SUM($Q$8:Q76),IF(AND(C77>$AL$1,$AC$3=$AL$2),BO78,IF($AO$18=$AO$20,$AO$21,ROUND((H77+I77)*10%,0))))))),\"\")","v":""},"",{"$f":"IFERROR(IF(C77=\"\",\"\",IF($AO$16=$AO$17,0,IF($C77=\"TOTAL\",SUM($S$8:S76),IF($AO$19=$AO$20,$AO$25,0)))),\"\")","v":""},{"$f":"IFERROR(IF(C77=\"\",\"\",IF($AO$16=$AO$17,0,IF($C77=\"TOTAL\",SUM($T$8:T76),IF($AO$19=$AO$20,$AO$24,0)))),\"\")","v":""},"",{"$f":"IF(C77=\"\",\"\",IF($C77=\"TOTAL\",SUM($V$8:V76),IF(AND($AO$2=$AO$20,C77=$AO$1),ROUND(D77/31*$AP$2,0),IF(C77=$AM$6,ROUND((G77)*1/30,0),IF(C77=$AN$6,ROUND((G77)*1/31,0),\"\")))))","v":""},{"$f":"IF(C77=\"\",\"\",IF($C77=\"TOTAL\",SUM($W$8:W76),IF(AND($AO$2=$AO$20,C77=$AO$1),ROUND(H77/31*$AP$2,0),IF(C77=$AM$6,ROUND((K77)*1/30,0),IF(C77=$AN$6,ROUND((K77)*1/31,0),\"\")))))","v":""},"",{"$f":"IFERROR(IF(C77=\"\",\"\",IF(AND(BH78=\"\",BO78=\"\"),\"\",IF($C77=\"TOTAL\",SUM($Y$8:Y76),BH78))),\"\")","v":""},{"$f":"IFERROR(IF(C77=\"\",\"\",IF($C77=\"TOTAL\",SUM($Z$8:Z76),ROUND(O77*$AO$7%,0))),\"\")","v":""},{"$f":"IFERROR(IF(C77=\"\",\"\",IF($C77=\"TOTAL\",SUM($AA$8:AA76),IF($AC$3=$AL$2,SUM(U77,X77,Y77,Z77),SUM(R77,U77,X77,Y77,Z77)))),\"\")","v":""},{"$f":"IFERROR(IF(C77=\"\",\"\",IF($C77=\"TOTAL\",SUM($AB$8:AB76),SUM(O77-AA77))),\"\")","v":""},{"$nulls":8},34,34,null,"2022-09-01",null,"2026-06-01","","","","","","","",null,"","","","",null,null,{"$f":"IF(AT77=\"\",\"\",IF(AT77=\"TOTAL\",\"\",IF(AY77=\"\",\"\",SUM(O76)-SUM((BF77-$AO$21)+SUM(U76,X76,Z76)))))","v":""},{"$f":"IF(AT76=\"\",\"\",IF(AT76=\"TOTAL\",\"\",IF(AND($AO$20=$AO$36,C77=$AO$37),$AO$38,BF76)))","v":""},"","",{"$f":"IFERROR(IF(AND($AO$16=$AO$17,BG77=\"YES\"),ROUND(ROUND(D76*3%,0)*10%,0),IF(AND($AO$16=$AO$15,BG77=\"YES\",$AM$7=\"NO\"),ROUND(ROUND((L76+H76)*3%,0)*10%,0),IF(AND($AO$16=$AO$15,BG77=\"YES\",$AM$7=\"YES\"),ROUND(ROUND((L76+M76)*3%,0)*10%,0),0))),\"\")","v":0},{"$f":"IF(AND($AO$16=$AO$17,BG77=\"YES\"),ROUND(D76*3%,0),IF(AND($AO$16=$AO$15,BG77=\"YES\",$AM$7=\"NO\"),ROUND((L76+H76)*3%,0),IF(AND($AO$16=$AO$15,BG77=\"YES\",$AM$7=\"YES\"),ROUND((L76+M76)*3%,0),0)))","v":0},{"$nulls":4},2100]
["","","",{"$f":"IFERROR(IF($C77=\"TOTAL\",\"अक्षरें राशि :-\",IF($C78=\"TOTAL\",SUM($D$8:D77),IF(AU79=\"\",\"\",AU79))),\"\")","v":""},{"$f":"IFERROR(IF($C78=\"TOTAL\",SUM($E$8:E77),IF(AV79=\"\",\"\",AV79)),\"\")","v":""},{"$f":"IFERROR(IF($C78=\"TOTAL\",SUM($F$8:F77),IF(AW79=\"\",\"\",AW79)),\"\")","v":""},"",{"$f":"IFERROR(IF($C78=\"TOTAL\",SUM($H$8:H77),IF(AY79=\"\",\"\",AY79)),\"\")","v":""},{"$f":"IFERROR(IF($C78=\"TOTAL\",SUM($I$8:I77),IF(AZ79=\"\",\"\",AZ79)),\"\")","v":""},{"$f":"IFERROR(IF($C78=\"TOTAL\",SUM($J$8:J77),IF(BA79=\"\",\"\",BA79)),\"\")","v":""},"",{"$f":"IFERROR(IF(C78=\"\",\"\",IF(D78=\"\",\"\",IF(H78=\"\",\"\",IF($C78=\"TOTAL\",SUM($L$8:L77),SUM(D78-H78))))),\"\")","v":""},{"$f":"IFERROR(IF(C78=\"\",\"\",IF(E78=\"\",\"\",IF(I78=\"\",\"\",IF($C78=\"TOTAL\",SUM($M$8:M77),SUM(E78-I78))))),\"\")","v":""},{"$f":"IFERROR(IF(C78=\"\",\"\",IF(F78=\"\",\"\",IF(J78=\"\",\"\",IF($C78=\"TOTAL\",SUM($N$8:N77),SUM(F78-J78))))),\"\")","v":""},"",{"$f":"IFERROR(IF(C78=\"\",\"\",IF($C78=\"TOTAL\",SUM($P$8:P77),IF(AND(C78>$AL$1,$AC$3=$AL$2),BO79,IF($AO$18=$AO$20,SUM(BB79+BJ79),ROUND((D78+E78)*10%,0))))),\"\")","v":""},{"$f":"IFERROR(IF(C78=\"\",\"\",IF(H78=\"\",\"\",IF(I78=\"\",\"\",IF($C78=\"TOTAL\",SUM($Q$8:Q77),IF(AND(C78>$AL$1,$AC$3=$AL$2),BO79,IF($AO$18=$AO$20,$AO$21,ROUND((H78+I78)*10%,0))))))),\"\")","v":""},"",{"$f":"IFERROR(IF(C78=\"\",\"\",IF($AO$16=$AO$17,0,IF($C78=\"TOTAL\",SUM($S$8:S77),IF($AO$19=$AO$20,$AO$25,0)))),\"\")","v":""},{"$f":"IFERROR(IF(C78=\"\",\"\",IF($AO$16=$AO$17,0,IF($C78=\"TOTAL\",SUM($T$8:T77),IF($AO$19=$AO$20,$AO$24,0)))),\"\")","v":""},"",{"$f":"IF(C78=\"\",\"\",IF($C78=\"TOTAL\",SUM($V$8:V77),IF(AND($AO$2=$AO$20,C78=$AO$1),ROUND(D78/31*$AP$2,0),IF(C78=$AM$6,ROUND((G78)*1/30,0),IF(C78=$AN$6,ROUND((G78)*1/31,0),\"\")))))","v":""},{"$f":"IF(C78=\"\",\"\",IF($C78=\"TOTAL\",SUM($W$8:W77),IF(AND($AO$2=$AO$20,C78=$AO$1),ROUND(H78/31*$AP$2,0),IF(C78=$AM$6,ROUND((K78)*1/30,0),IF(C78=$AN$6,ROUND((K78)*1/31,0),\"\")))))","v":""},"",{"$f":"IFERROR(IF(C78=\"\",\"\",IF(AND(BH79=\"\",BO79=\"\"),\"\",IF($C78=\"TOTAL\",SUM($Y$8:Y77),BH79))),\"\")","v":""},{"$f":"IFERROR(IF(C78=\"\",\"\",IF($C78=\"TOTAL\",SUM($Z$8:Z77),ROUND(O78*$AO$7%,0))),\"\")","v":""},{"$f":"IFERROR(IF(C78=\"\",\"\",IF($C78=\"TOTAL\",SUM($AA$8:AA77),IF($AC$3=$AL$2,SUM(U78,X78,Y78,Z78),SUM(R78,U78,X78,Y78,Z78)))),\"\")","v":""},{"$f":"IFERROR(IF(C78=\"\",\"\",IF($C78=\"TOTAL\",SUM($AB$8:AB77),SUM(O78-AA78))),\"\")","v":""},{"$nulls":8},34,34,null,"2022-10-01",null,"2026-07-01","","","","","",{"$f":"IF(AT78=\"\",\"\",IF(AT78=\"TOTAL\",\"\",ROUND(AU78*AK78%,0)))","v":""},"",null,"","","","",null,null,"","","","",0,0,{"$nulls":4},2100]
["","","",{"$f":"IFERROR(IF($C78=\"TOTAL\",\"अक्षरें राशि :-\",IF($C79=\"TOTAL\",SUM($D$8:D78),IF(AU80=\"\",\"\",AU80))),\"\")","v":""},{"$f":"IFERROR(IF($C79=\"TOTAL\",SUM($E$8:E78),IF(AV80=\"\",\"\",AV80)),\"\")","v":""},{"$f":"IFERROR(IF($C79=\"TOTAL\",SUM($F$8:F78),IF(AW80=\"\",\"\",AW80)),\"\")","v":""},"",{"$f":"IFERROR(IF($C79=\"TOTAL\",SUM($H$8:H78),IF(AY80=\"\",\"\",AY80)),\"\")","v":""},{"$f":"IFERROR(IF($C79=\"TOTAL\",SUM($I$8:I78),IF(AZ80=\"\",\"\",AZ80)),\"\")","v":""},{"$f":"IFERROR(IF($C79=\"TOTAL\",SUM($J$8:J78),IF(BA80=\"\",\"\",BA80)),\"\")","v":""},"",{"$f":"IFERROR(IF(C79=\"\",\"\",IF(D79=\"\",\"\",IF(H79=\"\",\"\",IF($C79=\"TOTAL\",SUM($L$8:L78),SUM(D79-H79))))),\"\")","v":""},{"$f":"IFERROR(IF(C79=\"\",\"\",IF(E79=\"\",\"\",IF(I79=\"\",\"\",IF($C79=\"TOTAL\",SUM($M$8:M78),SUM(E79-I79))))),\"\")","v":""},{"$f":"IFERROR(IF(C79=\"\",\"\",IF(F79=\"\",\"\",IF(J79=\"\",\"\",IF($C79=\"TOTAL\",SUM($N$8:N78),SUM(F79-J79))))),\"\")","v":""},"",{"$f":"IFERROR(IF(C79=\"\",\"\",IF($C79=\"TOTAL\",SUM($P$8:P78),IF(AND(C79>$AL$1,$AC$3=$AL$2),BO80,IF($AO$18=$AO$20,SUM(BB80+BJ80),ROUND((D79+E79)*10%,0))))),\"\")","v":""},{"$f":"IFERROR(IF(C79=\"\",\"\",IF(H79=\"\",\"\",IF(I79=\"\",\"\",IF($C79=\"TOTAL\",SUM($Q$8:Q78),IF(AND(C79>$AL$1,$AC$3=$AL$2),BO80,IF($AO$18=$AO$20,$AO$21,ROUND((H79+I79)*10%,0))))))),\"\")","v":""},"",{"$f":"IFERROR(IF(C79=\"\",\"\",IF($AO$16=$AO$17,0,IF($C79=\"TOTAL\",SUM($S$8:S78),IF($AO$19=$AO$20,$AO$25,0)))),\"\")","v":""},{"$f":"IFERROR(IF(C79=\"\",\"\",IF($AO$16=$AO$17,0,IF($C79=\"TOTAL\",SUM($T$8:T78),IF($AO$19=$AO$20,$AO$24,0)))),\"\")","v":""},"",{"$f":"IF(C79=\"\",\"\",IF($C79=\"TOTAL\",SUM($V$8:V78),IF(AND($AO$2=$AO$20,C79=$AO$1),ROUND(D79/31*$AP$2,0),IF(C79=$AM$6,ROUND((G79)*1/30,0),IF(C79=$AN$6,ROUND((G79)*1/31,0),\"\")))))","v":""},{"$f":"IF(C79=\"\",\"\",IF($C79=\"TOTAL\",SUM($W$8:W78),IF(AND($AO$2=$AO$20,C79=$AO$1),ROUND(H79/31*$AP$2,0),IF(C79=$AM$6,ROUND((K79)*1/30,0),IF(C79=$AN$6,ROUND((K79)*1/31,0),\"\")))))","v":""},"",{"$f":"IFERROR(IF(C79=\"\",\"\",IF(AND(BH80=\"\",BO80=\"\"),\"\",IF($C79=\"TOTAL\",SUM($Y$8:Y78),BH80))),\"\")","v":""},{"$f":"IFERROR(IF(C79=\"\",\"\",IF($C79=\"TOTAL\",SUM($Z$8:Z78),ROUND(O79*$AO$7%,0))),\"\")","v":""},{"$f":"IFERROR(IF(C79=\"\",\"\",IF($C79=\"TOTAL\",SUM($AA$8:AA78),IF($AC$3=$AL$2,SUM(U79,X79,Y79,Z79),SUM(R79,U79,X79,Y79,Z79)))),\"\")","v":""},{"$f":"IFERROR(IF(C79=\"\",\"\",IF($C79=\"TOTAL\",SUM($AB$8:AB78),SUM(O79-AA79))),\"\")","v":""},{"$nulls":8},34,34,null,"2022-11-01",null,"2026-08-01","","","","","","","",null,"","","","",null,null,"","","","",0,0,{"$nulls":4},2100]
["","","",{"$f":"IFERROR(IF($C79=\"TOTAL\",\"अक्षरें राशि :-\",IF($C80=\"TOTAL\",SUM($D$8:D79),IF(AU81=\"\",\"\",AU81))),\"\")","v":""},{"$f":"IFERROR(IF($C80=\"TOTAL\",SUM($E$8:E79),IF(AV81=\"\",\"\",AV81)),\"\")","v":""},{"$f":"IFERROR(IF($C80=\"TOTAL\",SUM($F$8:F79),IF(AW81=\"\",\"\",AW81)),\"\")","v":""},"",{"$f":"IFERROR(IF($C80=\"TOTAL\",SUM($H$8:H79),IF(AY81=\"\",\"\",AY81)),\"\")","v":""},{"$f":"IFERROR(IF($C80=\"TOTAL\",SUM($I$8:I79),IF(AZ81=\"\",\"\",AZ81)),\"\")","v":""},{"$f":"IFERROR(IF($C80=\"TOTAL\",SUM($J$8:J79),IF(BA81=\"\",\"\",BA81)),\"\")","v":""},"",{"$f":"IFERROR(IF(C80=\"\",\"\",IF(D80=\"\",\"\",IF(H80=\"\",\"\",IF($C80=\"TOTAL\",SUM($L$8:L79),SUM(D80-H80))))),\"\")","v":""},{"$f":"IFERROR(IF(C80=\"\",\"\",IF(E80=\"\",\"\",IF(I80=\"\",\"\",IF($C80=\"TOTAL\",SUM($M$8:M79),SUM(E80-I80))))),\"\")","v":""},{"$f":"IFERROR(IF(C80=\"\",\"\",IF(F80=\"\",\"\",IF(J80=\"\",\"\",IF($C80=\"TOTAL\",SUM($N$8:N79),SUM(F80-J80))))),\"\")","v":""},"",{"$f":"IFERROR(IF(C80=\"\",\"\",IF($C80=\"TOTAL\",SUM($P$8:P79),IF(AND(C80>$AL$1,$AC$3=$AL$2),BO81,IF($AO$18=$AO$20,SUM(BB81+BJ81),ROUND((D80+E80)*10%,0))))),\"\")","v":""},{"$f":"IFERROR(IF(C80=\"\",\"\",IF(H80=\"\",\"\",IF(I80=\"\",\"\",IF($C80=\"TOTAL\",SUM($Q$8:Q79),IF(AND(C80>$AL$1,$AC$3=$AL$2),BO81,IF($AO$18=$AO$20,$AO$21,ROUND((H80+I80)*10%,0))))))),\"\")","v":""},"",{"$f":"IFERROR(IF(C80=\"\",\"\",IF($AO$16=$AO$17,0,IF($C80=\"TOTAL\",SUM($S$8:S79),IF($AO$19=$AO$20,$AO$25,0)))),\"\")","v":""},{"$f":"IFERROR(IF(C80=\"\",\"\",IF($AO$16=$AO$17,0,IF($C80=\"TOTAL\",SUM($T$8:T79),IF($AO$19=$AO$20,$AO$24,0)))),\"\")","v":""},"",{"$f":"IF(C80=\"\",\"\",IF($C80=\"TOTAL\",SUM($V$8:V79),IF(AND($AO$2=$AO$20,C80=$AO$1),ROUND(D80/31*$AP$2,0),IF(C80=$AM$6,ROUND((G80)*1/30,0),IF(C80=$AN$6,ROUND((G80)*1/31,0),\"\")))))","v":""},{"$f":"IF(C80=\"\",\"\",IF($C80=\"TOTAL\",SUM($W$8:W79),IF(AND($AO$2=$AO$20,C80=$AO$1),ROUND(H80/31*$AP$2,0),IF(C80=$AM$6,ROUND((K80)*1/30,0),IF(C80=$AN$6,ROUND((K80)*1/31,0),\"\")))))","v":""},"",{"$f":"IFERROR(IF(C80=\"\",\"\",IF(AND(BH81=\"\",BO81=\"\"),\"\",IF($C80=\"TOTAL\",SUM($Y$8:Y79),BH81))),\"\")","v":""},{"$f":"IFERROR(IF(C80=\"\",\"\",IF($C80=\"TOTAL\",SUM($Z$8:Z79),ROUND(O80*$AO$7%,0))),\"\")","v":""},{"$f":"IFERROR(IF(C80=\"\",\"\",IF($C80=\"TOTAL\",SUM($AA$8:AA79),IF($AC$3=$AL$2,SUM(U80,X80,Y80,Z80),SUM(R80,U80,X80,Y80,Z80)))),\"\")","v":""},{"$f":"IFERROR(IF(C80=\"\",\"\",IF($C80=\"TOTAL\",SUM($AB$8:AB79),SUM(O80-AA80))),\"\")","v":""},{"$nulls":8},34,34,null,"2022-12-01",null,{"$f":"IF(AND($AO$6>$AP$6),\"\",DATE(YEAR(AP79),MONTH(AP79)+1,DAY(AP79)))","v":"2026-09-01"},"","","","","","","",null,"","","","",null,null,"","","","",0,0,{"$nulls":4},2100]
["","",{"$f":"IFERROR(IF(AT82=\"\",\"\",AT82),\"\")","v":""},{"$f":"IFERROR(IF($C80=\"TOTAL\",\"अक्षरें राशि :-\",IF($C81=\"TOTAL\",SUM($D$8:D80),IF(AU82=\"\",\"\",AU82))),\"\")","v":""},{"$f":"IFERROR(IF($C81=\"TOTAL\",SUM($E$8:E80),IF(AV82=\"\",\"\",AV82)),\"\")","v":""},{"$f":"IFERROR(IF($C81=\"TOTAL\",SUM($F$8:F80),IF(AW82=\"\",\"\",AW82)),\"\")","v":""},{"$f":"IF(C81=\"\",\"\",SUM(D81:F81))","v":""},{"$f":"IFERROR(IF($C81=\"TOTAL\",SUM($H$8:H80),IF(AY82=\"\",\"\",AY82)),\"\")","v":""},{"$f":"IFERROR(IF($C81=\"TOTAL\",SUM($I$8:I80),IF(AZ82=\"\",\"\",AZ82)),\"\")","v":""},{"$f":"IFERROR(IF($C81=\"TOTAL\",SUM($J$8:J80),IF(BA82=\"\",\"\",BA82)),\"\")","v":""},{"$f":"IF(C81=\"\",\"\",SUM(H81:J81))","v":""},{"$f":"IFERROR(IF(C81=\"\",\"\",IF(D81=\"\",\"\",IF(H81=\"\",\"\",IF($C81=\"TOTAL\",SUM($L$8:L80),SUM(D81-H81))))),\"\")","v":""},{"$f":"IFERROR(IF(C81=\"\",\"\",IF(E81=\"\",\"\",IF(I81=\"\",\"\",IF($C81=\"TOTAL\",SUM($M$8:M80),SUM(E81-I81))))),\"\")","v":""},{"$f":"IFERROR(IF(C81=\"\",\"\",IF(F81=\"\",\"\",IF(J81=\"\",\"\",IF($C81=\"TOTAL\",SUM($N$8:N80),SUM(F81-J81))))),\"\")","v":""},{"$f":"IFERROR(IF(C81=\"\",\"\",IF(G81=\"\",\"\",IF(K81=\"\",\"\",SUM(G81-K81)))),\"\")","v":""},{"$f":"IFERROR(IF(C81=\"\",\"\",IF($C81=\"TOTAL\",SUM($P$8:P80),IF(AND(C81>$AL$1,$AC$3=$AL$2),BO82,IF($AO$18=$AO$20,SUM(BB82+BJ82),ROUND((D81+E81)*10%,0))))),\"\")","v":""},{"$f":"IFERROR(IF(C81=\"\",\"\",IF(H81=\"\",\"\",IF(I81=\"\",\"\",IF($C81=\"TOTAL\",SUM($Q$8:Q80),IF(AND(C81>$AL$1,$AC$3=$AL$2),BO82,IF($AO$18=$AO$20,$AO$21,ROUND((H81+I81)*10%,0))))))),\"\")","v":""},{"$f":"IFERROR(IF(C81=\"\",\"\",SUM(P81-Q81)),\"\")","v":""},{"$f":"IFERROR(IF(C81=\"\",\"\",IF($AO$16=$AO$17,0,IF($C81=\"TOTAL\",SUM($S$8:S80),IF($AO$19=$AO$20,$AO$25,0)))),\"\")","v":""},{"$f":"IFERROR(IF(C81=\"\",\"\",IF($AO$16=$AO$17,0,IF($C81=\"TOTAL\",SUM($T$8:T80),IF($AO$19=$AO$20,$AO$24,0)))),\"\")","v":""},{"$f":"IFERROR(IF(C81=\"\",\"\",SUM(S81-T81)),\"\")","v":""},{"$f":"IF(C81=\"\",\"\",IF($C81=\"TOTAL\",SUM($V$8:V80),IF(AND($AO$2=$AO$20,C81=$AO$1),ROUND(D81/31*$AP$2,0),IF(C81=$AM$6,ROUND((G81)*1/30,0),IF(C81=$AN$6,ROUND((G81)*1/31,0),\"\")))))","v":""},{"$f":"IF(C81=\"\",\"\",IF($C81=\"TOTAL\",SUM($W$8:W80),IF(AND($AO$2=$AO$20,C81=$AO$1),ROUND(H81/31*$AP$2,0),IF(C81=$AM$6,ROUND((K81)*1/30,0),IF(C81=$AN$6,ROUND((K81)*1/31,0),\"\")))))","v":""},{"$f":"IFERROR(IF(C81=\"\",\"\",SUM(V81-W81)),\"\")","v":""},{"$f":"IFERROR(IF(C81=\"\",\"\",IF(AND(BH82=\"\",BO82=\"\"),\"\",IF($C81=\"TOTAL\",SUM($Y$8:Y80),BH82))),\"\")","v":""},{"$f":"IFERROR(IF(C81=\"\",\"\",IF($C81=\"TOTAL\",SUM($Z$8:Z80),ROUND(O81*$AO$7%,0))),\"\")","v":""},{"$f":"IFERROR(IF(C81=\"\",\"\",IF($C81=\"TOTAL\",SUM($AA$8:AA80),IF($AC$3=$AL$2,SUM(U81,X81,Y81,Z81),SUM(R81,U81,X81,Y81,Z81)))),\"\")","v":""},{"$f":"IFERROR(IF(C81=\"\",\"\",IF($C81=\"TOTAL\",SUM($AB$8:AB80),SUM(O81-AA81))),\"\")","v":""},{"$nulls":8},34,34,null,"2023-01-01",null,"2026-10-01","","","","","","","",null,"","","","",null,null,"","","","",0,0,{"$nulls":4},2100]
["","","",{"$f":"IFERROR(IF($C81=\"TOTAL\",\"अक्षरें राशि :-\",IF($C82=\"TOTAL\",SUM($D$8:D81),IF(AU83=\"\",\"\",AU83))),\"\")","v":""},{"$f":"IFERROR(IF($C82=\"TOTAL\",SUM($E$8:E81),IF(AV83=\"\",\"\",AV83)),\"\")","v":""},{"$f":"IFERROR(IF($C82=\"TOTAL\",SUM($F$8:F81),IF(AW83=\"\",\"\",AW83)),\"\")","v":""},"",{"$f":"IFERROR(IF($C82=\"TOTAL\",SUM($H$8:H81),IF(AY83=\"\",\"\",AY83)),\"\")","v":""},{"$f":"IFERROR(IF($C82=\"TOTAL\",SUM($I$8:I81),IF(AZ83=\"\",\"\",AZ83)),\"\")","v":""},{"$f":"IFERROR(IF($C82=\"TOTAL\",SUM($J$8:J81),IF(BA83=\"\",\"\",BA83)),\"\")","v":""},"",{"$f":"IFERROR(IF(C82=\"\",\"\",IF(D82=\"\",\"\",IF(H82=\"\",\"\",IF($C82=\"TOTAL\",SUM($L$8:L81),SUM(D82-H82))))),\"\")","v":""},{"$f":"IFERROR(IF(C82=\"\",\"\",IF(E82=\"\",\"\",IF(I82=\"\",\"\",IF($C82=\"TOTAL\",SUM($M$8:M81),SUM(E82-I82))))),\"\")","v":""},{"$f":"IFERROR(IF(C82=\"\",\"\",IF(F82=\"\",\"\",IF(J82=\"\",\"\",IF($C82=\"TOTAL\",SUM($N$8:N81),SUM(F82-J82))))),\"\")","v":""},"",{"$f":"IFERROR(IF(C82=\"\",\"\",IF($C82=\"TOTAL\",SUM($P$8:P81),IF(AND(C82>$AL$1,$AC$3=$AL$2),BO83,IF($AO$18=$AO$20,SUM(BB83+BJ83),ROUND((D82+E82)*10%,0))))),\"\")","v":""},{"$f":"IFERROR(IF(C82=\"\",\"\",IF(H82=\"\",\"\",IF(I82=\"\",\"\",IF($C82=\"TOTAL\",SUM($Q$8:Q81),IF(AND(C82>$AL$1,$AC$3=$AL$2),BO83,IF($AO$18=$AO$20,$AO$21,ROUND((H82+I82)*10%,0))))))),\"\")","v":""},"",{"$f":"IFERROR(IF(C82=\"\",\"\",IF($AO$16=$AO$17,0,IF($C82=\"TOTAL\",SUM($S$8:S81),IF($AO$19=$AO$20,$AO$25,0)))),\"\")","v":""},{"$f":"IFERROR(IF(C82=\"\",\"\",IF($AO$16=$AO$17,0,IF($C82=\"TOTAL\",SUM($T$8:T81),IF($AO$19=$AO$20,$AO$24,0)))),\"\")","v":""},"",{"$f":"IF(C82=\"\",\"\",IF($C82=\"TOTAL\",SUM($V$8:V81),IF(AND($AO$2=$AO$20,C82=$AO$1),ROUND(D82/31*$AP$2,0),IF(C82=$AM$6,ROUND((G82)*1/30,0),IF(C82=$AN$6,ROUND((G82)*1/31,0),\"\")))))","v":""},{"$f":"IF(C82=\"\",\"\",IF($C82=\"TOTAL\",SUM($W$8:W81),IF(AND($AO$2=$AO$20,C82=$AO$1),ROUND(H82/31*$AP$2,0),IF(C82=$AM$6,ROUND((K82)*1/30,0),IF(C82=$AN$6,ROUND((K82)*1/31,0),\"\")))))","v":""},"",{"$f":"IFERROR(IF(C82=\"\",\"\",IF(AND(BH83=\"\",BO83=\"\"),\"\",IF($C82=\"TOTAL\",SUM($Y$8:Y81),BH83))),\"\")","v":""},{"$f":"IFERROR(IF(C82=\"\",\"\",IF($C82=\"TOTAL\",SUM($Z$8:Z81),ROUND(O82*$AO$7%,0))),\"\")","v":""},{"$f":"IFERROR(IF(C82=\"\",\"\",IF($C82=\"TOTAL\",SUM($AA$8:AA81),IF($AC$3=$AL$2,SUM(U82,X82,Y82,Z82),SUM(R82,U82,X82,Y82,Z82)))),\"\")","v":""},{"$f":"IFERROR(IF(C82=\"\",\"\",IF($C82=\"TOTAL\",SUM($AB$8:AB81),SUM(O82-AA82))),\"\")","v":""},{"$nulls":8},{"$f":"IF(OR(AT82=$AN$9,AT82=$AN$10,AT82=$AN$11,AT82=$AN$12,AT82=$AN$13,AT82=$AN$14),4,IF(OR(AT82=$AN$15,AT82=$AN$16,AT82=$AN$17,AT82=$AN$18,AT82=$AN$19,AT82=$AN$20),5,IF(OR(AT82=$AN$21,AT82=$AN$22,AT82=$AN$23,AT82=$AN$24,AT82=$AN$25,AT82=$AN$26),7,IF(OR(AT82=$AN$27,AT82=$AN$28,AT82=$AN$29,AT82=$AN$30,AT82=$AN$31,AT82=$AN$32),9,IF(OR(AT82=$AN$33,AT82=$AN$34,AT82=$AN$35,AT82=$AN$36,AT82=$AN$37,AT82=$AN$38),12,IF(OR(AT82=$AN$39,AT82=$AN$40,AT82=$AN$41,AT82=$AN$42,AT82=$AN$43,AT82=$AN$44,AT82=$AN$45,AT82=$AN$46,AT82=$AN$47,AT82=$AN$48,AT82=$AN$49,AT82=$AN$50,AT82=$AN$51,AT82=$AN$52,AT82=$AN$53,AT82=$AN$54,AT82=$AN$55,AT82=$AN$56,AT82=$AN$57,AT82=$AN$58,AT82=$AN$59,AT82=$AN$60,AT82=$AN$61,AT82=$AN$62),17,IF(OR(AT82=$AN$63,AT82=$AN$64,AT82=$AN$65,AT82=$AN$66,AT82=$AN$67,AT82=$AN$68),31,34)))))))","v":34},{"$f":"IF(OR(AT82=$AN$9,AT82=$AN$10,AT82=$AN$11,AT82=$AN$12,AT82=$AN$13,AT82=$AN$14),4,IF(OR(AT82=$AN$15,AT82=$AN$16,AT82=$AN$17,AT82=$AN$18,AT82=$AN$19,AT82=$AN$20),5,IF(OR(AT82=$AN$21,AT82=$AN$22,AT82=$AN$23,AT82=$AN$24,AT82=$AN$25,AT82=$AN$26),7,IF(OR(AT82=$AN$27,AT82=$AN$28,AT82=$AN$29,AT82=$AN$30,AT82=$AN$31,AT82=$AN$32),9,IF(OR(AT82=$AN$33,AT82=$AN$34,AT82=$AN$35,AT82=$AN$36,AT82=$AN$37,AT82=$AN$38),12,IF(OR(AT82=$AN$39,AT82=$AN$40,AT82=$AN$41,AT82=$AN$42,AT82=$AN$43,AT82=$AN$44,AT82=$AN$45,AT82=$AN$46,AT82=$AN$47,AT82=$AN$48,AT82=$AN$49,AT82=$AN$50,AT82=$AN$51,AT82=$AN$52,AT82=$AN$53,AT82=$AN$54,AT82=$AN$55,AT82=$AN$56,AT82=$AN$57,AT82=$AN$58,AT82=$AN$59,AT82=$AN$60,AT82=$AN$61,AT82=$AN$62),17,IF(OR(AT82=$AN$63,AT82=$AN$64,AT82=$AN$65,AT82=$AN$66,AT82=$AN$67,AT82=$AN$68),31,34)))))))","v":34},null,"2023-02-01",null,"2026-11-01",null,"","","","","","",null,"","","","",null,null,"","","","",0,0,{"$nulls":4},2100]
["","","",{"$f":"IFERROR(IF($C82=\"TOTAL\",\"अक्षरें राशि :-\",IF($C83=\"TOTAL\",SUM($D$8:D82),IF(AU84=\"\",\"\",AU84))),\"\")","v":""},{"$f":"IFERROR(IF($C83=\"TOTAL\",SUM($E$8:E82),IF(AV84=\"\",\"\",AV84)),\"\")","v":""},{"$f":"IFERROR(IF($C83=\"TOTAL\",SUM($F$8:F82),IF(AW84=\"\",\"\",AW84)),\"\")","v":""},"",{"$f":"IFERROR(IF($C83=\"TOTAL\",SUM($H$8:H82),IF(AY84=\"\",\"\",AY84)),\"\")","v":""},{"$f":"IFERROR(IF($C83=\"TOTAL\",SUM($I$8:I82),IF(AZ84=\"\",\"\",AZ84)),\"\")","v":""},{"$f":"IFERROR(IF($C83=\"TOTAL\",SUM($J$8:J82),IF(BA84=\"\",\"\",BA84)),\"\")","v":""},"",{"$f":"IFERROR(IF(C83=\"\",\"\",IF(D83=\"\",\"\",IF(H83=\"\",\"\",IF($C83=\"TOTAL\",SUM($L$8:L82),SUM(D83-H83))))),\"\")","v":""},{"$f":"IFERROR(IF(C83=\"\",\"\",IF(E83=\"\",\"\",IF(I83=\"\",\"\",IF($C83=\"TOTAL\",SUM($M$8:M82),SUM(E83-I83))))),\"\")","v":""},{"$f":"IFERROR(IF(C83=\"\",\"\",IF(F83=\"\",\"\",IF(J83=\"\",\"\",IF($C83=\"TOTAL\",SUM($N$8:N82),SUM(F83-J83))))),\"\")","v":""},"",{"$f":"IFERROR(IF(C83=\"\",\"\",IF($C83=\"TOTAL\",SUM($P$8:P82),IF(AND(C83>$AL$1,$AC$3=$AL$2),BO84,IF($AO$18=$AO$20,SUM(BB84+BJ84),ROUND((D83+E83)*10%,0))))),\"\")","v":""},{"$f":"IFERROR(IF(C83=\"\",\"\",IF(H83=\"\",\"\",IF(I83=\"\",\"\",IF($C83=\"TOTAL\",SUM($Q$8:Q82),IF(AND(C83>$AL$1,$AC$3=$AL$2),BO84,IF($AO$18=$AO$20,$AO$21,ROUND((H83+I83)*10%,0))))))),\"\")","v":""},"",{"$f":"IFERROR(IF(C83=\"\",\"\",IF($AO$16=$AO$17,0,IF($C83=\"TOTAL\",SUM($S$8:S82),IF($AO$19=$AO$20,$AO$25,0)))),\"\")","v":""},{"$f":"IFERROR(IF(C83=\"\",\"\",IF($AO$16=$AO$17,0,IF($C83=\"TOTAL\",SUM($T$8:T82),IF($AO$19=$AO$20,$AO$24,0)))),\"\")","v":""},"",{"$f":"IF(C83=\"\",\"\",IF($C83=\"TOTAL\",SUM($V$8:V82),IF(AND($AO$2=$AO$20,C83=$AO$1),ROUND(D83/31*$AP$2,0),IF(C83=$AM$6,ROUND((G83)*1/30,0),IF(C83=$AN$6,ROUND((G83)*1/31,0),\"\")))))","v":""},{"$f":"IF(C83=\"\",\"\",IF($C83=\"TOTAL\",SUM($W$8:W82),IF(AND($AO$2=$AO$20,C83=$AO$1),ROUND(H83/31*$AP$2,0),IF(C83=$AM$6,ROUND((K83)*1/30,0),IF(C83=$AN$6,ROUND((K83)*1/31,0),\"\")))))","v":""},"",{"$f":"IFERROR(IF(C83=\"\",\"\",IF(AND(BH84=\"\",BO84=\"\"),\"\",IF($C83=\"TOTAL\",SUM($Y$8:Y82),BH84))),\"\")","v":""},{"$f":"IFERROR(IF(C83=\"\",\"\",IF($C83=\"TOTAL\",SUM($Z$8:Z82),ROUND(O83*$AO$7%,0))),\"\")","v":""},{"$f":"IFERROR(IF(C83=\"\",\"\",IF($C83=\"TOTAL\",SUM($AA$8:AA82),IF($AC$3=$AL$2,SUM(U83,X83,Y83,Z83),SUM(R83,U83,X83,Y83,Z83)))),\"\")","v":""},{"$f":"IFERROR(IF(C83=\"\",\"\",IF($C83=\"TOTAL\",SUM($AB$8:AB82),SUM(O83-AA83))),\"\")","v":""},{"$nulls":8},34,34,null,"2023-03-01",null,"2026-12-01",null,"","","","","","",null,"","","","",null,null,"","","","",0,0,{"$nulls":4},2100]
[{"$f":"IF(C84=\"TOTAL\",\"\",IF(B83=\"\",\"\",IF(LEN(C84)>=2,B83+1,0)))","v":""},"","",{"$f":"IFERROR(IF($C83=\"TOTAL\",\"अक्षरें राशि :-\",IF($C84=\"TOTAL\",SUM($D$8:D83),IF(AU85=\"\",\"\",AU85))),\"\")","v":""},{"$f":"IFERROR(IF($C84=\"TOTAL\",SUM($E$8:E83),IF(AV85=\"\",\"\",AV85)),\"\")","v":""},{"$f":"IFERROR(IF($C84=\"TOTAL\",SUM($F$8:F83),IF(AW85=\"\",\"\",AW85)),\"\")","v":""},"",{"$f":"IFERROR(IF($C84=\"TOTAL\",SUM($H$8:H83),IF(AY85=\"\",\"\",AY85)),\"\")","v":""},{"$f":"IFERROR(IF($C84=\"TOTAL\",SUM($I$8:I83),IF(AZ85=\"\",\"\",AZ85)),\"\")","v":""},{"$f":"IFERROR(IF($C84=\"TOTAL\",SUM($J$8:J83),IF(BA85=\"\",\"\",BA85)),\"\")","v":""},"",{"$f":"IFERROR(IF(C84=\"\",\"\",IF(D84=\"\",\"\",IF(H84=\"\",\"\",IF($C84=\"TOTAL\",SUM($L$8:L83),SUM(D84-H84))))),\"\")","v":""},{"$f":"IFERROR(IF(C84=\"\",\"\",IF(E84=\"\",\"\",IF(I84=\"\",\"\",IF($C84=\"TOTAL\",SUM($M$8:M83),SUM(E84-I84))))),\"\")","v":""},{"$f":"IFERROR(IF(C84=\"\",\"\",IF(F84=\"\",\"\",IF(J84=\"\",\"\",IF($C84=\"TOTAL\",SUM($N$8:N83),SUM(F84-J84))))),\"\")","v":""},"",{"$f":"IFERROR(IF(C84=\"\",\"\",IF($C84=\"TOTAL\",SUM($P$8:P83),IF(AND(C84>$AL$1,$AC$3=$AL$2),BO85,IF($AO$18=$AO$20,SUM(BB85+BJ85),ROUND((D84+E84)*10%,0))))),\"\")","v":""},{"$f":"IFERROR(IF(C84=\"\",\"\",IF(H84=\"\",\"\",IF(I84=\"\",\"\",IF($C84=\"TOTAL\",SUM($Q$8:Q83),IF(AND(C84>$AL$1,$AC$3=$AL$2),BO85,IF($AO$18=$AO$20,$AO$21,ROUND((H84+I84)*10%,0))))))),\"\")","v":""},"",{"$f":"IFERROR(IF(C84=\"\",\"\",IF($AO$16=$AO$17,0,IF($C84=\"TOTAL\",SUM($S$8:S83),IF($AO$19=$AO$20,$AO$25,0)))),\"\")","v":""},{"$f":"IFERROR(IF(C84=\"\",\"\",IF($AO$16=$AO$17,0,IF($C84=\"TOTAL\",SUM($T$8:T83),IF($AO$19=$AO$20,$AO$24,0)))),\"\")","v":""},"",{"$f":"IF(C84=\"\",\"\",IF($C84=\"TOTAL\",SUM($V$8:V83),IF(AND($AO$2=$AO$20,C84=$AO$1),ROUND(D84/31*$AP$2,0),IF(C84=$AM$6,ROUND((G84)*1/30,0),IF(C84=$AN$6,ROUND((G84)*1/31,0),\"\")))))","v":""},{"$f":"IF(C84=\"\",\"\",IF($C84=\"TOTAL\",SUM($W$8:W83),IF(AND($AO$2=$AO$20,C84=$AO$1),ROUND(H84/31*$AP$2,0),IF(C84=$AM$6,ROUND((K84)*1/30,0),IF(C84=$AN$6,ROUND((K84)*1/31,0),\"\")))))","v":""},"",{"$f":"IFERROR(IF(C84=\"\",\"\",IF(AND(BH85=\"\",BO85=\"\"),\"\",IF($C84=\"TOTAL\",SUM($Y$8:Y83),BH85))),\"\")","v":""},{"$f":"IFERROR(IF(C84=\"\",\"\",IF($C84=\"TOTAL\",SUM($Z$8:Z83),ROUND(O84*$AO$7%,0))),\"\")","v":""},{"$f":"IFERROR(IF(C84=\"\",\"\",IF($C84=\"TOTAL\",SUM($AA$8:AA83),IF($AC$3=$AL$2,SUM(U84,X84,Y84,Z84),SUM(R84,U84,X84,Y84,Z84)))),\"\")","v":""},{"$f":"IFERROR(IF(C84=\"\",\"\",IF($C84=\"TOTAL\",SUM($AB$8:AB83),SUM(O84-AA84))),\"\")","v":""},{"$nulls":8},34,34,null,"2023-04-01",null,{"$f":"IF(AND($AO$6>$AP$6),\"\",DATE(YEAR(AP83),MONTH(AP83)+1,DAY(AP83)))","v":"2027-01-01"},null,"","",{"$f":"IFERROR(IF(AS84=\"\",\"\",IF(DATE(YEAR(AS84),MONTH(AS84),DAY(AS84))=DATE(YEAR($AP$6),MONTH($AP$6)+1,DAY($AP$6)),\"TOTAL\",IF(AS84>$AP$6,\"\",AS84))),\"\")","v":""},"","","",null,"","","","",null,null,"","","","",0,0,{"$nulls":4},2100]
["","","",{"$f":"IFERROR(IF($C84=\"TOTAL\",\"अक्षरें राशि :-\",IF($C85=\"TOTAL\",SUM($D$8:D84),IF(AU86=\"\",\"\",AU86))),\"\")","v":""},{"$f":"IFERROR(IF($C85=\"TOTAL\",SUM($E$8:E84),IF(AV86=\"\",\"\",AV86)),\"\")","v":""},{"$f":"IFERROR(IF($C85=\"TOTAL\",SUM($F$8:F84),IF(AW86=\"\",\"\",AW86)),\"\")","v":""},"",{"$f":"IFERROR(IF($C85=\"TOTAL\",SUM($H$8:H84),IF(AY86=\"\",\"\",AY86)),\"\")","v":""},{"$f":"IFERROR(IF($C85=\"TOTAL\",SUM($I$8:I84),IF(AZ86=\"\",\"\",AZ86)),\"\")","v":""},{"$f":"IFERROR(IF($C85=\"TOTAL\",SUM($J$8:J84),IF(BA86=\"\",\"\",BA86)),\"\")","v":""},"",{"$f":"IFERROR(IF(C85=\"\",\"\",IF(D85=\"\",\"\",IF(H85=\"\",\"\",IF($C85=\"TOTAL\",SUM($L$8:L84),SUM(D85-H85))))),\"\")","v":""},{"$f":"IFERROR(IF(C85=\"\",\"\",IF(E85=\"\",\"\",IF(I85=\"\",\"\",IF($C85=\"TOTAL\",SUM($M$8:M84),SUM(E85-I85))))),\"\")","v":""},{"$f":"IFERROR(IF(C85=\"\",\"\",IF(F85=\"\",\"\",IF(J85=\"\",\"\",IF($C85=\"TOTAL\",SUM($N$8:N84),SUM(F85-J85))))),\"\")","v":""},"",{"$f":"IFERROR(IF(C85=\"\",\"\",IF($C85=\"TOTAL\",SUM($P$8:P84),IF(AND(C85>$AL$1,$AC$3=$AL$2),BO86,IF($AO$18=$AO$20,SUM(BB86+BJ86),ROUND((D85+E85)*10%,0))))),\"\")","v":""},{"$f":"IFERROR(IF(C85=\"\",\"\",IF(H85=\"\",\"\",IF(I85=\"\",\"\",IF($C85=\"TOTAL\",SUM($Q$8:Q84),IF(AND(C85>$AL$1,$AC$3=$AL$2),BO86,IF($AO$18=$AO$20,$AO$21,ROUND((H85+I85)*10%,0))))))),\"\")","v":""},"",{"$f":"IFERROR(IF(C85=\"\",\"\",IF($AO$16=$AO$17,0,IF($C85=\"TOTAL\",SUM($S$8:S84),IF($AO$19=$AO$20,$AO$25,0)))),\"\")","v":""},{"$f":"IFERROR(IF(C85=\"\",\"\",IF($AO$16=$AO$17,0,IF($C85=\"TOTAL\",SUM($T$8:T84),IF($AO$19=$AO$20,$AO$24,0)))),\"\")","v":""},"",{"$f":"IF(C85=\"\",\"\",IF($C85=\"TOTAL\",SUM($V$8:V84),IF(AND($AO$2=$AO$20,C85=$AO$1),ROUND(D85/31*$AP$2,0),IF(C85=$AM$6,ROUND((G85)*1/30,0),IF(C85=$AN$6,ROUND((G85)*1/31,0),\"\")))))","v":""},{"$f":"IF(C85=\"\",\"\",IF($C85=\"TOTAL\",SUM($W$8:W84),IF(AND($AO$2=$AO$20,C85=$AO$1),ROUND(H85/31*$AP$2,0),IF(C85=$AM$6,ROUND((K85)*1/30,0),IF(C85=$AN$6,ROUND((K85)*1/31,0),\"\")))))","v":""},"",{"$f":"IFERROR(IF(C85=\"\",\"\",IF(AND(BH86=\"\",BO86=\"\"),\"\",IF($C85=\"TOTAL\",SUM($Y$8:Y84),BH86))),\"\")","v":""},{"$f":"IFERROR(IF(C85=\"\",\"\",IF($C85=\"TOTAL\",SUM($Z$8:Z84),ROUND(O85*$AO$7%,0))),\"\")","v":""},{"$f":"IFERROR(IF(C85=\"\",\"\",IF($C85=\"TOTAL\",SUM($AA$8:AA84),IF($AC$3=$AL$2,SUM(U85,X85,Y85,Z85),SUM(R85,U85,X85,Y85,Z85)))),\"\")","v":""},{"$f":"IFERROR(IF(C85=\"\",\"\",IF($C85=\"TOTAL\",SUM($AB$8:AB84),SUM(O85-AA85))),\"\")","v":""},{"$nulls":8},34,34,null,"2023-05-01",null,"2027-02-01",null,"","",{"$f":"IFERROR(IF(AS85=\"\",\"\",IF(DATE(YEAR(AS85),MONTH(AS85),DAY(AS85))=DATE(YEAR($AP$6),MONTH($AP$6)+1,DAY($AP$6)),\"TOTAL\",IF(AS85>$AP$6,\"\",AS85))),\"\")","v":""},"","","",null,"","","","",null,null,"","","","",0,0,{"$nulls":4},2100]
["","","",{"$f":"IFERROR(IF($C85=\"TOTAL\",\"अक्षरें राशि :-\",IF($C86=\"TOTAL\",SUM($D$8:D85),IF(AU87=\"\",\"\",AU87))),\"\")","v":""},{"$f":"IFERROR(IF($C86=\"TOTAL\",SUM($E$8:E85),IF(AV87=\"\",\"\",AV87)),\"\")","v":""},{"$f":"IFERROR(IF($C86=\"TOTAL\",SUM($F$8:F85),IF(AW87=\"\",\"\",AW87)),\"\")","v":""},"",{"$f":"IFERROR(IF($C86=\"TOTAL\",SUM($H$8:H85),IF(AY87=\"\",\"\",AY87)),\"\")","v":""},{"$f":"IFERROR(IF($C86=\"TOTAL\",SUM($I$8:I85),IF(AZ87=\"\",\"\",AZ87)),\"\")","v":""},{"$f":"IFERROR(IF($C86=\"TOTAL\",SUM($J$8:J85),IF(BA87=\"\",\"\",BA87)),\"\")","v":""},"",{"$f":"IFERROR(IF(C86=\"\",\"\",IF(D86=\"\",\"\",IF(H86=\"\",\"\",IF($C86=\"TOTAL\",SUM($L$8:L85),SUM(D86-H86))))),\"\")","v":""},{"$f":"IFERROR(IF(C86=\"\",\"\",IF(E86=\"\",\"\",IF(I86=\"\",\"\",IF($C86=\"TOTAL\",SUM($M$8:M85),SUM(E86-I86))))),\"\")","v":""},{"$f":"IFERROR(IF(C86=\"\",\"\",IF(F86=\"\",\"\",IF(J86=\"\",\"\",IF($C86=\"TOTAL\",SUM($N$8:N85),SUM(F86-J86))))),\"\")","v":""},"",{"$f":"IFERROR(IF(C86=\"\",\"\",IF($C86=\"TOTAL\",SUM($P$8:P85),IF(AND(C86>$AL$1,$AC$3=$AL$2),BO87,IF($AO$18=$AO$20,SUM(BB87+BJ87),ROUND((D86+E86)*10%,0))))),\"\")","v":""},{"$f":"IFERROR(IF(C86=\"\",\"\",IF(H86=\"\",\"\",IF(I86=\"\",\"\",IF($C86=\"TOTAL\",SUM($Q$8:Q85),IF(AND(C86>$AL$1,$AC$3=$AL$2),BO87,IF($AO$18=$AO$20,$AO$21,ROUND((H86+I86)*10%,0))))))),\"\")","v":""},"",{"$f":"IFERROR(IF(C86=\"\",\"\",IF($AO$16=$AO$17,0,IF($C86=\"TOTAL\",SUM($S$8:S85),IF($AO$19=$AO$20,$AO$25,0)))),\"\")","v":""},{"$f":"IFERROR(IF(C86=\"\",\"\",IF($AO$16=$AO$17,0,IF($C86=\"TOTAL\",SUM($T$8:T85),IF($AO$19=$AO$20,$AO$24,0)))),\"\")","v":""},"",{"$f":"IF(C86=\"\",\"\",IF($C86=\"TOTAL\",SUM($V$8:V85),IF(AND($AO$2=$AO$20,C86=$AO$1),ROUND(D86/31*$AP$2,0),IF(C86=$AM$6,ROUND((G86)*1/30,0),IF(C86=$AN$6,ROUND((G86)*1/31,0),\"\")))))","v":""},{"$f":"IF(C86=\"\",\"\",IF($C86=\"TOTAL\",SUM($W$8:W85),IF(AND($AO$2=$AO$20,C86=$AO$1),ROUND(H86/31*$AP$2,0),IF(C86=$AM$6,ROUND((K86)*1/30,0),IF(C86=$AN$6,ROUND((K86)*1/31,0),\"\")))))","v":""},"",{"$f":"IFERROR(IF(C86=\"\",\"\",IF(AND(BH87=\"\",BO87=\"\"),\"\",IF($C86=\"TOTAL\",SUM($Y$8:Y85),BH87))),\"\")","v":""},{"$f":"IFERROR(IF(C86=\"\",\"\",IF($C86=\"TOTAL\",SUM($Z$8:Z85),ROUND(O86*$AO$7%,0))),\"\")","v":""},{"$f":"IFERROR(IF(C86=\"\",\"\",IF($C86=\"TOTAL\",SUM($AA$8:AA85),IF($AC$3=$AL$2,SUM(U86,X86,Y86,Z86),SUM(R86,U86,X86,Y86,Z86)))),\"\")","v":""},{"$f":"IFERROR(IF(C86=\"\",\"\",IF($C86=\"TOTAL\",SUM($AB$8:AB85),SUM(O86-AA86))),\"\")","v":""},{"$nulls":8},34,34,null,"2023-06-01",null,"2027-03-01",null,"","","","","","",null,"",{"$f":"IF(AT86=\"\",\"\",IF(AT86=\"TOTAL\",\"\",IF(AY86=\"\",\"\",IF($AO$16=$AO$17,0,ROUND(AY86*AL86%,0)))))","v":""},"","",null,null,"","","","",0,0,{"$nulls":4},2100]
["","","",{"$f":"IFERROR(IF($C86=\"TOTAL\",\"अक्षरें राशि :-\",IF($C87=\"TOTAL\",SUM($D$8:D86),IF(AU88=\"\",\"\",AU88))),\"\")","v":""},{"$f":"IFERROR(IF($C87=\"TOTAL\",SUM($E$8:E86),IF(AV88=\"\",\"\",AV88)),\"\")","v":""},{"$f":"IFERROR(IF($C87=\"TOTAL\",SUM($F$8:F86),IF(AW88=\"\",\"\",AW88)),\"\")","v":""},"",{"$f":"IFERROR(IF($C87=\"TOTAL\",SUM($H$8:H86),IF(AY88=\"\",\"\",AY88)),\"\")","v":""},{"$f":"IFERROR(IF($C87=\"TOTAL\",SUM($I$8:I86),IF(AZ88=\"\",\"\",AZ88)),\"\")","v":""},{"$f":"IFERROR(IF($C87=\"TOTAL\",SUM($J$8:J86),IF(BA88=\"\",\"\",BA88)),\"\")","v":""},"",{"$f":"IFERROR(IF(C87=\"\",\"\",IF(D87=\"\",\"\",IF(H87=\"\",\"\",IF($C87=\"TOTAL\",SUM($L$8:L86),SUM(D87-H87))))),\"\")","v":""},{"$f":"IFERROR(IF(C87=\"\",\"\",IF(E87=\"\",\"\",IF(I87=\"\",\"\",IF($C87=\"TOTAL\",SUM($M$8:M86),SUM(E87-I87))))),\"\")","v":""},{"$f":"IFERROR(IF(C87=\"\",\"\",IF(F87=\"\",\"\",IF(J87=\"\",\"\",IF($C87=\"TOTAL\",SUM($N$8:N86),SUM(F87-J87))))),\"\")","v":""},"",{"$f":"IFERROR(IF(C87=\"\",\"\",IF($C87=\"TOTAL\",SUM($P$8:P86),IF(AND(C87>$AL$1,$AC$3=$AL$2),BO88,IF($AO$18=$AO$20,SUM(BB88+BJ88),ROUND((D87+E87)*10%,0))))),\"\")","v":""},{"$f":"IFERROR(IF(C87=\"\",\"\",IF(H87=\"\",\"\",IF(I87=\"\",\"\",IF($C87=\"TOTAL\",SUM($Q$8:Q86),IF(AND(C87>$AL$1,$AC$3=$AL$2),BO88,IF($AO$18=$AO$20,$AO$21,ROUND((H87+I87)*10%,0))))))),\"\")","v":""},"",{"$f":"IFERROR(IF(C87=\"\",\"\",IF($AO$16=$AO$17,0,IF($C87=\"TOTAL\",SUM($S$8:S86),IF($AO$19=$AO$20,$AO$25,0)))),\"\")","v":""},{"$f":"IFERROR(IF(C87=\"\",\"\",IF($AO$16=$AO$17,0,IF($C87=\"TOTAL\",SUM($T$8:T86),IF($AO$19=$AO$20,$AO$24,0)))),\"\")","v":""},"",{"$f":"IF(C87=\"\",\"\",IF($C87=\"TOTAL\",SUM($V$8:V86),IF(AND($AO$2=$AO$20,C87=$AO$1),ROUND(D87/31*$AP$2,0),IF(C87=$AM$6,ROUND((G87)*1/30,0),IF(C87=$AN$6,ROUND((G87)*1/31,0),\"\")))))","v":""},{"$f":"IF(C87=\"\",\"\",IF($C87=\"TOTAL\",SUM($W$8:W86),IF(AND($AO$2=$AO$20,C87=$AO$1),ROUND(H87/31*$AP$2,0),IF(C87=$AM$6,ROUND((K87)*1/30,0),IF(C87=$AN$6,ROUND((K87)*1/31,0),\"\")))))","v":""},"",{"$f":"IFERROR(IF(C87=\"\",\"\",IF(AND(BH88=\"\",BO88=\"\"),\"\",IF($C87=\"TOTAL\",SUM($Y$8:Y86),BH88))),\"\")","v":""},{"$f":"IFERROR(IF(C87=\"\",\"\",IF($C87=\"TOTAL\",SUM($Z$8:Z86),ROUND(O87*$AO$7%,0))),\"\")","v":""},{"$f":"IFERROR(IF(C87=\"\",\"\",IF($C87=\"TOTAL\",SUM($AA$8:AA86),IF($AC$3=$AL$2,SUM(U87,X87,Y87,Z87),SUM(R87,U87,X87,Y87,Z87)))),\"\")","v":""},{"$f":"IFERROR(IF(C87=\"\",\"\",IF($C87=\"TOTAL\",SUM($AB$8:AB86),SUM(O87-AA87))),\"\")","v":""},{"$nulls":8},34,34,null,"2023-07-01",null,"2027-04-01",null,"","","","","","",null,"","","","",null,null,"","","","",0,0,{"$nulls":4},2100]
["","","",{"$f":"IFERROR(IF($C87=\"TOTAL\",\"अक्षरें राशि :-\",IF($C88=\"TOTAL\",SUM($D$8:D87),IF(AU89=\"\",\"\",AU89))),\"\")","v":""},{"$f":"IFERROR(IF($C88=\"TOTAL\",SUM($E$8:E87),IF(AV89=\"\",\"\",AV89)),\"\")","v":""},{"$f":"IFERROR(IF($C88=\"TOTAL\",SUM($F$8:F87),IF(AW89=\"\",\"\",AW89)),\"\")","v":""},"",{"$f":"IFERROR(IF($C88=\"TOTAL\",SUM($H$8:H87),IF(AY89=\"\",\"\",AY89)),\"\")","v":""},{"$f":"IFERROR(IF($C88=\"TOTAL\",SUM($I$8:I87),IF(AZ89=\"\",\"\",AZ89)),\"\")","v":""},{"$f":"IFERROR(IF($C88=\"TOTAL\",SUM($J$8:J87),IF(BA89=\"\",\"\",BA89)),\"\")","v":""},"",{"$f":"IFERROR(IF(C88=\"\",\"\",IF(D88=\"\",\"\",IF(H88=\"\",\"\",IF($C88=\"TOTAL\",SUM($L$8:L87),SUM(D88-H88))))),\"\")","v":""},{"$f":"IFERROR(IF(C88=\"\",\"\",IF(E88=\"\",\"\",IF(I88=\"\",\"\",IF($C88=\"TOTAL\",SUM($M$8:M87),SUM(E88-I88))))),\"\")","v":""},{"$f":"IFERROR(IF(C88=\"\",\"\",IF(F88=\"\",\"\",IF(J88=\"\",\"\",IF($C88=\"TOTAL\",SUM($N$8:N87),SUM(F88-J88))))),\"\")","v":""},"",{"$f":"IFERROR(IF(C88=\"\",\"\",IF($C88=\"TOTAL\",SUM($P$8:P87),IF(AND(C88>$AL$1,$AC$3=$AL$2),BO89,IF($AO$18=$AO$20,SUM(BB89+BJ89),ROUND((D88+E88)*10%,0))))),\"\")","v":""},{"$f":"IFERROR(IF(C88=\"\",\"\",IF(H88=\"\",\"\",IF(I88=\"\",\"\",IF($C88=\"TOTAL\",SUM($Q$8:Q87),IF(AND(C88>$AL$1,$AC$3=$AL$2),BO89,IF($AO$18=$AO$20,$AO$21,ROUND((H88+I88)*10%,0))))))),\"\")","v":""},"",{"$f":"IFERROR(IF(C88=\"\",\"\",IF($AO$16=$AO$17,0,IF($C88=\"TOTAL\",SUM($S$8:S87),IF($AO$19=$AO$20,$AO$25,0)))),\"\")","v":""},{"$f":"IFERROR(IF(C88=\"\",\"\",IF($AO$16=$AO$17,0,IF($C88=\"TOTAL\",SUM($T$8:T87),IF($AO$19=$AO$20,$AO$24,0)))),\"\")","v":""},"",{"$f":"IF(C88=\"\",\"\",IF($C88=\"TOTAL\",SUM($V$8:V87),IF(AND($AO$2=$AO$20,C88=$AO$1),ROUND(D88/31*$AP$2,0),IF(C88=$AM$6,ROUND((G88)*1/30,0),IF(C88=$AN$6,ROUND((G88)*1/31,0),\"\")))))","v":""},{"$f":"IF(C88=\"\",\"\",IF($C88=\"TOTAL\",SUM($W$8:W87),IF(AND($AO$2=$AO$20,C88=$AO$1),ROUND(H88/31*$AP$2,0),IF(C88=$AM$6,ROUND((K88)*1/30,0),IF(C88=$AN$6,ROUND((K88)*1/31,0),\"\")))))","v":""},"",{"$f":"IFERROR(IF(C88=\"\",\"\",IF(AND(BH89=\"\",BO89=\"\"),\"\",IF($C88=\"TOTAL\",SUM($Y$8:Y87),BH89))),\"\")","v":""},{"$f":"IFERROR(IF(C88=\"\",\"\",IF($C88=\"TOTAL\",SUM($Z$8:Z87),ROUND(O88*$AO$7%,0))),\"\")","v":""},{"$f":"IFERROR(IF(C88=\"\",\"\",IF($C88=\"TOTAL\",SUM($AA$8:AA87),IF($AC$3=$AL$2,SUM(U88,X88,Y88,Z88),SUM(R88,U88,X88,Y88,Z88)))),\"\")","v":""},{"$f":"IFERROR(IF(C88=\"\",\"\",IF($C88=\"TOTAL\",SUM($AB$8:AB87),SUM(O88-AA88))),\"\")","v":""},{"$nulls":8},34,34,null,"2023-08-01",null,"2027-05-01",null,"","","","","","",null,"","","","",null,null,"","","","",0,0,{"$nulls":4},2100]
[null,"","",{"$f":"IFERROR(IF($C88=\"TOTAL\",\"अक्षरें राशि :-\",IF($C89=\"TOTAL\",SUM($D$8:D88),IF(AU90=\"\",\"\",AU90))),\"\")","v":""},{"$f":"IFERROR(IF($C89=\"TOTAL\",SUM($E$8:E88),IF(AV90=\"\",\"\",AV90)),\"\")","v":""},{"$f":"IFERROR(IF($C89=\"TOTAL\",SUM($F$8:F88),IF(AW90=\"\",\"\",AW90)),\"\")","v":""},"",{"$f":"IFERROR(IF($C89=\"TOTAL\",SUM($H$8:H88),IF(AY90=\"\",\"\",AY90)),\"\")","v":""},{"$f":"IFERROR(IF($C89=\"TOTAL\",SUM($I$8:I88),IF(AZ90=\"\",\"\",AZ90)),\"\")","v":""},{"$f":"IFERROR(IF($C89=\"TOTAL\",SUM($J$8:J88),IF(BA90=\"\",\"\",BA90)),\"\")","v":""},"",{"$f":"IFERROR(IF(C89=\"\",\"\",IF(D89=\"\",\"\",IF(H89=\"\",\"\",IF($C89=\"TOTAL\",SUM($L$8:L88),SUM(D89-H89))))),\"\")","v":""},{"$f":"IFERROR(IF(C89=\"\",\"\",IF(E89=\"\",\"\",IF(I89=\"\",\"\",IF($C89=\"TOTAL\",SUM($M$8:M88),SUM(E89-I89))))),\"\")","v":""},{"$f":"IFERROR(IF(C89=\"\",\"\",IF(F89=\"\",\"\",IF(J89=\"\",\"\",IF($C89=\"TOTAL\",SUM($N$8:N88),SUM(F89-J89))))),\"\")","v":""},"",{"$f":"IFERROR(IF(C89=\"\",\"\",IF($C89=\"TOTAL\",SUM($P$8:P88),IF(AND(C89>$AL$1,$AC$3=$AL$2),BO90,IF($AO$18=$AO$20,SUM(BB90+BJ90),ROUND((D89+E89)*10%,0))))),\"\")","v":""},{"$f":"IFERROR(IF(C89=\"\",\"\",IF(H89=\"\",\"\",IF(I89=\"\",\"\",IF($C89=\"TOTAL\",SUM($Q$8:Q88),IF(AND(C89>$AL$1,$AC$3=$AL$2),BO90,IF($AO$18=$AO$20,$AO$21,ROUND((H89+I89)*10%,0))))))),\"\")","v":""},"",{"$f":"IFERROR(IF(C89=\"\",\"\",IF($AO$16=$AO$17,0,IF($C89=\"TOTAL\",SUM($S$8:S88),IF($AO$19=$AO$20,$AO$25,0)))),\"\")","v":""},{"$f":"IFERROR(IF(C89=\"\",\"\",IF($AO$16=$AO$17,0,IF($C89=\"TOTAL\",SUM($T$8:T88),IF($AO$19=$AO$20,$AO$24,0)))),\"\")","v":""},"",{"$f":"IF(C89=\"\",\"\",IF($C89=\"TOTAL\",SUM($V$8:V88),IF(AND($AO$2=$AO$20,C89=$AO$1),ROUND(D89/31*$AP$2,0),IF(C89=$AM$6,ROUND((G89)*1/30,0),IF(C89=$AN$6,ROUND((G89)*1/31,0),\"\")))))","v":""},{"$f":"IF(C89=\"\",\"\",IF($C89=\"TOTAL\",SUM($W$8:W88),IF(AND($AO$2=$AO$20,C89=$AO$1),ROUND(H89/31*$AP$2,0),IF(C89=$AM$6,ROUND((K89)*1/30,0),IF(C89=$AN$6,ROUND((K89)*1/31,0),\"\")))))","v":""},"",{"$f":"IFERROR(IF(C89=\"\",\"\",IF(AND(BH90=\"\",BO90=\"\"),\"\",IF($C89=\"TOTAL\",SUM($Y$8:Y88),BH90))),\"\")","v":""},{"$f":"IFERROR(IF(C89=\"\",\"\",IF($C89=\"TOTAL\",SUM($Z$8:Z88),ROUND(O89*$AO$7%,0))),\"\")","v":""},{"$f":"IFERROR(IF(C89=\"\",\"\",IF($C89=\"TOTAL\",SUM($AA$8:AA88),IF($AC$3=$AL$2,SUM(U89,X89,Y89,Z89),SUM(R89,U89,X89,Y89,Z89)))),\"\")","v":""},{"$f":"IFERROR(IF(C89=\"\",\"\",IF($C89=\"TOTAL\",SUM($AB$8:AB88),SUM(O89-AA89))),\"\")","v":""},{"$nulls":8},34,34,null,"2023-09-01",null,"2027-06-01",null,"","","","","","",null,"","","","",null,null,"","","","",0,0,{"$nulls":4},2100]
[null,{"$f":"IFERROR(IF(A90=\"\",\"\",IF(A90=0,\"\",A90)),\"\")","v":""},"",{"$f":"IFERROR(IF($C89=\"TOTAL\",\"अक्षरें राशि :-\",IF($C90=\"TOTAL\",SUM($D$8:D89),IF(AU91=\"\",\"\",AU91))),\"\")","v":""},{"$f":"IFERROR(IF($C90=\"TOTAL\",SUM($E$8:E89),IF(AV91=\"\",\"\",AV91)),\"\")","v":""},{"$f":"IFERROR(IF($C90=\"TOTAL\",SUM($F$8:F89),IF(AW91=\"\",\"\",AW91)),\"\")","v":""},"",{"$f":"IFERROR(IF($C90=\"TOTAL\",SUM($H$8:H89),IF(AY91=\"\",\"\",AY91)),\"\")","v":""},{"$f":"IFERROR(IF($C90=\"TOTAL\",SUM($I$8:I89),IF(AZ91=\"\",\"\",AZ91)),\"\")","v":""},{"$f":"IFERROR(IF($C90=\"TOTAL\",SUM($J$8:J89),IF(BA91=\"\",\"\",BA91)),\"\")","v":""},"",{"$f":"IFERROR(IF(C90=\"\",\"\",IF(D90=\"\",\"\",IF(H90=\"\",\"\",IF($C90=\"TOTAL\",SUM($L$8:L89),SUM(D90-H90))))),\"\")","v":""},{"$f":"IFERROR(IF(C90=\"\",\"\",IF(E90=\"\",\"\",IF(I90=\"\",\"\",IF($C90=\"TOTAL\",SUM($M$8:M89),SUM(E90-I90))))),\"\")","v":""},{"$f":"IFERROR(IF(C90=\"\",\"\",IF(F90=\"\",\"\",IF(J90=\"\",\"\",IF($C90=\"TOTAL\",SUM($N$8:N89),SUM(F90-J90))))),\"\")","v":""},"",{"$f":"IFERROR(IF(C90=\"\",\"\",IF($C90=\"TOTAL\",SUM($P$8:P89),IF(AND(C90>$AL$1,$AC$3=$AL$2),BO91,IF($AO$18=$AO$20,SUM(BB91+BJ91),ROUND((D90+E90)*10%,0))))),\"\")","v":""},{"$f":"IFERROR(IF(C90=\"\",\"\",IF(H90=\"\",\"\",IF(I90=\"\",\"\",IF($C90=\"TOTAL\",SUM($Q$8:Q89),IF(AND(C90>$AL$1,$AC$3=$AL$2),BO91,IF($AO$18=$AO$20,$AO$21,ROUND((H90+I90)*10%,0))))))),\"\")","v":""},"",{"$f":"IFERROR(IF(C90=\"\",\"\",IF($AO$16=$AO$17,0,IF($C90=\"TOTAL\",SUM($S$8:S89),IF($AO$19=$AO$20,$AO$25,0)))),\"\")","v":""},{"$f":"IFERROR(IF(C90=\"\",\"\",IF($AO$16=$AO$17,0,IF($C90=\"TOTAL\",SUM($T$8:T89),IF($AO$19=$AO$20,$AO$24,0)))),\"\")","v":""},"",{"$f":"IF(C90=\"\",\"\",IF($C90=\"TOTAL\",SUM($V$8:V89),IF(AND($AO$2=$AO$20,C90=$AO$1),ROUND(D90/31*$AP$2,0),IF(C90=$AM$6,ROUND((G90)*1/30,0),IF(C90=$AN$6,ROUND((G90)*1/31,0),\"\")))))","v":""},{"$f":"IF(C90=\"\",\"\",IF($C90=\"TOTAL\",SUM($W$8:W89),IF(AND($AO$2=$AO$20,C90=$AO$1),ROUND(H90/31*$AP$2,0),IF(C90=$AM$6,ROUND((K90)*1/30,0),IF(C90=$AN$6,ROUND((K90)*1/31,0),\"\")))))","v":""},"",{"$f":"IFERROR(IF(C90=\"\",\"\",IF(AND(BH91=\"\",BO91=\"\"),\"\",IF($C90=\"TOTAL\",SUM($Y$8:Y89),BH91))),\"\")","v":""},{"$f":"IFERROR(IF(C90=\"\",\"\",IF($C90=\"TOTAL\",SUM($Z$8:Z89),ROUND(O90*$AO$7%,0))),\"\")","v":""},{"$f":"IFERROR(IF(C90=\"\",\"\",IF($C90=\"TOTAL\",SUM($AA$8:AA89),IF($AC$3=$AL$2,SUM(U90,X90,Y90,Z90),SUM(R90,U90,X90,Y90,Z90)))),\"\")","v":""},{"$f":"IFERROR(IF(C90=\"\",\"\",IF($C90=\"TOTAL\",SUM($AB$8:AB89),SUM(O90-AA90))),\"\")","v":""},{"$nulls":8},34,34,null,"2023-10-01",null,"2027-07-01",null,"","","","","","",null,"","","","",null,null,"","","","",0,0,{"$nulls":4},2100]
[null,"","",{"$f":"IFERROR(IF($C90=\"TOTAL\",\"अक्षरें राशि :-\",IF($C91=\"TOTAL\",SUM($D$8:D90),IF(AU92=\"\",\"\",AU92))),\"\")","v":""},{"$f":"IFERROR(IF($C91=\"TOTAL\",SUM($E$8:E90),IF(AV92=\"\",\"\",AV92)),\"\")","v":""},{"$f":"IFERROR(IF($C91=\"TOTAL\",SUM($F$8:F90),IF(AW92=\"\",\"\",AW92)),\"\")","v":""},"",{"$f":"IFERROR(IF($C91=\"TOTAL\",SUM($H$8:H90),IF(AY92=\"\",\"\",AY92)),\"\")","v":""},{"$f":"IFERROR(IF($C91=\"TOTAL\",SUM($I$8:I90),IF(AZ92=\"\",\"\",AZ92)),\"\")","v":""},{"$f":"IFERROR(IF($C91=\"TOTAL\",SUM($J$8:J90),IF(BA92=\"\",\"\",BA92)),\"\")","v":""},"",{"$f":"IFERROR(IF(C91=\"\",\"\",IF(D91=\"\",\"\",IF(H91=\"\",\"\",IF($C91=\"TOTAL\",SUM($L$8:L90),SUM(D91-H91))))),\"\")","v":""},{"$f":"IFERROR(IF(C91=\"\",\"\",IF(E91=\"\",\"\",IF(I91=\"\",\"\",IF($C91=\"TOTAL\",SUM($M$8:M90),SUM(E91-I91))))),\"\")","v":""},{"$f":"IFERROR(IF(C91=\"\",\"\",IF(F91=\"\",\"\",IF(J91=\"\",\"\",IF($C91=\"TOTAL\",SUM($N$8:N90),SUM(F91-J91))))),\"\")","v":""},"",{"$f":"IFERROR(IF(C91=\"\",\"\",IF($C91=\"TOTAL\",SUM($P$8:P90),IF(AND(C91>$AL$1,$AC$3=$AL$2),BO92,IF($AO$18=$AO$20,SUM(BB92+BJ92),ROUND((D91+E91)*10%,0))))),\"\")","v":""},{"$f":"IFERROR(IF(C91=\"\",\"\",IF(H91=\"\",\"\",IF(I91=\"\",\"\",IF($C91=\"TOTAL\",SUM($Q$8:Q90),IF(AND(C91>$AL$1,$AC$3=$AL$2),BO92,IF($AO$18=$AO$20,$AO$21,ROUND((H91+I91)*10%,0))))))),\"\")","v":""},"",{"$f":"IFERROR(IF(C91=\"\",\"\",IF($AO$16=$AO$17,0,IF($C91=\"TOTAL\",SUM($S$8:S90),IF($AO$19=$AO$20,$AO$25,0)))),\"\")","v":""},{"$f":"IFERROR(IF(C91=\"\",\"\",IF($AO$16=$AO$17,0,IF($C91=\"TOTAL\",SUM($T$8:T90),IF($AO$19=$AO$20,$AO$24,0)))),\"\")","v":""},"",{"$f":"IF(C91=\"\",\"\",IF($C91=\"TOTAL\",SUM($V$8:V90),IF(AND($AO$2=$AO$20,C91=$AO$1),ROUND(D91/31*$AP$2,0),IF(C91=$AM$6,ROUND((G91)*1/30,0),IF(C91=$AN$6,ROUND((G91)*1/31,0),\"\")))))","v":""},{"$f":"IF(C91=\"\",\"\",IF($C91=\"TOTAL\",SUM($W$8:W90),IF(AND($AO$2=$AO$20,C91=$AO$1),ROUND(H91/31*$AP$2,0),IF(C91=$AM$6,ROUND((K91)*1/30,0),IF(C91=$AN$6,ROUND((K91)*1/31,0),\"\")))))","v":""},"",{"$f":"IFERROR(IF(C91=\"\",\"\",IF(AND(BH92=\"\",BO92=\"\"),\"\",IF($C91=\"TOTAL\",SUM($Y$8:Y90),BH92))),\"\")","v":""},{"$f":"IFERROR(IF(C91=\"\",\"\",IF($C91=\"TOTAL\",SUM($Z$8:Z90),ROUND(O91*$AO$7%,0))),\"\")","v":""},{"$f":"IFERROR(IF(C91=\"\",\"\",IF($C91=\"TOTAL\",SUM($AA$8:AA90),IF($AC$3=$AL$2,SUM(U91,X91,Y91,Z91),SUM(R91,U91,X91,Y91,Z91)))),\"\")","v":""},{"$f":"IFERROR(IF(C91=\"\",\"\",IF($C91=\"TOTAL\",SUM($AB$8:AB90),SUM(O91-AA91))),\"\")","v":""},{"$nulls":8},34,34,null,"2023-11-01",null,"2027-08-01",null,"","","","","","",null,"","","","",null,null,"","","","",0,0,{"$nulls":4},2100]
[null,"","",{"$f":"IFERROR(IF($C91=\"TOTAL\",\"अक्षरें राशि :-\",IF($C92=\"TOTAL\",SUM($D$8:D91),IF(AU93=\"\",\"\",AU93))),\"\")","v":""},{"$f":"IFERROR(IF($C92=\"TOTAL\",SUM($E$8:E91),IF(AV93=\"\",\"\",AV93)),\"\")","v":""},{"$f":"IFERROR(IF($C92=\"TOTAL\",SUM($F$8:F91),IF(AW93=\"\",\"\",AW93)),\"\")","v":""},"",{"$f":"IFERROR(IF($C92=\"TOTAL\",SUM($H$8:H91),IF(AY93=\"\",\"\",AY93)),\"\")","v":""},{"$f":"IFERROR(IF($C92=\"TOTAL\",SUM($I$8:I91),IF(AZ93=\"\",\"\",AZ93)),\"\")","v":""},{"$f":"IFERROR(IF($C92=\"TOTAL\",SUM($J$8:J91),IF(BA93=\"\",\"\",BA93)),\"\")","v":""},"",{"$f":"IFERROR(IF(C92=\"\",\"\",IF(D92=\"\",\"\",IF(H92=\"\",\"\",IF($C92=\"TOTAL\",SUM($L$8:L91),SUM(D92-H92))))),\"\")","v":""},{"$f":"IFERROR(IF(C92=\"\",\"\",IF(E92=\"\",\"\",IF(I92=\"\",\"\",IF($C92=\"TOTAL\",SUM($M$8:M91),SUM(E92-I92))))),\"\")","v":""},{"$f":"IFERROR(IF(C92=\"\",\"\",IF(F92=\"\",\"\",IF(J92=\"\",\"\",IF($C92=\"TOTAL\",SUM($N$8:N91),SUM(F92-J92))))),\"\")","v":""},"",{"$f":"IFERROR(IF(C92=\"\",\"\",IF($C92=\"TOTAL\",SUM($P$8:P91),IF(AND(C92>$AL$1,$AC$3=$AL$2),BO93,IF($AO$18=$AO$20,SUM(BB93+BJ93),ROUND((D92+E92)*10%,0))))),\"\")","v":""},{"$f":"IFERROR(IF(C92=\"\",\"\",IF(H92=\"\",\"\",IF(I92=\"\",\"\",IF($C92=\"TOTAL\",SUM($Q$8:Q91),IF(AND(C92>$AL$1,$AC$3=$AL$2),BO93,IF($AO$18=$AO$20,$AO$21,ROUND((H92+I92)*10%,0))))))),\"\")","v":""},"",{"$f":"IFERROR(IF(C92=\"\",\"\",IF($AO$16=$AO$17,0,IF($C92=\"TOTAL\",SUM($S$8:S91),IF($AO$19=$AO$20,$AO$25,0)))),\"\")","v":""},{"$f":"IFERROR(IF(C92=\"\",\"\",IF($AO$16=$AO$17,0,IF($C92=\"TOTAL\",SUM($T$8:T91),IF($AO$19=$AO$20,$AO$24,0)))),\"\")","v":""},"",{"$f":"IF(C92=\"\",\"\",IF($C92=\"TOTAL\",SUM($V$8:V91),IF(AND($AO$2=$AO$20,C92=$AO$1),ROUND(D92/31*$AP$2,0),IF(C92=$AM$6,ROUND((G92)*1/30,0),IF(C92=$AN$6,ROUND((G92)*1/31,0),\"\")))))","v":""},{"$f":"IF(C92=\"\",\"\",IF($C92=\"TOTAL\",SUM($W$8:W91),IF(AND($AO$2=$AO$20,C92=$AO$1),ROUND(H92/31*$AP$2,0),IF(C92=$AM$6,ROUND((K92)*1/30,0),IF(C92=$AN$6,ROUND((K92)*1/31,0),\"\")))))","v":""},"",{"$f":"IFERROR(IF(C92=\"\",\"\",IF(AND(BH93=\"\",BO93=\"\"),\"\",IF($C92=\"TOTAL\",SUM($Y$8:Y91),BH93))),\"\")","v":""},{"$f":"IFERROR(IF(C92=\"\",\"\",IF($C92=\"TOTAL\",SUM($Z$8:Z91),ROUND(O92*$AO$7%,0))),\"\")","v":""},{"$f":"IFERROR(IF(C92=\"\",\"\",IF($C92=\"TOTAL\",SUM($AA$8:AA91),IF($AC$3=$AL$2,SUM(U92,X92,Y92,Z92),SUM(R92,U92,X92,Y92,Z92)))),\"\")","v":""},{"$f":"IFERROR(IF(C92=\"\",\"\",IF($C92=\"TOTAL\",SUM($AB$8:AB91),SUM(O92-AA92))),\"\")","v":""},{"$nulls":8},34,34,null,"2023-12-01",null,"2027-09-01",null,"","","","","","",null,"","","","",null,null,"","","","",0,0,{"$nulls":4},2100]
[null,"","",{"$f":"IFERROR(IF($C92=\"TOTAL\",\"अक्षरें राशि :-\",IF($C93=\"TOTAL\",SUM($D$8:D92),IF(AU94=\"\",\"\",AU94))),\"\")","v":""},{"$f":"IFERROR(IF($C93=\"TOTAL\",SUM($E$8:E92),IF(AV94=\"\",\"\",AV94)),\"\")","v":""},{"$f":"IFERROR(IF($C93=\"TOTAL\",SUM($F$8:F92),IF(AW94=\"\",\"\",AW94)),\"\")","v":""},"",{"$f":"IFERROR(IF($C93=\"TOTAL\",SUM($H$8:H92),IF(AY94=\"\",\"\",AY94)),\"\")","v":""},{"$f":"IFERROR(IF($C93=\"TOTAL\",SUM($I$8:I92),IF(AZ94=\"\",\"\",AZ94)),\"\")","v":""},{"$f":"IFERROR(IF($C93=\"TOTAL\",SUM($J$8:J92),IF(BA94=\"\",\"\",BA94)),\"\")","v":""},"",{"$f":"IFERROR(IF(C93=\"\",\"\",IF(D93=\"\",\"\",IF(H93=\"\",\"\",IF($C93=\"TOTAL\",SUM($L$8:L92),SUM(D93-H93))))),\"\")","v":""},{"$f":"IFERROR(IF(C93=\"\",\"\",IF(E93=\"\",\"\",IF(I93=\"\",\"\",IF($C93=\"TOTAL\",SUM($M$8:M92),SUM(E93-I93))))),\"\")","v":""},{"$f":"IFERROR(IF(C93=\"\",\"\",IF(F93=\"\",\"\",IF(J93=\"\",\"\",IF($C93=\"TOTAL\",SUM($N$8:N92),SUM(F93-J93))))),\"\")","v":""},"",{"$f":"IFERROR(IF(C93=\"\",\"\",IF($C93=\"TOTAL\",SUM($P$8:P92),IF(AND(C93>$AL$1,$AC$3=$AL$2),BO94,IF($AO$18=$AO$20,SUM(BB94+BJ94),ROUND((D93+E93)*10%,0))))),\"\")","v":""},{"$f":"IFERROR(IF(C93=\"\",\"\",IF(H93=\"\",\"\",IF(I93=\"\",\"\",IF($C93=\"TOTAL\",SUM($Q$8:Q92),IF(AND(C93>$AL$1,$AC$3=$AL$2),BO94,IF($AO$18=$AO$20,$AO$21,ROUND((H93+I93)*10%,0))))))),\"\")","v":""},"",{"$f":"IFERROR(IF(C93=\"\",\"\",IF($AO$16=$AO$17,0,IF($C93=\"TOTAL\",SUM($S$8:S92),IF($AO$19=$AO$20,$AO$25,0)))),\"\")","v":""},{"$f":"IFERROR(IF(C93=\"\",\"\",IF($AO$16=$AO$17,0,IF($C93=\"TOTAL\",SUM($T$8:T92),IF($AO$19=$AO$20,$AO$24,0)))),\"\")","v":""},"",{"$f":"IF(C93=\"\",\"\",IF($C93=\"TOTAL\",SUM($V$8:V92),IF(AND($AO$2=$AO$20,C93=$AO$1),ROUND(D93/31*$AP$2,0),IF(C93=$AM$6,ROUND((G93)*1/30,0),IF(C93=$AN$6,ROUND((G93)*1/31,0),\"\")))))","v":""},{"$f":"IF(C93=\"\",\"\",IF($C93=\"TOTAL\",SUM($W$8:W92),IF(AND($AO$2=$AO$20,C93=$AO$1),ROUND(H93/31*$AP$2,0),IF(C93=$AM$6,ROUND((K93)*1/30,0),IF(C93=$AN$6,ROUND((K93)*1/31,0),\"\")))))","v":""},"",{"$f":"IFERROR(IF(C93=\"\",\"\",IF(AND(BH94=\"\",BO94=\"\"),\"\",IF($C93=\"TOTAL\",SUM($Y$8:Y92),BH94))),\"\")","v":""},{"$f":"IFERROR(IF(C93=\"\",\"\",IF($C93=\"TOTAL\",SUM($Z$8:Z92),ROUND(O93*$AO$7%,0))),\"\")","v":""},{"$f":"IFERROR(IF(C93=\"\",\"\",IF($C93=\"TOTAL\",SUM($AA$8:AA92),IF($AC$3=$AL$2,SUM(U93,X93,Y93,Z93),SUM(R93,U93,X93,Y93,Z93)))),\"\")","v":""},{"$f":"IFERROR(IF(C93=\"\",\"\",IF($C93=\"TOTAL\",SUM($AB$8:AB92),SUM(O93-AA93))),\"\")","v":""},{"$nulls":23},"","","",{"$nulls":4},"","",0,0,{"$nulls":4},""]
[null,"","",{"$f":"IFERROR(IF($C93=\"TOTAL\",\"अक्षरें राशि :-\",IF($C94=\"TOTAL\",SUM($D$8:D93),IF(AU95=\"\",\"\",AU95))),\"\")","v":""},{"$f":"IFERROR(IF($C94=\"TOTAL\",SUM($E$8:E93),IF(AV95=\"\",\"\",AV95)),\"\")","v":""},{"$f":"IFERROR(IF($C94=\"TOTAL\",SUM($F$8:F93),IF(AW95=\"\",\"\",AW95)),\"\")","v":""},"",{"$f":"IFERROR(IF($C94=\"TOTAL\",SUM($H$8:H93),IF(AY95=\"\",\"\",AY95)),\"\")","v":""},{"$f":"IFERROR(IF($C94=\"TOTAL\",SUM($I$8:I93),IF(AZ95=\"\",\"\",AZ95)),\"\")","v":""},{"$f":"IFERROR(IF($C94=\"TOTAL\",SUM($J$8:J93),IF(BA95=\"\",\"\",BA95)),\"\")","v":""},"",{"$f":"IFERROR(IF(C94=\"\",\"\",IF(D94=\"\",\"\",IF(H94=\"\",\"\",IF($C94=\"TOTAL\",SUM($L$8:L93),SUM(D94-H94))))),\"\")","v":""},{"$f":"IFERROR(IF(C94=\"\",\"\",IF(E94=\"\",\"\",IF(I94=\"\",\"\",IF($C94=\"TOTAL\",SUM($M$8:M93),SUM(E94-I94))))),\"\")","v":""},{"$f":"IFERROR(IF(C94=\"\",\"\",IF(F94=\"\",\"\",IF(J94=\"\",\"\",IF($C94=\"TOTAL\",SUM($N$8:N93),SUM(F94-J94))))),\"\")","v":""},"",{"$f":"IFERROR(IF(C94=\"\",\"\",IF(AND(C94>$AL$1,$AC$3=$AL$2),\"\",IF($AO$18=$AO$20,SUM(BB95,BJ95),ROUND((D94+E94)*10%,0)))),\"\")","v":""},{"$f":"IFERROR(IF(C94=\"\",\"\",IF(H94=\"\",\"\",IF(I94=\"\",\"\",IF(AND(C94>$AL$1,$AC$3=$AL$2),\"\",IF($C94=\"TOTAL\",SUM($Q$8:Q93),IF($AO$18=$AO$20,$AO$21,ROUND((H94+I94)*10%,0))))))),\"\")","v":""},"",{"$f":"IFERROR(IF(C94=\"\",\"\",IF($AO$16=$AO$17,0,IF($C94=\"TOTAL\",SUM($S$8:S93),IF($AO$19=$AO$20,$AO$25,0)))),\"\")","v":""},{"$f":"IFERROR(IF(C94=\"\",\"\",IF($AO$16=$AO$17,0,IF($C94=\"TOTAL\",SUM($T$8:T93),IF($AO$19=$AO$20,$AO$24,0)))),\"\")","v":""},"",{"$f":"IF(C94=\"\",\"\",IF($C94=\"TOTAL\",SUM($V$8:V93),IF(AND($AO$2=$AO$20,C94=$AO$1),ROUND(D94/31*$AP$2,0),IF(C94=$AM$6,ROUND((G94)*1/30,0),IF(C94=$AN$6,ROUND((G94)*1/31,0),\"\")))))","v":""},{"$f":"IF(C94=\"\",\"\",IF($C94=\"TOTAL\",SUM($W$8:W93),IF(AND($AO$2=$AO$20,C94=$AO$1),ROUND(H94/31*$AP$2,0),IF(C94=$AM$6,ROUND((K94)*1/30,0),IF(C94=$AN$6,ROUND((K94)*1/31,0),\"\")))))","v":""},"",{"$f":"IFERROR(IF(C94=\"\",\"\",IF(AND(BH95=\"\",BO95=\"\"),\"\",IF($C94=\"TOTAL\",SUM($Y$8:Y93),BH95))),\"\")","v":""},{"$f":"IFERROR(IF(C94=\"\",\"\",IF($C94=\"TOTAL\",SUM($Z$8:Z93),ROUND(O94*$AO$7%,0))),\"\")","v":""},{"$f":"IFERROR(IF(C94=\"\",\"\",IF($C94=\"TOTAL\",SUM($AA$8:AA93),IF($AC$3=$AL$2,SUM(U94,X94,Y94,Z94),SUM(R94,U94,X94,Y94,Z94)))),\"\")","v":""},{"$f":"IFERROR(IF(C94=\"\",\"\",IF($C94=\"TOTAL\",SUM($AB$8:AB93),SUM(O94-AA94))),\"\")","v":""},{"$nulls":31},""]
[null,"","",{"$f":"IFERROR(IF($C94=\"TOTAL\",\"अक्षरें राशि :-\",IF($C95=\"TOTAL\",SUM($D$8:D94),IF(AU96=\"\",\"\",AU96))),\"\")","v":""},{"$f":"IFERROR(IF($C95=\"TOTAL\",SUM($E$8:E94),IF(AV96=\"\",\"\",AV96)),\"\")","v":""},{"$f":"IFERROR(IF($C95=\"TOTAL\",SUM($F$8:F94),IF(AW96=\"\",\"\",AW96)),\"\")","v":""},"",{"$f":"IFERROR(IF($C95=\"TOTAL\",SUM($H$8:H94),IF(AY96=\"\",\"\",AY96)),\"\")","v":""},{"$f":"IFERROR(IF($C95=\"TOTAL\",SUM($I$8:I94),IF(AZ96=\"\",\"\",AZ96)),\"\")","v":""},{"$f":"IFERROR(IF($C95=\"TOTAL\",SUM($J$8:J94),IF(BA96=\"\",\"\",BA96)),\"\")","v":""},"",{"$f":"IFERROR(IF(C95=\"\",\"\",IF(D95=\"\",\"\",IF(H95=\"\",\"\",IF($C95=\"TOTAL\",SUM($L$8:L94),SUM(D95-H95))))),\"\")","v":""},{"$f":"IFERROR(IF(C95=\"\",\"\",IF(E95=\"\",\"\",IF(I95=\"\",\"\",IF($C95=\"TOTAL\",SUM($M$8:M94),SUM(E95-I95))))),\"\")","v":""},{"$f":"IFERROR(IF(C95=\"\",\"\",IF(F95=\"\",\"\",IF(J95=\"\",\"\",IF($C95=\"TOTAL\",SUM($N$8:N94),SUM(F95-J95))))),\"\")","v":""},"","",{"$f":"IFERROR(IF(C95=\"\",\"\",IF(H95=\"\",\"\",IF(I95=\"\",\"\",IF(AND(C95>$AL$1,$AC$3=$AL$2),\"\",IF($C95=\"TOTAL\",SUM($Q$8:Q94),IF($AO$18=$AO$20,$AO$21,ROUND((H95+I95)*10%,0))))))),\"\")","v":""},"",{"$f":"IFERROR(IF(C95=\"\",\"\",IF($AO$16=$AO$17,0,IF($C95=\"TOTAL\",SUM($S$8:S94),IF($AO$19=$AO$20,$AO$25,0)))),\"\")","v":""},{"$f":"IFERROR(IF(C95=\"\",\"\",IF($AO$16=$AO$17,0,IF($C95=\"TOTAL\",SUM($T$8:T94),IF($AO$19=$AO$20,$AO$24,0)))),\"\")","v":""},"",{"$f":"IF(C95=\"\",\"\",IF($C95=\"TOTAL\",SUM($V$8:V94),IF(AND($AO$2=$AO$20,C95=$AO$1),ROUND(D95/31*$AP$2,0),IF(C95=$AM$6,ROUND((G95)*1/30,0),IF(C95=$AN$6,ROUND((G95)*1/31,0),\"\")))))","v":""},{"$f":"IF(C95=\"\",\"\",IF($C95=\"TOTAL\",SUM($W$8:W94),IF(AND($AO$2=$AO$20,C95=$AO$1),ROUND(H95/31*$AP$2,0),IF(C95=$AM$6,ROUND((K95)*1/30,0),IF(C95=$AN$6,ROUND((K95)*1/31,0),\"\")))))","v":""},"",{"$f":"IFERROR(IF(C95=\"\",\"\",IF(AND(BH96=\"\",BO96=\"\"),\"\",IF($C95=\"TOTAL\",SUM($Y$8:Y94),BH96))),\"\")","v":""},{"$f":"IFERROR(IF(C95=\"\",\"\",IF($C95=\"TOTAL\",SUM($Z$8:Z94),ROUND(O95*$AO$7%,0))),\"\")","v":""},{"$f":"IFERROR(IF(C95=\"\",\"\",IF($C95=\"TOTAL\",SUM($AA$8:AA94),IF($AC$3=$AL$2,SUM(U95,X95,Y95,Z95),SUM(R95,U95,X95,Y95,Z95)))),\"\")","v":""},{"$f":"IFERROR(IF(C95=\"\",\"\",IF($C95=\"TOTAL\",SUM($AB$8:AB94),SUM(O95-AA95))),\"\")","v":""}]

{"sheet":"Unlock sheet","index":3,"n_rows":89,"n_cols":29,"rows_kept":89,"merged":[[0,1,0,28],[1,1,1,28],[2,1,2,3],[2,4,2,10],[2,11,2,12],[2,13,2,17],[2,18,2,20],[2,21,2,22],[2,24,2,26],[2,27,2,28],[3,1,3,3],[3,6,3,11],[3,12,3,14],[3,16,3,18],[3,19,3,21],[3,22,3,28],[5,0,6,0],[5,1,6,1],[5,2,5,5],[5,6,5,9],[5,10,5,13],[5,14,5,16],[5,17,5,19],[5,20,5,22],[5,23,6,23],[5,24,6,24],[5,25,6,25],[5,26,6,26],[5,27,6,27],[5,28,6,28],[79,0,79,1],[79,30,88,34],[79,35,88,35],[80,6,80,7],[80,8,80,27],[81,20,81,27],[82,2,82,6],[82,9,82,10],[82,20,82,27],[83,1,83,7],[84,1,84,6],[84,20,84,27],[85,1,85,4],[85,5,85,14],[85,20,85,27],[86,1,86,2],[86,20,87,27],[88,1,88,2]]}
[null,{"$f":"IF('Master Sheet'!D3=\"\",\"\",CONCATENATE(\"Office \",'Master Sheet'!D3))","v":"Office Mahatma Gandhi Government School (English Medium) Bar, PALI"}]
[null,"Difference Arrear Sheet"]
[null,"Name Of Employee :",null,null,{"$f":"IFERROR(UPPER('Master Sheet'!D7),\"\")","v":"HEERALAL JAT"},{"$nulls":6},"    Post :  ",null,{"$f":"IFERROR(UPPER('Master Sheet'!G7),\"\")","v":"SR. TEACHER"},{"$nulls":4},"    Pay Matrix Level : ",null,null,{"$f":"IFERROR(CONCATENATE(\"L - \",'Master Sheet'!K7),\"\")","v":"L - 10"},null,null,"GPF / NPS :-",null,null,{"$f":"IF('Arrear Sheet'!AO18='Arrear Sheet'!AO20,\"GPF\",\"NPS\")","v":"NPS"}]
[{"$nulls":6},"Arrear From Date :",{"$nulls":5},{"$f":"IFERROR('Master Sheet'!D9,\"\")","v":"2020-10-01"},null,null,"to",{"$f":"IFERROR('Master Sheet'!G9,\"\")","v":"2022-06-01"},null,null,"Posting Place :",null,null,{"$f":"IFERROR(IF('Arrear Sheet'!X4=\"\",\"\",'Arrear Sheet'!X4),\"\")","v":"Mahatma Gandhi Government School (English Medium) Bar, PALI"}]
[]
["Sr. No.","Month","Pay Due",{"$nulls":3},"Pay Drawn",{"$nulls":3},"Pay Difference",{"$nulls":3},{"$f":"'Arrear Sheet'!P6","v":"NPS/GPF-2004"},null,null,"SI",null,null,"Corona relief fund",null,null,"Arrear inGPF-2004","Income Tax","Total Deduction","Net Payment","Bill No./Date","Encashment Date"]
[null,null,"Pay","DA","HRA","Total","Pay","DA","HRA","Total","Pay","DA","HRA","Total","Due","Ded","Diff.","Due","Ded","Diff.","Due","Ded","Diff."]
[{"$f":"IF('Arrear Sheet'!B8=\"\",\"\",'Arrear Sheet'!B8)","v":1},{"$f":"IF('Arrear Sheet'!C8=\"\",\"\",IF('Arrear Sheet'!C8=\"TOTAL\",\"\",'Arrear Sheet'!C8))","v":"2020-10-01"},{"$f":"IF('Arrear Sheet'!D8=\"\",\"\",IF('Arrear Sheet'!C8=\"TOTAL\",\"\",IF('Arrear Sheet'!D8=\"अक्षरें राशि :-\",\"\",'Arrear Sheet'!D8)))","v":29439},{"$f":"IF('Arrear Sheet'!E8=\"\",\"\",IF('Arrear Sheet'!C8=\"TOTAL\",\"\",'Arrear Sheet'!E8))","v":5005},{"$f":"IF('Arrear Sheet'!F8=\"\",\"\",IF('Arrear Sheet'!C8=\"TOTAL\",\"\",'Arrear Sheet'!F8))","v":2355},{"$f":"IF('Arrear Sheet'!G8=\"\",\"\",IF('Arrear Sheet'!C8=\"TOTAL\",\"\",SUM(C8:E8)))","v":36799},{"$f":"IF('Arrear Sheet'!H8=\"\",\"\",IF('Arrear Sheet'!C8=\"TOTAL\",\"\",'Arrear Sheet'!H8))","v":20642},{"$f":"IF('Arrear Sheet'!I8=\"\",\"\",IF('Arrear Sheet'!C8=\"TOTAL\",\"\",'Arrear Sheet'!I8))","v":0},{"$f":"IF('Arrear Sheet'!J8=\"\",\"\",IF('Arrear Sheet'!C8=\"TOTAL\",\"\",'Arrear Sheet'!J8))","v":0},{"$f":"IF('Arrear Sheet'!K8=\"\",\"\",IF('Arrear Sheet'!C8=\"TOTAL\",\"\",SUM(G8:I8)))","v":20642},{"$f":"IF('Arrear Sheet'!L8=\"\",\"\",IF('Arrear Sheet'!C8=\"TOTAL\",\"\",'Arrear Sheet'!L8))","v":8797},{"$f":"IF('Arrear Sheet'!M8=\"\",\"\",IF('Arrear Sheet'!C8=\"TOTAL\",\"\",'Arrear Sheet'!M8))","v":5005},{"$f":"IF('Arrear Sheet'!N8=\"\",\"\",IF('Arrear Sheet'!C8=\"TOTAL\",\"\",'Arrear Sheet'!N8))","v":2355},{"$f":"IF('Arrear Sheet'!O8=\"\",\"\",IF('Arrear Sheet'!C8=\"TOTAL\",\"\",SUM(K8:M8)))","v":16157},{"$f":"IF('Arrear Sheet'!P8=\"\",\"\",IF('Arrear Sheet'!C8=\"TOTAL\",\"\",'Arrear Sheet'!P8))","v":3444},{"$f":"IF('Arrear Sheet'!Q8=\"\",\"\",IF('Arrear Sheet'!C8=\"TOTAL\",\"\",'Arrear Sheet'!Q8))","v":2064},{"$f":"IF('Arrear Sheet'!R8=\"\",\"\",IF('Arrear Sheet'!C8=\"TOTAL\",\"\",'Arrear Sheet'!R8))","v":1380},{"$f":"IF('Arrear Sheet'!S8=\"\",\"\",IF('Arrear Sheet'!C8=\"TOTAL\",\"\",'Arrear Sheet'!S8))","v":0},{"$f":"IF('Arrear Sheet'!T8=\"\",\"\",IF('Arrear Sheet'!C8=\"TOTAL\",\"\",'Arrear Sheet'!T8))","v":0},{"$f":"IF('Arrear Sheet'!U8=\"\",\"\",IF('Arrear Sheet'!C8=\"TOTAL\",\"\",'Arrear Sheet'!U8))","v":0},{"$f":"IF('Arrear Sheet'!V8=\"\",\"\",IF('Arrear Sheet'!C8=\"TOTAL\",\"\",'Arrear Sheet'!V8))","v":1187},{"$f":"IF('Arrear Sheet'!W8=\"\",\"\",IF('Arrear Sheet'!C8=\"TOTAL\",\"\",'Arrear Sheet'!W8))","v":666},{"$f":"IF('Arrear Sheet'!X8=\"\",\"\",IF('Arrear Sheet'!C8=\"TOTAL\",\"\",'Arrear Sheet'!X8))","v":521},{"$f":"IF('Arrear Sheet'!Y8=\"\",\"\",IF('Arrear Sheet'!C8=\"TOTAL\",\"\",'Arrear Sheet'!Y8))","v":""},{"$f":"IF('Arrear Sheet'!Z8=\"\",\"\",IF('Arrear Sheet'!C8=\"TOTAL\",\"\",'Arrear Sheet'!Z8))","v":0},{"$f":"IF('Arrear Sheet'!AA8=\"\",\"\",'Arrear Sheet'!AA8)","v":521},{"$f":"IF('Arrear Sheet'!AB8=\"\",\"\",IF('Arrear Sheet'!C8=\"TOTAL\",\"\",SUM(N8-Z8)))","v":15636}]
[{"$f":"IF('Arrear Sheet'!B9=\"\",\"\",'Arrear Sheet'!B9)","v":2},{"$f":"IF('Arrear Sheet'!C9=\"\",\"\",IF('Arrear Sheet'!C9=\"TOTAL\",\"\",'Arrear Sheet'!C9))","v":"2020-11-01"},{"$f":"IF('Arrear Sheet'!D9=\"\",\"\",IF('Arrear Sheet'!C9=\"TOTAL\",\"\",IF('Arrear Sheet'!D9=\"अक्षरें राशि :-\",\"\",'Arrear Sheet'!D9)))","v":33800},{"$f":"IF('Arrear Sheet'!E9=\"\",\"\",IF('Arrear Sheet'!C9=\"TOTAL\",\"\",'Arrear Sheet'!E9))","v":5746},{"$f":"IF('Arrear Sheet'!F9=\"\",\"\",IF('Arrear Sheet'!C9=\"TOTAL\",\"\",'Arrear Sheet'!F9))","v":2704},{"$f":"IF('Arrear Sheet'!G9=\"\",\"\",IF('Arrear Sheet'!C9=\"TOTAL\",\"\",SUM(C9:E9)))","v":42250},{"$f":"IF('Arrear Sheet'!H9=\"\",\"\",IF('Arrear Sheet'!C9=\"TOTAL\",\"\",'Arrear Sheet'!H9))","v":23700},{"$f":"IF('Arrear Sheet'!I9=\"\",\"\",IF('Arrear Sheet'!C9=\"TOTAL\",\"\",'Arrear Sheet'!I9))","v":0},{"$f":"IF('Arrear Sheet'!J9=\"\",\"\",IF('Arrear Sheet'!C9=\"TOTAL\",\"\",'Arrear Sheet'!J9))","v":0},{"$f":"IF('Arrear Sheet'!K9=\"\",\"\",IF('Arrear Sheet'!C9=\"TOTAL\",\"\",SUM(G9:I9)))","v":23700},{"$f":"IF('Arrear Sheet'!L9=\"\",\"\",IF('Arrear Sheet'!C9=\"TOTAL\",\"\",'Arrear Sheet'!L9))","v":10100},{"$f":"IF('Arrear Sheet'!M9=\"\",\"\",IF('Arrear Sheet'!C9=\"TOTAL\",\"\",'Arrear Sheet'!M9))","v":5746},{"$f":"IF('Arrear Sheet'!N9=\"\",\"\",IF('Arrear Sheet'!C9=\"TOTAL\",\"\",'Arrear Sheet'!N9))","v":2704},{"$f":"IF('Arrear Sheet'!O9=\"\",\"\",IF('Arrear Sheet'!C9=\"TOTAL\",\"\",SUM(K9:M9)))","v":18550},{"$f":"IF('Arrear Sheet'!P9=\"\",\"\",IF('Arrear Sheet'!C9=\"TOTAL\",\"\",'Arrear Sheet'!P9))","v":3955},{"$f":"IF('Arrear Sheet'!Q9=\"\",\"\",IF('Arrear Sheet'!C9=\"TOTAL\",\"\",'Arrear Sheet'!Q9))","v":2370},{"$f":"IF('Arrear Sheet'!R9=\"\",\"\",IF('Arrear Sheet'!C9=\"TOTAL\",\"\",'Arrear Sheet'!R9))","v":1585},{"$f":"IF('Arrear Sheet'!S9=\"\",\"\",IF('Arrear Sheet'!C9=\"TOTAL\",\"\",'Arrear Sheet'!S9))","v":0},{"$f":"IF('Arrear Sheet'!T9=\"\",\"\",IF('Arrear Sheet'!C9=\"TOTAL\",\"\",'Arrear Sheet'!T9))","v":0},{"$f":"IF('Arrear Sheet'!U9=\"\",\"\",IF('Arrear Sheet'!C9=\"TOTAL\",\"\",'Arrear Sheet'!U9))","v":0},{"$f":"IF('Arrear Sheet'!V9=\"\",\"\",IF('Arrear Sheet'!C9=\"TOTAL\",\"\",'Arrear Sheet'!V9))","v":""},{"$f":"IF('Arrear Sheet'!W9=\"\",\"\",IF('Arrear Sheet'!C9=\"TOTAL\",\"\",'Arrear Sheet'!W9))","v":""},{"$f":"IF('Arrear Sheet'!X9=\"\",\"\",IF('Arrear Sheet'!C9=\"TOTAL\",\"\",'Arrear Sheet'!X9))","v":""},{"$f":"IF('Arrear Sheet'!Y9=\"\",\"\",IF('Arrear Sheet'!C9=\"TOTAL\",\"\",'Arrear Sheet'!Y9))","v":""},{"$f":"IF('Arrear Sheet'!Z9=\"\",\"\",IF('Arrear Sheet'!C9=\"TOTAL\",\"\",'Arrear Sheet'!Z9))","v":0},{"$f":"IF('Arrear Sheet'!AA9=\"\",\"\",IF('Arrear Sheet'!C9=\"TOTAL\",\"\",'Arrear Sheet'!AA9))","v":0},{"$f":"IF('Arrear Sheet'!AB9=\"\",\"\",IF('Arrear Sheet'!C9=\"TOTAL\",\"\",SUM(N9-Z9)))","v":18550}]
[{"$f":"IF('Arrear Sheet'!B10=\"\",\"\",'Arrear Sheet'!B10)","v":3},{"$f":"IF('Arrear Sheet'!C10=\"\",\"\",IF('Arrear Sheet'!C10=\"TOTAL\",\"\",'Arrear Sheet'!C10))","v":"2020-12-01"},{"$f":"IF('Arrear Sheet'!D10=\"\",\"\",IF('Arrear Sheet'!C10=\"TOTAL\",\"\",IF('Arrear Sheet'!D10=\"अक्षरें राशि :-\",\"\",'Arrear Sheet'!D10)))","v":33800},{"$f":"IF('Arrear Sheet'!E10=\"\",\"\",IF('Arrear Sheet'!C10=\"TOTAL\",\"\",'Arrear Sheet'!E10))","v":5746},{"$f":"IF('Arrear Sheet'!F10=\"\",\"\",IF('Arrear Sheet'!C10=\"TOTAL\",\"\",'Arrear Sheet'!F10))","v":2704},{"$f":"IF('Arrear Sheet'!G10=\"\",\"\",IF('Arrear Sheet'!C10=\"TOTAL\",\"\",SUM(C10:E10)))","v":42250},{"$f":"IF('Arrear Sheet'!H10=\"\",\"\",IF('Arrear Sheet'!C10=\"TOTAL\",\"\",'Arrear Sheet'!H10))","v":23700},{"$f":"IF('Arrear Sheet'!I10=\"\",\"\",IF('Arrear Sheet'!C10=\"TOTAL\",\"\",'Arrear Sheet'!I10))","v":0},{"$f":"IF('Arrear Sheet'!J10=\"\",\"\",IF('Arrear Sheet'!C10=\"TOTAL\",\"\",'Arrear Sheet'!J10))","v":0},{"$f":"IF('Arrear Sheet'!K10=\"\",\"\",IF('Arrear Sheet'!C10=\"TOTAL\",\"\",SUM(G10:I10)))","v":23700},{"$f":"IF('Arrear Sheet'!L10=\"\",\"\",IF('Arrear Sheet'!C10=\"TOTAL\",\"\",'Arrear Sheet'!L10))","v":10100},{"$f":"IF('Arrear Sheet'!M10=\"\",\"\",IF('Arrear Sheet'!C10=\"TOTAL\",\"\",'Arrear Sheet'!M10))","v":5746},{"$f":"IF('Arrear Sheet'!N10=\"\",\"\",IF('Arrear Sheet'!C10=\"TOTAL\",\"\",'Arrear Sheet'!N10))","v":2704},{"$f":"IF('Arrear Sheet'!O10=\"\",\"\",IF('Arrear Sheet'!C10=\"TOTAL\",\"\",SUM(K10:M10)))","v":18550},{"$f":"IF('Arrear Sheet'!P10=\"\",\"\",IF('Arrear Sheet'!C10=\"TOTAL\",\"\",'Arrear Sheet'!P10))","v":3955},{"$f":"IF('Arrear Sheet'!Q10=\"\",\"\",IF('Arrear Sheet'!C10=\"TOTAL\",\"\",'Arrear Sheet'!Q10))","v":2370},{"$f":"IF('Arrear Sheet'!R10=\"\",\"\",IF('Arrear Sheet'!C10=\"TOTAL\",\"\",'Arrear Sheet'!R10))","v":1585},{"$f":"IF('Arrear Sheet'!S10=\"\",\"\",IF('Arrear Sheet'!C10=\"TOTAL\",\"\",'Arrear Sheet'!S10))","v":0},{"$f":"IF('Arrear Sheet'!T10=\"\",\"\",IF('Arrear Sheet'!C10=\"TOTAL\",\"\",'Arrear Sheet'!T10))","v":0},{"$f":"IF('Arrear Sheet'!U10=\"\",\"\",IF('Arrear Sheet'!C10=\"TOTAL\",\"\",'Arrear Sheet'!U10))","v":0},{"$f":"IF('Arrear Sheet'!V10=\"\",\"\",IF('Arrear Sheet'!C10=\"TOTAL\",\"\",'Arrear Sheet'!V10))","v":""},{"$f":"IF('Arrear Sheet'!W10=\"\",\"\",IF('Arrear Sheet'!C10=\"TOTAL\",\"\",'Arrear Sheet'!W10))","v":""},{"$f":"IF('Arrear Sheet'!X10=\"\",\"\",IF('Arrear Sheet'!C10=\"TOTAL\",\"\",'Arrear Sheet'!X10))","v":""},{"$f":"IF('Arrear Sheet'!Y10=\"\",\"\",IF('Arrear Sheet'!C10=\"TOTAL\",\"\",'Arrear Sheet'!Y10))","v":""},{"$f":"IF('Arrear Sheet'!Z10=\"\",\"\",IF('Arrear Sheet'!C10=\"TOTAL\",\"\",'Arrear Sheet'!Z10))","v":0},{"$f":"IF('Arrear Sheet'!AA10=\"\",\"\",IF('Arrear Sheet'!C10=\"TOTAL\",\"\",'Arrear Sheet'!AA10))","v":0},{"$f":"IF('Arrear Sheet'!AB10=\"\",\"\",IF('Arrear Sheet'!C10=\"TOTAL\",\"\",SUM(N10-Z10)))","v":18550}]
[{"$f":"IF('Arrear Sheet'!B11=\"\",\"\",'Arrear Sheet'!B11)","v":4},{"$f":"IF('Arrear Sheet'!C11=\"\",\"\",IF('Arrear Sheet'!C11=\"TOTAL\",\"\",'Arrear Sheet'!C11))","v":"2021-01-01"},{"$f":"IF('Arrear Sheet'!D11=\"\",\"\",IF('Arrear Sheet'!C11=\"TOTAL\",\"\",IF('Arrear Sheet'!D11=\"अक्षरें राशि :-\",\"\",'Arrear Sheet'!D11)))","v":33800},{"$f":"IF('Arrear Sheet'!E11=\"\",\"\",IF('Arrear Sheet'!C11=\"TOTAL\",\"\",'Arrear Sheet'!E11))","v":5746},{"$f":"IF('Arrear Sheet'!F11=\"\",\"\",IF('Arrear Sheet'!C11=\"TOTAL\",\"\",'Arrear Sheet'!F11))","v":2704},{"$f":"IF('Arrear Sheet'!G11=\"\",\"\",IF('Arrear Sheet'!C11=\"TOTAL\",\"\",SUM(C11:E11)))","v":42250},{"$f":"IF('Arrear Sheet'!H11=\"\",\"\",IF('Arrear Sheet'!C11=\"TOTAL\",\"\",'Arrear Sheet'!H11))","v":23700},{"$f":"IF('Arrear Sheet'!I11=\"\",\"\",IF('Arrear Sheet'!C11=\"TOTAL\",\"\",'Arrear Sheet'!I11))","v":0},{"$f":"IF('Arrear Sheet'!J11=\"\",\"\",IF('Arrear Sheet'!C11=\"TOTAL\",\"\",'Arrear Sheet'!J11))","v":0},{"$f":"IF('Arrear Sheet'!K11=\"\",\"\",IF('Arrear Sheet'!C11=\"TOTAL\",\"\",SUM(G11:I11)))","v":23700},{"$f":"IF('Arrear Sheet'!L11=\"\",\"\",IF('Arrear Sheet'!C11=\"TOTAL\",\"\",'Arrear Sheet'!L11))","v":10100},{"$f":"IF('Arrear Sheet'!M11=\"\",\"\",IF('Arrear Sheet'!C11=\"TOTAL\",\"\",'Arrear Sheet'!M11))","v":5746},{"$f":"IF('Arrear Sheet'!N11=\"\",\"\",IF('Arrear Sheet'!C11=\"TOTAL\",\"\",'Arrear Sheet'!N11))","v":2704},{"$f":"IF('Arrear Sheet'!O11=\"\",\"\",IF('Arrear Sheet'!C11=\"TOTAL\",\"\",SUM(K11:M11)))","v":18550},{"$f":"IF('Arrear Sheet'!P11=\"\",\"\",IF('Arrear Sheet'!C11=\"TOTAL\",\"\",'Arrear Sheet'!P11))","v":3955},{"$f":"IF('Arrear Sheet'!Q11=\"\",\"\",IF('Arrear Sheet'!C11=\"TOTAL\",\"\",'Arrear Sheet'!Q11))","v":2370},{"$f":"IF('Arrear Sheet'!R11=\"\",\"\",IF('Arrear Sheet'!C11=\"TOTAL\",\"\",'Arrear Sheet'!R11))","v":1585},{"$f":"IF('Arrear Sheet'!S11=\"\",\"\",IF('Arrear Sheet'!C11=\"TOTAL\",\"\",'Arrear Sheet'!S11))","v":0},{"$f":"IF('Arrear Sheet'!T11=\"\",\"\",IF('Arrear Sheet'!C11=\"TOTAL\",\"\",'Arrear Sheet'!T11))","v":0},{"$f":"IF('Arrear Sheet'!U11=\"\",\"\",IF('Arrear Sheet'!C11=\"TOTAL\",\"\",'Arrear Sheet'!U11))","v":0},{"$f":"IF('Arrear Sheet'!V11=\"\",\"\",IF('Arrear Sheet'!C11=\"TOTAL\",\"\",'Arrear Sheet'!V11))","v":""},{"$f":"IF('Arrear Sheet'!W11=\"\",\"\",IF('Arrear Sheet'!C11=\"TOTAL\",\"\",'Arrear Sheet'!W11))","v":""},{"$f":"IF('Arrear Sheet'!X11=\"\",\"\",IF('Arrear Sheet'!C11=\"TOTAL\",\"\",'Arrear Sheet'!X11))","v":""},{"$f":"IF('Arrear Sheet'!Y11=\"\",\"\",IF('Arrear Sheet'!C11=\"TOTAL\",\"\",'Arrear Sheet'!Y11))","v":""},{"$f":"IF('Arrear Sheet'!Z11=\"\",\"\",IF('Arrear Sheet'!C11=\"TOTAL\",\"\",'Arrear Sheet'!Z11))","v":0},{"$f":"IF('Arrear Sheet'!AA11=\"\",\"\",IF('Arrear Sheet'!C11=\"TOTAL\",\"\",'Arrear Sheet'!AA11))","v":0},{"$f":"IF('Arrear Sheet'!AB11=\"\",\"\",IF('Arrear Sheet'!C11=\"TOTAL\",\"\",SUM(N11-Z11)))","v":18550}]
[{"$f":"IF('Arrear Sheet'!B12=\"\",\"\",'Arrear Sheet'!B12)","v":5},{"$f":"IF('Arrear Sheet'!C12=\"\",\"\",IF('Arrear Sheet'!C12=\"TOTAL\",\"\",'Arrear Sheet'!C12))","v":"2021-02-01"},{"$f":"IF('Arrear Sheet'!D12=\"\",\"\",IF('Arrear Sheet'!C12=\"TOTAL\",\"\",IF('Arrear Sheet'!D12=\"अक्षरें राशि :-\",\"\",'Arrear Sheet'!D12)))","v":33800},{"$f":"IF('Arrear Sheet'!E12=\"\",\"\",IF('Arrear Sheet'!C12=\"TOTAL\",\"\",'Arrear Sheet'!E12))","v":5746},{"$f":"IF('Arrear Sheet'!F12=\"\",\"\",IF('Arrear Sheet'!C12=\"TOTAL\",\"\",'Arrear Sheet'!F12))","v":2704},{"$f":"IF('Arrear Sheet'!G12=\"\",\"\",IF('Arrear Sheet'!C12=\"TOTAL\",\"\",SUM(C12:E12)))","v":42250},{"$f":"IF('Arrear Sheet'!H12=\"\",\"\",IF('Arrear Sheet'!C12=\"TOTAL\",\"\",'Arrear Sheet'!H12))","v":23700},{"$f":"IF('Arrear Sheet'!I12=\"\",\"\",IF('Arrear Sheet'!C12=\"TOTAL\",\"\",'Arrear Sheet'!I12))","v":0},{"$f":"IF('Arrear Sheet'!J12=\"\",\"\",IF('Arrear Sheet'!C12=\"TOTAL\",\"\",'Arrear Sheet'!J12))","v":0},{"$f":"IF('Arrear Sheet'!K12=\"\",\"\",IF('Arrear Sheet'!C12=\"TOTAL\",\"\",SUM(G12:I12)))","v":23700},{"$f":"IF('Arrear Sheet'!L12=\"\",\"\",IF('Arrear Sheet'!C12=\"TOTAL\",\"\",'Arrear Sheet'!L12))","v":10100},{"$f":"IF('Arrear Sheet'!M12=\"\",\"\",IF('Arrear Sheet'!C12=\"TOTAL\",\"\",'Arrear Sheet'!M12))","v":5746},{"$f":"IF('Arrear Sheet'!N12=\"\",\"\",IF('Arrear Sheet'!C12=\"TOTAL\",\"\",'Arrear Sheet'!N12))","v":2704},{"$f":"IF('Arrear Sheet'!O12=\"\",\"\",IF('Arrear Sheet'!C12=\"TOTAL\",\"\",SUM(K12:M12)))","v":18550},{"$f":"IF('Arrear Sheet'!P12=\"\",\"\",IF('Arrear Sheet'!C12=\"TOTAL\",\"\",'Arrear Sheet'!P12))","v":3955},{"$f":"IF('Arrear Sheet'!Q12=\"\",\"\",IF('Arrear Sheet'!C12=\"TOTAL\",\"\",'Arrear Sheet'!Q12))","v":2370},{"$f":"IF('Arrear Sheet'!R12=\"\",\"\",IF('Arrear Sheet'!C12=\"TOTAL\",\"\",'Arrear Sheet'!R12))","v":1585},{"$f":"IF('Arrear Sheet'!S12=\"\",\"\",IF('Arrear Sheet'!C12=\"TOTAL\",\"\",'Arrear Sheet'!S12))","v":0},{"$f":"IF('Arrear Sheet'!T12=\"\",\"\",IF('Arrear Sheet'!C12=\"TOTAL\",\"\",'Arrear Sheet'!T12))","v":0},{"$f":"IF('Arrear Sheet'!U12=\"\",\"\",IF('Arrear Sheet'!C12=\"TOTAL\",\"\",'Arrear Sheet'!U12))","v":0},{"$f":"IF('Arrear Sheet'!V12=\"\",\"\",IF('Arrear Sheet'!C12=\"TOTAL\",\"\",'Arrear Sheet'!V12))","v":""},{"$f":"IF('Arrear Sheet'!W12=\"\",\"\",IF('Arrear Sheet'!C12=\"TOTAL\",\"\",'Arrear Sheet'!W12))","v":""},{"$f":"IF('Arrear Sheet'!X12=\"\",\"\",IF('Arrear Sheet'!C12=\"TOTAL\",\"\",'Arrear Sheet'!X12))","v":""},{"$f":"IF('Arrear Sheet'!Y12=\"\",\"\",IF('Arrear Sheet'!C12=\"TOTAL\",\"\",'Arrear Sheet'!Y12))","v":""},{"$f":"IF('Arrear Sheet'!Z12=\"\",\"\",IF('Arrear Sheet'!C12=\"TOTAL\",\"\",'Arrear Sheet'!Z12))","v":0},{"$f":"IF('Arrear Sheet'!AA12=\"\",\"\",IF('Arrear Sheet'!C12=\"TOTAL\",\"\",'Arrear Sheet'!AA12))","v":0},{"$f":"IF('Arrear Sheet'!AB12=\"\",\"\",IF('Arrear Sheet'!C12=\"TOTAL\",\"\",SUM(N12-Z12)))","v":18550}]
[{"$f":"IF('Arrear Sheet'!B13=\"\",\"\",'Arrear Sheet'!B13)","v":6},{"$f":"IF('Arrear Sheet'!C13=\"\",\"\",IF('Arrear Sheet'!C13=\"TOTAL\",\"\",'Arrear Sheet'!C13))","v":"2021-03-01"},{"$f":"IF('Arrear Sheet'!D13=\"\",\"\",IF('Arrear Sheet'!C13=\"TOTAL\",\"\",IF('Arrear Sheet'!D13=\"अक्षरें राशि :-\",\"\",'Arrear Sheet'!D13)))","v":33800},{"$f":"IF('Arrear Sheet'!E13=\"\",\"\",IF('Arrear Sheet'!C13=\"TOTAL\",\"\",'Arrear Sheet'!E13))","v":5746},{"$f":"IF('Arrear Sheet'!F13=\"\",\"\",IF('Arrear Sheet'!C13=\"TOTAL\",\"\",'Arrear Sheet'!F13))","v":2704},{"$f":"IF('Arrear Sheet'!G13=\"\",\"\",IF('Arrear Sheet'!C13=\"TOTAL\",\"\",SUM(C13:E13)))","v":42250},{"$f":"IF('Arrear Sheet'!H13=\"\",\"\",IF('Arrear Sheet'!C13=\"TOTAL\",\"\",'Arrear Sheet'!H13))","v":23700},{"$f":"IF('Arrear Sheet'!I13=\"\",\"\",IF('Arrear Sheet'!C13=\"TOTAL\",\"\",'Arrear Sheet'!I13))","v":0},{"$f":"IF('Arrear Sheet'!J13=\"\",\"\",IF('Arrear Sheet'!C13=\"TOTAL\",\"\",'Arrear Sheet'!J13))","v":0},{"$f":"IF('Arrear Sheet'!K13=\"\",\"\",IF('Arrear Sheet'!C13=\"TOTAL\",\"\",SUM(G13:I13)))","v":23700},{"$f":"IF('Arrear Sheet'!L13=\"\",\"\",IF('Arrear Sheet'!C13=\"TOTAL\",\"\",'Arrear Sheet'!L13))","v":10100},{"$f":"IF('Arrear Sheet'!M13=\"\",\"\",IF('Arrear Sheet'!C13=\"TOTAL\",\"\",'Arrear Sheet'!M13))","v":5746},{"$f":"IF('Arrear Sheet'!N13=\"\",\"\",IF('Arrear Sheet'!C13=\"TOTAL\",\"\",'Arrear Sheet'!N13))","v":2704},{"$f":"IF('Arrear Sheet'!O13=\"\",\"\",IF('Arrear Sheet'!C13=\"TOTAL\",\"\",SUM(K13:M13)))","v":18550},{"$f":"IF('Arrear Sheet'!P13=\"\",\"\",IF('Arrear Sheet'!C13=\"TOTAL\",\"\",'Arrear Sheet'!P13))","v":3955},{"$f":"IF('Arrear Sheet'!Q13=\"\",\"\",IF('Arrear Sheet'!C13=\"TOTAL\",\"\",'Arrear Sheet'!Q13))","v":2370},{"$f":"IF('Arrear Sheet'!R13=\"\",\"\",IF('Arrear Sheet'!C13=\"TOTAL\",\"\",'Arrear Sheet'!R13))","v":1585},{"$f":"IF('Arrear Sheet'!S13=\"\",\"\",IF('Arrear Sheet'!C13=\"TOTAL\",\"\",'Arrear Sheet'!S13))","v":0},{"$f":"IF('Arrear Sheet'!T13=\"\",\"\",IF('Arrear Sheet'!C13=\"TOTAL\",\"\",'Arrear Sheet'!T13))","v":0},{"$f":"IF('Arrear Sheet'!U13=\"\",\"\",IF('Arrear Sheet'!C13=\"TOTAL\",\"\",'Arrear Sheet'!U13))","v":0},{"$f":"IF('Arrear Sheet'!V13=\"\",\"\",IF('Arrear Sheet'!C13=\"TOTAL\",\"\",'Arrear Sheet'!V13))","v":""},{"$f":"IF('Arrear Sheet'!W13=\"\",\"\",IF('Arrear Sheet'!C13=\"TOTAL\",\"\",'Arrear Sheet'!W13))","v":""},{"$f":"IF('Arrear Sheet'!X13=\"\",\"\",IF('Arrear Sheet'!C13=\"TOTAL\",\"\",'Arrear Sheet'!X13))","v":""},{"$f":"IF('Arrear Sheet'!Y13=\"\",\"\",IF('Arrear Sheet'!C13=\"TOTAL\",\"\",'Arrear Sheet'!Y13))","v":""},{"$f":"IF('Arrear Sheet'!Z13=\"\",\"\",IF('Arrear Sheet'!C13=\"TOTAL\",\"\",'Arrear Sheet'!Z13))","v":0},{"$f":"IF('Arrear Sheet'!AA13=\"\",\"\",IF('Arrear Sheet'!C13=\"TOTAL\",\"\",'Arrear Sheet'!AA13))","v":0},{"$f":"IF('Arrear Sheet'!AB13=\"\",\"\",IF('Arrear Sheet'!C13=\"TOTAL\",\"\",SUM(N13-Z13)))","v":18550}]
[{"$f":"IF('Arrear Sheet'!B14=\"\",\"\",'Arrear Sheet'!B14)","v":7},{"$f":"IF('Arrear Sheet'!C14=\"\",\"\",IF('Arrear Sheet'!C14=\"TOTAL\",\"\",'Arrear Sheet'!C14))","v":"2021-04-01"},{"$f":"IF('Arrear Sheet'!D14=\"\",\"\",IF('Arrear Sheet'!C14=\"TOTAL\",\"\",IF('Arrear Sheet'!D14=\"अक्षरें राशि :-\",\"\",'Arrear Sheet'!D14)))","v":33800},{"$f":"IF('Arrear Sheet'!E14=\"\",\"\",IF('Arrear Sheet'!C14=\"TOTAL\",\"\",'Arrear Sheet'!E14))","v":5746},{"$f":"IF('Arrear Sheet'!F14=\"\",\"\",IF('Arrear Sheet'!C14=\"TOTAL\",\"\",'Arrear Sheet'!F14))","v":2704},{"$f":"IF('Arrear Sheet'!G14=\"\",\"\",IF('Arrear Sheet'!C14=\"TOTAL\",\"\",SUM(C14:E14)))","v":42250},{"$f":"IF('Arrear Sheet'!H14=\"\",\"\",IF('Arrear Sheet'!C14=\"TOTAL\",\"\",'Arrear Sheet'!H14))","v":23700},{"$f":"IF('Arrear Sheet'!I14=\"\",\"\",IF('Arrear Sheet'!C14=\"TOTAL\",\"\",'Arrear Sheet'!I14))","v":0},{"$f":"IF('Arrear Sheet'!J14=\"\",\"\",IF('Arrear Sheet'!C14=\"TOTAL\",\"\",'Arrear Sheet'!J14))","v":0},{"$f":"IF('Arrear Sheet'!K14=\"\",\"\",IF('Arrear Sheet'!C14=\"TOTAL\",\"\",SUM(G14:I14)))","v":23700},{"$f":"IF('Arrear Sheet'!L14=\"\",\"\",IF('Arrear Sheet'!C14=\"TOTAL\",\"\",'Arrear Sheet'!L14))","v":10100},{"$f":"IF('Arrear Sheet'!M14=\"\",\"\",IF('Arrear Sheet'!C14=\"TOTAL\",\"\",'Arrear Sheet'!M14))","v":5746},{"$f":"IF('Arrear Sheet'!N14=\"\",\"\",IF('Arrear Sheet'!C14=\"TOTAL\",\"\",'Arrear Sheet'!N14))","v":2704},{"$f":"IF('Arrear Sheet'!O14=\"\",\"\",IF('Arrear Sheet'!C14=\"TOTAL\",\"\",SUM(K14:M14)))","v":18550},{"$f":"IF('Arrear Sheet'!P14=\"\",\"\",IF('Arrear Sheet'!C14=\"TOTAL\",\"\",'Arrear Sheet'!P14))","v":3955},{"$f":"IF('Arrear Sheet'!Q14=\"\",\"\",IF('Arrear Sheet'!C14=\"TOTAL\",\"\",'Arrear Sheet'!Q14))","v":2370},{"$f":"IF('Arrear Sheet'!R14=\"\",\"\",IF('Arrear Sheet'!C14=\"TOTAL\",\"\",'Arrear Sheet'!R14))","v":1585},{"$f":"IF('Arrear Sheet'!S14=\"\",\"\",IF('Arrear Sheet'!C14=\"TOTAL\",\"\",'Arrear Sheet'!S14))","v":0},{"$f":"IF('Arrear Sheet'!T14=\"\",\"\",IF('Arrear Sheet'!C14=\"TOTAL\",\"\",'Arrear Sheet'!T14))","v":0},{"$f":"IF('Arrear Sheet'!U14=\"\",\"\",IF('Arrear Sheet'!C14=\"TOTAL\",\"\",'Arrear Sheet'!U14))","v":0},{"$f":"IF('Arrear Sheet'!V14=\"\",\"\",IF('Arrear Sheet'!C14=\"TOTAL\",\"\",'Arrear Sheet'!V14))","v":""},{"$f":"IF('Arrear Sheet'!W14=\"\",\"\",IF('Arrear Sheet'!C14=\"TOTAL\",\"\",'Arrear Sheet'!W14))","v":""},{"$f":"IF('Arrear Sheet'!X14=\"\",\"\",IF('Arrear Sheet'!C14=\"TOTAL\",\"\",'Arrear Sheet'!X14))","v":""},{"$f":"IF('Arrear Sheet'!Y14=\"\",\"\",IF('Arrear Sheet'!C14=\"TOTAL\",\"\",'Arrear Sheet'!Y14))","v":""},{"$f":"IF('Arrear Sheet'!Z14=\"\",\"\",IF('Arrear Sheet'!C14=\"TOTAL\",\"\",'Arrear Sheet'!Z14))","v":0},{"$f":"IF('Arrear Sheet'!AA14=\"\",\"\",IF('Arrear Sheet'!C14=\"TOTAL\",\"\",'Arrear Sheet'!AA14))","v":0},{"$f":"IF('Arrear Sheet'!AB14=\"\",\"\",IF('Arrear Sheet'!C14=\"TOTAL\",\"\",SUM(N14-Z14)))","v":18550}]
[{"$f":"IF('Arrear Sheet'!B15=\"\",\"\",'Arrear Sheet'!B15)","v":8},{"$f":"IF('Arrear Sheet'!C15=\"\",\"\",IF('Arrear Sheet'!C15=\"TOTAL\",\"\",'Arrear Sheet'!C15))","v":"2021-05-01"},{"$f":"IF('Arrear Sheet'!D15=\"\",\"\",IF('Arrear Sheet'!C15=\"TOTAL\",\"\",IF('Arrear Sheet'!D15=\"अक्षरें राशि :-\",\"\",'Arrear Sheet'!D15)))","v":33800},{"$f":"IF('Arrear Sheet'!E15=\"\",\"\",IF('Arrear Sheet'!C15=\"TOTAL\",\"\",'Arrear Sheet'!E15))","v":5746},{"$f":"IF('Arrear Sheet'!F15=\"\",\"\",IF('Arrear Sheet'!C15=\"TOTAL\",\"\",'Arrear Sheet'!F15))","v":2704},{"$f":"IF('Arrear Sheet'!G15=\"\",\"\",IF('Arrear Sheet'!C15=\"TOTAL\",\"\",SUM(C15:E15)))","v":42250},{"$f":"IF('Arrear Sheet'!H15=\"\",\"\",IF('Arrear Sheet'!C15=\"TOTAL\",\"\",'Arrear Sheet'!H15))","v":23700},{"$f":"IF('Arrear Sheet'!I15=\"\",\"\",IF('Arrear Sheet'!C15=\"TOTAL\",\"\",'Arrear Sheet'!I15))","v":0},{"$f":"IF('Arrear Sheet'!J15=\"\",\"\",IF('Arrear Sheet'!C15=\"TOTAL\",\"\",'Arrear Sheet'!J15))","v":0},{"$f":"IF('Arrear Sheet'!K15=\"\",\"\",IF('Arrear Sheet'!C15=\"TOTAL\",\"\",SUM(G15:I15)))","v":23700},{"$f":"IF('Arrear Sheet'!L15=\"\",\"\",IF('Arrear Sheet'!C15=\"TOTAL\",\"\",'Arrear Sheet'!L15))","v":10100},{"$f":"IF('Arrear Sheet'!M15=\"\",\"\",IF('Arrear Sheet'!C15=\"TOTAL\",\"\",'Arrear Sheet'!M15))","v":5746},{"$f":"IF('Arrear Sheet'!N15=\"\",\"\",IF('Arrear Sheet'!C15=\"TOTAL\",\"\",'Arrear Sheet'!N15))","v":2704},{"$f":"IF('Arrear Sheet'!O15=\"\",\"\",IF('Arrear Sheet'!C15=\"TOTAL\",\"\",SUM(K15:M15)))","v":18550},{"$f":"IF('Arrear Sheet'!P15=\"\",\"\",IF('Arrear Sheet'!C15=\"TOTAL\",\"\",'Arrear Sheet'!P15))","v":3955},{"$f":"IF('Arrear Sheet'!Q15=\"\",\"\",IF('Arrear Sheet'!C15=\"TOTAL\",\"\",'Arrear Sheet'!Q15))","v":2370},{"$f":"IF('Arrear Sheet'!R15=\"\",\"\",IF('Arrear Sheet'!C15=\"TOTAL\",\"\",'Arrear Sheet'!R15))","v":1585},{"$f":"IF('Arrear Sheet'!S15=\"\",\"\",IF('Arrear Sheet'!C15=\"TOTAL\",\"\",'Arrear Sheet'!S15))","v":0},{"$f":"IF('Arrear Sheet'!T15=\"\",\"\",IF('Arrear Sheet'!C15=\"TOTAL\",\"\",'Arrear Sheet'!T15))","v":0},{"$f":"IF('Arrear Sheet'!U15=\"\",\"\",IF('Arrear Sheet'!C15=\"TOTAL\",\"\",'Arrear Sheet'!U15))","v":0},{"$f":"IF('Arrear Sheet'!V15=\"\",\"\",IF('Arrear Sheet'!C15=\"TOTAL\",\"\",'Arrear Sheet'!V15))","v":""},{"$f":"IF('Arrear Sheet'!W15=\"\",\"\",IF('Arrear Sheet'!C15=\"TOTAL\",\"\",'Arrear Sheet'!W15))","v":""},{"$f":"IF('Arrear Sheet'!X15=\"\",\"\",IF('Arrear Sheet'!C15=\"TOTAL\",\"\",'Arrear Sheet'!X15))","v":""},{"$f":"IF('Arrear Sheet'!Y15=\"\",\"\",IF('Arrear Sheet'!C15=\"TOTAL\",\"\",'Arrear Sheet'!Y15))","v":""},{"$f":"IF('Arrear Sheet'!Z15=\"\",\"\",IF('Arrear Sheet'!C15=\"TOTAL\",\"\",'Arrear Sheet'!Z15))","v":0},{"$f":"IF('Arrear Sheet'!AA15=\"\",\"\",IF('Arrear Sheet'!C15=\"TOTAL\",\"\",'Arrear Sheet'!AA15))","v":0},{"$f":"IF('Arrear Sheet'!AB15=\"\",\"\",IF('Arrear Sheet'!C15=\"TOTAL\",\"\",SUM(N15-Z15)))","v":18550}]
[{"$f":"IF('Arrear Sheet'!B16=\"\",\"\",'Arrear Sheet'!B16)","v":9},{"$f":"IF('Arrear Sheet'!C16=\"\",\"\",IF('Arrear Sheet'!C16=\"TOTAL\",\"\",'Arrear Sheet'!C16))","v":"2021-06-01"},{"$f":"IF('Arrear Sheet'!D16=\"\",\"\",IF('Arrear Sheet'!C16=\"TOTAL\",\"\",IF('Arrear Sheet'!D16=\"अक्षरें राशि :-\",\"\",'Arrear Sheet'!D16)))","v":33800},{"$f":"IF('Arrear Sheet'!E16=\"\",\"\",IF('Arrear Sheet'!C16=\"TOTAL\",\"\",'Arrear Sheet'!E16))","v":5746},{"$f":"IF('Arrear Sheet'!F16=\"\",\"\",IF('Arrear Sheet'!C16=\"TOTAL\",\"\",'Arrear Sheet'!F16))","v":2704},{"$f":"IF('Arrear Sheet'!G16=\"\",\"\",IF('Arrear Sheet'!C16=\"TOTAL\",\"\",SUM(C16:E16)))","v":42250},{"$f":"IF('Arrear Sheet'!H16=\"\",\"\",IF('Arrear Sheet'!C16=\"TOTAL\",\"\",'Arrear Sheet'!H16))","v":23700},{"$f":"IF('Arrear Sheet'!I16=\"\",\"\",IF('Arrear Sheet'!C16=\"TOTAL\",\"\",'Arrear Sheet'!I16))","v":0},{"$f":"IF('Arrear Sheet'!J16=\"\",\"\",IF('Arrear Sheet'!C16=\"TOTAL\",\"\",'Arrear Sheet'!J16))","v":0},{"$f":"IF('Arrear Sheet'!K16=\"\",\"\",IF('Arrear Sheet'!C16=\"TOTAL\",\"\",SUM(G16:I16)))","v":23700},{"$f":"IF('Arrear Sheet'!L16=\"\",\"\",IF('Arrear Sheet'!C16=\"TOTAL\",\"\",'Arrear Sheet'!L16))","v":10100},{"$f":"IF('Arrear Sheet'!M16=\"\",\"\",IF('Arrear Sheet'!C16=\"TOTAL\",\"\",'Arrear Sheet'!M16))","v":5746},{"$f":"IF('Arrear Sheet'!N16=\"\",\"\",IF('Arrear Sheet'!C16=\"TOTAL\",\"\",'Arrear Sheet'!N16))","v":2704},{"$f":"IF('Arrear Sheet'!O16=\"\",\"\",IF('Arrear Sheet'!C16=\"TOTAL\",\"\",SUM(K16:M16)))","v":18550},{"$f":"IF('Arrear Sheet'!P16=\"\",\"\",IF('Arrear Sheet'!C16=\"TOTAL\",\"\",'Arrear Sheet'!P16))","v":3955},{"$f":"IF('Arrear Sheet'!Q16=\"\",\"\",IF('Arrear Sheet'!C16=\"TOTAL\",\"\",'Arrear Sheet'!Q16))","v":2370},{"$f":"IF('Arrear Sheet'!R16=\"\",\"\",IF('Arrear Sheet'!C16=\"TOTAL\",\"\",'Arrear Sheet'!R16))","v":1585},{"$f":"IF('Arrear Sheet'!S16=\"\",\"\",IF('Arrear Sheet'!C16=\"TOTAL\",\"\",'Arrear Sheet'!S16))","v":0},{"$f":"IF('Arrear Sheet'!T16=\"\",\"\",IF('Arrear Sheet'!C16=\"TOTAL\",\"\",'Arrear Sheet'!T16))","v":0},{"$f":"IF('Arrear Sheet'!U16=\"\",\"\",IF('Arrear Sheet'!C16=\"TOTAL\",\"\",'Arrear Sheet'!U16))","v":0},{"$f":"IF('Arrear Sheet'!V16=\"\",\"\",IF('Arrear Sheet'!C16=\"TOTAL\",\"\",'Arrear Sheet'!V16))","v":""},{"$f":"IF('Arrear Sheet'!W16=\"\",\"\",IF('Arrear Sheet'!C16=\"TOTAL\",\"\",'Arrear Sheet'!W16))","v":""},{"$f":"IF('Arrear Sheet'!X16=\"\",\"\",IF('Arrear Sheet'!C16=\"TOTAL\",\"\",'Arrear Sheet'!X16))","v":""},{"$f":"IF('Arrear Sheet'!Y16=\"\",\"\",IF('Arrear Sheet'!C16=\"TOTAL\",\"\",'Arrear Sheet'!Y16))","v":""},{"$f":"IF('Arrear Sheet'!Z16=\"\",\"\",IF('Arrear Sheet'!C16=\"TOTAL\",\"\",'Arrear Sheet'!Z16))","v":0},{"$f":"IF('Arrear Sheet'!AA16=\"\",\"\",IF('Arrear Sheet'!C16=\"TOTAL\",\"\",'Arrear Sheet'!AA16))","v":0},{"$f":"IF('Arrear Sheet'!AB16=\"\",\"\",IF('Arrear Sheet'!C16=\"TOTAL\",\"\",SUM(N16-Z16)))","v":18550}]
[{"$f":"IF('Arrear Sheet'!B17=\"\",\"\",'Arrear Sheet'!B17)","v":10},{"$f":"IF('Arrear Sheet'!C17=\"\",\"\",IF('Arrear Sheet'!C17=\"TOTAL\",\"\",'Arrear Sheet'!C17))","v":"2021-07-01"},{"$f":"IF('Arrear Sheet'!D17=\"\",\"\",IF('Arrear Sheet'!C17=\"TOTAL\",\"\",IF('Arrear Sheet'!D17=\"अक्षरें राशि :-\",\"\",'Arrear Sheet'!D17)))","v":34800},{"$f":"IF('Arrear Sheet'!E17=\"\",\"\",IF('Arrear Sheet'!C17=\"TOTAL\",\"\",'Arrear Sheet'!E17))","v":10788},{"$f":"IF('Arrear Sheet'!F17=\"\",\"\",IF('Arrear Sheet'!C17=\"TOTAL\",\"\",'Arrear Sheet'!F17))","v":3132},{"$f":"IF('Arrear Sheet'!G17=\"\",\"\",IF('Arrear Sheet'!C17=\"TOTAL\",\"\",SUM(C17:E17)))","v":48720},{"$f":"IF('Arrear Sheet'!H17=\"\",\"\",IF('Arrear Sheet'!C17=\"TOTAL\",\"\",'Arrear Sheet'!H17))","v":23700},{"$f":"IF('Arrear Sheet'!I17=\"\",\"\",IF('Arrear Sheet'!C17=\"TOTAL\",\"\",'Arrear Sheet'!I17))","v":0},{"$f":"IF('Arrear Sheet'!J17=\"\",\"\",IF('Arrear Sheet'!C17=\"TOTAL\",\"\",'Arrear Sheet'!J17))","v":0},{"$f":"IF('Arrear Sheet'!K17=\"\",\"\",IF('Arrear Sheet'!C17=\"TOTAL\",\"\",SUM(G17:I17)))","v":23700},{"$f":"IF('Arrear Sheet'!L17=\"\",\"\",IF('Arrear Sheet'!C17=\"TOTAL\",\"\",'Arrear Sheet'!L17))","v":11100},{"$f":"IF('Arrear Sheet'!M17=\"\",\"\",IF('Arrear Sheet'!C17=\"TOTAL\",\"\",'Arrear Sheet'!M17))","v":10788},{"$f":"IF('Arrear Sheet'!N17=\"\",\"\",IF('Arrear Sheet'!C17=\"TOTAL\",\"\",'Arrear Sheet'!N17))","v":3132},{"$f":"IF('Arrear Sheet'!O17=\"\",\"\",IF('Arrear Sheet'!C17=\"TOTAL\",\"\",SUM(K17:M17)))","v":25020},{"$f":"IF('Arrear Sheet'!P17=\"\",\"\",IF('Arrear Sheet'!C17=\"TOTAL\",\"\",'Arrear Sheet'!P17))","v":4559},{"$f":"IF('Arrear Sheet'!Q17=\"\",\"\",IF('Arrear Sheet'!C17=\"TOTAL\",\"\",'Arrear Sheet'!Q17))","v":2370},{"$f":"IF('Arrear Sheet'!R17=\"\",\"\",IF('Arrear Sheet'!C17=\"TOTAL\",\"\",'Arrear Sheet'!R17))","v":2189},{"$f":"IF('Arrear Sheet'!S17=\"\",\"\",IF('Arrear Sheet'!C17=\"TOTAL\",\"\",'Arrear Sheet'!S17))","v":0},{"$f":"IF('Arrear Sheet'!T17=\"\",\"\",IF('Arrear Sheet'!C17=\"TOTAL\",\"\",'Arrear Sheet'!T17))","v":0},{"$f":"IF('Arrear Sheet'!U17=\"\",\"\",IF('Arrear Sheet'!C17=\"TOTAL\",\"\",'Arrear Sheet'!U17))","v":0},{"$f":"IF('Arrear Sheet'!V17=\"\",\"\",IF('Arrear Sheet'!C17=\"TOTAL\",\"\",'Arrear Sheet'!V17))","v":""},{"$f":"IF('Arrear Sheet'!W17=\"\",\"\",IF('Arrear Sheet'!C17=\"TOTAL\",\"\",'Arrear Sheet'!W17))","v":""},{"$f":"IF('Arrear Sheet'!X17=\"\",\"\",IF('Arrear Sheet'!C17=\"TOTAL\",\"\",'Arrear Sheet'!X17))","v":""},{"$f":"IF('Arrear Sheet'!Y17=\"\",\"\",IF('Arrear Sheet'!C17=\"TOTAL\",\"\",'Arrear Sheet'!Y17))","v":1044},{"$f":"IF('Arrear Sheet'!Z17=\"\",\"\",IF('Arrear Sheet'!C17=\"TOTAL\",\"\",'Arrear Sheet'!Z17))","v":0},{"$f":"IF('Arrear Sheet'!AA17=\"\",\"\",IF('Arrear Sheet'!C17=\"TOTAL\",\"\",'Arrear Sheet'!AA17))","v":1044},{"$f":"IF('Arrear Sheet'!AB17=\"\",\"\",IF('Arrear Sheet'!C17=\"TOTAL\",\"\",SUM(N17-Z17)))","v":23976}]
[{"$f":"IF('Arrear Sheet'!B18=\"\",\"\",'Arrear Sheet'!B18)","v":11},{"$f":"IF('Arrear Sheet'!C18=\"\",\"\",IF('Arrear Sheet'!C18=\"TOTAL\",\"\",'Arrear Sheet'!C18))","v":"2021-08-01"},{"$f":"IF('Arrear Sheet'!D18=\"\",\"\",IF('Arrear Sheet'!C18=\"TOTAL\",\"\",IF('Arrear Sheet'!D18=\"अक्षरें राशि :-\",\"\",'Arrear Sheet'!D18)))","v":34800},{"$f":"IF('Arrear Sheet'!E18=\"\",\"\",IF('Arrear Sheet'!C18=\"TOTAL\",\"\",'Arrear Sheet'!E18))","v":10788},{"$f":"IF('Arrear Sheet'!F18=\"\",\"\",IF('Arrear Sheet'!C18=\"TOTAL\",\"\",'Arrear Sheet'!F18))","v":3132},{"$f":"IF('Arrear Sheet'!G18=\"\",\"\",IF('Arrear Sheet'!C18=\"TOTAL\",\"\",SUM(C18:E18)))","v":48720},{"$f":"IF('Arrear Sheet'!H18=\"\",\"\",IF('Arrear Sheet'!C18=\"TOTAL\",\"\",'Arrear Sheet'!H18))","v":23700},{"$f":"IF('Arrear Sheet'!I18=\"\",\"\",IF('Arrear Sheet'!C18=\"TOTAL\",\"\",'Arrear Sheet'!I18))","v":0},{"$f":"IF('Arrear Sheet'!J18=\"\",\"\",IF('Arrear Sheet'!C18=\"TOTAL\",\"\",'Arrear Sheet'!J18))","v":0},{"$f":"IF('Arrear Sheet'!K18=\"\",\"\",IF('Arrear Sheet'!C18=\"TOTAL\",\"\",SUM(G18:I18)))","v":23700},{"$f":"IF('Arrear Sheet'!L18=\"\",\"\",IF('Arrear Sheet'!C18=\"TOTAL\",\"\",'Arrear Sheet'!L18))","v":11100},{"$f":"IF('Arrear Sheet'!M18=\"\",\"\",IF('Arrear Sheet'!C18=\"TOTAL\",\"\",'Arrear Sheet'!M18))","v":10788},{"$f":"IF('Arrear Sheet'!N18=\"\",\"\",IF('Arrear Sheet'!C18=\"TOTAL\",\"\",'Arrear Sheet'!N18))","v":3132},{"$f":"IF('Arrear Sheet'!O18=\"\",\"\",IF('Arrear Sheet'!C18=\"TOTAL\",\"\",SUM(K18:M18)))","v":25020},{"$f":"IF('Arrear Sheet'!P18=\"\",\"\",IF('Arrear Sheet'!C18=\"TOTAL\",\"\",'Arrear Sheet'!P18))","v":4559},{"$f":"IF('Arrear Sheet'!Q18=\"\",\"\",IF('Arrear Sheet'!C18=\"TOTAL\",\"\",'Arrear Sheet'!Q18))","v":2370},{"$f":"IF('Arrear Sheet'!R18=\"\",\"\",IF('Arrear Sheet'!C18=\"TOTAL\",\"\",'Arrear Sheet'!R18))","v":2189},{"$f":"IF('Arrear Sheet'!S18=\"\",\"\",IF('Arrear Sheet'!C18=\"TOTAL\",\"\",'Arrear Sheet'!S18))","v":0},{"$f":"IF('Arrear Sheet'!T18=\"\",\"\",IF('Arrear Sheet'!C18=\"TOTAL\",\"\",'Arrear Sheet'!T18))","v":0},{"$f":"IF('Arrear Sheet'!U18=\"\",\"\",IF('Arrear Sheet'!C18=\"TOTAL\",\"\",'Arrear Sheet'!U18))","v":0},{"$f":"IF('Arrear Sheet'!V18=\"\",\"\",IF('Arrear Sheet'!C18=\"TOTAL\",\"\",'Arrear Sheet'!V18))","v":""},{"$f":"IF('Arrear Sheet'!W18=\"\",\"\",IF('Arrear Sheet'!C18=\"TOTAL\",\"\",'Arrear Sheet'!W18))","v":""},{"$f":"IF('Arrear Sheet'!X18=\"\",\"\",IF('Arrear Sheet'!C18=\"TOTAL\",\"\",'Arrear Sheet'!X18))","v":""},{"$f":"IF('Arrear Sheet'!Y18=\"\",\"\",IF('Arrear Sheet'!C18=\"TOTAL\",\"\",'Arrear Sheet'!Y18))","v":1044},{"$f":"IF('Arrear Sheet'!Z18=\"\",\"\",IF('Arrear Sheet'!C18=\"TOTAL\",\"\",'Arrear Sheet'!Z18))","v":0},{"$f":"IF('Arrear Sheet'!AA18=\"\",\"\",IF('Arrear Sheet'!C18=\"TOTAL\",\"\",'Arrear Sheet'!AA18))","v":1044},{"$f":"IF('Arrear Sheet'!AB18=\"\",\"\",IF('Arrear Sheet'!C18=\"TOTAL\",\"\",SUM(N18-Z18)))","v":23976}]
[{"$f":"IF('Arrear Sheet'!B19=\"\",\"\",'Arrear Sheet'!B19)","v":12},{"$f":"IF('Arrear Sheet'!C19=\"\",\"\",IF('Arrear Sheet'!C19=\"TOTAL\",\"\",'Arrear Sheet'!C19))","v":"2021-09-01"},{"$f":"IF('Arrear Sheet'!D19=\"\",\"\",IF('Arrear Sheet'!C19=\"TOTAL\",\"\",IF('Arrear Sheet'!D19=\"अक्षरें राशि :-\",\"\",'Arrear Sheet'!D19)))","v":34800},{"$f":"IF('Arrear Sheet'!E19=\"\",\"\",IF('Arrear Sheet'!C19=\"TOTAL\",\"\",'Arrear Sheet'!E19))","v":10788},{"$f":"IF('Arrear Sheet'!F19=\"\",\"\",IF('Arrear Sheet'!C19=\"TOTAL\",\"\",'Arrear Sheet'!F19))","v":3132},{"$f":"IF('Arrear Sheet'!G19=\"\",\"\",IF('Arrear Sheet'!C19=\"TOTAL\",\"\",SUM(C19:E19)))","v":48720},{"$f":"IF('Arrear Sheet'!H19=\"\",\"\",IF('Arrear Sheet'!C19=\"TOTAL\",\"\",'Arrear Sheet'!H19))","v":23700},{"$f":"IF('Arrear Sheet'!I19=\"\",\"\",IF('Arrear Sheet'!C19=\"TOTAL\",\"\",'Arrear Sheet'!I19))","v":0},{"$f":"IF('Arrear Sheet'!J19=\"\",\"\",IF('Arrear Sheet'!C19=\"TOTAL\",\"\",'Arrear Sheet'!J19))","v":0},{"$f":"IF('Arrear Sheet'!K19=\"\",\"\",IF('Arrear Sheet'!C19=\"TOTAL\",\"\",SUM(G19:I19)))","v":23700},{"$f":"IF('Arrear Sheet'!L19=\"\",\"\",IF('Arrear Sheet'!C19=\"TOTAL\",\"\",'Arrear Sheet'!L19))","v":11100},{"$f":"IF('Arrear Sheet'!M19=\"\",\"\",IF('Arrear Sheet'!C19=\"TOTAL\",\"\",'Arrear Sheet'!M19))","v":10788},{"$f":"IF('Arrear Sheet'!N19=\"\",\"\",IF('Arrear Sheet'!C19=\"TOTAL\",\"\",'Arrear Sheet'!N19))","v":3132},{"$f":"IF('Arrear Sheet'!O19=\"\",\"\",IF('Arrear Sheet'!C19=\"TOTAL\",\"\",SUM(K19:M19)))","v":25020},{"$f":"IF('Arrear Sheet'!P19=\"\",\"\",IF('Arrear Sheet'!C19=\"TOTAL\",\"\",'Arrear Sheet'!P19))","v":4559},{"$f":"IF('Arrear Sheet'!Q19=\"\",\"\",IF('Arrear Sheet'!C19=\"TOTAL\",\"\",'Arrear Sheet'!Q19))","v":2370},{"$f":"IF('Arrear Sheet'!R19=\"\",\"\",IF('Arrear Sheet'!C19=\"TOTAL\",\"\",'Arrear Sheet'!R19))","v":2189},{"$f":"IF('Arrear Sheet'!S19=\"\",\"\",IF('Arrear Sheet'!C19=\"TOTAL\",\"\",'Arrear Sheet'!S19))","v":0},{"$f":"IF('Arrear Sheet'!T19=\"\",\"\",IF('Arrear Sheet'!C19=\"TOTAL\",\"\",'Arrear Sheet'!T19))","v":0},{"$f":"IF('Arrear Sheet'!U19=\"\",\"\",IF('Arrear Sheet'!C19=\"TOTAL\",\"\",'Arrear Sheet'!U19))","v":0},{"$f":"IF('Arrear Sheet'!V19=\"\",\"\",IF('Arrear Sheet'!C19=\"TOTAL\",\"\",'Arrear Sheet'!V19))","v":""},{"$f":"IF('Arrear Sheet'!W19=\"\",\"\",IF('Arrear Sheet'!C19=\"TOTAL\",\"\",'Arrear Sheet'!W19))","v":""},{"$f":"IF('Arrear Sheet'!X19=\"\",\"\",IF('Arrear Sheet'!C19=\"TOTAL\",\"\",'Arrear Sheet'!X19))","v":""},{"$f":"IF('Arrear Sheet'!Y19=\"\",\"\",IF('Arrear Sheet'!C19=\"TOTAL\",\"\",'Arrear Sheet'!Y19))","v":1044},{"$f":"IF('Arrear Sheet'!Z19=\"\",\"\",IF('Arrear Sheet'!C19=\"TOTAL\",\"\",'Arrear Sheet'!Z19))","v":0},{"$f":"IF('Arrear Sheet'!AA19=\"\",\"\",IF('Arrear Sheet'!C19=\"TOTAL\",\"\",'Arrear Sheet'!AA19))","v":1044},{"$f":"IF('Arrear Sheet'!AB19=\"\",\"\",IF('Arrear Sheet'!C19=\"TOTAL\",\"\",SUM(N19-Z19)))","v":23976}]
[{"$f":"IF('Arrear Sheet'!B20=\"\",\"\",'Arrear Sheet'!B20)","v":13},{"$f":"IF('Arrear Sheet'!C20=\"\",\"\",IF('Arrear Sheet'!C20=\"TOTAL\",\"\",'Arrear Sheet'!C20))","v":"2021-10-01"},{"$f":"IF('Arrear Sheet'!D20=\"\",\"\",IF('Arrear Sheet'!C20=\"TOTAL\",\"\",IF('Arrear Sheet'!D20=\"अक्षरें राशि :-\",\"\",'Arrear Sheet'!D20)))","v":34800},{"$f":"IF('Arrear Sheet'!E20=\"\",\"\",IF('Arrear Sheet'!C20=\"TOTAL\",\"\",'Arrear Sheet'!E20))","v":10788},{"$f":"IF('Arrear Sheet'!F20=\"\",\"\",IF('Arrear Sheet'!C20=\"TOTAL\",\"\",'Arrear Sheet'!F20))","v":3132},{"$f":"IF('Arrear Sheet'!G20=\"\",\"\",IF('Arrear Sheet'!C20=\"TOTAL\",\"\",SUM(C20:E20)))","v":48720},{"$f":"IF('Arrear Sheet'!H20=\"\",\"\",IF('Arrear Sheet'!C20=\"TOTAL\",\"\",'Arrear Sheet'!H20))","v":23700},{"$f":"IF('Arrear Sheet'!I20=\"\",\"\",IF('Arrear Sheet'!C20=\"TOTAL\",\"\",'Arrear Sheet'!I20))","v":0},{"$f":"IF('Arrear Sheet'!J20=\"\",\"\",IF('Arrear Sheet'!C20=\"TOTAL\",\"\",'Arrear Sheet'!J20))","v":0},{"$f":"IF('Arrear Sheet'!K20=\"\",\"\",IF('Arrear Sheet'!C20=\"TOTAL\",\"\",SUM(G20:I20)))","v":23700},{"$f":"IF('Arrear Sheet'!L20=\"\",\"\",IF('Arrear Sheet'!C20=\"TOTAL\",\"\",'Arrear Sheet'!L20))","v":11100},{"$f":"IF('Arrear Sheet'!M20=\"\",\"\",IF('Arrear Sheet'!C20=\"TOTAL\",\"\",'Arrear Sheet'!M20))","v":10788},{"$f":"IF('Arrear Sheet'!N20=\"\",\"\",IF('Arrear Sheet'!C20=\"TOTAL\",\"\",'Arrear Sheet'!N20))","v":3132},{"$f":"IF('Arrear Sheet'!O20=\"\",\"\",IF('Arrear Sheet'!C20=\"TOTAL\",\"\",SUM(K20:M20)))","v":25020},{"$f":"IF('Arrear Sheet'!P20=\"\",\"\",IF('Arrear Sheet'!C20=\"TOTAL\",\"\",'Arrear Sheet'!P20))","v":4559},{"$f":"IF('Arrear Sheet'!Q20=\"\",\"\",IF('Arrear Sheet'!C20=\"TOTAL\",\"\",'Arrear Sheet'!Q20))","v":2370},{"$f":"IF('Arrear Sheet'!R20=\"\",\"\",IF('Arrear Sheet'!C20=\"TOTAL\",\"\",'Arrear Sheet'!R20))","v":2189},{"$f":"IF('Arrear Sheet'!S20=\"\",\"\",IF('Arrear Sheet'!C20=\"TOTAL\",\"\",'Arrear Sheet'!S20))","v":0},{"$f":"IF('Arrear Sheet'!T20=\"\",\"\",IF('Arrear Sheet'!C20=\"TOTAL\",\"\",'Arrear Sheet'!T20))","v":0},{"$f":"IF('Arrear Sheet'!U20=\"\",\"\",IF('Arrear Sheet'!C20=\"TOTAL\",\"\",'Arrear Sheet'!U20))","v":0},{"$f":"IF('Arrear Sheet'!V20=\"\",\"\",IF('Arrear Sheet'!C20=\"TOTAL\",\"\",'Arrear Sheet'!V20))","v":""},{"$f":"IF('Arrear Sheet'!W20=\"\",\"\",IF('Arrear Sheet'!C20=\"TOTAL\",\"\",'Arrear Sheet'!W20))","v":""},{"$f":"IF('Arrear Sheet'!X20=\"\",\"\",IF('Arrear Sheet'!C20=\"TOTAL\",\"\",'Arrear Sheet'!X20))","v":""},{"$f":"IF('Arrear Sheet'!Y20=\"\",\"\",IF('Arrear Sheet'!C20=\"TOTAL\",\"\",'Arrear Sheet'!Y20))","v":""},{"$f":"IF('Arrear Sheet'!Z20=\"\",\"\",IF('Arrear Sheet'!C20=\"TOTAL\",\"\",'Arrear Sheet'!Z20))","v":0},{"$f":"IF('Arrear Sheet'!AA20=\"\",\"\",IF('Arrear Sheet'!C20=\"TOTAL\",\"\",'Arrear Sheet'!AA20))","v":0},{"$f":"IF('Arrear Sheet'!AB20=\"\",\"\",IF('Arrear Sheet'!C20=\"TOTAL\",\"\",SUM(N20-Z20)))","v":25020}]
[{"$f":"IF('Arrear Sheet'!B21=\"\",\"\",'Arrear Sheet'!B21)","v":14},{"$f":"IF('Arrear Sheet'!C21=\"\",\"\",IF('Arrear Sheet'!C21=\"TOTAL\",\"\",'Arrear Sheet'!C21))","v":"2021-11-01"},{"$f":"IF('Arrear Sheet'!D21=\"\",\"\",IF('Arrear Sheet'!C21=\"TOTAL\",\"\",IF('Arrear Sheet'!D21=\"अक्षरें राशि :-\",\"\",'Arrear Sheet'!D21)))","v":34800},{"$f":"IF('Arrear Sheet'!E21=\"\",\"\",IF('Arrear Sheet'!C21=\"TOTAL\",\"\",'Arrear Sheet'!E21))","v":10788},{"$f":"IF('Arrear Sheet'!F21=\"\",\"\",IF('Arrear Sheet'!C21=\"TOTAL\",\"\",'Arrear Sheet'!F21))","v":3132},{"$f":"IF('Arrear Sheet'!G21=\"\",\"\",IF('Arrear Sheet'!C21=\"TOTAL\",\"\",SUM(C21:E21)))","v":48720},{"$f":"IF('Arrear Sheet'!H21=\"\",\"\",IF('Arrear Sheet'!C21=\"TOTAL\",\"\",'Arrear Sheet'!H21))","v":23700},{"$f":"IF('Arrear Sheet'!I21=\"\",\"\",IF('Arrear Sheet'!C21=\"TOTAL\",\"\",'Arrear Sheet'!I21))","v":0},{"$f":"IF('Arrear Sheet'!J21=\"\",\"\",IF('Arrear Sheet'!C21=\"TOTAL\",\"\",'Arrear Sheet'!J21))","v":0},{"$f":"IF('Arrear Sheet'!K21=\"\",\"\",IF('Arrear Sheet'!C21=\"TOTAL\",\"\",SUM(G21:I21)))","v":23700},{"$f":"IF('Arrear Sheet'!L21=\"\",\"\",IF('Arrear Sheet'!C21=\"TOTAL\",\"\",'Arrear Sheet'!L21))","v":11100},{"$f":"IF('Arrear Sheet'!M21=\"\",\"\",IF('Arrear Sheet'!C21=\"TOTAL\",\"\",'Arrear Sheet'!M21))","v":10788},{"$f":"IF('Arrear Sheet'!N21=\"\",\"\",IF('Arrear Sheet'!C21=\"TOTAL\",\"\",'Arrear Sheet'!N21))","v":3132},{"$f":"IF('Arrear Sheet'!O21=\"\",\"\",IF('Arrear Sheet'!C21=\"TOTAL\",\"\",SUM(K21:M21)))","v":25020},{"$f":"IF('Arrear Sheet'!P21=\"\",\"\",IF('Arrear Sheet'!C21=\"TOTAL\",\"\",'Arrear Sheet'!P21))","v":4559},{"$f":"IF('Arrear Sheet'!Q21=\"\",\"\",IF('Arrear Sheet'!C21=\"TOTAL\",\"\",'Arrear Sheet'!Q21))","v":2370},{"$f":"IF('Arrear Sheet'!R21=\"\",\"\",IF('Arrear Sheet'!C21=\"TOTAL\",\"\",'Arrear Sheet'!R21))","v":2189},{"$f":"IF('Arrear Sheet'!S21=\"\",\"\",IF('Arrear Sheet'!C21=\"TOTAL\",\"\",'Arrear Sheet'!S21))","v":0},{"$f":"IF('Arrear Sheet'!T21=\"\",\"\",IF('Arrear Sheet'!C21=\"TOTAL\",\"\",'Arrear Sheet'!T21))","v":0},{"$f":"IF('Arrear Sheet'!U21=\"\",\"\",IF('Arrear Sheet'!C21=\"TOTAL\",\"\",'Arrear Sheet'!U21))","v":0},{"$f":"IF('Arrear Sheet'!V21=\"\",\"\",IF('Arrear Sheet'!C21=\"TOTAL\",\"\",'Arrear Sheet'!V21))","v":""},{"$f":"IF('Arrear Sheet'!W21=\"\",\"\",IF('Arrear Sheet'!C21=\"TOTAL\",\"\",'Arrear Sheet'!W21))","v":""},{"$f":"IF('Arrear Sheet'!X21=\"\",\"\",IF('Arrear Sheet'!C21=\"TOTAL\",\"\",'Arrear Sheet'!X21))","v":""},{"$f":"IF('Arrear Sheet'!Y21=\"\",\"\",IF('Arrear Sheet'!C21=\"TOTAL\",\"\",'Arrear Sheet'!Y21))","v":""},{"$f":"IF('Arrear Sheet'!Z21=\"\",\"\",IF('Arrear Sheet'!C21=\"TOTAL\",\"\",'Arrear Sheet'!Z21))","v":0},{"$f":"IF('Arrear Sheet'!AA21=\"\",\"\",IF('Arrear Sheet'!C21=\"TOTAL\",\"\",'Arrear Sheet'!AA21))","v":0},{"$f":"IF('Arrear Sheet'!AB21=\"\",\"\",IF('Arrear Sheet'!C21=\"TOTAL\",\"\",SUM(N21-Z21)))","v":25020}]
[{"$f":"IF('Arrear Sheet'!B22=\"\",\"\",'Arrear Sheet'!B22)","v":15},{"$f":"IF('Arrear Sheet'!C22=\"\",\"\",IF('Arrear Sheet'!C22=\"TOTAL\",\"\",'Arrear Sheet'!C22))","v":"2021-12-01"},{"$f":"IF('Arrear Sheet'!D22=\"\",\"\",IF('Arrear Sheet'!C22=\"TOTAL\",\"\",IF('Arrear Sheet'!D22=\"अक्षरें राशि :-\",\"\",'Arrear Sheet'!D22)))","v":34800},{"$f":"IF('Arrear Sheet'!E22=\"\",\"\",IF('Arrear Sheet'!C22=\"TOTAL\",\"\",'Arrear Sheet'!E22))","v":10788},{"$f":"IF('Arrear Sheet'!F22=\"\",\"\",IF('Arrear Sheet'!C22=\"TOTAL\",\"\",'Arrear Sheet'!F22))","v":3132},{"$f":"IF('Arrear Sheet'!G22=\"\",\"\",IF('Arrear Sheet'!C22=\"TOTAL\",\"\",SUM(C22:E22)))","v":48720},{"$f":"IF('Arrear Sheet'!H22=\"\",\"\",IF('Arrear Sheet'!C22=\"TOTAL\",\"\",'Arrear Sheet'!H22))","v":23700},{"$f":"IF('Arrear Sheet'!I22=\"\",\"\",IF('Arrear Sheet'!C22=\"TOTAL\",\"\",'Arrear Sheet'!I22))","v":0},{"$f":"IF('Arrear Sheet'!J22=\"\",\"\",IF('Arrear Sheet'!C22=\"TOTAL\",\"\",'Arrear Sheet'!J22))","v":0},{"$f":"IF('Arrear Sheet'!K22=\"\",\"\",IF('Arrear Sheet'!C22=\"TOTAL\",\"\",SUM(G22:I22)))","v":23700},{"$f":"IF('Arrear Sheet'!L22=\"\",\"\",IF('Arrear Sheet'!C22=\"TOTAL\",\"\",'Arrear Sheet'!L22))","v":11100},{"$f":"IF('Arrear Sheet'!M22=\"\",\"\",IF('Arrear Sheet'!C22=\"TOTAL\",\"\",'Arrear Sheet'!M22))","v":10788},{"$f":"IF('Arrear Sheet'!N22=\"\",\"\",IF('Arrear Sheet'!C22=\"TOTAL\",\"\",'Arrear Sheet'!N22))","v":3132},{"$f":"IF('Arrear Sheet'!O22=\"\",\"\",IF('Arrear Sheet'!C22=\"TOTAL\",\"\",SUM(K22:M22)))","v":25020},{"$f":"IF('Arrear Sheet'!P22=\"\",\"\",IF('Arrear Sheet'!C22=\"TOTAL\",\"\",'Arrear Sheet'!P22))","v":4559},{"$f":"IF('Arrear Sheet'!Q22=\"\",\"\",IF('Arrear Sheet'!C22=\"TOTAL\",\"\",'Arrear Sheet'!Q22))","v":2370},{"$f":"IF('Arrear Sheet'!R22=\"\",\"\",IF('Arrear Sheet'!C22=\"TOTAL\",\"\",'Arrear Sheet'!R22))","v":2189},{"$f":"IF('Arrear Sheet'!S22=\"\",\"\",IF('Arrear Sheet'!C22=\"TOTAL\",\"\",'Arrear Sheet'!S22))","v":0},{"$f":"IF('Arrear Sheet'!T22=\"\",\"\",IF('Arrear Sheet'!C22=\"TOTAL\",\"\",'Arrear Sheet'!T22))","v":0},{"$f":"IF('Arrear Sheet'!U22=\"\",\"\",IF('Arrear Sheet'!C22=\"TOTAL\",\"\",'Arrear Sheet'!U22))","v":0},{"$f":"IF('Arrear Sheet'!V22=\"\",\"\",IF('Arrear Sheet'!C22=\"TOTAL\",\"\",'Arrear Sheet'!V22))","v":""},{"$f":"IF('Arrear Sheet'!W22=\"\",\"\",IF('Arrear Sheet'!C22=\"TOTAL\",\"\",'Arrear Sheet'!W22))","v":""},{"$f":"IF('Arrear Sheet'!X22=\"\",\"\",IF('Arrear Sheet'!C22=\"TOTAL\",\"\",'Arrear Sheet'!X22))","v":""},{"$f":"IF('Arrear Sheet'!Y22=\"\",\"\",IF('Arrear Sheet'!C22=\"TOTAL\",\"\",'Arrear Sheet'!Y22))","v":""},{"$f":"IF('Arrear Sheet'!Z22=\"\",\"\",IF('Arrear Sheet'!C22=\"TOTAL\",\"\",'Arrear Sheet'!Z22))","v":0},{"$f":"IF('Arrear Sheet'!AA22=\"\",\"\",IF('Arrear Sheet'!C22=\"TOTAL\",\"\",'Arrear Sheet'!AA22))","v":0},{"$f":"IF('Arrear Sheet'!AB22=\"\",\"\",IF('Arrear Sheet'!C22=\"TOTAL\",\"\",SUM(N22-Z22)))","v":25020}]
[{"$f":"IF('Arrear Sheet'!B23=\"\",\"\",'Arrear Sheet'!B23)","v":16},{"$f":"IF('Arrear Sheet'!C23=\"\",\"\",IF('Arrear Sheet'!C23=\"TOTAL\",\"\",'Arrear Sheet'!C23))","v":"2022-01-01"},{"$f":"IF('Arrear Sheet'!D23=\"\",\"\",IF('Arrear Sheet'!C23=\"TOTAL\",\"\",IF('Arrear Sheet'!D23=\"अक्षरें राशि :-\",\"\",'Arrear Sheet'!D23)))","v":34800},{"$f":"IF('Arrear Sheet'!E23=\"\",\"\",IF('Arrear Sheet'!C23=\"TOTAL\",\"\",'Arrear Sheet'!E23))","v":11832},{"$f":"IF('Arrear Sheet'!F23=\"\",\"\",IF('Arrear Sheet'!C23=\"TOTAL\",\"\",'Arrear Sheet'!F23))","v":3132},{"$f":"IF('Arrear Sheet'!G23=\"\",\"\",IF('Arrear Sheet'!C23=\"TOTAL\",\"\",SUM(C23:E23)))","v":49764},{"$f":"IF('Arrear Sheet'!H23=\"\",\"\",IF('Arrear Sheet'!C23=\"TOTAL\",\"\",'Arrear Sheet'!H23))","v":23700},{"$f":"IF('Arrear Sheet'!I23=\"\",\"\",IF('Arrear Sheet'!C23=\"TOTAL\",\"\",'Arrear Sheet'!I23))","v":0},{"$f":"IF('Arrear Sheet'!J23=\"\",\"\",IF('Arrear Sheet'!C23=\"TOTAL\",\"\",'Arrear Sheet'!J23))","v":0},{"$f":"IF('Arrear Sheet'!K23=\"\",\"\",IF('Arrear Sheet'!C23=\"TOTAL\",\"\",SUM(G23:I23)))","v":23700},{"$f":"IF('Arrear Sheet'!L23=\"\",\"\",IF('Arrear Sheet'!C23=\"TOTAL\",\"\",'Arrear Sheet'!L23))","v":11100},{"$f":"IF('Arrear Sheet'!M23=\"\",\"\",IF('Arrear Sheet'!C23=\"TOTAL\",\"\",'Arrear Sheet'!M23))","v":11832},{"$f":"IF('Arrear Sheet'!N23=\"\",\"\",IF('Arrear Sheet'!C23=\"TOTAL\",\"\",'Arrear Sheet'!N23))","v":3132},{"$f":"IF('Arrear Sheet'!O23=\"\",\"\",IF('Arrear Sheet'!C23=\"TOTAL\",\"\",SUM(K23:M23)))","v":26064},{"$f":"IF('Arrear Sheet'!P23=\"\",\"\",IF('Arrear Sheet'!C23=\"TOTAL\",\"\",'Arrear Sheet'!P23))","v":4663},{"$f":"IF('Arrear Sheet'!Q23=\"\",\"\",IF('Arrear Sheet'!C23=\"TOTAL\",\"\",'Arrear Sheet'!Q23))","v":2370},{"$f":"IF('Arrear Sheet'!R23=\"\",\"\",IF('Arrear Sheet'!C23=\"TOTAL\",\"\",'Arrear Sheet'!R23))","v":2293},{"$f":"IF('Arrear Sheet'!S23=\"\",\"\",IF('Arrear Sheet'!C23=\"TOTAL\",\"\",'Arrear Sheet'!S23))","v":0},{"$f":"IF('Arrear Sheet'!T23=\"\",\"\",IF('Arrear Sheet'!C23=\"TOTAL\",\"\",'Arrear Sheet'!T23))","v":0},{"$f":"IF('Arrear Sheet'!U23=\"\",\"\",IF('Arrear Sheet'!C23=\"TOTAL\",\"\",'Arrear Sheet'!U23))","v":0},{"$f":"IF('Arrear Sheet'!V23=\"\",\"\",IF('Arrear Sheet'!C23=\"TOTAL\",\"\",'Arrear Sheet'!V23))","v":""},{"$f":"IF('Arrear Sheet'!W23=\"\",\"\",IF('Arrear Sheet'!C23=\"TOTAL\",\"\",'Arrear Sheet'!W23))","v":""},{"$f":"IF('Arrear Sheet'!X23=\"\",\"\",IF('Arrear Sheet'!C23=\"TOTAL\",\"\",'Arrear Sheet'!X23))","v":""},{"$f":"IF('Arrear Sheet'!Y23=\"\",\"\",IF('Arrear Sheet'!C23=\"TOTAL\",\"\",'Arrear Sheet'!Y23))","v":""},{"$f":"IF('Arrear Sheet'!Z23=\"\",\"\",IF('Arrear Sheet'!C23=\"TOTAL\",\"\",'Arrear Sheet'!Z23))","v":0},{"$f":"IF('Arrear Sheet'!AA23=\"\",\"\",IF('Arrear Sheet'!C23=\"TOTAL\",\"\",'Arrear Sheet'!AA23))","v":0},{"$f":"IF('Arrear Sheet'!AB23=\"\",\"\",IF('Arrear Sheet'!C23=\"TOTAL\",\"\",SUM(N23-Z23)))","v":26064}]
[{"$f":"IF('Arrear Sheet'!B24=\"\",\"\",'Arrear Sheet'!B24)","v":17},{"$f":"IF('Arrear Sheet'!C24=\"\",\"\",IF('Arrear Sheet'!C24=\"TOTAL\",\"\",'Arrear Sheet'!C24))","v":"2022-02-01"},{"$f":"IF('Arrear Sheet'!D24=\"\",\"\",IF('Arrear Sheet'!C24=\"TOTAL\",\"\",IF('Arrear Sheet'!D24=\"अक्षरें राशि :-\",\"\",'Arrear Sheet'!D24)))","v":34800},{"$f":"IF('Arrear Sheet'!E24=\"\",\"\",IF('Arrear Sheet'!C24=\"TOTAL\",\"\",'Arrear Sheet'!E24))","v":11832},{"$f":"IF('Arrear Sheet'!F24=\"\",\"\",IF('Arrear Sheet'!C24=\"TOTAL\",\"\",'Arrear Sheet'!F24))","v":3132},{"$f":"IF('Arrear Sheet'!G24=\"\",\"\",IF('Arrear Sheet'!C24=\"TOTAL\",\"\",SUM(C24:E24)))","v":49764},{"$f":"IF('Arrear Sheet'!H24=\"\",\"\",IF('Arrear Sheet'!C24=\"TOTAL\",\"\",'Arrear Sheet'!H24))","v":23700},{"$f":"IF('Arrear Sheet'!I24=\"\",\"\",IF('Arrear Sheet'!C24=\"TOTAL\",\"\",'Arrear Sheet'!I24))","v":0},{"$f":"IF('Arrear Sheet'!J24=\"\",\"\",IF('Arrear Sheet'!C24=\"TOTAL\",\"\",'Arrear Sheet'!J24))","v":0},{"$f":"IF('Arrear Sheet'!K24=\"\",\"\",IF('Arrear Sheet'!C24=\"TOTAL\",\"\",SUM(G24:I24)))","v":23700},{"$f":"IF('Arrear Sheet'!L24=\"\",\"\",IF('Arrear Sheet'!C24=\"TOTAL\",\"\",'Arrear Sheet'!L24))","v":11100},{"$f":"IF('Arrear Sheet'!M24=\"\",\"\",IF('Arrear Sheet'!C24=\"TOTAL\",\"\",'Arrear Sheet'!M24))","v":11832},{"$f":"IF('Arrear Sheet'!N24=\"\",\"\",IF('Arrear Sheet'!C24=\"TOTAL\",\"\",'Arrear Sheet'!N24))","v":3132},{"$f":"IF('Arrear Sheet'!O24=\"\",\"\",IF('Arrear Sheet'!C24=\"TOTAL\",\"\",SUM(K24:M24)))","v":26064},{"$f":"IF('Arrear Sheet'!P24=\"\",\"\",IF('Arrear Sheet'!C24=\"TOTAL\",\"\",'Arrear Sheet'!P24))","v":4663},{"$f":"IF('Arrear Sheet'!Q24=\"\",\"\",IF('Arrear Sheet'!C24=\"TOTAL\",\"\",'Arrear Sheet'!Q24))","v":2370},{"$f":"IF('Arrear Sheet'!R24=\"\",\"\",IF('Arrear Sheet'!C24=\"TOTAL\",\"\",'Arrear Sheet'!R24))","v":2293},{"$f":"IF('Arrear Sheet'!S24=\"\",\"\",IF('Arrear Sheet'!C24=\"TOTAL\",\"\",'Arrear Sheet'!S24))","v":0},{"$f":"IF('Arrear Sheet'!T24=\"\",\"\",IF('Arrear Sheet'!C24=\"TOTAL\",\"\",'Arrear Sheet'!T24))","v":0},{"$f":"IF('Arrear Sheet'!U24=\"\",\"\",IF('Arrear Sheet'!C24=\"TOTAL\",\"\",'Arrear Sheet'!U24))","v":0},{"$f":"IF('Arrear Sheet'!V24=\"\",\"\",IF('Arrear Sheet'!C24=\"TOTAL\",\"\",'Arrear Sheet'!V24))","v":""},{"$f":"IF('Arrear Sheet'!W24=\"\",\"\",IF('Arrear Sheet'!C24=\"TOTAL\",\"\",'Arrear Sheet'!W24))","v":""},{"$f":"IF('Arrear Sheet'!X24=\"\",\"\",IF('Arrear Sheet'!C24=\"TOTAL\",\"\",'Arrear Sheet'!X24))","v":""},{"$f":"IF('Arrear Sheet'!Y24=\"\",\"\",IF('Arrear Sheet'!C24=\"TOTAL\",\"\",'Arrear Sheet'!Y24))","v":""},{"$f":"IF('Arrear Sheet'!Z24=\"\",\"\",IF('Arrear Sheet'!C24=\"TOTAL\",\"\",'Arrear Sheet'!Z24))","v":0},{"$f":"IF('Arrear Sheet'!AA24=\"\",\"\",IF('Arrear Sheet'!C24=\"TOTAL\",\"\",'Arrear Sheet'!AA24))","v":0},{"$f":"IF('Arrear Sheet'!AB24=\"\",\"\",IF('Arrear Sheet'!C24=\"TOTAL\",\"\",SUM(N24-Z24)))","v":26064}]
[{"$f":"IF('Arrear Sheet'!B25=\"\",\"\",'Arrear Sheet'!B25)","v":18},{"$f":"IF('Arrear Sheet'!C25=\"\",\"\",IF('Arrear Sheet'!C25=\"TOTAL\",\"\",'Arrear Sheet'!C25))","v":"2022-03-01"},{"$f":"IF('Arrear Sheet'!D25=\"\",\"\",IF('Arrear Sheet'!C25=\"TOTAL\",\"\",IF('Arrear Sheet'!D25=\"अक्षरें राशि :-\",\"\",'Arrear Sheet'!D25)))","v":34800},{"$f":"IF('Arrear Sheet'!E25=\"\",\"\",IF('Arrear Sheet'!C25=\"TOTAL\",\"\",'Arrear Sheet'!E25))","v":11832},{"$f":"IF('Arrear Sheet'!F25=\"\",\"\",IF('Arrear Sheet'!C25=\"TOTAL\",\"\",'Arrear Sheet'!F25))","v":3132},{"$f":"IF('Arrear Sheet'!G25=\"\",\"\",IF('Arrear Sheet'!C25=\"TOTAL\",\"\",SUM(C25:E25)))","v":49764},{"$f":"IF('Arrear Sheet'!H25=\"\",\"\",IF('Arrear Sheet'!C25=\"TOTAL\",\"\",'Arrear Sheet'!H25))","v":23700},{"$f":"IF('Arrear Sheet'!I25=\"\",\"\",IF('Arrear Sheet'!C25=\"TOTAL\",\"\",'Arrear Sheet'!I25))","v":0},{"$f":"IF('Arrear Sheet'!J25=\"\",\"\",IF('Arrear Sheet'!C25=\"TOTAL\",\"\",'Arrear Sheet'!J25))","v":0},{"$f":"IF('Arrear Sheet'!K25=\"\",\"\",IF('Arrear Sheet'!C25=\"TOTAL\",\"\",SUM(G25:I25)))","v":23700},{"$f":"IF('Arrear Sheet'!L25=\"\",\"\",IF('Arrear Sheet'!C25=\"TOTAL\",\"\",'Arrear Sheet'!L25))","v":11100},{"$f":"IF('Arrear Sheet'!M25=\"\",\"\",IF('Arrear Sheet'!C25=\"TOTAL\",\"\",'Arrear Sheet'!M25))","v":11832},{"$f":"IF('Arrear Sheet'!N25=\"\",\"\",IF('Arrear Sheet'!C25=\"TOTAL\",\"\",'Arrear Sheet'!N25))","v":3132},{"$f":"IF('Arrear Sheet'!O25=\"\",\"\",IF('Arrear Sheet'!C25=\"TOTAL\",\"\",SUM(K25:M25)))","v":26064},{"$f":"IF('Arrear Sheet'!P25=\"\",\"\",IF('Arrear Sheet'!C25=\"TOTAL\",\"\",'Arrear Sheet'!P25))","v":4663},{"$f":"IF('Arrear Sheet'!Q25=\"\",\"\",IF('Arrear Sheet'!C25=\"TOTAL\",\"\",'Arrear Sheet'!Q25))","v":2370},{"$f":"IF('Arrear Sheet'!R25=\"\",\"\",IF('Arrear Sheet'!C25=\"TOTAL\",\"\",'Arrear Sheet'!R25))","v":2293},{"$f":"IF('Arrear Sheet'!S25=\"\",\"\",IF('Arrear Sheet'!C25=\"TOTAL\",\"\",'Arrear Sheet'!S25))","v":0},{"$f":"IF('Arrear Sheet'!T25=\"\",\"\",IF('Arrear Sheet'!C25=\"TOTAL\",\"\",'Arrear Sheet'!T25))","v":0},{"$f":"IF('Arrear Sheet'!U25=\"\",\"\",IF('Arrear Sheet'!C25=\"TOTAL\",\"\",'Arrear Sheet'!U25))","v":0},{"$f":"IF('Arrear Sheet'!V25=\"\",\"\",IF('Arrear Sheet'!C25=\"TOTAL\",\"\",'Arrear Sheet'!V25))","v":""},{"$f":"IF('Arrear Sheet'!W25=\"\",\"\",IF('Arrear Sheet'!C25=\"TOTAL\",\"\",'Arrear Sheet'!W25))","v":""},{"$f":"IF('Arrear Sheet'!X25=\"\",\"\",IF('Arrear Sheet'!C25=\"TOTAL\",\"\",'Arrear Sheet'!X25))","v":""},{"$f":"IF('Arrear Sheet'!Y25=\"\",\"\",IF('Arrear Sheet'!C25=\"TOTAL\",\"\",'Arrear Sheet'!Y25))","v":""},{"$f":"IF('Arrear Sheet'!Z25=\"\",\"\",IF('Arrear Sheet'!C25=\"TOTAL\",\"\",'Arrear Sheet'!Z25))","v":0},{"$f":"IF('Arrear Sheet'!AA25=\"\",\"\",IF('Arrear Sheet'!C25=\"TOTAL\",\"\",'Arrear Sheet'!AA25))","v":0},{"$f":"IF('Arrear Sheet'!AB25=\"\",\"\",IF('Arrear Sheet'!C25=\"TOTAL\",\"\",SUM(N25-Z25)))","v":26064}]
[{"$f":"IF('Arrear Sheet'!B26=\"\",\"\",'Arrear Sheet'!B26)","v":19},{"$f":"IF('Arrear Sheet'!C26=\"\",\"\",IF('Arrear Sheet'!C26=\"TOTAL\",\"\",'Arrear Sheet'!C26))","v":"2022-04-01"},{"$f":"IF('Arrear Sheet'!D26=\"\",\"\",IF('Arrear Sheet'!C26=\"TOTAL\",\"\",IF('Arrear Sheet'!D26=\"अक्षरें राशि :-\",\"\",'Arrear Sheet'!D26)))","v":34800},{"$f":"IF('Arrear Sheet'!E26=\"\",\"\",IF('Arrear Sheet'!C26=\"TOTAL\",\"\",'Arrear Sheet'!E26))","v":11832},{"$f":"IF('Arrear Sheet'!F26=\"\",\"\",IF('Arrear Sheet'!C26=\"TOTAL\",\"\",'Arrear Sheet'!F26))","v":3132},{"$f":"IF('Arrear Sheet'!G26=\"\",\"\",IF('Arrear Sheet'!C26=\"TOTAL\",\"\",SUM(C26:E26)))","v":49764},{"$f":"IF('Arrear Sheet'!H26=\"\",\"\",IF('Arrear Sheet'!C26=\"TOTAL\",\"\",'Arrear Sheet'!H26))","v":23700},{"$f":"IF('Arrear Sheet'!I26=\"\",\"\",IF('Arrear Sheet'!C26=\"TOTAL\",\"\",'Arrear Sheet'!I26))","v":0},{"$f":"IF('Arrear Sheet'!J26=\"\",\"\",IF('Arrear Sheet'!C26=\"TOTAL\",\"\",'Arrear Sheet'!J26))","v":0},{"$f":"IF('Arrear Sheet'!K26=\"\",\"\",IF('Arrear Sheet'!C26=\"TOTAL\",\"\",SUM(G26:I26)))","v":23700},{"$f":"IF('Arrear Sheet'!L26=\"\",\"\",IF('Arrear Sheet'!C26=\"TOTAL\",\"\",'Arrear Sheet'!L26))","v":11100},{"$f":"IF('Arrear Sheet'!M26=\"\",\"\",IF('Arrear Sheet'!C26=\"TOTAL\",\"\",'Arrear Sheet'!M26))","v":11832},{"$f":"IF('Arrear Sheet'!N26=\"\",\"\",IF('Arrear Sheet'!C26=\"TOTAL\",\"\",'Arrear Sheet'!N26))","v":3132},{"$f":"IF('Arrear Sheet'!O26=\"\",\"\",IF('Arrear Sheet'!C26=\"TOTAL\",\"\",SUM(K26:M26)))","v":26064},{"$f":"IF('Arrear Sheet'!P26=\"\",\"\",IF('Arrear Sheet'!C26=\"TOTAL\",\"\",'Arrear Sheet'!P26))","v":2100},{"$f":"IF('Arrear Sheet'!Q26=\"\",\"\",IF('Arrear Sheet'!C26=\"TOTAL\",\"\",'Arrear Sheet'!Q26))","v":2100},{"$f":"IF('Arrear Sheet'!R26=\"\",\"\",IF('Arrear Sheet'!C26=\"TOTAL\",\"\",'Arrear Sheet'!R26))","v":0},{"$f":"IF('Arrear Sheet'!S26=\"\",\"\",IF('Arrear Sheet'!C26=\"TOTAL\",\"\",'Arrear Sheet'!S26))","v":0},{"$f":"IF('Arrear Sheet'!T26=\"\",\"\",IF('Arrear Sheet'!C26=\"TOTAL\",\"\",'Arrear Sheet'!T26))","v":0},{"$f":"IF('Arrear Sheet'!U26=\"\",\"\",IF('Arrear Sheet'!C26=\"TOTAL\",\"\",'Arrear Sheet'!U26))","v":0},{"$f":"IF('Arrear Sheet'!V26=\"\",\"\",IF('Arrear Sheet'!C26=\"TOTAL\",\"\",'Arrear Sheet'!V26))","v":""},{"$f":"IF('Arrear Sheet'!W26=\"\",\"\",IF('Arrear Sheet'!C26=\"TOTAL\",\"\",'Arrear Sheet'!W26))","v":""},{"$f":"IF('Arrear Sheet'!X26=\"\",\"\",IF('Arrear Sheet'!C26=\"TOTAL\",\"\",'Arrear Sheet'!X26))","v":""},{"$f":"IF('Arrear Sheet'!Y26=\"\",\"\",IF('Arrear Sheet'!C26=\"TOTAL\",\"\",'Arrear Sheet'!Y26))","v":""},{"$f":"IF('Arrear Sheet'!Z26=\"\",\"\",IF('Arrear Sheet'!C26=\"TOTAL\",\"\",'Arrear Sheet'!Z26))","v":0},{"$f":"IF('Arrear Sheet'!AA26=\"\",\"\",IF('Arrear Sheet'!C26=\"TOTAL\",\"\",'Arrear Sheet'!AA26))","v":0},{"$f":"IF('Arrear Sheet'!AB26=\"\",\"\",IF('Arrear Sheet'!C26=\"TOTAL\",\"\",SUM(N26-Z26)))","v":26064}]
[{"$f":"IF('Arrear Sheet'!B27=\"\",\"\",'Arrear Sheet'!B27)","v":20},{"$f":"IF('Arrear Sheet'!C27=\"\",\"\",IF('Arrear Sheet'!C27=\"TOTAL\",\"\",'Arrear Sheet'!C27))","v":"2022-05-01"},{"$f":"IF('Arrear Sheet'!D27=\"\",\"\",IF('Arrear Sheet'!C27=\"TOTAL\",\"\",IF('Arrear Sheet'!D27=\"अक्षरें राशि :-\",\"\",'Arrear Sheet'!D27)))","v":34800},{"$f":"IF('Arrear Sheet'!E27=\"\",\"\",IF('Arrear Sheet'!C27=\"TOTAL\",\"\",'Arrear Sheet'!E27))","v":11832},{"$f":"IF('Arrear Sheet'!F27=\"\",\"\",IF('Arrear Sheet'!C27=\"TOTAL\",\"\",'Arrear Sheet'!F27))","v":3132},{"$f":"IF('Arrear Sheet'!G27=\"\",\"\",IF('Arrear Sheet'!C27=\"TOTAL\",\"\",SUM(C27:E27)))","v":49764},{"$f":"IF('Arrear Sheet'!H27=\"\",\"\",IF('Arrear Sheet'!C27=\"TOTAL\",\"\",'Arrear Sheet'!H27))","v":23700},{"$f":"IF('Arrear Sheet'!I27=\"\",\"\",IF('Arrear Sheet'!C27=\"TOTAL\",\"\",'Arrear Sheet'!I27))","v":0},{"$f":"IF('Arrear Sheet'!J27=\"\",\"\",IF('Arrear Sheet'!C27=\"TOTAL\",\"\",'Arrear Sheet'!J27))","v":0},{"$f":"IF('Arrear Sheet'!K27=\"\",\"\",IF('Arrear Sheet'!C27=\"TOTAL\",\"\",SUM(G27:I27)))","v":23700},{"$f":"IF('Arrear Sheet'!L27=\"\",\"\",IF('Arrear Sheet'!C27=\"TOTAL\",\"\",'Arrear Sheet'!L27))","v":11100},{"$f":"IF('Arrear Sheet'!M27=\"\",\"\",IF('Arrear Sheet'!C27=\"TOTAL\",\"\",'Arrear Sheet'!M27))","v":11832},{"$f":"IF('Arrear Sheet'!N27=\"\",\"\",IF('Arrear Sheet'!C27=\"TOTAL\",\"\",'Arrear Sheet'!N27))","v":3132},{"$f":"IF('Arrear Sheet'!O27=\"\",\"\",IF('Arrear Sheet'!C27=\"TOTAL\",\"\",SUM(K27:M27)))","v":26064},{"$f":"IF('Arrear Sheet'!P27=\"\",\"\",IF('Arrear Sheet'!C27=\"TOTAL\",\"\",'Arrear Sheet'!P27))","v":2100},{"$f":"IF('Arrear Sheet'!Q27=\"\",\"\",IF('Arrear Sheet'!C27=\"TOTAL\",\"\",'Arrear Sheet'!Q27))","v":2100},{"$f":"IF('Arrear Sheet'!R27=\"\",\"\",IF('Arrear Sheet'!C27=\"TOTAL\",\"\",'Arrear Sheet'!R27))","v":0},{"$f":"IF('Arrear Sheet'!S27=\"\",\"\",IF('Arrear Sheet'!C27=\"TOTAL\",\"\",'Arrear Sheet'!S27))","v":0},{"$f":"IF('Arrear Sheet'!T27=\"\",\"\",IF('Arrear Sheet'!C27=\"TOTAL\",\"\",'Arrear Sheet'!T27))","v":0},{"$f":"IF('Arrear Sheet'!U27=\"\",\"\",IF('Arrear Sheet'!C27=\"TOTAL\",\"\",'Arrear Sheet'!U27))","v":0},{"$f":"IF('Arrear Sheet'!V27=\"\",\"\",IF('Arrear Sheet'!C27=\"TOTAL\",\"\",'Arrear Sheet'!V27))","v":""},{"$f":"IF('Arrear Sheet'!W27=\"\",\"\",IF('Arrear Sheet'!C27=\"TOTAL\",\"\",'Arrear Sheet'!W27))","v":""},{"$f":"IF('Arrear Sheet'!X27=\"\",\"\",IF('Arrear Sheet'!C27=\"TOTAL\",\"\",'Arrear Sheet'!X27))","v":""},{"$f":"IF('Arrear Sheet'!Y27=\"\",\"\",IF('Arrear Sheet'!C27=\"TOTAL\",\"\",'Arrear Sheet'!Y27))","v":""},{"$f":"IF('Arrear Sheet'!Z27=\"\",\"\",IF('Arrear Sheet'!C27=\"TOTAL\",\"\",'Arrear Sheet'!Z27))","v":0},{"$f":"IF('Arrear Sheet'!AA27=\"\",\"\",IF('Arrear Sheet'!C27=\"TOTAL\",\"\",'Arrear Sheet'!AA27))","v":0},{"$f":"IF('Arrear Sheet'!AB27=\"\",\"\",IF('Arrear Sheet'!C27=\"TOTAL\",\"\",SUM(N27-Z27)))","v":26064}]
[{"$f":"IF('Arrear Sheet'!B28=\"\",\"\",'Arrear Sheet'!B28)","v":21},{"$f":"IF('Arrear Sheet'!C28=\"\",\"\",IF('Arrear Sheet'!C28=\"TOTAL\",\"\",'Arrear Sheet'!C28))","v":"2022-06-01"},{"$f":"IF('Arrear Sheet'!D28=\"\",\"\",IF('Arrear Sheet'!C28=\"TOTAL\",\"\",IF('Arrear Sheet'!D28=\"अक्षरें राशि :-\",\"\",'Arrear Sheet'!D28)))","v":34800},{"$f":"IF('Arrear Sheet'!E28=\"\",\"\",IF('Arrear Sheet'!C28=\"TOTAL\",\"\",'Arrear Sheet'!E28))","v":11832},{"$f":"IF('Arrear Sheet'!F28=\"\",\"\",IF('Arrear Sheet'!C28=\"TOTAL\",\"\",'Arrear Sheet'!F28))","v":3132},{"$f":"IF('Arrear Sheet'!G28=\"\",\"\",IF('Arrear Sheet'!C28=\"TOTAL\",\"\",SUM(C28:E28)))","v":49764},{"$f":"IF('Arrear Sheet'!H28=\"\",\"\",IF('Arrear Sheet'!C28=\"TOTAL\",\"\",'Arrear Sheet'!H28))","v":23700},{"$f":"IF('Arrear Sheet'!I28=\"\",\"\",IF('Arrear Sheet'!C28=\"TOTAL\",\"\",'Arrear Sheet'!I28))","v":0},{"$f":"IF('Arrear Sheet'!J28=\"\",\"\",IF('Arrear Sheet'!C28=\"TOTAL\",\"\",'Arrear Sheet'!J28))","v":0},{"$f":"IF('Arrear Sheet'!K28=\"\",\"\",IF('Arrear Sheet'!C28=\"TOTAL\",\"\",SUM(G28:I28)))","v":23700},{"$f":"IF('Arrear Sheet'!L28=\"\",\"\",IF('Arrear Sheet'!C28=\"TOTAL\",\"\",'Arrear Sheet'!L28))","v":11100},{"$f":"IF('Arrear Sheet'!M28=\"\",\"\",IF('Arrear Sheet'!C28=\"TOTAL\",\"\",'Arrear Sheet'!M28))","v":11832},{"$f":"IF('Arrear Sheet'!N28=\"\",\"\",IF('Arrear Sheet'!C28=\"TOTAL\",\"\",'Arrear Sheet'!N28))","v":3132},{"$f":"IF('Arrear Sheet'!O28=\"\",\"\",IF('Arrear Sheet'!C28=\"TOTAL\",\"\",SUM(K28:M28)))","v":26064},{"$f":"IF('Arrear Sheet'!P28=\"\",\"\",IF('Arrear Sheet'!C28=\"TOTAL\",\"\",'Arrear Sheet'!P28))","v":2100},{"$f":"IF('Arrear Sheet'!Q28=\"\",\"\",IF('Arrear Sheet'!C28=\"TOTAL\",\"\",'Arrear Sheet'!Q28))","v":2100},{"$f":"IF('Arrear Sheet'!R28=\"\",\"\",IF('Arrear Sheet'!C28=\"TOTAL\",\"\",'Arrear Sheet'!R28))","v":0},{"$f":"IF('Arrear Sheet'!S28=\"\",\"\",IF('Arrear Sheet'!C28=\"TOTAL\",\"\",'Arrear Sheet'!S28))","v":0},{"$f":"IF('Arrear Sheet'!T28=\"\",\"\",IF('Arrear Sheet'!C28=\"TOTAL\",\"\",'Arrear Sheet'!T28))","v":0},{"$f":"IF('Arrear Sheet'!U28=\"\",\"\",IF('Arrear Sheet'!C28=\"TOTAL\",\"\",'Arrear Sheet'!U28))","v":0},{"$f":"IF('Arrear Sheet'!V28=\"\",\"\",IF('Arrear Sheet'!C28=\"TOTAL\",\"\",'Arrear Sheet'!V28))","v":""},{"$f":"IF('Arrear Sheet'!W28=\"\",\"\",IF('Arrear Sheet'!C28=\"TOTAL\",\"\",'Arrear Sheet'!W28))","v":""},{"$f":"IF('Arrear Sheet'!X28=\"\",\"\",IF('Arrear Sheet'!C28=\"TOTAL\",\"\",'Arrear Sheet'!X28))","v":""},{"$f":"IF('Arrear Sheet'!Y28=\"\",\"\",IF('Arrear Sheet'!C28=\"TOTAL\",\"\",'Arrear Sheet'!Y28))","v":""},{"$f":"IF('Arrear Sheet'!Z28=\"\",\"\",IF('Arrear Sheet'!C28=\"TOTAL\",\"\",'Arrear Sheet'!Z28))","v":0},{"$f":"IF('Arrear Sheet'!AA28=\"\",\"\",IF('Arrear Sheet'!C28=\"TOTAL\",\"\",'Arrear Sheet'!AA28))","v":0},{"$f":"IF('Arrear Sheet'!AB28=\"\",\"\",IF('Arrear Sheet'!C28=\"TOTAL\",\"\",SUM(N28-Z28)))","v":26064}]
[{"$f":"IF('Arrear Sheet'!B29=\"\",\"\",'Arrear Sheet'!B29)","v":""},{"$f":"IF('Arrear Sheet'!C29=\"\",\"\",IF('Arrear Sheet'!C29=\"TOTAL\",\"\",'Arrear Sheet'!C29))","v":""},{"$f":"IF('Arrear Sheet'!D29=\"\",\"\",IF('Arrear Sheet'!C29=\"TOTAL\",\"\",IF('Arrear Sheet'!D29=\"अक्षरें राशि :-\",\"\",'Arrear Sheet'!D29)))","v":""},{"$f":"IF('Arrear Sheet'!E29=\"\",\"\",IF('Arrear Sheet'!C29=\"TOTAL\",\"\",'Arrear Sheet'!E29))","v":""},{"$f":"IF('Arrear Sheet'!F29=\"\",\"\",IF('Arrear Sheet'!C29=\"TOTAL\",\"\",'Arrear Sheet'!F29))","v":""},{"$f":"IF('Arrear Sheet'!G29=\"\",\"\",IF('Arrear Sheet'!C29=\"TOTAL\",\"\",SUM(C29:E29)))","v":""},{"$f":"IF('Arrear Sheet'!H29=\"\",\"\",IF('Arrear Sheet'!C29=\"TOTAL\",\"\",'Arrear Sheet'!H29))","v":""},{"$f":"IF('Arrear Sheet'!I29=\"\",\"\",IF('Arrear Sheet'!C29=\"TOTAL\",\"\",'Arrear Sheet'!I29))","v":""},{"$f":"IF('Arrear Sheet'!J29=\"\",\"\",IF('Arrear Sheet'!C29=\"TOTAL\",\"\",'Arrear Sheet'!J29))","v":""},{"$f":"IF('Arrear Sheet'!K29=\"\",\"\",IF('Arrear Sheet'!C29=\"TOTAL\",\"\",SUM(G29:I29)))","v":""},{"$f":"IF('Arrear Sheet'!L29=\"\",\"\",IF('Arrear Sheet'!C29=\"TOTAL\",\"\",'Arrear Sheet'!L29))","v":""},{"$f":"IF('Arrear Sheet'!M29=\"\",\"\",IF('Arrear Sheet'!C29=\"TOTAL\",\"\",'Arrear Sheet'!M29))","v":""},{"$f":"IF('Arrear Sheet'!N29=\"\",\"\",IF('Arrear Sheet'!C29=\"TOTAL\",\"\",'Arrear Sheet'!N29))","v":""},{"$f":"IF('Arrear Sheet'!O29=\"\",\"\",IF('Arrear Sheet'!C29=\"TOTAL\",\"\",SUM(K29:M29)))","v":""},{"$f":"IF('Arrear Sheet'!P29=\"\",\"\",IF('Arrear Sheet'!C29=\"TOTAL\",\"\",'Arrear Sheet'!P29))","v":""},{"$f":"IF('Arrear Sheet'!Q29=\"\",\"\",IF('Arrear Sheet'!C29=\"TOTAL\",\"\",'Arrear Sheet'!Q29))","v":""},{"$f":"IF('Arrear Sheet'!R29=\"\",\"\",IF('Arrear Sheet'!C29=\"TOTAL\",\"\",'Arrear Sheet'!R29))","v":""},{"$f":"IF('Arrear Sheet'!S29=\"\",\"\",IF('Arrear Sheet'!C29=\"TOTAL\",\"\",'Arrear Sheet'!S29))","v":""},{"$f":"IF('Arrear Sheet'!T29=\"\",\"\",IF('Arrear Sheet'!C29=\"TOTAL\",\"\",'Arrear Sheet'!T29))","v":""},{"$f":"IF('Arrear Sheet'!U29=\"\",\"\",IF('Arrear Sheet'!C29=\"TOTAL\",\"\",'Arrear Sheet'!U29))","v":""},{"$f":"IF('Arrear Sheet'!V29=\"\",\"\",IF('Arrear Sheet'!C29=\"TOTAL\",\"\",'Arrear Sheet'!V29))","v":""},{"$f":"IF('Arrear Sheet'!W29=\"\",\"\",IF('Arrear Sheet'!C29=\"TOTAL\",\"\",'Arrear Sheet'!W29))","v":""},{"$f":"IF('Arrear Sheet'!X29=\"\",\"\",IF('Arrear Sheet'!C29=\"TOTAL\",\"\",'Arrear Sheet'!X29))","v":""},{"$f":"IF('Arrear Sheet'!Y29=\"\",\"\",IF('Arrear Sheet'!C29=\"TOTAL\",\"\",'Arrear Sheet'!Y29))","v":""},{"$f":"IF('Arrear Sheet'!Z29=\"\",\"\",IF('Arrear Sheet'!C29=\"TOTAL\",\"\",'Arrear Sheet'!Z29))","v":""},{"$f":"IF('Arrear Sheet'!AA29=\"\",\"\",IF('Arrear Sheet'!C29=\"TOTAL\",\"\",'Arrear Sheet'!AA29))","v":""},{"$f":"IF('Arrear Sheet'!AB29=\"\",\"\",IF('Arrear Sheet'!C29=\"TOTAL\",\"\",SUM(N29-Z29)))","v":""}]
[{"$f":"IF('Arrear Sheet'!B30=\"\",\"\",'Arrear Sheet'!B30)","v":""},{"$f":"IF('Arrear Sheet'!C30=\"\",\"\",IF('Arrear Sheet'!C30=\"TOTAL\",\"\",'Arrear Sheet'!C30))","v":""},{"$f":"IF('Arrear Sheet'!D30=\"\",\"\",IF('Arrear Sheet'!C30=\"TOTAL\",\"\",IF('Arrear Sheet'!D30=\"अक्षरें राशि :-\",\"\",'Arrear Sheet'!D30)))","v":""},{"$f":"IF('Arrear Sheet'!E30=\"\",\"\",IF('Arrear Sheet'!C30=\"TOTAL\",\"\",'Arrear Sheet'!E30))","v":""},{"$f":"IF('Arrear Sheet'!F30=\"\",\"\",IF('Arrear Sheet'!C30=\"TOTAL\",\"\",'Arrear Sheet'!F30))","v":""},{"$f":"IF('Arrear Sheet'!G30=\"\",\"\",IF('Arrear Sheet'!C30=\"TOTAL\",\"\",SUM(C30:E30)))","v":""},{"$f":"IF('Arrear Sheet'!H30=\"\",\"\",IF('Arrear Sheet'!C30=\"TOTAL\",\"\",'Arrear Sheet'!H30))","v":""},{"$f":"IF('Arrear Sheet'!I30=\"\",\"\",IF('Arrear Sheet'!C30=\"TOTAL\",\"\",'Arrear Sheet'!I30))","v":""},{"$f":"IF('Arrear Sheet'!J30=\"\",\"\",IF('Arrear Sheet'!C30=\"TOTAL\",\"\",'Arrear Sheet'!J30))","v":""},{"$f":"IF('Arrear Sheet'!K30=\"\",\"\",IF('Arrear Sheet'!C30=\"TOTAL\",\"\",SUM(G30:I30)))","v":""},{"$f":"IF('Arrear Sheet'!L30=\"\",\"\",IF('Arrear Sheet'!C30=\"TOTAL\",\"\",'Arrear Sheet'!L30))","v":""},{"$f":"IF('Arrear Sheet'!M30=\"\",\"\",IF('Arrear Sheet'!C30=\"TOTAL\",\"\",'Arrear Sheet'!M30))","v":""},{"$f":"IF('Arrear Sheet'!N30=\"\",\"\",IF('Arrear Sheet'!C30=\"TOTAL\",\"\",'Arrear Sheet'!N30))","v":""},{"$f":"IF('Arrear Sheet'!O30=\"\",\"\",IF('Arrear Sheet'!C30=\"TOTAL\",\"\",SUM(K30:M30)))","v":""},{"$f":"IF('Arrear Sheet'!P30=\"\",\"\",IF('Arrear Sheet'!C30=\"TOTAL\",\"\",'Arrear Sheet'!P30))","v":""},{"$f":"IF('Arrear Sheet'!Q30=\"\",\"\",IF('Arrear Sheet'!C30=\"TOTAL\",\"\",'Arrear Sheet'!Q30))","v":""},{"$f":"IF('Arrear Sheet'!R30=\"\",\"\",IF('Arrear Sheet'!C30=\"TOTAL\",\"\",'Arrear Sheet'!R30))","v":""},{"$f":"IF('Arrear Sheet'!S30=\"\",\"\",IF('Arrear Sheet'!C30=\"TOTAL\",\"\",'Arrear Sheet'!S30))","v":""},{"$f":"IF('Arrear Sheet'!T30=\"\",\"\",IF('Arrear Sheet'!C30=\"TOTAL\",\"\",'Arrear Sheet'!T30))","v":""},{"$f":"IF('Arrear Sheet'!U30=\"\",\"\",IF('Arrear Sheet'!C30=\"TOTAL\",\"\",'Arrear Sheet'!U30))","v":""},{"$f":"IF('Arrear Sheet'!V30=\"\",\"\",IF('Arrear Sheet'!C30=\"TOTAL\",\"\",'Arrear Sheet'!V30))","v":""},{"$f":"IF('Arrear Sheet'!W30=\"\",\"\",IF('Arrear Sheet'!C30=\"TOTAL\",\"\",'Arrear Sheet'!W30))","v":""},{"$f":"IF('Arrear Sheet'!X30=\"\",\"\",IF('Arrear Sheet'!C30=\"TOTAL\",\"\",'Arrear Sheet'!X30))","v":""},{"$f":"IF('Arrear Sheet'!Y30=\"\",\"\",IF('Arrear Sheet'!C30=\"TOTAL\",\"\",'Arrear Sheet'!Y30))","v":""},{"$f":"IF('Arrear Sheet'!Z30=\"\",\"\",IF('Arrear Sheet'!C30=\"TOTAL\",\"\",'Arrear Sheet'!Z30))","v":""},{"$f":"IF('Arrear Sheet'!AA30=\"\",\"\",IF('Arrear Sheet'!C30=\"TOTAL\",\"\",'Arrear Sheet'!AA30))","v":""},{"$f":"IF('Arrear Sheet'!AB30=\"\",\"\",IF('Arrear Sheet'!C30=\"TOTAL\",\"\",SUM(N30-Z30)))","v":""}]
[{"$f":"IF('Arrear Sheet'!B31=\"\",\"\",'Arrear Sheet'!B31)","v":""},{"$f":"IF('Arrear Sheet'!C31=\"\",\"\",IF('Arrear Sheet'!C31=\"TOTAL\",\"\",'Arrear Sheet'!C31))","v":""},{"$f":"IF('Arrear Sheet'!D31=\"\",\"\",IF('Arrear Sheet'!C31=\"TOTAL\",\"\",IF('Arrear Sheet'!D31=\"अक्षरें राशि :-\",\"\",'Arrear Sheet'!D31)))","v":""},{"$f":"IF('Arrear Sheet'!E31=\"\",\"\",IF('Arrear Sheet'!C31=\"TOTAL\",\"\",'Arrear Sheet'!E31))","v":""},{"$f":"IF('Arrear Sheet'!F31=\"\",\"\",IF('Arrear Sheet'!C31=\"TOTAL\",\"\",'Arrear Sheet'!F31))","v":""},{"$f":"IF('Arrear Sheet'!G31=\"\",\"\",IF('Arrear Sheet'!C31=\"TOTAL\",\"\",SUM(C31:E31)))","v":""},{"$f":"IF('Arrear Sheet'!H31=\"\",\"\",IF('Arrear Sheet'!C31=\"TOTAL\",\"\",'Arrear Sheet'!H31))","v":""},{"$f":"IF('Arrear Sheet'!I31=\"\",\"\",IF('Arrear Sheet'!C31=\"TOTAL\",\"\",'Arrear Sheet'!I31))","v":""},{"$f":"IF('Arrear Sheet'!J31=\"\",\"\",IF('Arrear Sheet'!C31=\"TOTAL\",\"\",'Arrear Sheet'!J31))","v":""},{"$f":"IF('Arrear Sheet'!K31=\"\",\"\",IF('Arrear Sheet'!C31=\"TOTAL\",\"\",SUM(G31:I31)))","v":""},{"$f":"IF('Arrear Sheet'!L31=\"\",\"\",IF('Arrear Sheet'!C31=\"TOTAL\",\"\",'Arrear Sheet'!L31))","v":""},{"$f":"IF('Arrear Sheet'!M31=\"\",\"\",IF('Arrear Sheet'!C31=\"TOTAL\",\"\",'Arrear Sheet'!M31))","v":""},{"$f":"IF('Arrear Sheet'!N31=\"\",\"\",IF('Arrear Sheet'!C31=\"TOTAL\",\"\",'Arrear Sheet'!N31))","v":""},{"$f":"IF('Arrear Sheet'!O31=\"\",\"\",IF('Arrear Sheet'!C31=\"TOTAL\",\"\",SUM(K31:M31)))","v":""},{"$f":"IF('Arrear Sheet'!P31=\"\",\"\",IF('Arrear Sheet'!C31=\"TOTAL\",\"\",'Arrear Sheet'!P31))","v":""},{"$f":"IF('Arrear Sheet'!Q31=\"\",\"\",IF('Arrear Sheet'!C31=\"TOTAL\",\"\",'Arrear Sheet'!Q31))","v":""},{"$f":"IF('Arrear Sheet'!R31=\"\",\"\",IF('Arrear Sheet'!C31=\"TOTAL\",\"\",'Arrear Sheet'!R31))","v":""},{"$f":"IF('Arrear Sheet'!S31=\"\",\"\",IF('Arrear Sheet'!C31=\"TOTAL\",\"\",'Arrear Sheet'!S31))","v":""},{"$f":"IF('Arrear Sheet'!T31=\"\",\"\",IF('Arrear Sheet'!C31=\"TOTAL\",\"\",'Arrear Sheet'!T31))","v":""},{"$f":"IF('Arrear Sheet'!U31=\"\",\"\",IF('Arrear Sheet'!C31=\"TOTAL\",\"\",'Arrear Sheet'!U31))","v":""},{"$f":"IF('Arrear Sheet'!V31=\"\",\"\",IF('Arrear Sheet'!C31=\"TOTAL\",\"\",'Arrear Sheet'!V31))","v":""},{"$f":"IF('Arrear Sheet'!W31=\"\",\"\",IF('Arrear Sheet'!C31=\"TOTAL\",\"\",'Arrear Sheet'!W31))","v":""},{"$f":"IF('Arrear Sheet'!X31=\"\",\"\",IF('Arrear Sheet'!C31=\"TOTAL\",\"\",'Arrear Sheet'!X31))","v":""},{"$f":"IF('Arrear Sheet'!Y31=\"\",\"\",IF('Arrear Sheet'!C31=\"TOTAL\",\"\",'Arrear Sheet'!Y31))","v":""},{"$f":"IF('Arrear Sheet'!Z31=\"\",\"\",IF('Arrear Sheet'!C31=\"TOTAL\",\"\",'Arrear Sheet'!Z31))","v":""},{"$f":"IF('Arrear Sheet'!AA31=\"\",\"\",IF('Arrear Sheet'!C31=\"TOTAL\",\"\",'Arrear Sheet'!AA31))","v":""},{"$f":"IF('Arrear Sheet'!AB31=\"\",\"\",IF('Arrear Sheet'!C31=\"TOTAL\",\"\",SUM(N31-Z31)))","v":""}]
[{"$f":"IF('Arrear Sheet'!B32=\"\",\"\",'Arrear Sheet'!B32)","v":""},{"$f":"IF('Arrear Sheet'!C32=\"\",\"\",IF('Arrear Sheet'!C32=\"TOTAL\",\"\",'Arrear Sheet'!C32))","v":""},{"$f":"IF('Arrear Sheet'!D32=\"\",\"\",IF('Arrear Sheet'!C32=\"TOTAL\",\"\",IF('Arrear Sheet'!D32=\"अक्षरें राशि :-\",\"\",'Arrear Sheet'!D32)))","v":""},{"$f":"IF('Arrear Sheet'!E32=\"\",\"\",IF('Arrear Sheet'!C32=\"TOTAL\",\"\",'Arrear Sheet'!E32))","v":""},{"$f":"IF('Arrear Sheet'!F32=\"\",\"\",IF('Arrear Sheet'!C32=\"TOTAL\",\"\",'Arrear Sheet'!F32))","v":""},{"$f":"IF('Arrear Sheet'!G32=\"\",\"\",IF('Arrear Sheet'!C32=\"TOTAL\",\"\",SUM(C32:E32)))","v":""},{"$f":"IF('Arrear Sheet'!H32=\"\",\"\",IF('Arrear Sheet'!C32=\"TOTAL\",\"\",'Arrear Sheet'!H32))","v":""},{"$f":"IF('Arrear Sheet'!I32=\"\",\"\",IF('Arrear Sheet'!C32=\"TOTAL\",\"\",'Arrear Sheet'!I32))","v":""},{"$f":"IF('Arrear Sheet'!J32=\"\",\"\",IF('Arrear Sheet'!C32=\"TOTAL\",\"\",'Arrear Sheet'!J32))","v":""},{"$f":"IF('Arrear Sheet'!K32=\"\",\"\",IF('Arrear Sheet'!C32=\"TOTAL\",\"\",SUM(G32:I32)))","v":""},{"$f":"IF('Arrear Sheet'!L32=\"\",\"\",IF('Arrear Sheet'!C32=\"TOTAL\",\"\",'Arrear Sheet'!L32))","v":""},{"$f":"IF('Arrear Sheet'!M32=\"\",\"\",IF('Arrear Sheet'!C32=\"TOTAL\",\"\",'Arrear Sheet'!M32))","v":""},{"$f":"IF('Arrear Sheet'!N32=\"\",\"\",IF('Arrear Sheet'!C32=\"TOTAL\",\"\",'Arrear Sheet'!N32))","v":""},{"$f":"IF('Arrear Sheet'!O32=\"\",\"\",IF('Arrear Sheet'!C32=\"TOTAL\",\"\",SUM(K32:M32)))","v":""},{"$f":"IF('Arrear Sheet'!P32=\"\",\"\",IF('Arrear Sheet'!C32=\"TOTAL\",\"\",'Arrear Sheet'!P32))","v":""},{"$f":"IF('Arrear Sheet'!Q32=\"\",\"\",IF('Arrear Sheet'!C32=\"TOTAL\",\"\",'Arrear Sheet'!Q32))","v":""},{"$f":"IF('Arrear Sheet'!R32=\"\",\"\",IF('Arrear Sheet'!C32=\"TOTAL\",\"\",'Arrear Sheet'!R32))","v":""},{"$f":"IF('Arrear Sheet'!S32=\"\",\"\",IF('Arrear Sheet'!C32=\"TOTAL\",\"\",'Arrear Sheet'!S32))","v":""},{"$f":"IF('Arrear Sheet'!T32=\"\",\"\",IF('Arrear Sheet'!C32=\"TOTAL\",\"\",'Arrear Sheet'!T32))","v":""},{"$f":"IF('Arrear Sheet'!U32=\"\",\"\",IF('Arrear Sheet'!C32=\"TOTAL\",\"\",'Arrear Sheet'!U32))","v":""},{"$f":"IF('Arrear Sheet'!V32=\"\",\"\",IF('Arrear Sheet'!C32=\"TOTAL\",\"\",'Arrear Sheet'!V32))","v":""},{"$f":"IF('Arrear Sheet'!W32=\"\",\"\",IF('Arrear Sheet'!C32=\"TOTAL\",\"\",'Arrear Sheet'!W32))","v":""},{"$f":"IF('Arrear Sheet'!X32=\"\",\"\",IF('Arrear Sheet'!C32=\"TOTAL\",\"\",'Arrear Sheet'!X32))","v":""},{"$f":"IF('Arrear Sheet'!Y32=\"\",\"\",IF('Arrear Sheet'!C32=\"TOTAL\",\"\",'Arrear Sheet'!Y32))","v":""},{"$f":"IF('Arrear Sheet'!Z32=\"\",\"\",IF('Arrear Sheet'!C32=\"TOTAL\",\"\",'Arrear Sheet'!Z32))","v":""},{"$f":"IF('Arrear Sheet'!AA32=\"\",\"\",IF('Arrear Sheet'!C32=\"TOTAL\",\"\",'Arrear Sheet'!AA32))","v":""},{"$f":"IF('Arrear Sheet'!AB32=\"\",\"\",IF('Arrear Sheet'!C32=\"TOTAL\",\"\",SUM(N32-Z32)))","v":""}]
[{"$f":"IF('Arrear Sheet'!B33=\"\",\"\",'Arrear Sheet'!B33)","v":""},{"$f":"IF('Arrear Sheet'!C33=\"\",\"\",IF('Arrear Sheet'!C33=\"TOTAL\",\"\",'Arrear Sheet'!C33))","v":""},{"$f":"IF('Arrear Sheet'!D33=\"\",\"\",IF('Arrear Sheet'!C33=\"TOTAL\",\"\",IF('Arrear Sheet'!D33=\"अक्षरें राशि :-\",\"\",'Arrear Sheet'!D33)))","v":""},{"$f":"IF('Arrear Sheet'!E33=\"\",\"\",IF('Arrear Sheet'!C33=\"TOTAL\",\"\",'Arrear Sheet'!E33))","v":""},{"$f":"IF('Arrear Sheet'!F33=\"\",\"\",IF('Arrear Sheet'!C33=\"TOTAL\",\"\",'Arrear Sheet'!F33))","v":""},{"$f":"IF('Arrear Sheet'!G33=\"\",\"\",IF('Arrear Sheet'!C33=\"TOTAL\",\"\",SUM(C33:E33)))","v":""},{"$f":"IF('Arrear Sheet'!H33=\"\",\"\",IF('Arrear Sheet'!C33=\"TOTAL\",\"\",'Arrear Sheet'!H33))","v":""},{"$f":"IF('Arrear Sheet'!I33=\"\",\"\",IF('Arrear Sheet'!C33=\"TOTAL\",\"\",'Arrear Sheet'!I33))","v":""},{"$f":"IF('Arrear Sheet'!J33=\"\",\"\",IF('Arrear Sheet'!C33=\"TOTAL\",\"\",'Arrear Sheet'!J33))","v":""},{"$f":"IF('Arrear Sheet'!K33=\"\",\"\",IF('Arrear Sheet'!C33=\"TOTAL\",\"\",SUM(G33:I33)))","v":""},{"$f":"IF('Arrear Sheet'!L33=\"\",\"\",IF('Arrear Sheet'!C33=\"TOTAL\",\"\",'Arrear Sheet'!L33))","v":""},{"$f":"IF('Arrear Sheet'!M33=\"\",\"\",IF('Arrear Sheet'!C33=\"TOTAL\",\"\",'Arrear Sheet'!M33))","v":""},{"$f":"IF('Arrear Sheet'!N33=\"\",\"\",IF('Arrear Sheet'!C33=\"TOTAL\",\"\",'Arrear Sheet'!N33))","v":""},{"$f":"IF('Arrear Sheet'!O33=\"\",\"\",IF('Arrear Sheet'!C33=\"TOTAL\",\"\",SUM(K33:M33)))","v":""},{"$f":"IF('Arrear Sheet'!P33=\"\",\"\",IF('Arrear Sheet'!C33=\"TOTAL\",\"\",'Arrear Sheet'!P33))","v":""},{"$f":"IF('Arrear Sheet'!Q33=\"\",\"\",IF('Arrear Sheet'!C33=\"TOTAL\",\"\",'Arrear Sheet'!Q33))","v":""},{"$f":"IF('Arrear Sheet'!R33=\"\",\"\",IF('Arrear Sheet'!C33=\"TOTAL\",\"\",'Arrear Sheet'!R33))","v":""},{"$f":"IF('Arrear Sheet'!S33=\"\",\"\",IF('Arrear Sheet'!C33=\"TOTAL\",\"\",'Arrear Sheet'!S33))","v":""},{"$f":"IF('Arrear Sheet'!T33=\"\",\"\",IF('Arrear Sheet'!C33=\"TOTAL\",\"\",'Arrear Sheet'!T33))","v":""},{"$f":"IF('Arrear Sheet'!U33=\"\",\"\",IF('Arrear Sheet'!C33=\"TOTAL\",\"\",'Arrear Sheet'!U33))","v":""},{"$f":"IF('Arrear Sheet'!V33=\"\",\"\",IF('Arrear Sheet'!C33=\"TOTAL\",\"\",'Arrear Sheet'!V33))","v":""},{"$f":"IF('Arrear Sheet'!W33=\"\",\"\",IF('Arrear Sheet'!C33=\"TOTAL\",\"\",'Arrear Sheet'!W33))","v":""},{"$f":"IF('Arrear Sheet'!X33=\"\",\"\",IF('Arrear Sheet'!C33=\"TOTAL\",\"\",'Arrear Sheet'!X33))","v":""},{"$f":"IF('Arrear Sheet'!Y33=\"\",\"\",IF('Arrear Sheet'!C33=\"TOTAL\",\"\",'Arrear Sheet'!Y33))","v":""},{"$f":"IF('Arrear Sheet'!Z33=\"\",\"\",IF('Arrear Sheet'!C33=\"TOTAL\",\"\",'Arrear Sheet'!Z33))","v":""},{"$f":"IF('Arrear Sheet'!AA33=\"\",\"\",IF('Arrear Sheet'!C33=\"TOTAL\",\"\",'Arrear Sheet'!AA33))","v":""},{"$f":"IF('Arrear Sheet'!AB33=\"\",\"\",IF('Arrear Sheet'!C33=\"TOTAL\",\"\",SUM(N33-Z33)))","v":""}]
[{"$f":"IF('Arrear Sheet'!B34=\"\",\"\",'Arrear Sheet'!B34)","v":""},{"$f":"IF('Arrear Sheet'!C34=\"\",\"\",IF('Arrear Sheet'!C34=\"TOTAL\",\"\",'Arrear Sheet'!C34))","v":""},{"$f":"IF('Arrear Sheet'!D34=\"\",\"\",IF('Arrear Sheet'!C34=\"TOTAL\",\"\",IF('Arrear Sheet'!D34=\"अक्षरें राशि :-\",\"\",'Arrear Sheet'!D34)))","v":""},{"$f":"IF('Arrear Sheet'!E34=\"\",\"\",IF('Arrear Sheet'!C34=\"TOTAL\",\"\",'Arrear Sheet'!E34))","v":""},{"$f":"IF('Arrear Sheet'!F34=\"\",\"\",IF('Arrear Sheet'!C34=\"TOTAL\",\"\",'Arrear Sheet'!F34))","v":""},{"$f":"IF('Arrear Sheet'!G34=\"\",\"\",IF('Arrear Sheet'!C34=\"TOTAL\",\"\",SUM(C34:E34)))","v":""},{"$f":"IF('Arrear Sheet'!H34=\"\",\"\",IF('Arrear Sheet'!C34=\"TOTAL\",\"\",'Arrear Sheet'!H34))","v":""},{"$f":"IF('Arrear Sheet'!I34=\"\",\"\",IF('Arrear Sheet'!C34=\"TOTAL\",\"\",'Arrear Sheet'!I34))","v":""},{"$f":"IF('Arrear Sheet'!J34=\"\",\"\",IF('Arrear Sheet'!C34=\"TOTAL\",\"\",'Arrear Sheet'!J34))","v":""},{"$f":"IF('Arrear Sheet'!K34=\"\",\"\",IF('Arrear Sheet'!C34=\"TOTAL\",\"\",SUM(G34:I34)))","v":""},{"$f":"IF('Arrear Sheet'!L34=\"\",\"\",IF('Arrear Sheet'!C34=\"TOTAL\",\"\",'Arrear Sheet'!L34))","v":""},{"$f":"IF('Arrear Sheet'!M34=\"\",\"\",IF('Arrear Sheet'!C34=\"TOTAL\",\"\",'Arrear Sheet'!M34))","v":""},{"$f":"IF('Arrear Sheet'!N34=\"\",\"\",IF('Arrear Sheet'!C34=\"TOTAL\",\"\",'Arrear Sheet'!N34))","v":""},{"$f":"IF('Arrear Sheet'!O34=\"\",\"\",IF('Arrear Sheet'!C34=\"TOTAL\",\"\",SUM(K34:M34)))","v":""},{"$f":"IF('Arrear Sheet'!P34=\"\",\"\",IF('Arrear Sheet'!C34=\"TOTAL\",\"\",'Arrear Sheet'!P34))","v":""},{"$f":"IF('Arrear Sheet'!Q34=\"\",\"\",IF('Arrear Sheet'!C34=\"TOTAL\",\"\",'Arrear Sheet'!Q34))","v":""},{"$f":"IF('Arrear Sheet'!R34=\"\",\"\",IF('Arrear Sheet'!C34=\"TOTAL\",\"\",'Arrear Sheet'!R34))","v":""},{"$f":"IF('Arrear Sheet'!S34=\"\",\"\",IF('Arrear Sheet'!C34=\"TOTAL\",\"\",'Arrear Sheet'!S34))","v":""},{"$f":"IF('Arrear Sheet'!T34=\"\",\"\",IF('Arrear Sheet'!C34=\"TOTAL\",\"\",'Arrear Sheet'!T34))","v":""},{"$f":"IF('Arrear Sheet'!U34=\"\",\"\",IF('Arrear Sheet'!C34=\"TOTAL\",\"\",'Arrear Sheet'!U34))","v":""},{"$f":"IF('Arrear Sheet'!V34=\"\",\"\",IF('Arrear Sheet'!C34=\"TOTAL\",\"\",'Arrear Sheet'!V34))","v":""},{"$f":"IF('Arrear Sheet'!W34=\"\",\"\",IF('Arrear Sheet'!C34=\"TOTAL\",\"\",'Arrear Sheet'!W34))","v":""},{"$f":"IF('Arrear Sheet'!X34=\"\",\"\",IF('Arrear Sheet'!C34=\"TOTAL\",\"\",'Arrear Sheet'!X34))","v":""},{"$f":"IF('Arrear Sheet'!Y34=\"\",\"\",IF('Arrear Sheet'!C34=\"TOTAL\",\"\",'Arrear Sheet'!Y34))","v":""},{"$f":"IF('Arrear Sheet'!Z34=\"\",\"\",IF('Arrear Sheet'!C34=\"TOTAL\",\"\",'Arrear Sheet'!Z34))","v":""},{"$f":"IF('Arrear Sheet'!AA34=\"\",\"\",IF('Arrear Sheet'!C34=\"TOTAL\",\"\",'Arrear Sheet'!AA34))","v":""},{"$f":"IF('Arrear Sheet'!AB34=\"\",\"\",IF('Arrear Sheet'!C34=\"TOTAL\",\"\",SUM(N34-Z34)))","v":""}]
[{"$f":"IF('Arrear Sheet'!B35=\"\",\"\",'Arrear Sheet'!B35)","v":""},{"$f":"IF('Arrear Sheet'!C35=\"\",\"\",IF('Arrear Sheet'!C35=\"TOTAL\",\"\",'Arrear Sheet'!C35))","v":""},{"$f":"IF('Arrear Sheet'!D35=\"\",\"\",IF('Arrear Sheet'!C35=\"TOTAL\",\"\",IF('Arrear Sheet'!D35=\"अक्षरें राशि :-\",\"\",'Arrear Sheet'!D35)))","v":""},{"$f":"IF('Arrear Sheet'!E35=\"\",\"\",IF('Arrear Sheet'!C35=\"TOTAL\",\"\",'Arrear Sheet'!E35))","v":""},{"$f":"IF('Arrear Sheet'!F35=\"\",\"\",IF('Arrear Sheet'!C35=\"TOTAL\",\"\",'Arrear Sheet'!F35))","v":""},{"$f":"IF('Arrear Sheet'!G35=\"\",\"\",IF('Arrear Sheet'!C35=\"TOTAL\",\"\",SUM(C35:E35)))","v":""},{"$f":"IF('Arrear Sheet'!H35=\"\",\"\",IF('Arrear Sheet'!C35=\"TOTAL\",\"\",'Arrear Sheet'!H35))","v":""},{"$f":"IF('Arrear Sheet'!I35=\"\",\"\",IF('Arrear Sheet'!C35=\"TOTAL\",\"\",'Arrear Sheet'!I35))","v":""},{"$f":"IF('Arrear Sheet'!J35=\"\",\"\",IF('Arrear Sheet'!C35=\"TOTAL\",\"\",'Arrear Sheet'!J35))","v":""},{"$f":"IF('Arrear Sheet'!K35=\"\",\"\",IF('Arrear Sheet'!C35=\"TOTAL\",\"\",SUM(G35:I35)))","v":""},{"$f":"IF('Arrear Sheet'!L35=\"\",\"\",IF('Arrear Sheet'!C35=\"TOTAL\",\"\",'Arrear Sheet'!L35))","v":""},{"$f":"IF('Arrear Sheet'!M35=\"\",\"\",IF('Arrear Sheet'!C35=\"TOTAL\",\"\",'Arrear Sheet'!M35))","v":""},{"$f":"IF('Arrear Sheet'!N35=\"\",\"\",IF('Arrear Sheet'!C35=\"TOTAL\",\"\",'Arrear Sheet'!N35))","v":""},{"$f":"IF('Arrear Sheet'!O35=\"\",\"\",IF('Arrear Sheet'!C35=\"TOTAL\",\"\",SUM(K35:M35)))","v":""},{"$f":"IF('Arrear Sheet'!P35=\"\",\"\",IF('Arrear Sheet'!C35=\"TOTAL\",\"\",'Arrear Sheet'!P35))","v":""},{"$f":"IF('Arrear Sheet'!Q35=\"\",\"\",IF('Arrear Sheet'!C35=\"TOTAL\",\"\",'Arrear Sheet'!Q35))","v":""},{"$f":"IF('Arrear Sheet'!R35=\"\",\"\",IF('Arrear Sheet'!C35=\"TOTAL\",\"\",'Arrear Sheet'!R35))","v":""},{"$f":"IF('Arrear Sheet'!S35=\"\",\"\",IF('Arrear Sheet'!C35=\"TOTAL\",\"\",'Arrear Sheet'!S35))","v":""},{"$f":"IF('Arrear Sheet'!T35=\"\",\"\",IF('Arrear Sheet'!C35=\"TOTAL\",\"\",'Arrear Sheet'!T35))","v":""},{"$f":"IF('Arrear Sheet'!U35=\"\",\"\",IF('Arrear Sheet'!C35=\"TOTAL\",\"\",'Arrear Sheet'!U35))","v":""},{"$f":"IF('Arrear Sheet'!V35=\"\",\"\",IF('Arrear Sheet'!C35=\"TOTAL\",\"\",'Arrear Sheet'!V35))","v":""},{"$f":"IF('Arrear Sheet'!W35=\"\",\"\",IF('Arrear Sheet'!C35=\"TOTAL\",\"\",'Arrear Sheet'!W35))","v":""},{"$f":"IF('Arrear Sheet'!X35=\"\",\"\",IF('Arrear Sheet'!C35=\"TOTAL\",\"\",'Arrear Sheet'!X35))","v":""},{"$f":"IF('Arrear Sheet'!Y35=\"\",\"\",IF('Arrear Sheet'!C35=\"TOTAL\",\"\",'Arrear Sheet'!Y35))","v":""},{"$f":"IF('Arrear Sheet'!Z35=\"\",\"\",IF('Arrear Sheet'!C35=\"TOTAL\",\"\",'Arrear Sheet'!Z35))","v":""},{"$f":"IF('Arrear Sheet'!AA35=\"\",\"\",IF('Arrear Sheet'!C35=\"TOTAL\",\"\",'Arrear Sheet'!AA35))","v":""},{"$f":"IF('Arrear Sheet'!AB35=\"\",\"\",IF('Arrear Sheet'!C35=\"TOTAL\",\"\",SUM(N35-Z35)))","v":""}]
[{"$f":"IF('Arrear Sheet'!B36=\"\",\"\",'Arrear Sheet'!B36)","v":""},{"$f":"IF('Arrear Sheet'!C36=\"\",\"\",IF('Arrear Sheet'!C36=\"TOTAL\",\"\",'Arrear Sheet'!C36))","v":""},{"$f":"IF('Arrear Sheet'!D36=\"\",\"\",IF('Arrear Sheet'!C36=\"TOTAL\",\"\",IF('Arrear Sheet'!D36=\"अक्षरें राशि :-\",\"\",'Arrear Sheet'!D36)))","v":""},{"$f":"IF('Arrear Sheet'!E36=\"\",\"\",IF('Arrear Sheet'!C36=\"TOTAL\",\"\",'Arrear Sheet'!E36))","v":""},{"$f":"IF('Arrear Sheet'!F36=\"\",\"\",IF('Arrear Sheet'!C36=\"TOTAL\",\"\",'Arrear Sheet'!F36))","v":""},{"$f":"IF('Arrear Sheet'!G36=\"\",\"\",IF('Arrear Sheet'!C36=\"TOTAL\",\"\",SUM(C36:E36)))","v":""},{"$f":"IF('Arrear Sheet'!H36=\"\",\"\",IF('Arrear Sheet'!C36=\"TOTAL\",\"\",'Arrear Sheet'!H36))","v":""},{"$f":"IF('Arrear Sheet'!I36=\"\",\"\",IF('Arrear Sheet'!C36=\"TOTAL\",\"\",'Arrear Sheet'!I36))","v":""},{"$f":"IF('Arrear Sheet'!J36=\"\",\"\",IF('Arrear Sheet'!C36=\"TOTAL\",\"\",'Arrear Sheet'!J36))","v":""},{"$f":"IF('Arrear Sheet'!K36=\"\",\"\",IF('Arrear Sheet'!C36=\"TOTAL\",\"\",SUM(G36:I36)))","v":""},{"$f":"IF('Arrear Sheet'!L36=\"\",\"\",IF('Arrear Sheet'!C36=\"TOTAL\",\"\",'Arrear Sheet'!L36))","v":""},{"$f":"IF('Arrear Sheet'!M36=\"\",\"\",IF('Arrear Sheet'!C36=\"TOTAL\",\"\",'Arrear Sheet'!M36))","v":""},{"$f":"IF('Arrear Sheet'!N36=\"\",\"\",IF('Arrear Sheet'!C36=\"TOTAL\",\"\",'Arrear Sheet'!N36))","v":""},{"$f":"IF('Arrear Sheet'!O36=\"\",\"\",IF('Arrear Sheet'!C36=\"TOTAL\",\"\",SUM(K36:M36)))","v":""},{"$f":"IF('Arrear Sheet'!P36=\"\",\"\",IF('Arrear Sheet'!C36=\"TOTAL\",\"\",'Arrear Sheet'!P36))","v":""},{"$f":"IF('Arrear Sheet'!Q36=\"\",\"\",IF('Arrear Sheet'!C36=\"TOTAL\",\"\",'Arrear Sheet'!Q36))","v":""},{"$f":"IF('Arrear Sheet'!R36=\"\",\"\",IF('Arrear Sheet'!C36=\"TOTAL\",\"\",'Arrear Sheet'!R36))","v":""},{"$f":"IF('Arrear Sheet'!S36=\"\",\"\",IF('Arrear Sheet'!C36=\"TOTAL\",\"\",'Arrear Sheet'!S36))","v":""},{"$f":"IF('Arrear Sheet'!T36=\"\",\"\",IF('Arrear Sheet'!C36=\"TOTAL\",\"\",'Arrear Sheet'!T36))","v":""},{"$f":"IF('Arrear Sheet'!U36=\"\",\"\",IF('Arrear Sheet'!C36=\"TOTAL\",\"\",'Arrear Sheet'!U36))","v":""},{"$f":"IF('Arrear Sheet'!V36=\"\",\"\",IF('Arrear Sheet'!C36=\"TOTAL\",\"\",'Arrear Sheet'!V36))","v":""},{"$f":"IF('Arrear Sheet'!W36=\"\",\"\",IF('Arrear Sheet'!C36=\"TOTAL\",\"\",'Arrear Sheet'!W36))","v":""},{"$f":"IF('Arrear Sheet'!X36=\"\",\"\",IF('Arrear Sheet'!C36=\"TOTAL\",\"\",'Arrear Sheet'!X36))","v":""},{"$f":"IF('Arrear Sheet'!Y36=\"\",\"\",IF('Arrear Sheet'!C36=\"TOTAL\",\"\",'Arrear Sheet'!Y36))","v":""},{"$f":"IF('Arrear Sheet'!Z36=\"\",\"\",IF('Arrear Sheet'!C36=\"TOTAL\",\"\",'Arrear Sheet'!Z36))","v":""},{"$f":"IF('Arrear Sheet'!AA36=\"\",\"\",IF('Arrear Sheet'!C36=\"TOTAL\",\"\",'Arrear Sheet'!AA36))","v":""},{"$f":"IF('Arrear Sheet'!AB36=\"\",\"\",IF('Arrear Sheet'!C36=\"TOTAL\",\"\",SUM(N36-Z36)))","v":""}]
[{"$f":"IF('Arrear Sheet'!B37=\"\",\"\",'Arrear Sheet'!B37)","v":""},{"$f":"IF('Arrear Sheet'!C37=\"\",\"\",IF('Arrear Sheet'!C37=\"TOTAL\",\"\",'Arrear Sheet'!C37))","v":""},{"$f":"IF('Arrear Sheet'!D37=\"\",\"\",IF('Arrear Sheet'!C37=\"TOTAL\",\"\",IF('Arrear Sheet'!D37=\"अक्षरें राशि :-\",\"\",'Arrear Sheet'!D37)))","v":""},{"$f":"IF('Arrear Sheet'!E37=\"\",\"\",IF('Arrear Sheet'!C37=\"TOTAL\",\"\",'Arrear Sheet'!E37))","v":""},{"$f":"IF('Arrear Sheet'!F37=\"\",\"\",IF('Arrear Sheet'!C37=\"TOTAL\",\"\",'Arrear Sheet'!F37))","v":""},{"$f":"IF('Arrear Sheet'!G37=\"\",\"\",IF('Arrear Sheet'!C37=\"TOTAL\",\"\",SUM(C37:E37)))","v":""},{"$f":"IF('Arrear Sheet'!H37=\"\",\"\",IF('Arrear Sheet'!C37=\"TOTAL\",\"\",'Arrear Sheet'!H37))","v":""},{"$f":"IF('Arrear Sheet'!I37=\"\",\"\",IF('Arrear Sheet'!C37=\"TOTAL\",\"\",'Arrear Sheet'!I37))","v":""},{"$f":"IF('Arrear Sheet'!J37=\"\",\"\",IF('Arrear Sheet'!C37=\"TOTAL\",\"\",'Arrear Sheet'!J37))","v":""},{"$f":"IF('Arrear Sheet'!K37=\"\",\"\",IF('Arrear Sheet'!C37=\"TOTAL\",\"\",SUM(G37:I37)))","v":""},{"$f":"IF('Arrear Sheet'!L37=\"\",\"\",IF('Arrear Sheet'!C37=\"TOTAL\",\"\",'Arrear Sheet'!L37))","v":""},{"$f":"IF('Arrear Sheet'!M37=\"\",\"\",IF('Arrear Sheet'!C37=\"TOTAL\",\"\",'Arrear Sheet'!M37))","v":""},{"$f":"IF('Arrear Sheet'!N37=\"\",\"\",IF('Arrear Sheet'!C37=\"TOTAL\",\"\",'Arrear Sheet'!N37))","v":""},{"$f":"IF('Arrear Sheet'!O37=\"\",\"\",IF('Arrear Sheet'!C37=\"TOTAL\",\"\",SUM(K37:M37)))","v":""},{"$f":"IF('Arrear Sheet'!P37=\"\",\"\",IF('Arrear Sheet'!C37=\"TOTAL\",\"\",'Arrear Sheet'!P37))","v":""},{"$f":"IF('Arrear Sheet'!Q37=\"\",\"\",IF('Arrear Sheet'!C37=\"TOTAL\",\"\",'Arrear Sheet'!Q37))","v":""},{"$f":"IF('Arrear Sheet'!R37=\"\",\"\",IF('Arrear Sheet'!C37=\"TOTAL\",\"\",'Arrear Sheet'!R37))","v":""},{"$f":"IF('Arrear Sheet'!S37=\"\",\"\",IF('Arrear Sheet'!C37=\"TOTAL\",\"\",'Arrear Sheet'!S37))","v":""},{"$f":"IF('Arrear Sheet'!T37=\"\",\"\",IF('Arrear Sheet'!C37=\"TOTAL\",\"\",'Arrear Sheet'!T37))","v":""},{"$f":"IF('Arrear Sheet'!U37=\"\",\"\",IF('Arrear Sheet'!C37=\"TOTAL\",\"\",'Arrear Sheet'!U37))","v":""},{"$f":"IF('Arrear Sheet'!V37=\"\",\"\",IF('Arrear Sheet'!C37=\"TOTAL\",\"\",'Arrear Sheet'!V37))","v":""},{"$f":"IF('Arrear Sheet'!W37=\"\",\"\",IF('Arrear Sheet'!C37=\"TOTAL\",\"\",'Arrear Sheet'!W37))","v":""},{"$f":"IF('Arrear Sheet'!X37=\"\",\"\",IF('Arrear Sheet'!C37=\"TOTAL\",\"\",'Arrear Sheet'!X37))","v":""},{"$f":"IF('Arrear Sheet'!Y37=\"\",\"\",IF('Arrear Sheet'!C37=\"TOTAL\",\"\",'Arrear Sheet'!Y37))","v":""},{"$f":"IF('Arrear Sheet'!Z37=\"\",\"\",IF('Arrear Sheet'!C37=\"TOTAL\",\"\",'Arrear Sheet'!Z37))","v":""},{"$f":"IF('Arrear Sheet'!AA37=\"\",\"\",IF('Arrear Sheet'!C37=\"TOTAL\",\"\",'Arrear Sheet'!AA37))","v":""},{"$f":"IF('Arrear Sheet'!AB37=\"\",\"\",IF('Arrear Sheet'!C37=\"TOTAL\",\"\",SUM(N37-Z37)))","v":""}]
[{"$f":"IF('Arrear Sheet'!B38=\"\",\"\",'Arrear Sheet'!B38)","v":""},{"$f":"IF('Arrear Sheet'!C38=\"\",\"\",IF('Arrear Sheet'!C38=\"TOTAL\",\"\",'Arrear Sheet'!C38))","v":""},{"$f":"IF('Arrear Sheet'!D38=\"\",\"\",IF('Arrear Sheet'!C38=\"TOTAL\",\"\",IF('Arrear Sheet'!D38=\"अक्षरें राशि :-\",\"\",'Arrear Sheet'!D38)))","v":""},{"$f":"IF('Arrear Sheet'!E38=\"\",\"\",IF('Arrear Sheet'!C38=\"TOTAL\",\"\",'Arrear Sheet'!E38))","v":""},{"$f":"IF('Arrear Sheet'!F38=\"\",\"\",IF('Arrear Sheet'!C38=\"TOTAL\",\"\",'Arrear Sheet'!F38))","v":""},{"$f":"IF('Arrear Sheet'!G38=\"\",\"\",IF('Arrear Sheet'!C38=\"TOTAL\",\"\",SUM(C38:E38)))","v":""},{"$f":"IF('Arrear Sheet'!H38=\"\",\"\",IF('Arrear Sheet'!C38=\"TOTAL\",\"\",'Arrear Sheet'!H38))","v":""},{"$f":"IF('Arrear Sheet'!I38=\"\",\"\",IF('Arrear Sheet'!C38=\"TOTAL\",\"\",'Arrear Sheet'!I38))","v":""},{"$f":"IF('Arrear Sheet'!J38=\"\",\"\",IF('Arrear Sheet'!C38=\"TOTAL\",\"\",'Arrear Sheet'!J38))","v":""},{"$f":"IF('Arrear Sheet'!K38=\"\",\"\",IF('Arrear Sheet'!C38=\"TOTAL\",\"\",SUM(G38:I38)))","v":""},{"$f":"IF('Arrear Sheet'!L38=\"\",\"\",IF('Arrear Sheet'!C38=\"TOTAL\",\"\",'Arrear Sheet'!L38))","v":""},{"$f":"IF('Arrear Sheet'!M38=\"\",\"\",IF('Arrear Sheet'!C38=\"TOTAL\",\"\",'Arrear Sheet'!M38))","v":""},{"$f":"IF('Arrear Sheet'!N38=\"\",\"\",IF('Arrear Sheet'!C38=\"TOTAL\",\"\",'Arrear Sheet'!N38))","v":""},{"$f":"IF('Arrear Sheet'!O38=\"\",\"\",IF('Arrear Sheet'!C38=\"TOTAL\",\"\",SUM(K38:M38)))","v":""},{"$f":"IF('Arrear Sheet'!P38=\"\",\"\",IF('Arrear Sheet'!C38=\"TOTAL\",\"\",'Arrear Sheet'!P38))","v":""},{"$f":"IF('Arrear Sheet'!Q38=\"\",\"\",IF('Arrear Sheet'!C38=\"TOTAL\",\"\",'Arrear Sheet'!Q38))","v":""},{"$f":"IF('Arrear Sheet'!R38=\"\",\"\",IF('Arrear Sheet'!C38=\"TOTAL\",\"\",'Arrear Sheet'!R38))","v":""},{"$f":"IF('Arrear Sheet'!S38=\"\",\"\",IF('Arrear Sheet'!C38=\"TOTAL\",\"\",'Arrear Sheet'!S38))","v":""},{"$f":"IF('Arrear Sheet'!T38=\"\",\"\",IF('Arrear Sheet'!C38=\"TOTAL\",\"\",'Arrear Sheet'!T38))","v":""},{"$f":"IF('Arrear Sheet'!U38=\"\",\"\",IF('Arrear Sheet'!C38=\"TOTAL\",\"\",'Arrear Sheet'!U38))","v":""},{"$f":"IF('Arrear Sheet'!V38=\"\",\"\",IF('Arrear Sheet'!C38=\"TOTAL\",\"\",'Arrear Sheet'!V38))","v":""},{"$f":"IF('Arrear Sheet'!W38=\"\",\"\",IF('Arrear Sheet'!C38=\"TOTAL\",\"\",'Arrear Sheet'!W38))","v":""},{"$f":"IF('Arrear Sheet'!X38=\"\",\"\",IF('Arrear Sheet'!C38=\"TOTAL\",\"\",'Arrear Sheet'!X38))","v":""},{"$f":"IF('Arrear Sheet'!Y38=\"\",\"\",IF('Arrear Sheet'!C38=\"TOTAL\",\"\",'Arrear Sheet'!Y38))","v":""},{"$f":"IF('Arrear Sheet'!Z38=\"\",\"\",IF('Arrear Sheet'!C38=\"TOTAL\",\"\",'Arrear Sheet'!Z38))","v":""},{"$f":"IF('Arrear Sheet'!AA38=\"\",\"\",IF('Arrear Sheet'!C38=\"TOTAL\",\"\",'Arrear Sheet'!AA38))","v":""},{"$f":"IF('Arrear Sheet'!AB38=\"\",\"\",IF('Arrear Sheet'!C38=\"TOTAL\",\"\",SUM(N38-Z38)))","v":""}]
[{"$f":"IF('Arrear Sheet'!B39=\"\",\"\",'Arrear Sheet'!B39)","v":""},{"$f":"IF('Arrear Sheet'!C39=\"\",\"\",IF('Arrear Sheet'!C39=\"TOTAL\",\"\",'Arrear Sheet'!C39))","v":""},{"$f":"IF('Arrear Sheet'!D39=\"\",\"\",IF('Arrear Sheet'!C39=\"TOTAL\",\"\",IF('Arrear Sheet'!D39=\"अक्षरें राशि :-\",\"\",'Arrear Sheet'!D39)))","v":""},{"$f":"IF('Arrear Sheet'!E39=\"\",\"\",IF('Arrear Sheet'!C39=\"TOTAL\",\"\",'Arrear Sheet'!E39))","v":""},{"$f":"IF('Arrear Sheet'!F39=\"\",\"\",IF('Arrear Sheet'!C39=\"TOTAL\",\"\",'Arrear Sheet'!F39))","v":""},{"$f":"IF('Arrear Sheet'!G39=\"\",\"\",IF('Arrear Sheet'!C39=\"TOTAL\",\"\",SUM(C39:E39)))","v":""},{"$f":"IF('Arrear Sheet'!H39=\"\",\"\",IF('Arrear Sheet'!C39=\"TOTAL\",\"\",'Arrear Sheet'!H39))","v":""},{"$f":"IF('Arrear Sheet'!I39=\"\",\"\",IF('Arrear Sheet'!C39=\"TOTAL\",\"\",'Arrear Sheet'!I39))","v":""},{"$f":"IF('Arrear Sheet'!J39=\"\",\"\",IF('Arrear Sheet'!C39=\"TOTAL\",\"\",'Arrear Sheet'!J39))","v":""},{"$f":"IF('Arrear Sheet'!K39=\"\",\"\",IF('Arrear Sheet'!C39=\"TOTAL\",\"\",SUM(G39:I39)))","v":""},{"$f":"IF('Arrear Sheet'!L39=\"\",\"\",IF('Arrear Sheet'!C39=\"TOTAL\",\"\",'Arrear Sheet'!L39))","v":""},{"$f":"IF('Arrear Sheet'!M39=\"\",\"\",IF('Arrear Sheet'!C39=\"TOTAL\",\"\",'Arrear Sheet'!M39))","v":""},{"$f":"IF('Arrear Sheet'!N39=\"\",\"\",IF('Arrear Sheet'!C39=\"TOTAL\",\"\",'Arrear Sheet'!N39))","v":""},{"$f":"IF('Arrear Sheet'!O39=\"\",\"\",IF('Arrear Sheet'!C39=\"TOTAL\",\"\",SUM(K39:M39)))","v":""},{"$f":"IF('Arrear Sheet'!P39=\"\",\"\",IF('Arrear Sheet'!C39=\"TOTAL\",\"\",'Arrear Sheet'!P39))","v":""},{"$f":"IF('Arrear Sheet'!Q39=\"\",\"\",IF('Arrear Sheet'!C39=\"TOTAL\",\"\",'Arrear Sheet'!Q39))","v":""},{"$f":"IF('Arrear Sheet'!R39=\"\",\"\",IF('Arrear Sheet'!C39=\"TOTAL\",\"\",'Arrear Sheet'!R39))","v":""},{"$f":"IF('Arrear Sheet'!S39=\"\",\"\",IF('Arrear Sheet'!C39=\"TOTAL\",\"\",'Arrear Sheet'!S39))","v":""},{"$f":"IF('Arrear Sheet'!T39=\"\",\"\",IF('Arrear Sheet'!C39=\"TOTAL\",\"\",'Arrear Sheet'!T39))","v":""},{"$f":"IF('Arrear Sheet'!U39=\"\",\"\",IF('Arrear Sheet'!C39=\"TOTAL\",\"\",'Arrear Sheet'!U39))","v":""},{"$f":"IF('Arrear Sheet'!V39=\"\",\"\",IF('Arrear Sheet'!C39=\"TOTAL\",\"\",'Arrear Sheet'!V39))","v":""},{"$f":"IF('Arrear Sheet'!W39=\"\",\"\",IF('Arrear Sheet'!C39=\"TOTAL\",\"\",'Arrear Sheet'!W39))","v":""},{"$f":"IF('Arrear Sheet'!X39=\"\",\"\",IF('Arrear Sheet'!C39=\"TOTAL\",\"\",'Arrear Sheet'!X39))","v":""},{"$f":"IF('Arrear Sheet'!Y39=\"\",\"\",IF('Arrear Sheet'!C39=\"TOTAL\",\"\",'Arrear Sheet'!Y39))","v":""},{"$f":"IF('Arrear Sheet'!Z39=\"\",\"\",IF('Arrear Sheet'!C39=\"TOTAL\",\"\",'Arrear Sheet'!Z39))","v":""},{"$f":"IF('Arrear Sheet'!AA39=\"\",\"\",IF('Arrear Sheet'!C39=\"TOTAL\",\"\",'Arrear Sheet'!AA39))","v":""},{"$f":"IF('Arrear Sheet'!AB39=\"\",\"\",IF('Arrear Sheet'!C39=\"TOTAL\",\"\",SUM(N39-Z39)))","v":""}]
[{"$f":"IF('Arrear Sheet'!B40=\"\",\"\",'Arrear Sheet'!B40)","v":""},{"$f":"IF('Arrear Sheet'!C40=\"\",\"\",IF('Arrear Sheet'!C40=\"TOTAL\",\"\",'Arrear Sheet'!C40))","v":""},{"$f":"IF('Arrear Sheet'!D40=\"\",\"\",IF('Arrear Sheet'!C40=\"TOTAL\",\"\",IF('Arrear Sheet'!D40=\"अक्षरें राशि :-\",\"\",'Arrear Sheet'!D40)))","v":""},{"$f":"IF('Arrear Sheet'!E40=\"\",\"\",IF('Arrear Sheet'!C40=\"TOTAL\",\"\",'Arrear Sheet'!E40))","v":""},{"$f":"IF('Arrear Sheet'!F40=\"\",\"\",IF('Arrear Sheet'!C40=\"TOTAL\",\"\",'Arrear Sheet'!F40))","v":""},{"$f":"IF('Arrear Sheet'!G40=\"\",\"\",IF('Arrear Sheet'!C40=\"TOTAL\",\"\",SUM(C40:E40)))","v":""},{"$f":"IF('Arrear Sheet'!H40=\"\",\"\",IF('Arrear Sheet'!C40=\"TOTAL\",\"\",'Arrear Sheet'!H40))","v":""},{"$f":"IF('Arrear Sheet'!I40=\"\",\"\",IF('Arrear Sheet'!C40=\"TOTAL\",\"\",'Arrear Sheet'!I40))","v":""},{"$f":"IF('Arrear Sheet'!J40=\"\",\"\",IF('Arrear Sheet'!C40=\"TOTAL\",\"\",'Arrear Sheet'!J40))","v":""},{"$f":"IF('Arrear Sheet'!K40=\"\",\"\",IF('Arrear Sheet'!C40=\"TOTAL\",\"\",SUM(G40:I40)))","v":""},{"$f":"IF('Arrear Sheet'!L40=\"\",\"\",IF('Arrear Sheet'!C40=\"TOTAL\",\"\",'Arrear Sheet'!L40))","v":""},{"$f":"IF('Arrear Sheet'!M40=\"\",\"\",IF('Arrear Sheet'!C40=\"TOTAL\",\"\",'Arrear Sheet'!M40))","v":""},{"$f":"IF('Arrear Sheet'!N40=\"\",\"\",IF('Arrear Sheet'!C40=\"TOTAL\",\"\",'Arrear Sheet'!N40))","v":""},{"$f":"IF('Arrear Sheet'!O40=\"\",\"\",IF('Arrear Sheet'!C40=\"TOTAL\",\"\",SUM(K40:M40)))","v":""},{"$f":"IF('Arrear Sheet'!P40=\"\",\"\",IF('Arrear Sheet'!C40=\"TOTAL\",\"\",'Arrear Sheet'!P40))","v":""},{"$f":"IF('Arrear Sheet'!Q40=\"\",\"\",IF('Arrear Sheet'!C40=\"TOTAL\",\"\",'Arrear Sheet'!Q40))","v":""},{"$f":"IF('Arrear Sheet'!R40=\"\",\"\",IF('Arrear Sheet'!C40=\"TOTAL\",\"\",'Arrear Sheet'!R40))","v":""},{"$f":"IF('Arrear Sheet'!S40=\"\",\"\",IF('Arrear Sheet'!C40=\"TOTAL\",\"\",'Arrear Sheet'!S40))","v":""},{"$f":"IF('Arrear Sheet'!T40=\"\",\"\",IF('Arrear Sheet'!C40=\"TOTAL\",\"\",'Arrear Sheet'!T40))","v":""},{"$f":"IF('Arrear Sheet'!U40=\"\",\"\",IF('Arrear Sheet'!C40=\"TOTAL\",\"\",'Arrear Sheet'!U40))","v":""},{"$f":"IF('Arrear Sheet'!V40=\"\",\"\",IF('Arrear Sheet'!C40=\"TOTAL\",\"\",'Arrear Sheet'!V40))","v":""},{"$f":"IF('Arrear Sheet'!W40=\"\",\"\",IF('Arrear Sheet'!C40=\"TOTAL\",\"\",'Arrear Sheet'!W40))","v":""},{"$f":"IF('Arrear Sheet'!X40=\"\",\"\",IF('Arrear Sheet'!C40=\"TOTAL\",\"\",'Arrear Sheet'!X40))","v":""},{"$f":"IF('Arrear Sheet'!Y40=\"\",\"\",IF('Arrear Sheet'!C40=\"TOTAL\",\"\",'Arrear Sheet'!Y40))","v":""},{"$f":"IF('Arrear Sheet'!Z40=\"\",\"\",IF('Arrear Sheet'!C40=\"TOTAL\",\"\",'Arrear Sheet'!Z40))","v":""},{"$f":"IF('Arrear Sheet'!AA40=\"\",\"\",IF('Arrear Sheet'!C40=\"TOTAL\",\"\",'Arrear Sheet'!AA40))","v":""},{"$f":"IF('Arrear Sheet'!AB40=\"\",\"\",IF('Arrear Sheet'!C40=\"TOTAL\",\"\",SUM(N40-Z40)))","v":""}]
[{"$f":"IF('Arrear Sheet'!B41=\"\",\"\",'Arrear Sheet'!B41)","v":""},{"$f":"IF('Arrear Sheet'!C41=\"\",\"\",IF('Arrear Sheet'!C41=\"TOTAL\",\"\",'Arrear Sheet'!C41))","v":""},{"$f":"IF('Arrear Sheet'!D41=\"\",\"\",IF('Arrear Sheet'!C41=\"TOTAL\",\"\",IF('Arrear Sheet'!D41=\"अक्षरें राशि :-\",\"\",'Arrear Sheet'!D41)))","v":""},{"$f":"IF('Arrear Sheet'!E41=\"\",\"\",IF('Arrear Sheet'!C41=\"TOTAL\",\"\",'Arrear Sheet'!E41))","v":""},{"$f":"IF('Arrear Sheet'!F41=\"\",\"\",IF('Arrear Sheet'!C41=\"TOTAL\",\"\",'Arrear Sheet'!F41))","v":""},{"$f":"IF('Arrear Sheet'!G41=\"\",\"\",IF('Arrear Sheet'!C41=\"TOTAL\",\"\",SUM(C41:E41)))","v":""},{"$f":"IF('Arrear Sheet'!H41=\"\",\"\",IF('Arrear Sheet'!C41=\"TOTAL\",\"\",'Arrear Sheet'!H41))","v":""},{"$f":"IF('Arrear Sheet'!I41=\"\",\"\",IF('Arrear Sheet'!C41=\"TOTAL\",\"\",'Arrear Sheet'!I41))","v":""},{"$f":"IF('Arrear Sheet'!J41=\"\",\"\",IF('Arrear Sheet'!C41=\"TOTAL\",\"\",'Arrear Sheet'!J41))","v":""},{"$f":"IF('Arrear Sheet'!K41=\"\",\"\",IF('Arrear Sheet'!C41=\"TOTAL\",\"\",SUM(G41:I41)))","v":""},{"$f":"IF('Arrear Sheet'!L41=\"\",\"\",IF('Arrear Sheet'!C41=\"TOTAL\",\"\",'Arrear Sheet'!L41))","v":""},{"$f":"IF('Arrear Sheet'!M41=\"\",\"\",IF('Arrear Sheet'!C41=\"TOTAL\",\"\",'Arrear Sheet'!M41))","v":""},{"$f":"IF('Arrear Sheet'!N41=\"\",\"\",IF('Arrear Sheet'!C41=\"TOTAL\",\"\",'Arrear Sheet'!N41))","v":""},{"$f":"IF('Arrear Sheet'!O41=\"\",\"\",IF('Arrear Sheet'!C41=\"TOTAL\",\"\",SUM(K41:M41)))","v":""},{"$f":"IF('Arrear Sheet'!P41=\"\",\"\",IF('Arrear Sheet'!C41=\"TOTAL\",\"\",'Arrear Sheet'!P41))","v":""},{"$f":"IF('Arrear Sheet'!Q41=\"\",\"\",IF('Arrear Sheet'!C41=\"TOTAL\",\"\",'Arrear Sheet'!Q41))","v":""},{"$f":"IF('Arrear Sheet'!R41=\"\",\"\",IF('Arrear Sheet'!C41=\"TOTAL\",\"\",'Arrear Sheet'!R41))","v":""},{"$f":"IF('Arrear Sheet'!S41=\"\",\"\",IF('Arrear Sheet'!C41=\"TOTAL\",\"\",'Arrear Sheet'!S41))","v":""},{"$f":"IF('Arrear Sheet'!T41=\"\",\"\",IF('Arrear Sheet'!C41=\"TOTAL\",\"\",'Arrear Sheet'!T41))","v":""},{"$f":"IF('Arrear Sheet'!U41=\"\",\"\",IF('Arrear Sheet'!C41=\"TOTAL\",\"\",'Arrear Sheet'!U41))","v":""},{"$f":"IF('Arrear Sheet'!V41=\"\",\"\",IF('Arrear Sheet'!C41=\"TOTAL\",\"\",'Arrear Sheet'!V41))","v":""},{"$f":"IF('Arrear Sheet'!W41=\"\",\"\",IF('Arrear Sheet'!C41=\"TOTAL\",\"\",'Arrear Sheet'!W41))","v":""},{"$f":"IF('Arrear Sheet'!X41=\"\",\"\",IF('Arrear Sheet'!C41=\"TOTAL\",\"\",'Arrear Sheet'!X41))","v":""},{"$f":"IF('Arrear Sheet'!Y41=\"\",\"\",IF('Arrear Sheet'!C41=\"TOTAL\",\"\",'Arrear Sheet'!Y41))","v":""},{"$f":"IF('Arrear Sheet'!Z41=\"\",\"\",IF('Arrear Sheet'!C41=\"TOTAL\",\"\",'Arrear Sheet'!Z41))","v":""},{"$f":"IF('Arrear Sheet'!AA41=\"\",\"\",IF('Arrear Sheet'!C41=\"TOTAL\",\"\",'Arrear Sheet'!AA41))","v":""},{"$f":"IF('Arrear Sheet'!AB41=\"\",\"\",IF('Arrear Sheet'!C41=\"TOTAL\",\"\",SUM(N41-Z41)))","v":""}]
[{"$f":"IF('Arrear Sheet'!B42=\"\",\"\",'Arrear Sheet'!B42)","v":""},{"$f":"IF('Arrear Sheet'!C42=\"\",\"\",IF('Arrear Sheet'!C42=\"TOTAL\",\"\",'Arrear Sheet'!C42))","v":""},{"$f":"IF('Arrear Sheet'!D42=\"\",\"\",IF('Arrear Sheet'!C42=\"TOTAL\",\"\",IF('Arrear Sheet'!D42=\"अक्षरें राशि :-\",\"\",'Arrear Sheet'!D42)))","v":""},{"$f":"IF('Arrear Sheet'!E42=\"\",\"\",IF('Arrear Sheet'!C42=\"TOTAL\",\"\",'Arrear Sheet'!E42))","v":""},{"$f":"IF('Arrear Sheet'!F42=\"\",\"\",IF('Arrear Sheet'!C42=\"TOTAL\",\"\",'Arrear Sheet'!F42))","v":""},{"$f":"IF('Arrear Sheet'!G42=\"\",\"\",IF('Arrear Sheet'!C42=\"TOTAL\",\"\",SUM(C42:E42)))","v":""},{"$f":"IF('Arrear Sheet'!H42=\"\",\"\",IF('Arrear Sheet'!C42=\"TOTAL\",\"\",'Arrear Sheet'!H42))","v":""},{"$f":"IF('Arrear Sheet'!I42=\"\",\"\",IF('Arrear Sheet'!C42=\"TOTAL\",\"\",'Arrear Sheet'!I42))","v":""},{"$f":"IF('Arrear Sheet'!J42=\"\",\"\",IF('Arrear Sheet'!C42=\"TOTAL\",\"\",'Arrear Sheet'!J42))","v":""},{"$f":"IF('Arrear Sheet'!K42=\"\",\"\",IF('Arrear Sheet'!C42=\"TOTAL\",\"\",SUM(G42:I42)))","v":""},{"$f":"IF('Arrear Sheet'!L42=\"\",\"\",IF('Arrear Sheet'!C42=\"TOTAL\",\"\",'Arrear Sheet'!L42))","v":""},{"$f":"IF('Arrear Sheet'!M42=\"\",\"\",IF('Arrear Sheet'!C42=\"TOTAL\",\"\",'Arrear Sheet'!M42))","v":""},{"$f":"IF('Arrear Sheet'!N42=\"\",\"\",IF('Arrear Sheet'!C42=\"TOTAL\",\"\",'Arrear Sheet'!N42))","v":""},{"$f":"IF('Arrear Sheet'!O42=\"\",\"\",IF('Arrear Sheet'!C42=\"TOTAL\",\"\",SUM(K42:M42)))","v":""},{"$f":"IF('Arrear Sheet'!P42=\"\",\"\",IF('Arrear Sheet'!C42=\"TOTAL\",\"\",'Arrear Sheet'!P42))","v":""},{"$f":"IF('Arrear Sheet'!Q42=\"\",\"\",IF('Arrear Sheet'!C42=\"TOTAL\",\"\",'Arrear Sheet'!Q42))","v":""},{"$f":"IF('Arrear Sheet'!R42=\"\",\"\",IF('Arrear Sheet'!C42=\"TOTAL\",\"\",'Arrear Sheet'!R42))","v":""},{"$f":"IF('Arrear Sheet'!S42=\"\",\"\",IF('Arrear Sheet'!C42=\"TOTAL\",\"\",'Arrear Sheet'!S42))","v":""},{"$f":"IF('Arrear Sheet'!T42=\"\",\"\",IF('Arrear Sheet'!C42=\"TOTAL\",\"\",'Arrear Sheet'!T42))","v":""},{"$f":"IF('Arrear Sheet'!U42=\"\",\"\",IF('Arrear Sheet'!C42=\"TOTAL\",\"\",'Arrear Sheet'!U42))","v":""},{"$f":"IF('Arrear Sheet'!V42=\"\",\"\",IF('Arrear Sheet'!C42=\"TOTAL\",\"\",'Arrear Sheet'!V42))","v":""},{"$f":"IF('Arrear Sheet'!W42=\"\",\"\",IF('Arrear Sheet'!C42=\"TOTAL\",\"\",'Arrear Sheet'!W42))","v":""},{"$f":"IF('Arrear Sheet'!X42=\"\",\"\",IF('Arrear Sheet'!C42=\"TOTAL\",\"\",'Arrear Sheet'!X42))","v":""},{"$f":"IF('Arrear Sheet'!Y42=\"\",\"\",IF('Arrear Sheet'!C42=\"TOTAL\",\"\",'Arrear Sheet'!Y42))","v":""},{"$f":"IF('Arrear Sheet'!Z42=\"\",\"\",IF('Arrear Sheet'!C42=\"TOTAL\",\"\",'Arrear Sheet'!Z42))","v":""},{"$f":"IF('Arrear Sheet'!AA42=\"\",\"\",IF('Arrear Sheet'!C42=\"TOTAL\",\"\",'Arrear Sheet'!AA42))","v":""},{"$f":"IF('Arrear Sheet'!AB42=\"\",\"\",IF('Arrear Sheet'!C42=\"TOTAL\",\"\",SUM(N42-Z42)))","v":""}]
[{"$f":"IF('Arrear Sheet'!B43=\"\",\"\",'Arrear Sheet'!B43)","v":""},{"$f":"IF('Arrear Sheet'!C43=\"\",\"\",IF('Arrear Sheet'!C43=\"TOTAL\",\"\",'Arrear Sheet'!C43))","v":""},{"$f":"IF('Arrear Sheet'!D43=\"\",\"\",IF('Arrear Sheet'!C43=\"TOTAL\",\"\",IF('Arrear Sheet'!D43=\"अक्षरें राशि :-\",\"\",'Arrear Sheet'!D43)))","v":""},{"$f":"IF('Arrear Sheet'!E43=\"\",\"\",IF('Arrear Sheet'!C43=\"TOTAL\",\"\",'Arrear Sheet'!E43))","v":""},{"$f":"IF('Arrear Sheet'!F43=\"\",\"\",IF('Arrear Sheet'!C43=\"TOTAL\",\"\",'Arrear Sheet'!F43))","v":""},{"$f":"IF('Arrear Sheet'!G43=\"\",\"\",IF('Arrear Sheet'!C43=\"TOTAL\",\"\",SUM(C43:E43)))","v":""},{"$f":"IF('Arrear Sheet'!H43=\"\",\"\",IF('Arrear Sheet'!C43=\"TOTAL\",\"\",'Arrear Sheet'!H43))","v":""},{"$f":"IF('Arrear Sheet'!I43=\"\",\"\",IF('Arrear Sheet'!C43=\"TOTAL\",\"\",'Arrear Sheet'!I43))","v":""},{"$f":"IF('Arrear Sheet'!J43=\"\",\"\",IF('Arrear Sheet'!C43=\"TOTAL\",\"\",'Arrear Sheet'!J43))","v":""},{"$f":"IF('Arrear Sheet'!K43=\"\",\"\",IF('Arrear Sheet'!C43=\"TOTAL\",\"\",SUM(G43:I43)))","v":""},{"$f":"IF('Arrear Sheet'!L43=\"\",\"\",IF('Arrear Sheet'!C43=\"TOTAL\",\"\",'Arrear Sheet'!L43))","v":""},{"$f":"IF('Arrear Sheet'!M43=\"\",\"\",IF('Arrear Sheet'!C43=\"TOTAL\",\"\",'Arrear Sheet'!M43))","v":""},{"$f":"IF('Arrear Sheet'!N43=\"\",\"\",IF('Arrear Sheet'!C43=\"TOTAL\",\"\",'Arrear Sheet'!N43))","v":""},{"$f":"IF('Arrear Sheet'!O43=\"\",\"\",IF('Arrear Sheet'!C43=\"TOTAL\",\"\",SUM(K43:M43)))","v":""},{"$f":"IF('Arrear Sheet'!P43=\"\",\"\",IF('Arrear Sheet'!C43=\"TOTAL\",\"\",'Arrear Sheet'!P43))","v":""},{"$f":"IF('Arrear Sheet'!Q43=\"\",\"\",IF('Arrear Sheet'!C43=\"TOTAL\",\"\",'Arrear Sheet'!Q43))","v":""},{"$f":"IF('Arrear Sheet'!R43=\"\",\"\",IF('Arrear Sheet'!C43=\"TOTAL\",\"\",'Arrear Sheet'!R43))","v":""},{"$f":"IF('Arrear Sheet'!S43=\"\",\"\",IF('Arrear Sheet'!C43=\"TOTAL\",\"\",'Arrear Sheet'!S43))","v":""},{"$f":"IF('Arrear Sheet'!T43=\"\",\"\",IF('Arrear Sheet'!C43=\"TOTAL\",\"\",'Arrear Sheet'!T43))","v":""},{"$f":"IF('Arrear Sheet'!U43=\"\",\"\",IF('Arrear Sheet'!C43=\"TOTAL\",\"\",'Arrear Sheet'!U43))","v":""},{"$f":"IF('Arrear Sheet'!V43=\"\",\"\",IF('Arrear Sheet'!C43=\"TOTAL\",\"\",'Arrear Sheet'!V43))","v":""},{"$f":"IF('Arrear Sheet'!W43=\"\",\"\",IF('Arrear Sheet'!C43=\"TOTAL\",\"\",'Arrear Sheet'!W43))","v":""},{"$f":"IF('Arrear Sheet'!X43=\"\",\"\",IF('Arrear Sheet'!C43=\"TOTAL\",\"\",'Arrear Sheet'!X43))","v":""},{"$f":"IF('Arrear Sheet'!Y43=\"\",\"\",IF('Arrear Sheet'!C43=\"TOTAL\",\"\",'Arrear Sheet'!Y43))","v":""},{"$f":"IF('Arrear Sheet'!Z43=\"\",\"\",IF('Arrear Sheet'!C43=\"TOTAL\",\"\",'Arrear Sheet'!Z43))","v":""},{"$f":"IF('Arrear Sheet'!AA43=\"\",\"\",IF('Arrear Sheet'!C43=\"TOTAL\",\"\",'Arrear Sheet'!AA43))","v":""},{"$f":"IF('Arrear Sheet'!AB43=\"\",\"\",IF('Arrear Sheet'!C43=\"TOTAL\",\"\",SUM(N43-Z43)))","v":""}]
[{"$f":"IF('Arrear Sheet'!B44=\"\",\"\",'Arrear Sheet'!B44)","v":""},{"$f":"IF('Arrear Sheet'!C44=\"\",\"\",IF('Arrear Sheet'!C44=\"TOTAL\",\"\",'Arrear Sheet'!C44))","v":""},{"$f":"IF('Arrear Sheet'!D44=\"\",\"\",IF('Arrear Sheet'!C44=\"TOTAL\",\"\",IF('Arrear Sheet'!D44=\"अक्षरें राशि :-\",\"\",'Arrear Sheet'!D44)))","v":""},{"$f":"IF('Arrear Sheet'!E44=\"\",\"\",IF('Arrear Sheet'!C44=\"TOTAL\",\"\",'Arrear Sheet'!E44))","v":""},{"$f":"IF('Arrear Sheet'!F44=\"\",\"\",IF('Arrear Sheet'!C44=\"TOTAL\",\"\",'Arrear Sheet'!F44))","v":""},{"$f":"IF('Arrear Sheet'!G44=\"\",\"\",IF('Arrear Sheet'!C44=\"TOTAL\",\"\",SUM(C44:E44)))","v":""},{"$f":"IF('Arrear Sheet'!H44=\"\",\"\",IF('Arrear Sheet'!C44=\"TOTAL\",\"\",'Arrear Sheet'!H44))","v":""},{"$f":"IF('Arrear Sheet'!I44=\"\",\"\",IF('Arrear Sheet'!C44=\"TOTAL\",\"\",'Arrear Sheet'!I44))","v":""},{"$f":"IF('Arrear Sheet'!J44=\"\",\"\",IF('Arrear Sheet'!C44=\"TOTAL\",\"\",'Arrear Sheet'!J44))","v":""},{"$f":"IF('Arrear Sheet'!K44=\"\",\"\",IF('Arrear Sheet'!C44=\"TOTAL\",\"\",SUM(G44:I44)))","v":""},{"$f":"IF('Arrear Sheet'!L44=\"\",\"\",IF('Arrear Sheet'!C44=\"TOTAL\",\"\",'Arrear Sheet'!L44))","v":""},{"$f":"IF('Arrear Sheet'!M44=\"\",\"\",IF('Arrear Sheet'!C44=\"TOTAL\",\"\",'Arrear Sheet'!M44))","v":""},{"$f":"IF('Arrear Sheet'!N44=\"\",\"\",IF('Arrear Sheet'!C44=\"TOTAL\",\"\",'Arrear Sheet'!N44))","v":""},{"$f":"IF('Arrear Sheet'!O44=\"\",\"\",IF('Arrear Sheet'!C44=\"TOTAL\",\"\",SUM(K44:M44)))","v":""},{"$f":"IF('Arrear Sheet'!P44=\"\",\"\",IF('Arrear Sheet'!C44=\"TOTAL\",\"\",'Arrear Sheet'!P44))","v":""},{"$f":"IF('Arrear Sheet'!Q44=\"\",\"\",IF('Arrear Sheet'!C44=\"TOTAL\",\"\",'Arrear Sheet'!Q44))","v":""},{"$f":"IF('Arrear Sheet'!R44=\"\",\"\",IF('Arrear Sheet'!C44=\"TOTAL\",\"\",'Arrear Sheet'!R44))","v":""},{"$f":"IF('Arrear Sheet'!S44=\"\",\"\",IF('Arrear Sheet'!C44=\"TOTAL\",\"\",'Arrear Sheet'!S44))","v":""},{"$f":"IF('Arrear Sheet'!T44=\"\",\"\",IF('Arrear Sheet'!C44=\"TOTAL\",\"\",'Arrear Sheet'!T44))","v":""},{"$f":"IF('Arrear Sheet'!U44=\"\",\"\",IF('Arrear Sheet'!C44=\"TOTAL\",\"\",'Arrear Sheet'!U44))","v":""},{"$f":"IF('Arrear Sheet'!V44=\"\",\"\",IF('Arrear Sheet'!C44=\"TOTAL\",\"\",'Arrear Sheet'!V44))","v":""},{"$f":"IF('Arrear Sheet'!W44=\"\",\"\",IF('Arrear Sheet'!C44=\"TOTAL\",\"\",'Arrear Sheet'!W44))","v":""},{"$f":"IF('Arrear Sheet'!X44=\"\",\"\",IF('Arrear Sheet'!C44=\"TOTAL\",\"\",'Arrear Sheet'!X44))","v":""},{"$f":"IF('Arrear Sheet'!Y44=\"\",\"\",IF('Arrear Sheet'!C44=\"TOTAL\",\"\",'Arrear Sheet'!Y44))","v":""},{"$f":"IF('Arrear Sheet'!Z44=\"\",\"\",IF('Arrear Sheet'!C44=\"TOTAL\",\"\",'Arrear Sheet'!Z44))","v":""},{"$f":"IF('Arrear Sheet'!AA44=\"\",\"\",IF('Arrear Sheet'!C44=\"TOTAL\",\"\",'Arrear Sheet'!AA44))","v":""},{"$f":"IF('Arrear Sheet'!AB44=\"\",\"\",IF('Arrear Sheet'!C44=\"TOTAL\",\"\",SUM(N44-Z44)))","v":""}]
[{"$f":"IF('Arrear Sheet'!B45=\"\",\"\",'Arrear Sheet'!B45)","v":""},{"$f":"IF('Arrear Sheet'!C45=\"\",\"\",IF('Arrear Sheet'!C45=\"TOTAL\",\"\",'Arrear Sheet'!C45))","v":""},{"$f":"IF('Arrear Sheet'!D45=\"\",\"\",IF('Arrear Sheet'!C45=\"TOTAL\",\"\",IF('Arrear Sheet'!D45=\"अक्षरें राशि :-\",\"\",'Arrear Sheet'!D45)))","v":""},{"$f":"IF('Arrear Sheet'!E45=\"\",\"\",IF('Arrear Sheet'!C45=\"TOTAL\",\"\",'Arrear Sheet'!E45))","v":""},{"$f":"IF('Arrear Sheet'!F45=\"\",\"\",IF('Arrear Sheet'!C45=\"TOTAL\",\"\",'Arrear Sheet'!F45))","v":""},{"$f":"IF('Arrear Sheet'!G45=\"\",\"\",IF('Arrear Sheet'!C45=\"TOTAL\",\"\",SUM(C45:E45)))","v":""},{"$f":"IF('Arrear Sheet'!H45=\"\",\"\",IF('Arrear Sheet'!C45=\"TOTAL\",\"\",'Arrear Sheet'!H45))","v":""},{"$f":"IF('Arrear Sheet'!I45=\"\",\"\",IF('Arrear Sheet'!C45=\"TOTAL\",\"\",'Arrear Sheet'!I45))","v":""},{"$f":"IF('Arrear Sheet'!J45=\"\",\"\",IF('Arrear Sheet'!C45=\"TOTAL\",\"\",'Arrear Sheet'!J45))","v":""},{"$f":"IF('Arrear Sheet'!K45=\"\",\"\",IF('Arrear Sheet'!C45=\"TOTAL\",\"\",SUM(G45:I45)))","v":""},{"$f":"IF('Arrear Sheet'!L45=\"\",\"\",IF('Arrear Sheet'!C45=\"TOTAL\",\"\",'Arrear Sheet'!L45))","v":""},{"$f":"IF('Arrear Sheet'!M45=\"\",\"\",IF('Arrear Sheet'!C45=\"TOTAL\",\"\",'Arrear Sheet'!M45))","v":""},{"$f":"IF('Arrear Sheet'!N45=\"\",\"\",IF('Arrear Sheet'!C45=\"TOTAL\",\"\",'Arrear Sheet'!N45))","v":""},{"$f":"IF('Arrear Sheet'!O45=\"\",\"\",IF('Arrear Sheet'!C45=\"TOTAL\",\"\",SUM(K45:M45)))","v":""},{"$f":"IF('Arrear Sheet'!P45=\"\",\"\",IF('Arrear Sheet'!C45=\"TOTAL\",\"\",'Arrear Sheet'!P45))","v":""},{"$f":"IF('Arrear Sheet'!Q45=\"\",\"\",IF('Arrear Sheet'!C45=\"TOTAL\",\"\",'Arrear Sheet'!Q45))","v":""},{"$f":"IF('Arrear Sheet'!R45=\"\",\"\",IF('Arrear Sheet'!C45=\"TOTAL\",\"\",'Arrear Sheet'!R45))","v":""},{"$f":"IF('Arrear Sheet'!S45=\"\",\"\",IF('Arrear Sheet'!C45=\"TOTAL\",\"\",'Arrear Sheet'!S45))","v":""},{"$f":"IF('Arrear Sheet'!T45=\"\",\"\",IF('Arrear Sheet'!C45=\"TOTAL\",\"\",'Arrear Sheet'!T45))","v":""},{"$f":"IF('Arrear Sheet'!U45=\"\",\"\",IF('Arrear Sheet'!C45=\"TOTAL\",\"\",'Arrear Sheet'!U45))","v":""},{"$f":"IF('Arrear Sheet'!V45=\"\",\"\",IF('Arrear Sheet'!C45=\"TOTAL\",\"\",'Arrear Sheet'!V45))","v":""},{"$f":"IF('Arrear Sheet'!W45=\"\",\"\",IF('Arrear Sheet'!C45=\"TOTAL\",\"\",'Arrear Sheet'!W45))","v":""},{"$f":"IF('Arrear Sheet'!X45=\"\",\"\",IF('Arrear Sheet'!C45=\"TOTAL\",\"\",'Arrear Sheet'!X45))","v":""},{"$f":"IF('Arrear Sheet'!Y45=\"\",\"\",IF('Arrear Sheet'!C45=\"TOTAL\",\"\",'Arrear Sheet'!Y45))","v":""},{"$f":"IF('Arrear Sheet'!Z45=\"\",\"\",IF('Arrear Sheet'!C45=\"TOTAL\",\"\",'Arrear Sheet'!Z45))","v":""},{"$f":"IF('Arrear Sheet'!AA45=\"\",\"\",IF('Arrear Sheet'!C45=\"TOTAL\",\"\",'Arrear Sheet'!AA45))","v":""},{"$f":"IF('Arrear Sheet'!AB45=\"\",\"\",IF('Arrear Sheet'!C45=\"TOTAL\",\"\",SUM(N45-Z45)))","v":""}]
[{"$f":"IF('Arrear Sheet'!B46=\"\",\"\",'Arrear Sheet'!B46)","v":""},{"$f":"IF('Arrear Sheet'!C46=\"\",\"\",IF('Arrear Sheet'!C46=\"TOTAL\",\"\",'Arrear Sheet'!C46))","v":""},{"$f":"IF('Arrear Sheet'!D46=\"\",\"\",IF('Arrear Sheet'!C46=\"TOTAL\",\"\",IF('Arrear Sheet'!D46=\"अक्षरें राशि :-\",\"\",'Arrear Sheet'!D46)))","v":""},{"$f":"IF('Arrear Sheet'!E46=\"\",\"\",IF('Arrear Sheet'!C46=\"TOTAL\",\"\",'Arrear Sheet'!E46))","v":""},{"$f":"IF('Arrear Sheet'!F46=\"\",\"\",IF('Arrear Sheet'!C46=\"TOTAL\",\"\",'Arrear Sheet'!F46))","v":""},{"$f":"IF('Arrear Sheet'!G46=\"\",\"\",IF('Arrear Sheet'!C46=\"TOTAL\",\"\",SUM(C46:E46)))","v":""},{"$f":"IF('Arrear Sheet'!H46=\"\",\"\",IF('Arrear Sheet'!C46=\"TOTAL\",\"\",'Arrear Sheet'!H46))","v":""},{"$f":"IF('Arrear Sheet'!I46=\"\",\"\",IF('Arrear Sheet'!C46=\"TOTAL\",\"\",'Arrear Sheet'!I46))","v":""},{"$f":"IF('Arrear Sheet'!J46=\"\",\"\",IF('Arrear Sheet'!C46=\"TOTAL\",\"\",'Arrear Sheet'!J46))","v":""},{"$f":"IF('Arrear Sheet'!K46=\"\",\"\",IF('Arrear Sheet'!C46=\"TOTAL\",\"\",SUM(G46:I46)))","v":""},{"$f":"IF('Arrear Sheet'!L46=\"\",\"\",IF('Arrear Sheet'!C46=\"TOTAL\",\"\",'Arrear Sheet'!L46))","v":""},{"$f":"IF('Arrear Sheet'!M46=\"\",\"\",IF('Arrear Sheet'!C46=\"TOTAL\",\"\",'Arrear Sheet'!M46))","v":""},{"$f":"IF('Arrear Sheet'!N46=\"\",\"\",IF('Arrear Sheet'!C46=\"TOTAL\",\"\",'Arrear Sheet'!N46))","v":""},{"$f":"IF('Arrear Sheet'!O46=\"\",\"\",IF('Arrear Sheet'!C46=\"TOTAL\",\"\",SUM(K46:M46)))","v":""},{"$f":"IF('Arrear Sheet'!P46=\"\",\"\",IF('Arrear Sheet'!C46=\"TOTAL\",\"\",'Arrear Sheet'!P46))","v":""},{"$f":"IF('Arrear Sheet'!Q46=\"\",\"\",IF('Arrear Sheet'!C46=\"TOTAL\",\"\",'Arrear Sheet'!Q46))","v":""},{"$f":"IF('Arrear Sheet'!R46=\"\",\"\",IF('Arrear Sheet'!C46=\"TOTAL\",\"\",'Arrear Sheet'!R46))","v":""},{"$f":"IF('Arrear Sheet'!S46=\"\",\"\",IF('Arrear Sheet'!C46=\"TOTAL\",\"\",'Arrear Sheet'!S46))","v":""},{"$f":"IF('Arrear Sheet'!T46=\"\",\"\",IF('Arrear Sheet'!C46=\"TOTAL\",\"\",'Arrear Sheet'!T46))","v":""},{"$f":"IF('Arrear Sheet'!U46=\"\",\"\",IF('Arrear Sheet'!C46=\"TOTAL\",\"\",'Arrear Sheet'!U46))","v":""},{"$f":"IF('Arrear Sheet'!V46=\"\",\"\",IF('Arrear Sheet'!C46=\"TOTAL\",\"\",'Arrear Sheet'!V46))","v":""},{"$f":"IF('Arrear Sheet'!W46=\"\",\"\",IF('Arrear Sheet'!C46=\"TOTAL\",\"\",'Arrear Sheet'!W46))","v":""},{"$f":"IF('Arrear Sheet'!X46=\"\",\"\",IF('Arrear Sheet'!C46=\"TOTAL\",\"\",'Arrear Sheet'!X46))","v":""},{"$f":"IF('Arrear Sheet'!Y46=\"\",\"\",IF('Arrear Sheet'!C46=\"TOTAL\",\"\",'Arrear Sheet'!Y46))","v":""},{"$f":"IF('Arrear Sheet'!Z46=\"\",\"\",IF('Arrear Sheet'!C46=\"TOTAL\",\"\",'Arrear Sheet'!Z46))","v":""},{"$f":"IF('Arrear Sheet'!AA46=\"\",\"\",IF('Arrear Sheet'!C46=\"TOTAL\",\"\",'Arrear Sheet'!AA46))","v":""},{"$f":"IF('Arrear Sheet'!AB46=\"\",\"\",IF('Arrear Sheet'!C46=\"TOTAL\",\"\",SUM(N46-Z46)))","v":""}]
[{"$f":"IF('Arrear Sheet'!B47=\"\",\"\",'Arrear Sheet'!B47)","v":""},{"$f":"IF('Arrear Sheet'!C47=\"\",\"\",IF('Arrear Sheet'!C47=\"TOTAL\",\"\",'Arrear Sheet'!C47))","v":""},{"$f":"IF('Arrear Sheet'!D47=\"\",\"\",IF('Arrear Sheet'!C47=\"TOTAL\",\"\",IF('Arrear Sheet'!D47=\"अक्षरें राशि :-\",\"\",'Arrear Sheet'!D47)))","v":""},{"$f":"IF('Arrear Sheet'!E47=\"\",\"\",IF('Arrear Sheet'!C47=\"TOTAL\",\"\",'Arrear Sheet'!E47))","v":""},{"$f":"IF('Arrear Sheet'!F47=\"\",\"\",IF('Arrear Sheet'!C47=\"TOTAL\",\"\",'Arrear Sheet'!F47))","v":""},{"$f":"IF('Arrear Sheet'!G47=\"\",\"\",IF('Arrear Sheet'!C47=\"TOTAL\",\"\",SUM(C47:E47)))","v":""},{"$f":"IF('Arrear Sheet'!H47=\"\",\"\",IF('Arrear Sheet'!C47=\"TOTAL\",\"\",'Arrear Sheet'!H47))","v":""},{"$f":"IF('Arrear Sheet'!I47=\"\",\"\",IF('Arrear Sheet'!C47=\"TOTAL\",\"\",'Arrear Sheet'!I47))","v":""},{"$f":"IF('Arrear Sheet'!J47=\"\",\"\",IF('Arrear Sheet'!C47=\"TOTAL\",\"\",'Arrear Sheet'!J47))","v":""},{"$f":"IF('Arrear Sheet'!K47=\"\",\"\",IF('Arrear Sheet'!C47=\"TOTAL\",\"\",SUM(G47:I47)))","v":""},{"$f":"IF('Arrear Sheet'!L47=\"\",\"\",IF('Arrear Sheet'!C47=\"TOTAL\",\"\",'Arrear Sheet'!L47))","v":""},{"$f":"IF('Arrear Sheet'!M47=\"\",\"\",IF('Arrear Sheet'!C47=\"TOTAL\",\"\",'Arrear Sheet'!M47))","v":""},{"$f":"IF('Arrear Sheet'!N47=\"\",\"\",IF('Arrear Sheet'!C47=\"TOTAL\",\"\",'Arrear Sheet'!N47))","v":""},{"$f":"IF('Arrear Sheet'!O47=\"\",\"\",IF('Arrear Sheet'!C47=\"TOTAL\",\"\",SUM(K47:M47)))","v":""},{"$f":"IF('Arrear Sheet'!P47=\"\",\"\",IF('Arrear Sheet'!C47=\"TOTAL\",\"\",'Arrear Sheet'!P47))","v":""},{"$f":"IF('Arrear Sheet'!Q47=\"\",\"\",IF('Arrear Sheet'!C47=\"TOTAL\",\"\",'Arrear Sheet'!Q47))","v":""},{"$f":"IF('Arrear Sheet'!R47=\"\",\"\",IF('Arrear Sheet'!C47=\"TOTAL\",\"\",'Arrear Sheet'!R47))","v":""},{"$f":"IF('Arrear Sheet'!S47=\"\",\"\",IF('Arrear Sheet'!C47=\"TOTAL\",\"\",'Arrear Sheet'!S47))","v":""},{"$f":"IF('Arrear Sheet'!T47=\"\",\"\",IF('Arrear Sheet'!C47=\"TOTAL\",\"\",'Arrear Sheet'!T47))","v":""},{"$f":"IF('Arrear Sheet'!U47=\"\",\"\",IF('Arrear Sheet'!C47=\"TOTAL\",\"\",'Arrear Sheet'!U47))","v":""},{"$f":"IF('Arrear Sheet'!V47=\"\",\"\",IF('Arrear Sheet'!C47=\"TOTAL\",\"\",'Arrear Sheet'!V47))","v":""},{"$f":"IF('Arrear Sheet'!W47=\"\",\"\",IF('Arrear Sheet'!C47=\"TOTAL\",\"\",'Arrear Sheet'!W47))","v":""},{"$f":"IF('Arrear Sheet'!X47=\"\",\"\",IF('Arrear Sheet'!C47=\"TOTAL\",\"\",'Arrear Sheet'!X47))","v":""},{"$f":"IF('Arrear Sheet'!Y47=\"\",\"\",IF('Arrear Sheet'!C47=\"TOTAL\",\"\",'Arrear Sheet'!Y47))","v":""},{"$f":"IF('Arrear Sheet'!Z47=\"\",\"\",IF('Arrear Sheet'!C47=\"TOTAL\",\"\",'Arrear Sheet'!Z47))","v":""},{"$f":"IF('Arrear Sheet'!AA47=\"\",\"\",IF('Arrear Sheet'!C47=\"TOTAL\",\"\",'Arrear Sheet'!AA47))","v":""},{"$f":"IF('Arrear Sheet'!AB47=\"\",\"\",IF('Arrear Sheet'!C47=\"TOTAL\",\"\",SUM(N47-Z47)))","v":""}]
[{"$f":"IF('Arrear Sheet'!B48=\"\",\"\",'Arrear Sheet'!B48)","v":""},{"$f":"IF('Arrear Sheet'!C48=\"\",\"\",IF('Arrear Sheet'!C48=\"TOTAL\",\"\",'Arrear Sheet'!C48))","v":""},{"$f":"IF('Arrear Sheet'!D48=\"\",\"\",IF('Arrear Sheet'!C48=\"TOTAL\",\"\",IF('Arrear Sheet'!D48=\"अक्षरें राशि :-\",\"\",'Arrear Sheet'!D48)))","v":""},{"$f":"IF('Arrear Sheet'!E48=\"\",\"\",IF('Arrear Sheet'!C48=\"TOTAL\",\"\",'Arrear Sheet'!E48))","v":""},{"$f":"IF('Arrear Sheet'!F48=\"\",\"\",IF('Arrear Sheet'!C48=\"TOTAL\",\"\",'Arrear Sheet'!F48))","v":""},{"$f":"IF('Arrear Sheet'!G48=\"\",\"\",IF('Arrear Sheet'!C48=\"TOTAL\",\"\",SUM(C48:E48)))","v":""},{"$f":"IF('Arrear Sheet'!H48=\"\",\"\",IF('Arrear Sheet'!C48=\"TOTAL\",\"\",'Arrear Sheet'!H48))","v":""},{"$f":"IF('Arrear Sheet'!I48=\"\",\"\",IF('Arrear Sheet'!C48=\"TOTAL\",\"\",'Arrear Sheet'!I48))","v":""},{"$f":"IF('Arrear Sheet'!J48=\"\",\"\",IF('Arrear Sheet'!C48=\"TOTAL\",\"\",'Arrear Sheet'!J48))","v":""},{"$f":"IF('Arrear Sheet'!K48=\"\",\"\",IF('Arrear Sheet'!C48=\"TOTAL\",\"\",SUM(G48:I48)))","v":""},{"$f":"IF('Arrear Sheet'!L48=\"\",\"\",IF('Arrear Sheet'!C48=\"TOTAL\",\"\",'Arrear Sheet'!L48))","v":""},{"$f":"IF('Arrear Sheet'!M48=\"\",\"\",IF('Arrear Sheet'!C48=\"TOTAL\",\"\",'Arrear Sheet'!M48))","v":""},{"$f":"IF('Arrear Sheet'!N48=\"\",\"\",IF('Arrear Sheet'!C48=\"TOTAL\",\"\",'Arrear Sheet'!N48))","v":""},{"$f":"IF('Arrear Sheet'!O48=\"\",\"\",IF('Arrear Sheet'!C48=\"TOTAL\",\"\",SUM(K48:M48)))","v":""},{"$f":"IF('Arrear Sheet'!P48=\"\",\"\",IF('Arrear Sheet'!C48=\"TOTAL\",\"\",'Arrear Sheet'!P48))","v":""},{"$f":"IF('Arrear Sheet'!Q48=\"\",\"\",IF('Arrear Sheet'!C48=\"TOTAL\",\"\",'Arrear Sheet'!Q48))","v":""},{"$f":"IF('Arrear Sheet'!R48=\"\",\"\",IF('Arrear Sheet'!C48=\"TOTAL\",\"\",'Arrear Sheet'!R48))","v":""},{"$f":"IF('Arrear Sheet'!S48=\"\",\"\",IF('Arrear Sheet'!C48=\"TOTAL\",\"\",'Arrear Sheet'!S48))","v":""},{"$f":"IF('Arrear Sheet'!T48=\"\",\"\",IF('Arrear Sheet'!C48=\"TOTAL\",\"\",'Arrear Sheet'!T48))","v":""},{"$f":"IF('Arrear Sheet'!U48=\"\",\"\",IF('Arrear Sheet'!C48=\"TOTAL\",\"\",'Arrear Sheet'!U48))","v":""},{"$f":"IF('Arrear Sheet'!V48=\"\",\"\",IF('Arrear Sheet'!C48=\"TOTAL\",\"\",'Arrear Sheet'!V48))","v":""},{"$f":"IF('Arrear Sheet'!W48=\"\",\"\",IF('Arrear Sheet'!C48=\"TOTAL\",\"\",'Arrear Sheet'!W48))","v":""},{"$f":"IF('Arrear Sheet'!X48=\"\",\"\",IF('Arrear Sheet'!C48=\"TOTAL\",\"\",'Arrear Sheet'!X48))","v":""},{"$f":"IF('Arrear Sheet'!Y48=\"\",\"\",IF('Arrear Sheet'!C48=\"TOTAL\",\"\",'Arrear Sheet'!Y48))","v":""},{"$f":"IF('Arrear Sheet'!Z48=\"\",\"\",IF('Arrear Sheet'!C48=\"TOTAL\",\"\",'Arrear Sheet'!Z48))","v":""},{"$f":"IF('Arrear Sheet'!AA48=\"\",\"\",IF('Arrear Sheet'!C48=\"TOTAL\",\"\",'Arrear Sheet'!AA48))","v":""},{"$f":"IF('Arrear Sheet'!AB48=\"\",\"\",IF('Arrear Sheet'!C48=\"TOTAL\",\"\",SUM(N48-Z48)))","v":""}]
[{"$f":"IF('Arrear Sheet'!B49=\"\",\"\",'Arrear Sheet'!B49)","v":""},{"$f":"IF('Arrear Sheet'!C49=\"\",\"\",IF('Arrear Sheet'!C49=\"TOTAL\",\"\",'Arrear Sheet'!C49))","v":""},{"$f":"IF('Arrear Sheet'!D49=\"\",\"\",IF('Arrear Sheet'!C49=\"TOTAL\",\"\",IF('Arrear Sheet'!D49=\"अक्षरें राशि :-\",\"\",'Arrear Sheet'!D49)))","v":""},{"$f":"IF('Arrear Sheet'!E49=\"\",\"\",IF('Arrear Sheet'!C49=\"TOTAL\",\"\",'Arrear Sheet'!E49))","v":""},{"$f":"IF('Arrear Sheet'!F49=\"\",\"\",IF('Arrear Sheet'!C49=\"TOTAL\",\"\",'Arrear Sheet'!F49))","v":""},{"$f":"IF('Arrear Sheet'!G49=\"\",\"\",IF('Arrear Sheet'!C49=\"TOTAL\",\"\",SUM(C49:E49)))","v":""},{"$f":"IF('Arrear Sheet'!H49=\"\",\"\",IF('Arrear Sheet'!C49=\"TOTAL\",\"\",'Arrear Sheet'!H49))","v":""},{"$f":"IF('Arrear Sheet'!I49=\"\",\"\",IF('Arrear Sheet'!C49=\"TOTAL\",\"\",'Arrear Sheet'!I49))","v":""},{"$f":"IF('Arrear Sheet'!J49=\"\",\"\",IF('Arrear Sheet'!C49=\"TOTAL\",\"\",'Arrear Sheet'!J49))","v":""},{"$f":"IF('Arrear Sheet'!K49=\"\",\"\",IF('Arrear Sheet'!C49=\"TOTAL\",\"\",SUM(G49:I49)))","v":""},{"$f":"IF('Arrear Sheet'!L49=\"\",\"\",IF('Arrear Sheet'!C49=\"TOTAL\",\"\",'Arrear Sheet'!L49))","v":""},{"$f":"IF('Arrear Sheet'!M49=\"\",\"\",IF('Arrear Sheet'!C49=\"TOTAL\",\"\",'Arrear Sheet'!M49))","v":""},{"$f":"IF('Arrear Sheet'!N49=\"\",\"\",IF('Arrear Sheet'!C49=\"TOTAL\",\"\",'Arrear Sheet'!N49))","v":""},{"$f":"IF('Arrear Sheet'!O49=\"\",\"\",IF('Arrear Sheet'!C49=\"TOTAL\",\"\",SUM(K49:M49)))","v":""},{"$f":"IF('Arrear Sheet'!P49=\"\",\"\",IF('Arrear Sheet'!C49=\"TOTAL\",\"\",'Arrear Sheet'!P49))","v":""},{"$f":"IF('Arrear Sheet'!Q49=\"\",\"\",IF('Arrear Sheet'!C49=\"TOTAL\",\"\",'Arrear Sheet'!Q49))","v":""},{"$f":"IF('Arrear Sheet'!R49=\"\",\"\",IF('Arrear Sheet'!C49=\"TOTAL\",\"\",'Arrear Sheet'!R49))","v":""},{"$f":"IF('Arrear Sheet'!S49=\"\",\"\",IF('Arrear Sheet'!C49=\"TOTAL\",\"\",'Arrear Sheet'!S49))","v":""},{"$f":"IF('Arrear Sheet'!T49=\"\",\"\",IF('Arrear Sheet'!C49=\"TOTAL\",\"\",'Arrear Sheet'!T49))","v":""},{"$f":"IF('Arrear Sheet'!U49=\"\",\"\",IF('Arrear Sheet'!C49=\"TOTAL\",\"\",'Arrear Sheet'!U49))","v":""},{"$f":"IF('Arrear Sheet'!V49=\"\",\"\",IF('Arrear Sheet'!C49=\"TOTAL\",\"\",'Arrear Sheet'!V49))","v":""},{"$f":"IF('Arrear Sheet'!W49=\"\",\"\",IF('Arrear Sheet'!C49=\"TOTAL\",\"\",'Arrear Sheet'!W49))","v":""},{"$f":"IF('Arrear Sheet'!X49=\"\",\"\",IF('Arrear Sheet'!C49=\"TOTAL\",\"\",'Arrear Sheet'!X49))","v":""},{"$f":"IF('Arrear Sheet'!Y49=\"\",\"\",IF('Arrear Sheet'!C49=\"TOTAL\",\"\",'Arrear Sheet'!Y49))","v":""},{"$f":"IF('Arrear Sheet'!Z49=\"\",\"\",IF('Arrear Sheet'!C49=\"TOTAL\",\"\",'Arrear Sheet'!Z49))","v":""},{"$f":"IF('Arrear Sheet'!AA49=\"\",\"\",IF('Arrear Sheet'!C49=\"TOTAL\",\"\",'Arrear Sheet'!AA49))","v":""},{"$f":"IF('Arrear Sheet'!AB49=\"\",\"\",IF('Arrear Sheet'!C49=\"TOTAL\",\"\",SUM(N49-Z49)))","v":""}]
[{"$f":"IF('Arrear Sheet'!B50=\"\",\"\",'Arrear Sheet'!B50)","v":""},{"$f":"IF('Arrear Sheet'!C50=\"\",\"\",IF('Arrear Sheet'!C50=\"TOTAL\",\"\",'Arrear Sheet'!C50))","v":""},{"$f":"IF('Arrear Sheet'!D50=\"\",\"\",IF('Arrear Sheet'!C50=\"TOTAL\",\"\",IF('Arrear Sheet'!D50=\"अक्षरें राशि :-\",\"\",'Arrear Sheet'!D50)))","v":""},{"$f":"IF('Arrear Sheet'!E50=\"\",\"\",IF('Arrear Sheet'!C50=\"TOTAL\",\"\",'Arrear Sheet'!E50))","v":""},{"$f":"IF('Arrear Sheet'!F50=\"\",\"\",IF('Arrear Sheet'!C50=\"TOTAL\",\"\",'Arrear Sheet'!F50))","v":""},{"$f":"IF('Arrear Sheet'!G50=\"\",\"\",IF('Arrear Sheet'!C50=\"TOTAL\",\"\",SUM(C50:E50)))","v":""},{"$f":"IF('Arrear Sheet'!H50=\"\",\"\",IF('Arrear Sheet'!C50=\"TOTAL\",\"\",'Arrear Sheet'!H50))","v":""},{"$f":"IF('Arrear Sheet'!I50=\"\",\"\",IF('Arrear Sheet'!C50=\"TOTAL\",\"\",'Arrear Sheet'!I50))","v":""},{"$f":"IF('Arrear Sheet'!J50=\"\",\"\",IF('Arrear Sheet'!C50=\"TOTAL\",\"\",'Arrear Sheet'!J50))","v":""},{"$f":"IF('Arrear Sheet'!K50=\"\",\"\",IF('Arrear Sheet'!C50=\"TOTAL\",\"\",SUM(G50:I50)))","v":""},{"$f":"IF('Arrear Sheet'!L50=\"\",\"\",IF('Arrear Sheet'!C50=\"TOTAL\",\"\",'Arrear Sheet'!L50))","v":""},{"$f":"IF('Arrear Sheet'!M50=\"\",\"\",IF('Arrear Sheet'!C50=\"TOTAL\",\"\",'Arrear Sheet'!M50))","v":""},{"$f":"IF('Arrear Sheet'!N50=\"\",\"\",IF('Arrear Sheet'!C50=\"TOTAL\",\"\",'Arrear Sheet'!N50))","v":""},{"$f":"IF('Arrear Sheet'!O50=\"\",\"\",IF('Arrear Sheet'!C50=\"TOTAL\",\"\",SUM(K50:M50)))","v":""},{"$f":"IF('Arrear Sheet'!P50=\"\",\"\",IF('Arrear Sheet'!C50=\"TOTAL\",\"\",'Arrear Sheet'!P50))","v":""},{"$f":"IF('Arrear Sheet'!Q50=\"\",\"\",IF('Arrear Sheet'!C50=\"TOTAL\",\"\",'Arrear Sheet'!Q50))","v":""},{"$f":"IF('Arrear Sheet'!R50=\"\",\"\",IF('Arrear Sheet'!C50=\"TOTAL\",\"\",'Arrear Sheet'!R50))","v":""},{"$f":"IF('Arrear Sheet'!S50=\"\",\"\",IF('Arrear Sheet'!C50=\"TOTAL\",\"\",'Arrear Sheet'!S50))","v":""},{"$f":"IF('Arrear Sheet'!T50=\"\",\"\",IF('Arrear Sheet'!C50=\"TOTAL\",\"\",'Arrear Sheet'!T50))","v":""},{"$f":"IF('Arrear Sheet'!U50=\"\",\"\",IF('Arrear Sheet'!C50=\"TOTAL\",\"\",'Arrear Sheet'!U50))","v":""},{"$f":"IF('Arrear Sheet'!V50=\"\",\"\",IF('Arrear Sheet'!C50=\"TOTAL\",\"\",'Arrear Sheet'!V50))","v":""},{"$f":"IF('Arrear Sheet'!W50=\"\",\"\",IF('Arrear Sheet'!C50=\"TOTAL\",\"\",'Arrear Sheet'!W50))","v":""},{"$f":"IF('Arrear Sheet'!X50=\"\",\"\",IF('Arrear Sheet'!C50=\"TOTAL\",\"\",'Arrear Sheet'!X50))","v":""},{"$f":"IF('Arrear Sheet'!Y50=\"\",\"\",IF('Arrear Sheet'!C50=\"TOTAL\",\"\",'Arrear Sheet'!Y50))","v":""},{"$f":"IF('Arrear Sheet'!Z50=\"\",\"\",IF('Arrear Sheet'!C50=\"TOTAL\",\"\",'Arrear Sheet'!Z50))","v":""},{"$f":"IF('Arrear Sheet'!AA50=\"\",\"\",IF('Arrear Sheet'!C50=\"TOTAL\",\"\",'Arrear Sheet'!AA50))","v":""},{"$f":"IF('Arrear Sheet'!AB50=\"\",\"\",IF('Arrear Sheet'!C50=\"TOTAL\",\"\",SUM(N50-Z50)))","v":""}]
[{"$f":"IF('Arrear Sheet'!B51=\"\",\"\",'Arrear Sheet'!B51)","v":""},{"$f":"IF('Arrear Sheet'!C51=\"\",\"\",IF('Arrear Sheet'!C51=\"TOTAL\",\"\",'Arrear Sheet'!C51))","v":""},{"$f":"IF('Arrear Sheet'!D51=\"\",\"\",IF('Arrear Sheet'!C51=\"TOTAL\",\"\",IF('Arrear Sheet'!D51=\"अक्षरें राशि :-\",\"\",'Arrear Sheet'!D51)))","v":""},{"$f":"IF('Arrear Sheet'!E51=\"\",\"\",IF('Arrear Sheet'!C51=\"TOTAL\",\"\",'Arrear Sheet'!E51))","v":""},{"$f":"IF('Arrear Sheet'!F51=\"\",\"\",IF('Arrear Sheet'!C51=\"TOTAL\",\"\",'Arrear Sheet'!F51))","v":""},{"$f":"IF('Arrear Sheet'!G51=\"\",\"\",IF('Arrear Sheet'!C51=\"TOTAL\",\"\",SUM(C51:E51)))","v":""},{"$f":"IF('Arrear Sheet'!H51=\"\",\"\",IF('Arrear Sheet'!C51=\"TOTAL\",\"\",'Arrear Sheet'!H51))","v":""},{"$f":"IF('Arrear Sheet'!I51=\"\",\"\",IF('Arrear Sheet'!C51=\"TOTAL\",\"\",'Arrear Sheet'!I51))","v":""},{"$f":"IF('Arrear Sheet'!J51=\"\",\"\",IF('Arrear Sheet'!C51=\"TOTAL\",\"\",'Arrear Sheet'!J51))","v":""},{"$f":"IF('Arrear Sheet'!K51=\"\",\"\",IF('Arrear Sheet'!C51=\"TOTAL\",\"\",SUM(G51:I51)))","v":""},{"$f":"IF('Arrear Sheet'!L51=\"\",\"\",IF('Arrear Sheet'!C51=\"TOTAL\",\"\",'Arrear Sheet'!L51))","v":""},{"$f":"IF('Arrear Sheet'!M51=\"\",\"\",IF('Arrear Sheet'!C51=\"TOTAL\",\"\",'Arrear Sheet'!M51))","v":""},{"$f":"IF('Arrear Sheet'!N51=\"\",\"\",IF('Arrear Sheet'!C51=\"TOTAL\",\"\",'Arrear Sheet'!N51))","v":""},{"$f":"IF('Arrear Sheet'!O51=\"\",\"\",IF('Arrear Sheet'!C51=\"TOTAL\",\"\",SUM(K51:M51)))","v":""},{"$f":"IF('Arrear Sheet'!P51=\"\",\"\",IF('Arrear Sheet'!C51=\"TOTAL\",\"\",'Arrear Sheet'!P51))","v":""},{"$f":"IF('Arrear Sheet'!Q51=\"\",\"\",IF('Arrear Sheet'!C51=\"TOTAL\",\"\",'Arrear Sheet'!Q51))","v":""},{"$f":"IF('Arrear Sheet'!R51=\"\",\"\",IF('Arrear Sheet'!C51=\"TOTAL\",\"\",'Arrear Sheet'!R51))","v":""},{"$f":"IF('Arrear Sheet'!S51=\"\",\"\",IF('Arrear Sheet'!C51=\"TOTAL\",\"\",'Arrear Sheet'!S51))","v":""},{"$f":"IF('Arrear Sheet'!T51=\"\",\"\",IF('Arrear Sheet'!C51=\"TOTAL\",\"\",'Arrear Sheet'!T51))","v":""},{"$f":"IF('Arrear Sheet'!U51=\"\",\"\",IF('Arrear Sheet'!C51=\"TOTAL\",\"\",'Arrear Sheet'!U51))","v":""},{"$f":"IF('Arrear Sheet'!V51=\"\",\"\",IF('Arrear Sheet'!C51=\"TOTAL\",\"\",'Arrear Sheet'!V51))","v":""},{"$f":"IF('Arrear Sheet'!W51=\"\",\"\",IF('Arrear Sheet'!C51=\"TOTAL\",\"\",'Arrear Sheet'!W51))","v":""},{"$f":"IF('Arrear Sheet'!X51=\"\",\"\",IF('Arrear Sheet'!C51=\"TOTAL\",\"\",'Arrear Sheet'!X51))","v":""},{"$f":"IF('Arrear Sheet'!Y51=\"\",\"\",IF('Arrear Sheet'!C51=\"TOTAL\",\"\",'Arrear Sheet'!Y51))","v":""},{"$f":"IF('Arrear Sheet'!Z51=\"\",\"\",IF('Arrear Sheet'!C51=\"TOTAL\",\"\",'Arrear Sheet'!Z51))","v":""},{"$f":"IF('Arrear Sheet'!AA51=\"\",\"\",IF('Arrear Sheet'!C51=\"TOTAL\",\"\",'Arrear Sheet'!AA51))","v":""},{"$f":"IF('Arrear Sheet'!AB51=\"\",\"\",IF('Arrear Sheet'!C51=\"TOTAL\",\"\",SUM(N51-Z51)))","v":""}]
[{"$f":"IF('Arrear Sheet'!B52=\"\",\"\",'Arrear Sheet'!B52)","v":""},{"$f":"IF('Arrear Sheet'!C52=\"\",\"\",IF('Arrear Sheet'!C52=\"TOTAL\",\"\",'Arrear Sheet'!C52))","v":""},{"$f":"IF('Arrear Sheet'!D52=\"\",\"\",IF('Arrear Sheet'!C52=\"TOTAL\",\"\",IF('Arrear Sheet'!D52=\"अक्षरें राशि :-\",\"\",'Arrear Sheet'!D52)))","v":""},{"$f":"IF('Arrear Sheet'!E52=\"\",\"\",IF('Arrear Sheet'!C52=\"TOTAL\",\"\",'Arrear Sheet'!E52))","v":""},{"$f":"IF('Arrear Sheet'!F52=\"\",\"\",IF('Arrear Sheet'!C52=\"TOTAL\",\"\",'Arrear Sheet'!F52))","v":""},{"$f":"IF('Arrear Sheet'!G52=\"\",\"\",IF('Arrear Sheet'!C52=\"TOTAL\",\"\",SUM(C52:E52)))","v":""},{"$f":"IF('Arrear Sheet'!H52=\"\",\"\",IF('Arrear Sheet'!C52=\"TOTAL\",\"\",'Arrear Sheet'!H52))","v":""},{"$f":"IF('Arrear Sheet'!I52=\"\",\"\",IF('Arrear Sheet'!C52=\"TOTAL\",\"\",'Arrear Sheet'!I52))","v":""},{"$f":"IF('Arrear Sheet'!J52=\"\",\"\",IF('Arrear Sheet'!C52=\"TOTAL\",\"\",'Arrear Sheet'!J52))","v":""},{"$f":"IF('Arrear Sheet'!K52=\"\",\"\",IF('Arrear Sheet'!C52=\"TOTAL\",\"\",SUM(G52:I52)))","v":""},{"$f":"IF('Arrear Sheet'!L52=\"\",\"\",IF('Arrear Sheet'!C52=\"TOTAL\",\"\",'Arrear Sheet'!L52))","v":""},{"$f":"IF('Arrear Sheet'!M52=\"\",\"\",IF('Arrear Sheet'!C52=\"TOTAL\",\"\",'Arrear Sheet'!M52))","v":""},{"$f":"IF('Arrear Sheet'!N52=\"\",\"\",IF('Arrear Sheet'!C52=\"TOTAL\",\"\",'Arrear Sheet'!N52))","v":""},{"$f":"IF('Arrear Sheet'!O52=\"\",\"\",IF('Arrear Sheet'!C52=\"TOTAL\",\"\",SUM(K52:M52)))","v":""},{"$f":"IF('Arrear Sheet'!P52=\"\",\"\",IF('Arrear Sheet'!C52=\"TOTAL\",\"\",'Arrear Sheet'!P52))","v":""},{"$f":"IF('Arrear Sheet'!Q52=\"\",\"\",IF('Arrear Sheet'!C52=\"TOTAL\",\"\",'Arrear Sheet'!Q52))","v":""},{"$f":"IF('Arrear Sheet'!R52=\"\",\"\",IF('Arrear Sheet'!C52=\"TOTAL\",\"\",'Arrear Sheet'!R52))","v":""},{"$f":"IF('Arrear Sheet'!S52=\"\",\"\",IF('Arrear Sheet'!C52=\"TOTAL\",\"\",'Arrear Sheet'!S52))","v":""},{"$f":"IF('Arrear Sheet'!T52=\"\",\"\",IF('Arrear Sheet'!C52=\"TOTAL\",\"\",'Arrear Sheet'!T52))","v":""},{"$f":"IF('Arrear Sheet'!U52=\"\",\"\",IF('Arrear Sheet'!C52=\"TOTAL\",\"\",'Arrear Sheet'!U52))","v":""},{"$f":"IF('Arrear Sheet'!V52=\"\",\"\",IF('Arrear Sheet'!C52=\"TOTAL\",\"\",'Arrear Sheet'!V52))","v":""},{"$f":"IF('Arrear Sheet'!W52=\"\",\"\",IF('Arrear Sheet'!C52=\"TOTAL\",\"\",'Arrear Sheet'!W52))","v":""},{"$f":"IF('Arrear Sheet'!X52=\"\",\"\",IF('Arrear Sheet'!C52=\"TOTAL\",\"\",'Arrear Sheet'!X52))","v":""},{"$f":"IF('Arrear Sheet'!Y52=\"\",\"\",IF('Arrear Sheet'!C52=\"TOTAL\",\"\",'Arrear Sheet'!Y52))","v":""},{"$f":"IF('Arrear Sheet'!Z52=\"\",\"\",IF('Arrear Sheet'!C52=\"TOTAL\",\"\",'Arrear Sheet'!Z52))","v":""},{"$f":"IF('Arrear Sheet'!AA52=\"\",\"\",IF('Arrear Sheet'!C52=\"TOTAL\",\"\",'Arrear Sheet'!AA52))","v":""},{"$f":"IF('Arrear Sheet'!AB52=\"\",\"\",IF('Arrear Sheet'!C52=\"TOTAL\",\"\",SUM(N52-Z52)))","v":""}]
[{"$f":"IF('Arrear Sheet'!B53=\"\",\"\",'Arrear Sheet'!B53)","v":""},{"$f":"IF('Arrear Sheet'!C53=\"\",\"\",IF('Arrear Sheet'!C53=\"TOTAL\",\"\",'Arrear Sheet'!C53))","v":""},{"$f":"IF('Arrear Sheet'!D53=\"\",\"\",IF('Arrear Sheet'!C53=\"TOTAL\",\"\",IF('Arrear Sheet'!D53=\"अक्षरें राशि :-\",\"\",'Arrear Sheet'!D53)))","v":""},{"$f":"IF('Arrear Sheet'!E53=\"\",\"\",IF('Arrear Sheet'!C53=\"TOTAL\",\"\",'Arrear Sheet'!E53))","v":""},{"$f":"IF('Arrear Sheet'!F53=\"\",\"\",IF('Arrear Sheet'!C53=\"TOTAL\",\"\",'Arrear Sheet'!F53))","v":""},{"$f":"IF('Arrear Sheet'!G53=\"\",\"\",IF('Arrear Sheet'!C53=\"TOTAL\",\"\",SUM(C53:E53)))","v":""},{"$f":"IF('Arrear Sheet'!H53=\"\",\"\",IF('Arrear Sheet'!C53=\"TOTAL\",\"\",'Arrear Sheet'!H53))","v":""},{"$f":"IF('Arrear Sheet'!I53=\"\",\"\",IF('Arrear Sheet'!C53=\"TOTAL\",\"\",'Arrear Sheet'!I53))","v":""},{"$f":"IF('Arrear Sheet'!J53=\"\",\"\",IF('Arrear Sheet'!C53=\"TOTAL\",\"\",'Arrear Sheet'!J53))","v":""},{"$f":"IF('Arrear Sheet'!K53=\"\",\"\",IF('Arrear Sheet'!C53=\"TOTAL\",\"\",SUM(G53:I53)))","v":""},{"$f":"IF('Arrear Sheet'!L53=\"\",\"\",IF('Arrear Sheet'!C53=\"TOTAL\",\"\",'Arrear Sheet'!L53))","v":""},{"$f":"IF('Arrear Sheet'!M53=\"\",\"\",IF('Arrear Sheet'!C53=\"TOTAL\",\"\",'Arrear Sheet'!M53))","v":""},{"$f":"IF('Arrear Sheet'!N53=\"\",\"\",IF('Arrear Sheet'!C53=\"TOTAL\",\"\",'Arrear Sheet'!N53))","v":""},{"$f":"IF('Arrear Sheet'!O53=\"\",\"\",IF('Arrear Sheet'!C53=\"TOTAL\",\"\",SUM(K53:M53)))","v":""},{"$f":"IF('Arrear Sheet'!P53=\"\",\"\",IF('Arrear Sheet'!C53=\"TOTAL\",\"\",'Arrear Sheet'!P53))","v":""},{"$f":"IF('Arrear Sheet'!Q53=\"\",\"\",IF('Arrear Sheet'!C53=\"TOTAL\",\"\",'Arrear Sheet'!Q53))","v":""},{"$f":"IF('Arrear Sheet'!R53=\"\",\"\",IF('Arrear Sheet'!C53=\"TOTAL\",\"\",'Arrear Sheet'!R53))","v":""},{"$f":"IF('Arrear Sheet'!S53=\"\",\"\",IF('Arrear Sheet'!C53=\"TOTAL\",\"\",'Arrear Sheet'!S53))","v":""},{"$f":"IF('Arrear Sheet'!T53=\"\",\"\",IF('Arrear Sheet'!C53=\"TOTAL\",\"\",'Arrear Sheet'!T53))","v":""},{"$f":"IF('Arrear Sheet'!U53=\"\",\"\",IF('Arrear Sheet'!C53=\"TOTAL\",\"\",'Arrear Sheet'!U53))","v":""},{"$f":"IF('Arrear Sheet'!V53=\"\",\"\",IF('Arrear Sheet'!C53=\"TOTAL\",\"\",'Arrear Sheet'!V53))","v":""},{"$f":"IF('Arrear Sheet'!W53=\"\",\"\",IF('Arrear Sheet'!C53=\"TOTAL\",\"\",'Arrear Sheet'!W53))","v":""},{"$f":"IF('Arrear Sheet'!X53=\"\",\"\",IF('Arrear Sheet'!C53=\"TOTAL\",\"\",'Arrear Sheet'!X53))","v":""},{"$f":"IF('Arrear Sheet'!Y53=\"\",\"\",IF('Arrear Sheet'!C53=\"TOTAL\",\"\",'Arrear Sheet'!Y53))","v":""},{"$f":"IF('Arrear Sheet'!Z53=\"\",\"\",IF('Arrear Sheet'!C53=\"TOTAL\",\"\",'Arrear Sheet'!Z53))","v":""},{"$f":"IF('Arrear Sheet'!AA53=\"\",\"\",IF('Arrear Sheet'!C53=\"TOTAL\",\"\",'Arrear Sheet'!AA53))","v":""},{"$f":"IF('Arrear Sheet'!AB53=\"\",\"\",IF('Arrear Sheet'!C53=\"TOTAL\",\"\",SUM(N53-Z53)))","v":""}]
[{"$f":"IF('Arrear Sheet'!B54=\"\",\"\",'Arrear Sheet'!B54)","v":""},{"$f":"IF('Arrear Sheet'!C54=\"\",\"\",IF('Arrear Sheet'!C54=\"TOTAL\",\"\",'Arrear Sheet'!C54))","v":""},{"$f":"IF('Arrear Sheet'!D54=\"\",\"\",IF('Arrear Sheet'!C54=\"TOTAL\",\"\",IF('Arrear Sheet'!D54=\"अक्षरें राशि :-\",\"\",'Arrear Sheet'!D54)))","v":""},{"$f":"IF('Arrear Sheet'!E54=\"\",\"\",IF('Arrear Sheet'!C54=\"TOTAL\",\"\",'Arrear Sheet'!E54))","v":""},{"$f":"IF('Arrear Sheet'!F54=\"\",\"\",IF('Arrear Sheet'!C54=\"TOTAL\",\"\",'Arrear Sheet'!F54))","v":""},{"$f":"IF('Arrear Sheet'!G54=\"\",\"\",IF('Arrear Sheet'!C54=\"TOTAL\",\"\",SUM(C54:E54)))","v":""},{"$f":"IF('Arrear Sheet'!H54=\"\",\"\",IF('Arrear Sheet'!C54=\"TOTAL\",\"\",'Arrear Sheet'!H54))","v":""},{"$f":"IF('Arrear Sheet'!I54=\"\",\"\",IF('Arrear Sheet'!C54=\"TOTAL\",\"\",'Arrear Sheet'!I54))","v":""},{"$f":"IF('Arrear Sheet'!J54=\"\",\"\",IF('Arrear Sheet'!C54=\"TOTAL\",\"\",'Arrear Sheet'!J54))","v":""},{"$f":"IF('Arrear Sheet'!K54=\"\",\"\",IF('Arrear Sheet'!C54=\"TOTAL\",\"\",SUM(G54:I54)))","v":""},{"$f":"IF('Arrear Sheet'!L54=\"\",\"\",IF('Arrear Sheet'!C54=\"TOTAL\",\"\",'Arrear Sheet'!L54))","v":""},{"$f":"IF('Arrear Sheet'!M54=\"\",\"\",IF('Arrear Sheet'!C54=\"TOTAL\",\"\",'Arrear Sheet'!M54))","v":""},{"$f":"IF('Arrear Sheet'!N54=\"\",\"\",IF('Arrear Sheet'!C54=\"TOTAL\",\"\",'Arrear Sheet'!N54))","v":""},{"$f":"IF('Arrear Sheet'!O54=\"\",\"\",IF('Arrear Sheet'!C54=\"TOTAL\",\"\",SUM(K54:M54)))","v":""},{"$f":"IF('Arrear Sheet'!P54=\"\",\"\",IF('Arrear Sheet'!C54=\"TOTAL\",\"\",'Arrear Sheet'!P54))","v":""},{"$f":"IF('Arrear Sheet'!Q54=\"\",\"\",IF('Arrear Sheet'!C54=\"TOTAL\",\"\",'Arrear Sheet'!Q54))","v":""},{"$f":"IF('Arrear Sheet'!R54=\"\",\"\",IF('Arrear Sheet'!C54=\"TOTAL\",\"\",'Arrear Sheet'!R54))","v":""},{"$f":"IF('Arrear Sheet'!S54=\"\",\"\",IF('Arrear Sheet'!C54=\"TOTAL\",\"\",'Arrear Sheet'!S54))","v":""},{"$f":"IF('Arrear Sheet'!T54=\"\",\"\",IF('Arrear Sheet'!C54=\"TOTAL\",\"\",'Arrear Sheet'!T54))","v":""},{"$f":"IF('Arrear Sheet'!U54=\"\",\"\",IF('Arrear Sheet'!C54=\"TOTAL\",\"\",'Arrear Sheet'!U54))","v":""},{"$f":"IF('Arrear Sheet'!V54=\"\",\"\",IF('Arrear Sheet'!C54=\"TOTAL\",\"\",'Arrear Sheet'!V54))","v":""},{"$f":"IF('Arrear Sheet'!W54=\"\",\"\",IF('Arrear Sheet'!C54=\"TOTAL\",\"\",'Arrear Sheet'!W54))","v":""},{"$f":"IF('Arrear Sheet'!X54=\"\",\"\",IF('Arrear Sheet'!C54=\"TOTAL\",\"\",'Arrear Sheet'!X54))","v":""},{"$f":"IF('Arrear Sheet'!Y54=\"\",\"\",IF('Arrear Sheet'!C54=\"TOTAL\",\"\",'Arrear Sheet'!Y54))","v":""},{"$f":"IF('Arrear Sheet'!Z54=\"\",\"\",IF('Arrear Sheet'!C54=\"TOTAL\",\"\",'Arrear Sheet'!Z54))","v":""},{"$f":"IF('Arrear Sheet'!AA54=\"\",\"\",IF('Arrear Sheet'!C54=\"TOTAL\",\"\",'Arrear Sheet'!AA54))","v":""},{"$f":"IF('Arrear Sheet'!AB54=\"\",\"\",IF('Arrear Sheet'!C54=\"TOTAL\",\"\",SUM(N54-Z54)))","v":""}]
[{"$f":"IF('Arrear Sheet'!B55=\"\",\"\",'Arrear Sheet'!B55)","v":""},{"$f":"IF('Arrear Sheet'!C55=\"\",\"\",IF('Arrear Sheet'!C55=\"TOTAL\",\"\",'Arrear Sheet'!C55))","v":""},{"$f":"IF('Arrear Sheet'!D55=\"\",\"\",IF('Arrear Sheet'!C55=\"TOTAL\",\"\",IF('Arrear Sheet'!D55=\"अक्षरें राशि :-\",\"\",'Arrear Sheet'!D55)))","v":""},{"$f":"IF('Arrear Sheet'!E55=\"\",\"\",IF('Arrear Sheet'!C55=\"TOTAL\",\"\",'Arrear Sheet'!E55))","v":""},{"$f":"IF('Arrear Sheet'!F55=\"\",\"\",IF('Arrear Sheet'!C55=\"TOTAL\",\"\",'Arrear Sheet'!F55))","v":""},{"$f":"IF('Arrear Sheet'!G55=\"\",\"\",IF('Arrear Sheet'!C55=\"TOTAL\",\"\",SUM(C55:E55)))","v":""},{"$f":"IF('Arrear Sheet'!H55=\"\",\"\",IF('Arrear Sheet'!C55=\"TOTAL\",\"\",'Arrear Sheet'!H55))","v":""},{"$f":"IF('Arrear Sheet'!I55=\"\",\"\",IF('Arrear Sheet'!C55=\"TOTAL\",\"\",'Arrear Sheet'!I55))","v":""},{"$f":"IF('Arrear Sheet'!J55=\"\",\"\",IF('Arrear Sheet'!C55=\"TOTAL\",\"\",'Arrear Sheet'!J55))","v":""},{"$f":"IF('Arrear Sheet'!K55=\"\",\"\",IF('Arrear Sheet'!C55=\"TOTAL\",\"\",SUM(G55:I55)))","v":""},{"$f":"IF('Arrear Sheet'!L55=\"\",\"\",IF('Arrear Sheet'!C55=\"TOTAL\",\"\",'Arrear Sheet'!L55))","v":""},{"$f":"IF('Arrear Sheet'!M55=\"\",\"\",IF('Arrear Sheet'!C55=\"TOTAL\",\"\",'Arrear Sheet'!M55))","v":""},{"$f":"IF('Arrear Sheet'!N55=\"\",\"\",IF('Arrear Sheet'!C55=\"TOTAL\",\"\",'Arrear Sheet'!N55))","v":""},{"$f":"IF('Arrear Sheet'!O55=\"\",\"\",IF('Arrear Sheet'!C55=\"TOTAL\",\"\",SUM(K55:M55)))","v":""},{"$f":"IF('Arrear Sheet'!P55=\"\",\"\",IF('Arrear Sheet'!C55=\"TOTAL\",\"\",'Arrear Sheet'!P55))","v":""},{"$f":"IF('Arrear Sheet'!Q55=\"\",\"\",IF('Arrear Sheet'!C55=\"TOTAL\",\"\",'Arrear Sheet'!Q55))","v":""},{"$f":"IF('Arrear Sheet'!R55=\"\",\"\",IF('Arrear Sheet'!C55=\"TOTAL\",\"\",'Arrear Sheet'!R55))","v":""},{"$f":"IF('Arrear Sheet'!S55=\"\",\"\",IF('Arrear Sheet'!C55=\"TOTAL\",\"\",'Arrear Sheet'!S55))","v":""},{"$f":"IF('Arrear Sheet'!T55=\"\",\"\",IF('Arrear Sheet'!C55=\"TOTAL\",\"\",'Arrear Sheet'!T55))","v":""},{"$f":"IF('Arrear Sheet'!U55=\"\",\"\",IF('Arrear Sheet'!C55=\"TOTAL\",\"\",'Arrear Sheet'!U55))","v":""},{"$f":"IF('Arrear Sheet'!V55=\"\",\"\",IF('Arrear Sheet'!C55=\"TOTAL\",\"\",'Arrear Sheet'!V55))","v":""},{"$f":"IF('Arrear Sheet'!W55=\"\",\"\",IF('Arrear Sheet'!C55=\"TOTAL\",\"\",'Arrear Sheet'!W55))","v":""},{"$f":"IF('Arrear Sheet'!X55=\"\",\"\",IF('Arrear Sheet'!C55=\"TOTAL\",\"\",'Arrear Sheet'!X55))","v":""},{"$f":"IF('Arrear Sheet'!Y55=\"\",\"\",IF('Arrear Sheet'!C55=\"TOTAL\",\"\",'Arrear Sheet'!Y55))","v":""},{"$f":"IF('Arrear Sheet'!Z55=\"\",\"\",IF('Arrear Sheet'!C55=\"TOTAL\",\"\",'Arrear Sheet'!Z55))","v":""},{"$f":"IF('Arrear Sheet'!AA55=\"\",\"\",IF('Arrear Sheet'!C55=\"TOTAL\",\"\",'Arrear Sheet'!AA55))","v":""},{"$f":"IF('Arrear Sheet'!AB55=\"\",\"\",IF('Arrear Sheet'!C55=\"TOTAL\",\"\",SUM(N55-Z55)))","v":""}]
[{"$f":"IF('Arrear Sheet'!B56=\"\",\"\",'Arrear Sheet'!B56)","v":""},{"$f":"IF('Arrear Sheet'!C56=\"\",\"\",IF('Arrear Sheet'!C56=\"TOTAL\",\"\",'Arrear Sheet'!C56))","v":""},{"$f":"IF('Arrear Sheet'!D56=\"\",\"\",IF('Arrear Sheet'!C56=\"TOTAL\",\"\",IF('Arrear Sheet'!D56=\"अक्षरें राशि :-\",\"\",'Arrear Sheet'!D56)))","v":""},{"$f":"IF('Arrear Sheet'!E56=\"\",\"\",IF('Arrear Sheet'!C56=\"TOTAL\",\"\",'Arrear Sheet'!E56))","v":""},{"$f":"IF('Arrear Sheet'!F56=\"\",\"\",IF('Arrear Sheet'!C56=\"TOTAL\",\"\",'Arrear Sheet'!F56))","v":""},{"$f":"IF('Arrear Sheet'!G56=\"\",\"\",IF('Arrear Sheet'!C56=\"TOTAL\",\"\",SUM(C56:E56)))","v":""},{"$f":"IF('Arrear Sheet'!H56=\"\",\"\",IF('Arrear Sheet'!C56=\"TOTAL\",\"\",'Arrear Sheet'!H56))","v":""},{"$f":"IF('Arrear Sheet'!I56=\"\",\"\",IF('Arrear Sheet'!C56=\"TOTAL\",\"\",'Arrear Sheet'!I56))","v":""},{"$f":"IF('Arrear Sheet'!J56=\"\",\"\",IF('Arrear Sheet'!C56=\"TOTAL\",\"\",'Arrear Sheet'!J56))","v":""},{"$f":"IF('Arrear Sheet'!K56=\"\",\"\",IF('Arrear Sheet'!C56=\"TOTAL\",\"\",SUM(G56:I56)))","v":""},{"$f":"IF('Arrear Sheet'!L56=\"\",\"\",IF('Arrear Sheet'!C56=\"TOTAL\",\"\",'Arrear Sheet'!L56))","v":""},{"$f":"IF('Arrear Sheet'!M56=\"\",\"\",IF('Arrear Sheet'!C56=\"TOTAL\",\"\",'Arrear Sheet'!M56))","v":""},{"$f":"IF('Arrear Sheet'!N56=\"\",\"\",IF('Arrear Sheet'!C56=\"TOTAL\",\"\",'Arrear Sheet'!N56))","v":""},{"$f":"IF('Arrear Sheet'!O56=\"\",\"\",IF('Arrear Sheet'!C56=\"TOTAL\",\"\",SUM(K56:M56)))","v":""},{"$f":"IF('Arrear Sheet'!P56=\"\",\"\",IF('Arrear Sheet'!C56=\"TOTAL\",\"\",'Arrear Sheet'!P56))","v":""},{"$f":"IF('Arrear Sheet'!Q56=\"\",\"\",IF('Arrear Sheet'!C56=\"TOTAL\",\"\",'Arrear Sheet'!Q56))","v":""},{"$f":"IF('Arrear Sheet'!R56=\"\",\"\",IF('Arrear Sheet'!C56=\"TOTAL\",\"\",'Arrear Sheet'!R56))","v":""},{"$f":"IF('Arrear Sheet'!S56=\"\",\"\",IF('Arrear Sheet'!C56=\"TOTAL\",\"\",'Arrear Sheet'!S56))","v":""},{"$f":"IF('Arrear Sheet'!T56=\"\",\"\",IF('Arrear Sheet'!C56=\"TOTAL\",\"\",'Arrear Sheet'!T56))","v":""},{"$f":"IF('Arrear Sheet'!U56=\"\",\"\",IF('Arrear Sheet'!C56=\"TOTAL\",\"\",'Arrear Sheet'!U56))","v":""},{"$f":"IF('Arrear Sheet'!V56=\"\",\"\",IF('Arrear Sheet'!C56=\"TOTAL\",\"\",'Arrear Sheet'!V56))","v":""},{"$f":"IF('Arrear Sheet'!W56=\"\",\"\",IF('Arrear Sheet'!C56=\"TOTAL\",\"\",'Arrear Sheet'!W56))","v":""},{"$f":"IF('Arrear Sheet'!X56=\"\",\"\",IF('Arrear Sheet'!C56=\"TOTAL\",\"\",'Arrear Sheet'!X56))","v":""},{"$f":"IF('Arrear Sheet'!Y56=\"\",\"\",IF('Arrear Sheet'!C56=\"TOTAL\",\"\",'Arrear Sheet'!Y56))","v":""},{"$f":"IF('Arrear Sheet'!Z56=\"\",\"\",IF('Arrear Sheet'!C56=\"TOTAL\",\"\",'Arrear Sheet'!Z56))","v":""},{"$f":"IF('Arrear Sheet'!AA56=\"\",\"\",IF('Arrear Sheet'!C56=\"TOTAL\",\"\",'Arrear Sheet'!AA56))","v":""},{"$f":"IF('Arrear Sheet'!AB56=\"\",\"\",IF('Arrear Sheet'!C56=\"TOTAL\",\"\",SUM(N56-Z56)))","v":""}]
[{"$f":"IF('Arrear Sheet'!B57=\"\",\"\",'Arrear Sheet'!B57)","v":""},{"$f":"IF('Arrear Sheet'!C57=\"\",\"\",IF('Arrear Sheet'!C57=\"TOTAL\",\"\",'Arrear Sheet'!C57))","v":""},{"$f":"IF('Arrear Sheet'!D57=\"\",\"\",IF('Arrear Sheet'!C57=\"TOTAL\",\"\",IF('Arrear Sheet'!D57=\"अक्षरें राशि :-\",\"\",'Arrear Sheet'!D57)))","v":""},{"$f":"IF('Arrear Sheet'!E57=\"\",\"\",IF('Arrear Sheet'!C57=\"TOTAL\",\"\",'Arrear Sheet'!E57))","v":""},{"$f":"IF('Arrear Sheet'!F57=\"\",\"\",IF('Arrear Sheet'!C57=\"TOTAL\",\"\",'Arrear Sheet'!F57))","v":""},{"$f":"IF('Arrear Sheet'!G57=\"\",\"\",IF('Arrear Sheet'!C57=\"TOTAL\",\"\",SUM(C57:E57)))","v":""},{"$f":"IF('Arrear Sheet'!H57=\"\",\"\",IF('Arrear Sheet'!C57=\"TOTAL\",\"\",'Arrear Sheet'!H57))","v":""},{"$f":"IF('Arrear Sheet'!I57=\"\",\"\",IF('Arrear Sheet'!C57=\"TOTAL\",\"\",'Arrear Sheet'!I57))","v":""},{"$f":"IF('Arrear Sheet'!J57=\"\",\"\",IF('Arrear Sheet'!C57=\"TOTAL\",\"\",'Arrear Sheet'!J57))","v":""},{"$f":"IF('Arrear Sheet'!K57=\"\",\"\",IF('Arrear Sheet'!C57=\"TOTAL\",\"\",SUM(G57:I57)))","v":""},{"$f":"IF('Arrear Sheet'!L57=\"\",\"\",IF('Arrear Sheet'!C57=\"TOTAL\",\"\",'Arrear Sheet'!L57))","v":""},{"$f":"IF('Arrear Sheet'!M57=\"\",\"\",IF('Arrear Sheet'!C57=\"TOTAL\",\"\",'Arrear Sheet'!M57))","v":""},{"$f":"IF('Arrear Sheet'!N57=\"\",\"\",IF('Arrear Sheet'!C57=\"TOTAL\",\"\",'Arrear Sheet'!N57))","v":""},{"$f":"IF('Arrear Sheet'!O57=\"\",\"\",IF('Arrear Sheet'!C57=\"TOTAL\",\"\",SUM(K57:M57)))","v":""},{"$f":"IF('Arrear Sheet'!P57=\"\",\"\",IF('Arrear Sheet'!C57=\"TOTAL\",\"\",'Arrear Sheet'!P57))","v":""},{"$f":"IF('Arrear Sheet'!Q57=\"\",\"\",IF('Arrear Sheet'!C57=\"TOTAL\",\"\",'Arrear Sheet'!Q57))","v":""},{"$f":"IF('Arrear Sheet'!R57=\"\",\"\",IF('Arrear Sheet'!C57=\"TOTAL\",\"\",'Arrear Sheet'!R57))","v":""},{"$f":"IF('Arrear Sheet'!S57=\"\",\"\",IF('Arrear Sheet'!C57=\"TOTAL\",\"\",'Arrear Sheet'!S57))","v":""},{"$f":"IF('Arrear Sheet'!T57=\"\",\"\",IF('Arrear Sheet'!C57=\"TOTAL\",\"\",'Arrear Sheet'!T57))","v":""},{"$f":"IF('Arrear Sheet'!U57=\"\",\"\",IF('Arrear Sheet'!C57=\"TOTAL\",\"\",'Arrear Sheet'!U57))","v":""},{"$f":"IF('Arrear Sheet'!V57=\"\",\"\",IF('Arrear Sheet'!C57=\"TOTAL\",\"\",'Arrear Sheet'!V57))","v":""},{"$f":"IF('Arrear Sheet'!W57=\"\",\"\",IF('Arrear Sheet'!C57=\"TOTAL\",\"\",'Arrear Sheet'!W57))","v":""},{"$f":"IF('Arrear Sheet'!X57=\"\",\"\",IF('Arrear Sheet'!C57=\"TOTAL\",\"\",'Arrear Sheet'!X57))","v":""},{"$f":"IF('Arrear Sheet'!Y57=\"\",\"\",IF('Arrear Sheet'!C57=\"TOTAL\",\"\",'Arrear Sheet'!Y57))","v":""},{"$f":"IF('Arrear Sheet'!Z57=\"\",\"\",IF('Arrear Sheet'!C57=\"TOTAL\",\"\",'Arrear Sheet'!Z57))","v":""},{"$f":"IF('Arrear Sheet'!AA57=\"\",\"\",IF('Arrear Sheet'!C57=\"TOTAL\",\"\",'Arrear Sheet'!AA57))","v":""},{"$f":"IF('Arrear Sheet'!AB57=\"\",\"\",IF('Arrear Sheet'!C57=\"TOTAL\",\"\",SUM(N57-Z57)))","v":""}]
[{"$f":"IF('Arrear Sheet'!B58=\"\",\"\",'Arrear Sheet'!B58)","v":""},{"$f":"IF('Arrear Sheet'!C58=\"\",\"\",IF('Arrear Sheet'!C58=\"TOTAL\",\"\",'Arrear Sheet'!C58))","v":""},{"$f":"IF('Arrear Sheet'!D58=\"\",\"\",IF('Arrear Sheet'!C58=\"TOTAL\",\"\",IF('Arrear Sheet'!D58=\"अक्षरें राशि :-\",\"\",'Arrear Sheet'!D58)))","v":""},{"$f":"IF('Arrear Sheet'!E58=\"\",\"\",IF('Arrear Sheet'!C58=\"TOTAL\",\"\",'Arrear Sheet'!E58))","v":""},{"$f":"IF('Arrear Sheet'!F58=\"\",\"\",IF('Arrear Sheet'!C58=\"TOTAL\",\"\",'Arrear Sheet'!F58))","v":""},{"$f":"IF('Arrear Sheet'!G58=\"\",\"\",IF('Arrear Sheet'!C58=\"TOTAL\",\"\",SUM(C58:E58)))","v":""},{"$f":"IF('Arrear Sheet'!H58=\"\",\"\",IF('Arrear Sheet'!C58=\"TOTAL\",\"\",'Arrear Sheet'!H58))","v":""},{"$f":"IF('Arrear Sheet'!I58=\"\",\"\",IF('Arrear Sheet'!C58=\"TOTAL\",\"\",'Arrear Sheet'!I58))","v":""},{"$f":"IF('Arrear Sheet'!J58=\"\",\"\",IF('Arrear Sheet'!C58=\"TOTAL\",\"\",'Arrear Sheet'!J58))","v":""},{"$f":"IF('Arrear Sheet'!K58=\"\",\"\",IF('Arrear Sheet'!C58=\"TOTAL\",\"\",SUM(G58:I58)))","v":""},{"$f":"IF('Arrear Sheet'!L58=\"\",\"\",IF('Arrear Sheet'!C58=\"TOTAL\",\"\",'Arrear Sheet'!L58))","v":""},{"$f":"IF('Arrear Sheet'!M58=\"\",\"\",IF('Arrear Sheet'!C58=\"TOTAL\",\"\",'Arrear Sheet'!M58))","v":""},{"$f":"IF('Arrear Sheet'!N58=\"\",\"\",IF('Arrear Sheet'!C58=\"TOTAL\",\"\",'Arrear Sheet'!N58))","v":""},{"$f":"IF('Arrear Sheet'!O58=\"\",\"\",IF('Arrear Sheet'!C58=\"TOTAL\",\"\",SUM(K58:M58)))","v":""},{"$f":"IF('Arrear Sheet'!P58=\"\",\"\",IF('Arrear Sheet'!C58=\"TOTAL\",\"\",'Arrear Sheet'!P58))","v":""},{"$f":"IF('Arrear Sheet'!Q58=\"\",\"\",IF('Arrear Sheet'!C58=\"TOTAL\",\"\",'Arrear Sheet'!Q58))","v":""},{"$f":"IF('Arrear Sheet'!R58=\"\",\"\",IF('Arrear Sheet'!C58=\"TOTAL\",\"\",'Arrear Sheet'!R58))","v":""},{"$f":"IF('Arrear Sheet'!S58=\"\",\"\",IF('Arrear Sheet'!C58=\"TOTAL\",\"\",'Arrear Sheet'!S58))","v":""},{"$f":"IF('Arrear Sheet'!T58=\"\",\"\",IF('Arrear Sheet'!C58=\"TOTAL\",\"\",'Arrear Sheet'!T58))","v":""},{"$f":"IF('Arrear Sheet'!U58=\"\",\"\",IF('Arrear Sheet'!C58=\"TOTAL\",\"\",'Arrear Sheet'!U58))","v":""},{"$f":"IF('Arrear Sheet'!V58=\"\",\"\",IF('Arrear Sheet'!C58=\"TOTAL\",\"\",'Arrear Sheet'!V58))","v":""},{"$f":"IF('Arrear Sheet'!W58=\"\",\"\",IF('Arrear Sheet'!C58=\"TOTAL\",\"\",'Arrear Sheet'!W58))","v":""},{"$f":"IF('Arrear Sheet'!X58=\"\",\"\",IF('Arrear Sheet'!C58=\"TOTAL\",\"\",'Arrear Sheet'!X58))","v":""},{"$f":"IF('Arrear Sheet'!Y58=\"\",\"\",IF('Arrear Sheet'!C58=\"TOTAL\",\"\",'Arrear Sheet'!Y58))","v":""},{"$f":"IF('Arrear Sheet'!Z58=\"\",\"\",IF('Arrear Sheet'!C58=\"TOTAL\",\"\",'Arrear Sheet'!Z58))","v":""},{"$f":"IF('Arrear Sheet'!AA58=\"\",\"\",IF('Arrear Sheet'!C58=\"TOTAL\",\"\",'Arrear Sheet'!AA58))","v":""},{"$f":"IF('Arrear Sheet'!AB58=\"\",\"\",IF('Arrear Sheet'!C58=\"TOTAL\",\"\",SUM(N58-Z58)))","v":""}]
[{"$f":"IF('Arrear Sheet'!B59=\"\",\"\",'Arrear Sheet'!B59)","v":""},{"$f":"IF('Arrear Sheet'!C59=\"\",\"\",IF('Arrear Sheet'!C59=\"TOTAL\",\"\",'Arrear Sheet'!C59))","v":""},{"$f":"IF('Arrear Sheet'!D59=\"\",\"\",IF('Arrear Sheet'!C59=\"TOTAL\",\"\",IF('Arrear Sheet'!D59=\"अक्षरें राशि :-\",\"\",'Arrear Sheet'!D59)))","v":""},{"$f":"IF('Arrear Sheet'!E59=\"\",\"\",IF('Arrear Sheet'!C59=\"TOTAL\",\"\",'Arrear Sheet'!E59))","v":""},{"$f":"IF('Arrear Sheet'!F59=\"\",\"\",IF('Arrear Sheet'!C59=\"TOTAL\",\"\",'Arrear Sheet'!F59))","v":""},{"$f":"IF('Arrear Sheet'!G59=\"\",\"\",IF('Arrear Sheet'!C59=\"TOTAL\",\"\",SUM(C59:E59)))","v":""},{"$f":"IF('Arrear Sheet'!H59=\"\",\"\",IF('Arrear Sheet'!C59=\"TOTAL\",\"\",'Arrear Sheet'!H59))","v":""},{"$f":"IF('Arrear Sheet'!I59=\"\",\"\",IF('Arrear Sheet'!C59=\"TOTAL\",\"\",'Arrear Sheet'!I59))","v":""},{"$f":"IF('Arrear Sheet'!J59=\"\",\"\",IF('Arrear Sheet'!C59=\"TOTAL\",\"\",'Arrear Sheet'!J59))","v":""},{"$f":"IF('Arrear Sheet'!K59=\"\",\"\",IF('Arrear Sheet'!C59=\"TOTAL\",\"\",SUM(G59:I59)))","v":""},{"$f":"IF('Arrear Sheet'!L59=\"\",\"\",IF('Arrear Sheet'!C59=\"TOTAL\",\"\",'Arrear Sheet'!L59))","v":""},{"$f":"IF('Arrear Sheet'!M59=\"\",\"\",IF('Arrear Sheet'!C59=\"TOTAL\",\"\",'Arrear Sheet'!M59))","v":""},{"$f":"IF('Arrear Sheet'!N59=\"\",\"\",IF('Arrear Sheet'!C59=\"TOTAL\",\"\",'Arrear Sheet'!N59))","v":""},{"$f":"IF('Arrear Sheet'!O59=\"\",\"\",IF('Arrear Sheet'!C59=\"TOTAL\",\"\",SUM(K59:M59)))","v":""},{"$f":"IF('Arrear Sheet'!P59=\"\",\"\",IF('Arrear Sheet'!C59=\"TOTAL\",\"\",'Arrear Sheet'!P59))","v":""},{"$f":"IF('Arrear Sheet'!Q59=\"\",\"\",IF('Arrear Sheet'!C59=\"TOTAL\",\"\",'Arrear Sheet'!Q59))","v":""},{"$f":"IF('Arrear Sheet'!R59=\"\",\"\",IF('Arrear Sheet'!C59=\"TOTAL\",\"\",'Arrear Sheet'!R59))","v":""},{"$f":"IF('Arrear Sheet'!S59=\"\",\"\",IF('Arrear Sheet'!C59=\"TOTAL\",\"\",'Arrear Sheet'!S59))","v":""},{"$f":"IF('Arrear Sheet'!T59=\"\",\"\",IF('Arrear Sheet'!C59=\"TOTAL\",\"\",'Arrear Sheet'!T59))","v":""},{"$f":"IF('Arrear Sheet'!U59=\"\",\"\",IF('Arrear Sheet'!C59=\"TOTAL\",\"\",'Arrear Sheet'!U59))","v":""},{"$f":"IF('Arrear Sheet'!V59=\"\",\"\",IF('Arrear Sheet'!C59=\"TOTAL\",\"\",'Arrear Sheet'!V59))","v":""},{"$f":"IF('Arrear Sheet'!W59=\"\",\"\",IF('Arrear Sheet'!C59=\"TOTAL\",\"\",'Arrear Sheet'!W59))","v":""},{"$f":"IF('Arrear Sheet'!X59=\"\",\"\",IF('Arrear Sheet'!C59=\"TOTAL\",\"\",'Arrear Sheet'!X59))","v":""},{"$f":"IF('Arrear Sheet'!Y59=\"\",\"\",IF('Arrear Sheet'!C59=\"TOTAL\",\"\",'Arrear Sheet'!Y59))","v":""},{"$f":"IF('Arrear Sheet'!Z59=\"\",\"\",IF('Arrear Sheet'!C59=\"TOTAL\",\"\",'Arrear Sheet'!Z59))","v":""},{"$f":"IF('Arrear Sheet'!AA59=\"\",\"\",IF('Arrear Sheet'!C59=\"TOTAL\",\"\",'Arrear Sheet'!AA59))","v":""},{"$f":"IF('Arrear Sheet'!AB59=\"\",\"\",IF('Arrear Sheet'!C59=\"TOTAL\",\"\",SUM(N59-Z59)))","v":""}]
[{"$f":"IF('Arrear Sheet'!B60=\"\",\"\",'Arrear Sheet'!B60)","v":""},{"$f":"IF('Arrear Sheet'!C60=\"\",\"\",IF('Arrear Sheet'!C60=\"TOTAL\",\"\",'Arrear Sheet'!C60))","v":""},{"$f":"IF('Arrear Sheet'!D60=\"\",\"\",IF('Arrear Sheet'!C60=\"TOTAL\",\"\",IF('Arrear Sheet'!D60=\"अक्षरें राशि :-\",\"\",'Arrear Sheet'!D60)))","v":""},{"$f":"IF('Arrear Sheet'!E60=\"\",\"\",IF('Arrear Sheet'!C60=\"TOTAL\",\"\",'Arrear Sheet'!E60))","v":""},{"$f":"IF('Arrear Sheet'!F60=\"\",\"\",IF('Arrear Sheet'!C60=\"TOTAL\",\"\",'Arrear Sheet'!F60))","v":""},{"$f":"IF('Arrear Sheet'!G60=\"\",\"\",IF('Arrear Sheet'!C60=\"TOTAL\",\"\",SUM(C60:E60)))","v":""},{"$f":"IF('Arrear Sheet'!H60=\"\",\"\",IF('Arrear Sheet'!C60=\"TOTAL\",\"\",'Arrear Sheet'!H60))","v":""},{"$f":"IF('Arrear Sheet'!I60=\"\",\"\",IF('Arrear Sheet'!C60=\"TOTAL\",\"\",'Arrear Sheet'!I60))","v":""},{"$f":"IF('Arrear Sheet'!J60=\"\",\"\",IF('Arrear Sheet'!C60=\"TOTAL\",\"\",'Arrear Sheet'!J60))","v":""},{"$f":"IF('Arrear Sheet'!K60=\"\",\"\",IF('Arrear Sheet'!C60=\"TOTAL\",\"\",SUM(G60:I60)))","v":""},{"$f":"IF('Arrear Sheet'!L60=\"\",\"\",IF('Arrear Sheet'!C60=\"TOTAL\",\"\",'Arrear Sheet'!L60))","v":""},{"$f":"IF('Arrear Sheet'!M60=\"\",\"\",IF('Arrear Sheet'!C60=\"TOTAL\",\"\",'Arrear Sheet'!M60))","v":""},{"$f":"IF('Arrear Sheet'!N60=\"\",\"\",IF('Arrear Sheet'!C60=\"TOTAL\",\"\",'Arrear Sheet'!N60))","v":""},{"$f":"IF('Arrear Sheet'!O60=\"\",\"\",IF('Arrear Sheet'!C60=\"TOTAL\",\"\",SUM(K60:M60)))","v":""},{"$f":"IF('Arrear Sheet'!P60=\"\",\"\",IF('Arrear Sheet'!C60=\"TOTAL\",\"\",'Arrear Sheet'!P60))","v":""},{"$f":"IF('Arrear Sheet'!Q60=\"\",\"\",IF('Arrear Sheet'!C60=\"TOTAL\",\"\",'Arrear Sheet'!Q60))","v":""},{"$f":"IF('Arrear Sheet'!R60=\"\",\"\",IF('Arrear Sheet'!C60=\"TOTAL\",\"\",'Arrear Sheet'!R60))","v":""},{"$f":"IF('Arrear Sheet'!S60=\"\",\"\",IF('Arrear Sheet'!C60=\"TOTAL\",\"\",'Arrear Sheet'!S60))","v":""},{"$f":"IF('Arrear Sheet'!T60=\"\",\"\",IF('Arrear Sheet'!C60=\"TOTAL\",\"\",'Arrear Sheet'!T60))","v":""},{"$f":"IF('Arrear Sheet'!U60=\"\",\"\",IF('Arrear Sheet'!C60=\"TOTAL\",\"\",'Arrear Sheet'!U60))","v":""},{"$f":"IF('Arrear Sheet'!V60=\"\",\"\",IF('Arrear Sheet'!C60=\"TOTAL\",\"\",'Arrear Sheet'!V60))","v":""},{"$f":"IF('Arrear Sheet'!W60=\"\",\"\",IF('Arrear Sheet'!C60=\"TOTAL\",\"\",'Arrear Sheet'!W60))","v":""},{"$f":"IF('Arrear Sheet'!X60=\"\",\"\",IF('Arrear Sheet'!C60=\"TOTAL\",\"\",'Arrear Sheet'!X60))","v":""},{"$f":"IF('Arrear Sheet'!Y60=\"\",\"\",IF('Arrear Sheet'!C60=\"TOTAL\",\"\",'Arrear Sheet'!Y60))","v":""},{"$f":"IF('Arrear Sheet'!Z60=\"\",\"\",IF('Arrear Sheet'!C60=\"TOTAL\",\"\",'Arrear Sheet'!Z60))","v":""},{"$f":"IF('Arrear Sheet'!AA60=\"\",\"\",IF('Arrear Sheet'!C60=\"TOTAL\",\"\",'Arrear Sheet'!AA60))","v":""},{"$f":"IF('Arrear Sheet'!AB60=\"\",\"\",IF('Arrear Sheet'!C60=\"TOTAL\",\"\",SUM(N60-Z60)))","v":""}]
[{"$f":"IF('Arrear Sheet'!B61=\"\",\"\",'Arrear Sheet'!B61)","v":""},{"$f":"IF('Arrear Sheet'!C61=\"\",\"\",IF('Arrear Sheet'!C61=\"TOTAL\",\"\",'Arrear Sheet'!C61))","v":""},{"$f":"IF('Arrear Sheet'!D61=\"\",\"\",IF('Arrear Sheet'!C61=\"TOTAL\",\"\",IF('Arrear Sheet'!D61=\"अक्षरें राशि :-\",\"\",'Arrear Sheet'!D61)))","v":""},{"$f":"IF('Arrear Sheet'!E61=\"\",\"\",IF('Arrear Sheet'!C61=\"TOTAL\",\"\",'Arrear Sheet'!E61))","v":""},{"$f":"IF('Arrear Sheet'!F61=\"\",\"\",IF('Arrear Sheet'!C61=\"TOTAL\",\"\",'Arrear Sheet'!F61))","v":""},{"$f":"IF('Arrear Sheet'!G61=\"\",\"\",IF('Arrear Sheet'!C61=\"TOTAL\",\"\",SUM(C61:E61)))","v":""},{"$f":"IF('Arrear Sheet'!H61=\"\",\"\",IF('Arrear Sheet'!C61=\"TOTAL\",\"\",'Arrear Sheet'!H61))","v":""},{"$f":"IF('Arrear Sheet'!I61=\"\",\"\",IF('Arrear Sheet'!C61=\"TOTAL\",\"\",'Arrear Sheet'!I61))","v":""},{"$f":"IF('Arrear Sheet'!J61=\"\",\"\",IF('Arrear Sheet'!C61=\"TOTAL\",\"\",'Arrear Sheet'!J61))","v":""},{"$f":"IF('Arrear Sheet'!K61=\"\",\"\",IF('Arrear Sheet'!C61=\"TOTAL\",\"\",SUM(G61:I61)))","v":""},{"$f":"IF('Arrear Sheet'!L61=\"\",\"\",IF('Arrear Sheet'!C61=\"TOTAL\",\"\",'Arrear Sheet'!L61))","v":""},{"$f":"IF('Arrear Sheet'!M61=\"\",\"\",IF('Arrear Sheet'!C61=\"TOTAL\",\"\",'Arrear Sheet'!M61))","v":""},{"$f":"IF('Arrear Sheet'!N61=\"\",\"\",IF('Arrear Sheet'!C61=\"TOTAL\",\"\",'Arrear Sheet'!N61))","v":""},{"$f":"IF('Arrear Sheet'!O61=\"\",\"\",IF('Arrear Sheet'!C61=\"TOTAL\",\"\",SUM(K61:M61)))","v":""},{"$f":"IF('Arrear Sheet'!P61=\"\",\"\",IF('Arrear Sheet'!C61=\"TOTAL\",\"\",'Arrear Sheet'!P61))","v":""},{"$f":"IF('Arrear Sheet'!Q61=\"\",\"\",IF('Arrear Sheet'!C61=\"TOTAL\",\"\",'Arrear Sheet'!Q61))","v":""},{"$f":"IF('Arrear Sheet'!R61=\"\",\"\",IF('Arrear Sheet'!C61=\"TOTAL\",\"\",'Arrear Sheet'!R61))","v":""},{"$f":"IF('Arrear Sheet'!S61=\"\",\"\",IF('Arrear Sheet'!C61=\"TOTAL\",\"\",'Arrear Sheet'!S61))","v":""},{"$f":"IF('Arrear Sheet'!T61=\"\",\"\",IF('Arrear Sheet'!C61=\"TOTAL\",\"\",'Arrear Sheet'!T61))","v":""},{"$f":"IF('Arrear Sheet'!U61=\"\",\"\",IF('Arrear Sheet'!C61=\"TOTAL\",\"\",'Arrear Sheet'!U61))","v":""},{"$f":"IF('Arrear Sheet'!V61=\"\",\"\",IF('Arrear Sheet'!C61=\"TOTAL\",\"\",'Arrear Sheet'!V61))","v":""},{"$f":"IF('Arrear Sheet'!W61=\"\",\"\",IF('Arrear Sheet'!C61=\"TOTAL\",\"\",'Arrear Sheet'!W61))","v":""},{"$f":"IF('Arrear Sheet'!X61=\"\",\"\",IF('Arrear Sheet'!C61=\"TOTAL\",\"\",'Arrear Sheet'!X61))","v":""},{"$f":"IF('Arrear Sheet'!Y61=\"\",\"\",IF('Arrear Sheet'!C61=\"TOTAL\",\"\",'Arrear Sheet'!Y61))","v":""},{"$f":"IF('Arrear Sheet'!Z61=\"\",\"\",IF('Arrear Sheet'!C61=\"TOTAL\",\"\",'Arrear Sheet'!Z61))","v":""},{"$f":"IF('Arrear Sheet'!AA61=\"\",\"\",IF('Arrear Sheet'!C61=\"TOTAL\",\"\",'Arrear Sheet'!AA61))","v":""},{"$f":"IF('Arrear Sheet'!AB61=\"\",\"\",IF('Arrear Sheet'!C61=\"TOTAL\",\"\",SUM(N61-Z61)))","v":""}]
[{"$f":"IF('Arrear Sheet'!B62=\"\",\"\",'Arrear Sheet'!B62)","v":""},{"$f":"IF('Arrear Sheet'!C62=\"\",\"\",IF('Arrear Sheet'!C62=\"TOTAL\",\"\",'Arrear Sheet'!C62))","v":""},{"$f":"IF('Arrear Sheet'!D62=\"\",\"\",IF('Arrear Sheet'!C62=\"TOTAL\",\"\",IF('Arrear Sheet'!D62=\"अक्षरें राशि :-\",\"\",'Arrear Sheet'!D62)))","v":""},{"$f":"IF('Arrear Sheet'!E62=\"\",\"\",IF('Arrear Sheet'!C62=\"TOTAL\",\"\",'Arrear Sheet'!E62))","v":""},{"$f":"IF('Arrear Sheet'!F62=\"\",\"\",IF('Arrear Sheet'!C62=\"TOTAL\",\"\",'Arrear Sheet'!F62))","v":""},{"$f":"IF('Arrear Sheet'!G62=\"\",\"\",IF('Arrear Sheet'!C62=\"TOTAL\",\"\",SUM(C62:E62)))","v":""},{"$f":"IF('Arrear Sheet'!H62=\"\",\"\",IF('Arrear Sheet'!C62=\"TOTAL\",\"\",'Arrear Sheet'!H62))","v":""},{"$f":"IF('Arrear Sheet'!I62=\"\",\"\",IF('Arrear Sheet'!C62=\"TOTAL\",\"\",'Arrear Sheet'!I62))","v":""},{"$f":"IF('Arrear Sheet'!J62=\"\",\"\",IF('Arrear Sheet'!C62=\"TOTAL\",\"\",'Arrear Sheet'!J62))","v":""},{"$f":"IF('Arrear Sheet'!K62=\"\",\"\",IF('Arrear Sheet'!C62=\"TOTAL\",\"\",SUM(G62:I62)))","v":""},{"$f":"IF('Arrear Sheet'!L62=\"\",\"\",IF('Arrear Sheet'!C62=\"TOTAL\",\"\",'Arrear Sheet'!L62))","v":""},{"$f":"IF('Arrear Sheet'!M62=\"\",\"\",IF('Arrear Sheet'!C62=\"TOTAL\",\"\",'Arrear Sheet'!M62))","v":""},{"$f":"IF('Arrear Sheet'!N62=\"\",\"\",IF('Arrear Sheet'!C62=\"TOTAL\",\"\",'Arrear Sheet'!N62))","v":""},{"$f":"IF('Arrear Sheet'!O62=\"\",\"\",IF('Arrear Sheet'!C62=\"TOTAL\",\"\",SUM(K62:M62)))","v":""},{"$f":"IF('Arrear Sheet'!P62=\"\",\"\",IF('Arrear Sheet'!C62=\"TOTAL\",\"\",'Arrear Sheet'!P62))","v":""},{"$f":"IF('Arrear Sheet'!Q62=\"\",\"\",IF('Arrear Sheet'!C62=\"TOTAL\",\"\",'Arrear Sheet'!Q62))","v":""},{"$f":"IF('Arrear Sheet'!R62=\"\",\"\",IF('Arrear Sheet'!C62=\"TOTAL\",\"\",'Arrear Sheet'!R62))","v":""},{"$f":"IF('Arrear Sheet'!S62=\"\",\"\",IF('Arrear Sheet'!C62=\"TOTAL\",\"\",'Arrear Sheet'!S62))","v":""},{"$f":"IF('Arrear Sheet'!T62=\"\",\"\",IF('Arrear Sheet'!C62=\"TOTAL\",\"\",'Arrear Sheet'!T62))","v":""},{"$f":"IF('Arrear Sheet'!U62=\"\",\"\",IF('Arrear Sheet'!C62=\"TOTAL\",\"\",'Arrear Sheet'!U62))","v":""},{"$f":"IF('Arrear Sheet'!V62=\"\",\"\",IF('Arrear Sheet'!C62=\"TOTAL\",\"\",'Arrear Sheet'!V62))","v":""},{"$f":"IF('Arrear Sheet'!W62=\"\",\"\",IF('Arrear Sheet'!C62=\"TOTAL\",\"\",'Arrear Sheet'!W62))","v":""},{"$f":"IF('Arrear Sheet'!X62=\"\",\"\",IF('Arrear Sheet'!C62=\"TOTAL\",\"\",'Arrear Sheet'!X62))","v":""},{"$f":"IF('Arrear Sheet'!Y62=\"\",\"\",IF('Arrear Sheet'!C62=\"TOTAL\",\"\",'Arrear Sheet'!Y62))","v":""},{"$f":"IF('Arrear Sheet'!Z62=\"\",\"\",IF('Arrear Sheet'!C62=\"TOTAL\",\"\",'Arrear Sheet'!Z62))","v":""},{"$f":"IF('Arrear Sheet'!AA62=\"\",\"\",IF('Arrear Sheet'!C62=\"TOTAL\",\"\",'Arrear Sheet'!AA62))","v":""},{"$f":"IF('Arrear Sheet'!AB62=\"\",\"\",IF('Arrear Sheet'!C62=\"TOTAL\",\"\",SUM(N62-Z62)))","v":""}]
[{"$f":"IF('Arrear Sheet'!B63=\"\",\"\",'Arrear Sheet'!B63)","v":""},{"$f":"IF('Arrear Sheet'!C63=\"\",\"\",IF('Arrear Sheet'!C63=\"TOTAL\",\"\",'Arrear Sheet'!C63))","v":""},{"$f":"IF('Arrear Sheet'!D63=\"\",\"\",IF('Arrear Sheet'!C63=\"TOTAL\",\"\",IF('Arrear Sheet'!D63=\"अक्षरें राशि :-\",\"\",'Arrear Sheet'!D63)))","v":""},{"$f":"IF('Arrear Sheet'!E63=\"\",\"\",IF('Arrear Sheet'!C63=\"TOTAL\",\"\",'Arrear Sheet'!E63))","v":""},{"$f":"IF('Arrear Sheet'!F63=\"\",\"\",IF('Arrear Sheet'!C63=\"TOTAL\",\"\",'Arrear Sheet'!F63))","v":""},{"$f":"IF('Arrear Sheet'!G63=\"\",\"\",IF('Arrear Sheet'!C63=\"TOTAL\",\"\",SUM(C63:E63)))","v":""},{"$f":"IF('Arrear Sheet'!H63=\"\",\"\",IF('Arrear Sheet'!C63=\"TOTAL\",\"\",'Arrear Sheet'!H63))","v":""},{"$f":"IF('Arrear Sheet'!I63=\"\",\"\",IF('Arrear Sheet'!C63=\"TOTAL\",\"\",'Arrear Sheet'!I63))","v":""},{"$f":"IF('Arrear Sheet'!J63=\"\",\"\",IF('Arrear Sheet'!C63=\"TOTAL\",\"\",'Arrear Sheet'!J63))","v":""},{"$f":"IF('Arrear Sheet'!K63=\"\",\"\",IF('Arrear Sheet'!C63=\"TOTAL\",\"\",SUM(G63:I63)))","v":""},{"$f":"IF('Arrear Sheet'!L63=\"\",\"\",IF('Arrear Sheet'!C63=\"TOTAL\",\"\",'Arrear Sheet'!L63))","v":""},{"$f":"IF('Arrear Sheet'!M63=\"\",\"\",IF('Arrear Sheet'!C63=\"TOTAL\",\"\",'Arrear Sheet'!M63))","v":""},{"$f":"IF('Arrear Sheet'!N63=\"\",\"\",IF('Arrear Sheet'!C63=\"TOTAL\",\"\",'Arrear Sheet'!N63))","v":""},{"$f":"IF('Arrear Sheet'!O63=\"\",\"\",IF('Arrear Sheet'!C63=\"TOTAL\",\"\",SUM(K63:M63)))","v":""},{"$f":"IF('Arrear Sheet'!P63=\"\",\"\",IF('Arrear Sheet'!C63=\"TOTAL\",\"\",'Arrear Sheet'!P63))","v":""},{"$f":"IF('Arrear Sheet'!Q63=\"\",\"\",IF('Arrear Sheet'!C63=\"TOTAL\",\"\",'Arrear Sheet'!Q63))","v":""},{"$f":"IF('Arrear Sheet'!R63=\"\",\"\",IF('Arrear Sheet'!C63=\"TOTAL\",\"\",'Arrear Sheet'!R63))","v":""},{"$f":"IF('Arrear Sheet'!S63=\"\",\"\",IF('Arrear Sheet'!C63=\"TOTAL\",\"\",'Arrear Sheet'!S63))","v":""},{"$f":"IF('Arrear Sheet'!T63=\"\",\"\",IF('Arrear Sheet'!C63=\"TOTAL\",\"\",'Arrear Sheet'!T63))","v":""},{"$f":"IF('Arrear Sheet'!U63=\"\",\"\",IF('Arrear Sheet'!C63=\"TOTAL\",\"\",'Arrear Sheet'!U63))","v":""},{"$f":"IF('Arrear Sheet'!V63=\"\",\"\",IF('Arrear Sheet'!C63=\"TOTAL\",\"\",'Arrear Sheet'!V63))","v":""},{"$f":"IF('Arrear Sheet'!W63=\"\",\"\",IF('Arrear Sheet'!C63=\"TOTAL\",\"\",'Arrear Sheet'!W63))","v":""},{"$f":"IF('Arrear Sheet'!X63=\"\",\"\",IF('Arrear Sheet'!C63=\"TOTAL\",\"\",'Arrear Sheet'!X63))","v":""},{"$f":"IF('Arrear Sheet'!Y63=\"\",\"\",IF('Arrear Sheet'!C63=\"TOTAL\",\"\",'Arrear Sheet'!Y63))","v":""},{"$f":"IF('Arrear Sheet'!Z63=\"\",\"\",IF('Arrear Sheet'!C63=\"TOTAL\",\"\",'Arrear Sheet'!Z63))","v":""},{"$f":"IF('Arrear Sheet'!AA63=\"\",\"\",IF('Arrear Sheet'!C63=\"TOTAL\",\"\",'Arrear Sheet'!AA63))","v":""},{"$f":"IF('Arrear Sheet'!AB63=\"\",\"\",IF('Arrear Sheet'!C63=\"TOTAL\",\"\",SUM(N63-Z63)))","v":""}]
[{"$f":"IF('Arrear Sheet'!B64=\"\",\"\",'Arrear Sheet'!B64)","v":""},{"$f":"IF('Arrear Sheet'!C64=\"\",\"\",IF('Arrear Sheet'!C64=\"TOTAL\",\"\",'Arrear Sheet'!C64))","v":""},{"$f":"IF('Arrear Sheet'!D64=\"\",\"\",IF('Arrear Sheet'!C64=\"TOTAL\",\"\",IF('Arrear Sheet'!D64=\"अक्षरें राशि :-\",\"\",'Arrear Sheet'!D64)))","v":""},{"$f":"IF('Arrear Sheet'!E64=\"\",\"\",IF('Arrear Sheet'!C64=\"TOTAL\",\"\",'Arrear Sheet'!E64))","v":""},{"$f":"IF('Arrear Sheet'!F64=\"\",\"\",IF('Arrear Sheet'!C64=\"TOTAL\",\"\",'Arrear Sheet'!F64))","v":""},{"$f":"IF('Arrear Sheet'!G64=\"\",\"\",IF('Arrear Sheet'!C64=\"TOTAL\",\"\",SUM(C64:E64)))","v":""},{"$f":"IF('Arrear Sheet'!H64=\"\",\"\",IF('Arrear Sheet'!C64=\"TOTAL\",\"\",'Arrear Sheet'!H64))","v":""},{"$f":"IF('Arrear Sheet'!I64=\"\",\"\",IF('Arrear Sheet'!C64=\"TOTAL\",\"\",'Arrear Sheet'!I64))","v":""},{"$f":"IF('Arrear Sheet'!J64=\"\",\"\",IF('Arrear Sheet'!C64=\"TOTAL\",\"\",'Arrear Sheet'!J64))","v":""},{"$f":"IF('Arrear Sheet'!K64=\"\",\"\",IF('Arrear Sheet'!C64=\"TOTAL\",\"\",SUM(G64:I64)))","v":""},{"$f":"IF('Arrear Sheet'!L64=\"\",\"\",IF('Arrear Sheet'!C64=\"TOTAL\",\"\",'Arrear Sheet'!L64))","v":""},{"$f":"IF('Arrear Sheet'!M64=\"\",\"\",IF('Arrear Sheet'!C64=\"TOTAL\",\"\",'Arrear Sheet'!M64))","v":""},{"$f":"IF('Arrear Sheet'!N64=\"\",\"\",IF('Arrear Sheet'!C64=\"TOTAL\",\"\",'Arrear Sheet'!N64))","v":""},{"$f":"IF('Arrear Sheet'!O64=\"\",\"\",IF('Arrear Sheet'!C64=\"TOTAL\",\"\",SUM(K64:M64)))","v":""},{"$f":"IF('Arrear Sheet'!P64=\"\",\"\",IF('Arrear Sheet'!C64=\"TOTAL\",\"\",'Arrear Sheet'!P64))","v":""},{"$f":"IF('Arrear Sheet'!Q64=\"\",\"\",IF('Arrear Sheet'!C64=\"TOTAL\",\"\",'Arrear Sheet'!Q64))","v":""},{"$f":"IF('Arrear Sheet'!R64=\"\",\"\",IF('Arrear Sheet'!C64=\"TOTAL\",\"\",'Arrear Sheet'!R64))","v":""},{"$f":"IF('Arrear Sheet'!S64=\"\",\"\",IF('Arrear Sheet'!C64=\"TOTAL\",\"\",'Arrear Sheet'!S64))","v":""},{"$f":"IF('Arrear Sheet'!T64=\"\",\"\",IF('Arrear Sheet'!C64=\"TOTAL\",\"\",'Arrear Sheet'!T64))","v":""},{"$f":"IF('Arrear Sheet'!U64=\"\",\"\",IF('Arrear Sheet'!C64=\"TOTAL\",\"\",'Arrear Sheet'!U64))","v":""},{"$f":"IF('Arrear Sheet'!V64=\"\",\"\",IF('Arrear Sheet'!C64=\"TOTAL\",\"\",'Arrear Sheet'!V64))","v":""},{"$f":"IF('Arrear Sheet'!W64=\"\",\"\",IF('Arrear Sheet'!C64=\"TOTAL\",\"\",'Arrear Sheet'!W64))","v":""},{"$f":"IF('Arrear Sheet'!X64=\"\",\"\",IF('Arrear Sheet'!C64=\"TOTAL\",\"\",'Arrear Sheet'!X64))","v":""},{"$f":"IF('Arrear Sheet'!Y64=\"\",\"\",IF('Arrear Sheet'!C64=\"TOTAL\",\"\",'Arrear Sheet'!Y64))","v":""},{"$f":"IF('Arrear Sheet'!Z64=\"\",\"\",IF('Arrear Sheet'!C64=\"TOTAL\",\"\",'Arrear Sheet'!Z64))","v":""},{"$f":"IF('Arrear Sheet'!AA64=\"\",\"\",IF('Arrear Sheet'!C64=\"TOTAL\",\"\",'Arrear Sheet'!AA64))","v":""},{"$f":"IF('Arrear Sheet'!AB64=\"\",\"\",IF('Arrear Sheet'!C64=\"TOTAL\",\"\",SUM(N64-Z64)))","v":""}]
[{"$f":"IF('Arrear Sheet'!B65=\"\",\"\",'Arrear Sheet'!B65)","v":""},{"$f":"IF('Arrear Sheet'!C65=\"\",\"\",IF('Arrear Sheet'!C65=\"TOTAL\",\"\",'Arrear Sheet'!C65))","v":""},{"$f":"IF('Arrear Sheet'!D65=\"\",\"\",IF('Arrear Sheet'!C65=\"TOTAL\",\"\",IF('Arrear Sheet'!D65=\"अक्षरें राशि :-\",\"\",'Arrear Sheet'!D65)))","v":""},{"$f":"IF('Arrear Sheet'!E65=\"\",\"\",IF('Arrear Sheet'!C65=\"TOTAL\",\"\",'Arrear Sheet'!E65))","v":""},{"$f":"IF('Arrear Sheet'!F65=\"\",\"\",IF('Arrear Sheet'!C65=\"TOTAL\",\"\",'Arrear Sheet'!F65))","v":""},{"$f":"IF('Arrear Sheet'!G65=\"\",\"\",IF('Arrear Sheet'!C65=\"TOTAL\",\"\",SUM(C65:E65)))","v":""},{"$f":"IF('Arrear Sheet'!H65=\"\",\"\",IF('Arrear Sheet'!C65=\"TOTAL\",\"\",'Arrear Sheet'!H65))","v":""},{"$f":"IF('Arrear Sheet'!I65=\"\",\"\",IF('Arrear Sheet'!C65=\"TOTAL\",\"\",'Arrear Sheet'!I65))","v":""},{"$f":"IF('Arrear Sheet'!J65=\"\",\"\",IF('Arrear Sheet'!C65=\"TOTAL\",\"\",'Arrear Sheet'!J65))","v":""},{"$f":"IF('Arrear Sheet'!K65=\"\",\"\",IF('Arrear Sheet'!C65=\"TOTAL\",\"\",SUM(G65:I65)))","v":""},{"$f":"IF('Arrear Sheet'!L65=\"\",\"\",IF('Arrear Sheet'!C65=\"TOTAL\",\"\",'Arrear Sheet'!L65))","v":""},{"$f":"IF('Arrear Sheet'!M65=\"\",\"\",IF('Arrear Sheet'!C65=\"TOTAL\",\"\",'Arrear Sheet'!M65))","v":""},{"$f":"IF('Arrear Sheet'!N65=\"\",\"\",IF('Arrear Sheet'!C65=\"TOTAL\",\"\",'Arrear Sheet'!N65))","v":""},{"$f":"IF('Arrear Sheet'!O65=\"\",\"\",IF('Arrear Sheet'!C65=\"TOTAL\",\"\",SUM(K65:M65)))","v":""},{"$f":"IF('Arrear Sheet'!P65=\"\",\"\",IF('Arrear Sheet'!C65=\"TOTAL\",\"\",'Arrear Sheet'!P65))","v":""},{"$f":"IF('Arrear Sheet'!Q65=\"\",\"\",IF('Arrear Sheet'!C65=\"TOTAL\",\"\",'Arrear Sheet'!Q65))","v":""},{"$f":"IF('Arrear Sheet'!R65=\"\",\"\",IF('Arrear Sheet'!C65=\"TOTAL\",\"\",'Arrear Sheet'!R65))","v":""},{"$f":"IF('Arrear Sheet'!S65=\"\",\"\",IF('Arrear Sheet'!C65=\"TOTAL\",\"\",'Arrear Sheet'!S65))","v":""},{"$f":"IF('Arrear Sheet'!T65=\"\",\"\",IF('Arrear Sheet'!C65=\"TOTAL\",\"\",'Arrear Sheet'!T65))","v":""},{"$f":"IF('Arrear Sheet'!U65=\"\",\"\",IF('Arrear Sheet'!C65=\"TOTAL\",\"\",'Arrear Sheet'!U65))","v":""},{"$f":"IF('Arrear Sheet'!V65=\"\",\"\",IF('Arrear Sheet'!C65=\"TOTAL\",\"\",'Arrear Sheet'!V65))","v":""},{"$f":"IF('Arrear Sheet'!W65=\"\",\"\",IF('Arrear Sheet'!C65=\"TOTAL\",\"\",'Arrear Sheet'!W65))","v":""},{"$f":"IF('Arrear Sheet'!X65=\"\",\"\",IF('Arrear Sheet'!C65=\"TOTAL\",\"\",'Arrear Sheet'!X65))","v":""},{"$f":"IF('Arrear Sheet'!Y65=\"\",\"\",IF('Arrear Sheet'!C65=\"TOTAL\",\"\",'Arrear Sheet'!Y65))","v":""},{"$f":"IF('Arrear Sheet'!Z65=\"\",\"\",IF('Arrear Sheet'!C65=\"TOTAL\",\"\",'Arrear Sheet'!Z65))","v":""},{"$f":"IF('Arrear Sheet'!AA65=\"\",\"\",IF('Arrear Sheet'!C65=\"TOTAL\",\"\",'Arrear Sheet'!AA65))","v":""},{"$f":"IF('Arrear Sheet'!AB65=\"\",\"\",IF('Arrear Sheet'!C65=\"TOTAL\",\"\",SUM(N65-Z65)))","v":""}]
[{"$f":"IF('Arrear Sheet'!B66=\"\",\"\",'Arrear Sheet'!B66)","v":""},{"$f":"IF('Arrear Sheet'!C66=\"\",\"\",IF('Arrear Sheet'!C66=\"TOTAL\",\"\",'Arrear Sheet'!C66))","v":""},{"$f":"IF('Arrear Sheet'!D66=\"\",\"\",IF('Arrear Sheet'!C66=\"TOTAL\",\"\",IF('Arrear Sheet'!D66=\"अक्षरें राशि :-\",\"\",'Arrear Sheet'!D66)))","v":""},{"$f":"IF('Arrear Sheet'!E66=\"\",\"\",IF('Arrear Sheet'!C66=\"TOTAL\",\"\",'Arrear Sheet'!E66))","v":""},{"$f":"IF('Arrear Sheet'!F66=\"\",\"\",IF('Arrear Sheet'!C66=\"TOTAL\",\"\",'Arrear Sheet'!F66))","v":""},{"$f":"IF('Arrear Sheet'!G66=\"\",\"\",IF('Arrear Sheet'!C66=\"TOTAL\",\"\",SUM(C66:E66)))","v":""},{"$f":"IF('Arrear Sheet'!H66=\"\",\"\",IF('Arrear Sheet'!C66=\"TOTAL\",\"\",'Arrear Sheet'!H66))","v":""},{"$f":"IF('Arrear Sheet'!I66=\"\",\"\",IF('Arrear Sheet'!C66=\"TOTAL\",\"\",'Arrear Sheet'!I66))","v":""},{"$f":"IF('Arrear Sheet'!J66=\"\",\"\",IF('Arrear Sheet'!C66=\"TOTAL\",\"\",'Arrear Sheet'!J66))","v":""},{"$f":"IF('Arrear Sheet'!K66=\"\",\"\",IF('Arrear Sheet'!C66=\"TOTAL\",\"\",SUM(G66:I66)))","v":""},{"$f":"IF('Arrear Sheet'!L66=\"\",\"\",IF('Arrear Sheet'!C66=\"TOTAL\",\"\",'Arrear Sheet'!L66))","v":""},{"$f":"IF('Arrear Sheet'!M66=\"\",\"\",IF('Arrear Sheet'!C66=\"TOTAL\",\"\",'Arrear Sheet'!M66))","v":""},{"$f":"IF('Arrear Sheet'!N66=\"\",\"\",IF('Arrear Sheet'!C66=\"TOTAL\",\"\",'Arrear Sheet'!N66))","v":""},{"$f":"IF('Arrear Sheet'!O66=\"\",\"\",IF('Arrear Sheet'!C66=\"TOTAL\",\"\",SUM(K66:M66)))","v":""},{"$f":"IF('Arrear Sheet'!P66=\"\",\"\",IF('Arrear Sheet'!C66=\"TOTAL\",\"\",'Arrear Sheet'!P66))","v":""},{"$f":"IF('Arrear Sheet'!Q66=\"\",\"\",IF('Arrear Sheet'!C66=\"TOTAL\",\"\",'Arrear Sheet'!Q66))","v":""},{"$f":"IF('Arrear Sheet'!R66=\"\",\"\",IF('Arrear Sheet'!C66=\"TOTAL\",\"\",'Arrear Sheet'!R66))","v":""},{"$f":"IF('Arrear Sheet'!S66=\"\",\"\",IF('Arrear Sheet'!C66=\"TOTAL\",\"\",'Arrear Sheet'!S66))","v":""},{"$f":"IF('Arrear Sheet'!T66=\"\",\"\",IF('Arrear Sheet'!C66=\"TOTAL\",\"\",'Arrear Sheet'!T66))","v":""},{"$f":"IF('Arrear Sheet'!U66=\"\",\"\",IF('Arrear Sheet'!C66=\"TOTAL\",\"\",'Arrear Sheet'!U66))","v":""},{"$f":"IF('Arrear Sheet'!V66=\"\",\"\",IF('Arrear Sheet'!C66=\"TOTAL\",\"\",'Arrear Sheet'!V66))","v":""},{"$f":"IF('Arrear Sheet'!W66=\"\",\"\",IF('Arrear Sheet'!C66=\"TOTAL\",\"\",'Arrear Sheet'!W66))","v":""},{"$f":"IF('Arrear Sheet'!X66=\"\",\"\",IF('Arrear Sheet'!C66=\"TOTAL\",\"\",'Arrear Sheet'!X66))","v":""},{"$f":"IF('Arrear Sheet'!Y66=\"\",\"\",IF('Arrear Sheet'!C66=\"TOTAL\",\"\",'Arrear Sheet'!Y66))","v":""},{"$f":"IF('Arrear Sheet'!Z66=\"\",\"\",IF('Arrear Sheet'!C66=\"TOTAL\",\"\",'Arrear Sheet'!Z66))","v":""},{"$f":"IF('Arrear Sheet'!AA66=\"\",\"\",IF('Arrear Sheet'!C66=\"TOTAL\",\"\",'Arrear Sheet'!AA66))","v":""},{"$f":"IF('Arrear Sheet'!AB66=\"\",\"\",IF('Arrear Sheet'!C66=\"TOTAL\",\"\",SUM(N66-Z66)))","v":""}]
[{"$f":"IF('Arrear Sheet'!B67=\"\",\"\",'Arrear Sheet'!B67)","v":""},{"$f":"IF('Arrear Sheet'!C67=\"\",\"\",IF('Arrear Sheet'!C67=\"TOTAL\",\"\",'Arrear Sheet'!C67))","v":""},{"$f":"IF('Arrear Sheet'!D67=\"\",\"\",IF('Arrear Sheet'!C67=\"TOTAL\",\"\",IF('Arrear Sheet'!D67=\"अक्षरें राशि :-\",\"\",'Arrear Sheet'!D67)))","v":""},{"$f":"IF('Arrear Sheet'!E67=\"\",\"\",IF('Arrear Sheet'!C67=\"TOTAL\",\"\",'Arrear Sheet'!E67))","v":""},{"$f":"IF('Arrear Sheet'!F67=\"\",\"\",IF('Arrear Sheet'!C67=\"TOTAL\",\"\",'Arrear Sheet'!F67))","v":""},{"$f":"IF('Arrear Sheet'!G67=\"\",\"\",IF('Arrear Sheet'!C67=\"TOTAL\",\"\",SUM(C67:E67)))","v":""},{"$f":"IF('Arrear Sheet'!H67=\"\",\"\",IF('Arrear Sheet'!C67=\"TOTAL\",\"\",'Arrear Sheet'!H67))","v":""},{"$f":"IF('Arrear Sheet'!I67=\"\",\"\",IF('Arrear Sheet'!C67=\"TOTAL\",\"\",'Arrear Sheet'!I67))","v":""},{"$f":"IF('Arrear Sheet'!J67=\"\",\"\",IF('Arrear Sheet'!C67=\"TOTAL\",\"\",'Arrear Sheet'!J67))","v":""},{"$f":"IF('Arrear Sheet'!K67=\"\",\"\",IF('Arrear Sheet'!C67=\"TOTAL\",\"\",SUM(G67:I67)))","v":""},{"$f":"IF('Arrear Sheet'!L67=\"\",\"\",IF('Arrear Sheet'!C67=\"TOTAL\",\"\",'Arrear Sheet'!L67))","v":""},{"$f":"IF('Arrear Sheet'!M67=\"\",\"\",IF('Arrear Sheet'!C67=\"TOTAL\",\"\",'Arrear Sheet'!M67))","v":""},{"$f":"IF('Arrear Sheet'!N67=\"\",\"\",IF('Arrear Sheet'!C67=\"TOTAL\",\"\",'Arrear Sheet'!N67))","v":""},{"$f":"IF('Arrear Sheet'!O67=\"\",\"\",IF('Arrear Sheet'!C67=\"TOTAL\",\"\",SUM(K67:M67)))","v":""},{"$f":"IF('Arrear Sheet'!P67=\"\",\"\",IF('Arrear Sheet'!C67=\"TOTAL\",\"\",'Arrear Sheet'!P67))","v":""},{"$f":"IF('Arrear Sheet'!Q67=\"\",\"\",IF('Arrear Sheet'!C67=\"TOTAL\",\"\",'Arrear Sheet'!Q67))","v":""},{"$f":"IF('Arrear Sheet'!R67=\"\",\"\",IF('Arrear Sheet'!C67=\"TOTAL\",\"\",'Arrear Sheet'!R67))","v":""},{"$f":"IF('Arrear Sheet'!S67=\"\",\"\",IF('Arrear Sheet'!C67=\"TOTAL\",\"\",'Arrear Sheet'!S67))","v":""},{"$f":"IF('Arrear Sheet'!T67=\"\",\"\",IF('Arrear Sheet'!C67=\"TOTAL\",\"\",'Arrear Sheet'!T67))","v":""},{"$f":"IF('Arrear Sheet'!U67=\"\",\"\",IF('Arrear Sheet'!C67=\"TOTAL\",\"\",'Arrear Sheet'!U67))","v":""},{"$f":"IF('Arrear Sheet'!V67=\"\",\"\",IF('Arrear Sheet'!C67=\"TOTAL\",\"\",'Arrear Sheet'!V67))","v":""},{"$f":"IF('Arrear Sheet'!W67=\"\",\"\",IF('Arrear Sheet'!C67=\"TOTAL\",\"\",'Arrear Sheet'!W67))","v":""},{"$f":"IF('Arrear Sheet'!X67=\"\",\"\",IF('Arrear Sheet'!C67=\"TOTAL\",\"\",'Arrear Sheet'!X67))","v":""},{"$f":"IF('Arrear Sheet'!Y67=\"\",\"\",IF('Arrear Sheet'!C67=\"TOTAL\",\"\",'Arrear Sheet'!Y67))","v":""},{"$f":"IF('Arrear Sheet'!Z67=\"\",\"\",IF('Arrear Sheet'!C67=\"TOTAL\",\"\",'Arrear Sheet'!Z67))","v":""},{"$f":"IF('Arrear Sheet'!AA67=\"\",\"\",IF('Arrear Sheet'!C67=\"TOTAL\",\"\",'Arrear Sheet'!AA67))","v":""},{"$f":"IF('Arrear Sheet'!AB67=\"\",\"\",IF('Arrear Sheet'!C67=\"TOTAL\",\"\",SUM(N67-Z67)))","v":""}]
[{"$f":"IF('Arrear Sheet'!B68=\"\",\"\",'Arrear Sheet'!B68)","v":""},{"$f":"IF('Arrear Sheet'!C68=\"\",\"\",IF('Arrear Sheet'!C68=\"TOTAL\",\"\",'Arrear Sheet'!C68))","v":""},{"$f":"IF('Arrear Sheet'!D68=\"\",\"\",IF('Arrear Sheet'!C68=\"TOTAL\",\"\",IF('Arrear Sheet'!D68=\"अक्षरें राशि :-\",\"\",'Arrear Sheet'!D68)))","v":""},{"$f":"IF('Arrear Sheet'!E68=\"\",\"\",IF('Arrear Sheet'!C68=\"TOTAL\",\"\",'Arrear Sheet'!E68))","v":""},{"$f":"IF('Arrear Sheet'!F68=\"\",\"\",IF('Arrear Sheet'!C68=\"TOTAL\",\"\",'Arrear Sheet'!F68))","v":""},{"$f":"IF('Arrear Sheet'!G68=\"\",\"\",IF('Arrear Sheet'!C68=\"TOTAL\",\"\",SUM(C68:E68)))","v":""},{"$f":"IF('Arrear Sheet'!H68=\"\",\"\",IF('Arrear Sheet'!C68=\"TOTAL\",\"\",'Arrear Sheet'!H68))","v":""},{"$f":"IF('Arrear Sheet'!I68=\"\",\"\",IF('Arrear Sheet'!C68=\"TOTAL\",\"\",'Arrear Sheet'!I68))","v":""},{"$f":"IF('Arrear Sheet'!J68=\"\",\"\",IF('Arrear Sheet'!C68=\"TOTAL\",\"\",'Arrear Sheet'!J68))","v":""},{"$f":"IF('Arrear Sheet'!K68=\"\",\"\",IF('Arrear Sheet'!C68=\"TOTAL\",\"\",SUM(G68:I68)))","v":""},{"$f":"IF('Arrear Sheet'!L68=\"\",\"\",IF('Arrear Sheet'!C68=\"TOTAL\",\"\",'Arrear Sheet'!L68))","v":""},{"$f":"IF('Arrear Sheet'!M68=\"\",\"\",IF('Arrear Sheet'!C68=\"TOTAL\",\"\",'Arrear Sheet'!M68))","v":""},{"$f":"IF('Arrear Sheet'!N68=\"\",\"\",IF('Arrear Sheet'!C68=\"TOTAL\",\"\",'Arrear Sheet'!N68))","v":""},{"$f":"IF('Arrear Sheet'!O68=\"\",\"\",IF('Arrear Sheet'!C68=\"TOTAL\",\"\",SUM(K68:M68)))","v":""},{"$f":"IF('Arrear Sheet'!P68=\"\",\"\",IF('Arrear Sheet'!C68=\"TOTAL\",\"\",'Arrear Sheet'!P68))","v":""},{"$f":"IF('Arrear Sheet'!Q68=\"\",\"\",IF('Arrear Sheet'!C68=\"TOTAL\",\"\",'Arrear Sheet'!Q68))","v":""},{"$f":"IF('Arrear Sheet'!R68=\"\",\"\",IF('Arrear Sheet'!C68=\"TOTAL\",\"\",'Arrear Sheet'!R68))","v":""},{"$f":"IF('Arrear Sheet'!S68=\"\",\"\",IF('Arrear Sheet'!C68=\"TOTAL\",\"\",'Arrear Sheet'!S68))","v":""},{"$f":"IF('Arrear Sheet'!T68=\"\",\"\",IF('Arrear Sheet'!C68=\"TOTAL\",\"\",'Arrear Sheet'!T68))","v":""},{"$f":"IF('Arrear Sheet'!U68=\"\",\"\",IF('Arrear Sheet'!C68=\"TOTAL\",\"\",'Arrear Sheet'!U68))","v":""},{"$f":"IF('Arrear Sheet'!V68=\"\",\"\",IF('Arrear Sheet'!C68=\"TOTAL\",\"\",'Arrear Sheet'!V68))","v":""},{"$f":"IF('Arrear Sheet'!W68=\"\",\"\",IF('Arrear Sheet'!C68=\"TOTAL\",\"\",'Arrear Sheet'!W68))","v":""},{"$f":"IF('Arrear Sheet'!X68=\"\",\"\",IF('Arrear Sheet'!C68=\"TOTAL\",\"\",'Arrear Sheet'!X68))","v":""},{"$f":"IF('Arrear Sheet'!Y68=\"\",\"\",IF('Arrear Sheet'!C68=\"TOTAL\",\"\",'Arrear Sheet'!Y68))","v":""},{"$f":"IF('Arrear Sheet'!Z68=\"\",\"\",IF('Arrear Sheet'!C68=\"TOTAL\",\"\",'Arrear Sheet'!Z68))","v":""},{"$f":"IF('Arrear Sheet'!AA68=\"\",\"\",IF('Arrear Sheet'!C68=\"TOTAL\",\"\",'Arrear Sheet'!AA68))","v":""},{"$f":"IF('Arrear Sheet'!AB68=\"\",\"\",IF('Arrear Sheet'!C68=\"TOTAL\",\"\",SUM(N68-Z68)))","v":""}]
[{"$f":"IF('Arrear Sheet'!B69=\"\",\"\",'Arrear Sheet'!B69)","v":""},{"$f":"IF('Arrear Sheet'!C69=\"\",\"\",IF('Arrear Sheet'!C69=\"TOTAL\",\"\",'Arrear Sheet'!C69))","v":""},{"$f":"IF('Arrear Sheet'!D69=\"\",\"\",IF('Arrear Sheet'!C69=\"TOTAL\",\"\",IF('Arrear Sheet'!D69=\"अक्षरें राशि :-\",\"\",'Arrear Sheet'!D69)))","v":""},{"$f":"IF('Arrear Sheet'!E69=\"\",\"\",IF('Arrear Sheet'!C69=\"TOTAL\",\"\",'Arrear Sheet'!E69))","v":""},{"$f":"IF('Arrear Sheet'!F69=\"\",\"\",IF('Arrear Sheet'!C69=\"TOTAL\",\"\",'Arrear Sheet'!F69))","v":""},{"$f":"IF('Arrear Sheet'!G69=\"\",\"\",IF('Arrear Sheet'!C69=\"TOTAL\",\"\",SUM(C69:E69)))","v":""},{"$f":"IF('Arrear Sheet'!H69=\"\",\"\",IF('Arrear Sheet'!C69=\"TOTAL\",\"\",'Arrear Sheet'!H69))","v":""},{"$f":"IF('Arrear Sheet'!I69=\"\",\"\",IF('Arrear Sheet'!C69=\"TOTAL\",\"\",'Arrear Sheet'!I69))","v":""},{"$f":"IF('Arrear Sheet'!J69=\"\",\"\",IF('Arrear Sheet'!C69=\"TOTAL\",\"\",'Arrear Sheet'!J69))","v":""},{"$f":"IF('Arrear Sheet'!K69=\"\",\"\",IF('Arrear Sheet'!C69=\"TOTAL\",\"\",SUM(G69:I69)))","v":""},{"$f":"IF('Arrear Sheet'!L69=\"\",\"\",IF('Arrear Sheet'!C69=\"TOTAL\",\"\",'Arrear Sheet'!L69))","v":""},{"$f":"IF('Arrear Sheet'!M69=\"\",\"\",IF('Arrear Sheet'!C69=\"TOTAL\",\"\",'Arrear Sheet'!M69))","v":""},{"$f":"IF('Arrear Sheet'!N69=\"\",\"\",IF('Arrear Sheet'!C69=\"TOTAL\",\"\",'Arrear Sheet'!N69))","v":""},{"$f":"IF('Arrear Sheet'!O69=\"\",\"\",IF('Arrear Sheet'!C69=\"TOTAL\",\"\",SUM(K69:M69)))","v":""},{"$f":"IF('Arrear Sheet'!P69=\"\",\"\",IF('Arrear Sheet'!C69=\"TOTAL\",\"\",'Arrear Sheet'!P69))","v":""},{"$f":"IF('Arrear Sheet'!Q69=\"\",\"\",IF('Arrear Sheet'!C69=\"TOTAL\",\"\",'Arrear Sheet'!Q69))","v":""},{"$f":"IF('Arrear Sheet'!R69=\"\",\"\",IF('Arrear Sheet'!C69=\"TOTAL\",\"\",'Arrear Sheet'!R69))","v":""},{"$f":"IF('Arrear Sheet'!S69=\"\",\"\",IF('Arrear Sheet'!C69=\"TOTAL\",\"\",'Arrear Sheet'!S69))","v":""},{"$f":"IF('Arrear Sheet'!T69=\"\",\"\",IF('Arrear Sheet'!C69=\"TOTAL\",\"\",'Arrear Sheet'!T69))","v":""},{"$f":"IF('Arrear Sheet'!U69=\"\",\"\",IF('Arrear Sheet'!C69=\"TOTAL\",\"\",'Arrear Sheet'!U69))","v":""},{"$f":"IF('Arrear Sheet'!V69=\"\",\"\",IF('Arrear Sheet'!C69=\"TOTAL\",\"\",'Arrear Sheet'!V69))","v":""},{"$f":"IF('Arrear Sheet'!W69=\"\",\"\",IF('Arrear Sheet'!C69=\"TOTAL\",\"\",'Arrear Sheet'!W69))","v":""},{"$f":"IF('Arrear Sheet'!X69=\"\",\"\",IF('Arrear Sheet'!C69=\"TOTAL\",\"\",'Arrear Sheet'!X69))","v":""},{"$f":"IF('Arrear Sheet'!Y69=\"\",\"\",IF('Arrear Sheet'!C69=\"TOTAL\",\"\",'Arrear Sheet'!Y69))","v":""},{"$f":"IF('Arrear Sheet'!Z69=\"\",\"\",IF('Arrear Sheet'!C69=\"TOTAL\",\"\",'Arrear Sheet'!Z69))","v":""},{"$f":"IF('Arrear Sheet'!AA69=\"\",\"\",IF('Arrear Sheet'!C69=\"TOTAL\",\"\",'Arrear Sheet'!AA69))","v":""},{"$f":"IF('Arrear Sheet'!AB69=\"\",\"\",IF('Arrear Sheet'!C69=\"TOTAL\",\"\",SUM(N69-Z69)))","v":""}]
[{"$f":"IF('Arrear Sheet'!B70=\"\",\"\",'Arrear Sheet'!B70)","v":""},{"$f":"IF('Arrear Sheet'!C70=\"\",\"\",IF('Arrear Sheet'!C70=\"TOTAL\",\"\",'Arrear Sheet'!C70))","v":""},{"$f":"IF('Arrear Sheet'!D70=\"\",\"\",IF('Arrear Sheet'!C70=\"TOTAL\",\"\",IF('Arrear Sheet'!D70=\"अक्षरें राशि :-\",\"\",'Arrear Sheet'!D70)))","v":""},{"$f":"IF('Arrear Sheet'!E70=\"\",\"\",IF('Arrear Sheet'!C70=\"TOTAL\",\"\",'Arrear Sheet'!E70))","v":""},{"$f":"IF('Arrear Sheet'!F70=\"\",\"\",IF('Arrear Sheet'!C70=\"TOTAL\",\"\",'Arrear Sheet'!F70))","v":""},{"$f":"IF('Arrear Sheet'!G70=\"\",\"\",IF('Arrear Sheet'!C70=\"TOTAL\",\"\",SUM(C70:E70)))","v":""},{"$f":"IF('Arrear Sheet'!H70=\"\",\"\",IF('Arrear Sheet'!C70=\"TOTAL\",\"\",'Arrear Sheet'!H70))","v":""},{"$f":"IF('Arrear Sheet'!I70=\"\",\"\",IF('Arrear Sheet'!C70=\"TOTAL\",\"\",'Arrear Sheet'!I70))","v":""},{"$f":"IF('Arrear Sheet'!J70=\"\",\"\",IF('Arrear Sheet'!C70=\"TOTAL\",\"\",'Arrear Sheet'!J70))","v":""},{"$f":"IF('Arrear Sheet'!K70=\"\",\"\",IF('Arrear Sheet'!C70=\"TOTAL\",\"\",SUM(G70:I70)))","v":""},{"$f":"IF('Arrear Sheet'!L70=\"\",\"\",IF('Arrear Sheet'!C70=\"TOTAL\",\"\",'Arrear Sheet'!L70))","v":""},{"$f":"IF('Arrear Sheet'!M70=\"\",\"\",IF('Arrear Sheet'!C70=\"TOTAL\",\"\",'Arrear Sheet'!M70))","v":""},{"$f":"IF('Arrear Sheet'!N70=\"\",\"\",IF('Arrear Sheet'!C70=\"TOTAL\",\"\",'Arrear Sheet'!N70))","v":""},{"$f":"IF('Arrear Sheet'!O70=\"\",\"\",IF('Arrear Sheet'!C70=\"TOTAL\",\"\",SUM(K70:M70)))","v":""},{"$f":"IF('Arrear Sheet'!P70=\"\",\"\",IF('Arrear Sheet'!C70=\"TOTAL\",\"\",'Arrear Sheet'!P70))","v":""},{"$f":"IF('Arrear Sheet'!Q70=\"\",\"\",IF('Arrear Sheet'!C70=\"TOTAL\",\"\",'Arrear Sheet'!Q70))","v":""},{"$f":"IF('Arrear Sheet'!R70=\"\",\"\",IF('Arrear Sheet'!C70=\"TOTAL\",\"\",'Arrear Sheet'!R70))","v":""},{"$f":"IF('Arrear Sheet'!S70=\"\",\"\",IF('Arrear Sheet'!C70=\"TOTAL\",\"\",'Arrear Sheet'!S70))","v":""},{"$f":"IF('Arrear Sheet'!T70=\"\",\"\",IF('Arrear Sheet'!C70=\"TOTAL\",\"\",'Arrear Sheet'!T70))","v":""},{"$f":"IF('Arrear Sheet'!U70=\"\",\"\",IF('Arrear Sheet'!C70=\"TOTAL\",\"\",'Arrear Sheet'!U70))","v":""},{"$f":"IF('Arrear Sheet'!V70=\"\",\"\",IF('Arrear Sheet'!C70=\"TOTAL\",\"\",'Arrear Sheet'!V70))","v":""},{"$f":"IF('Arrear Sheet'!W70=\"\",\"\",IF('Arrear Sheet'!C70=\"TOTAL\",\"\",'Arrear Sheet'!W70))","v":""},{"$f":"IF('Arrear Sheet'!X70=\"\",\"\",IF('Arrear Sheet'!C70=\"TOTAL\",\"\",'Arrear Sheet'!X70))","v":""},{"$f":"IF('Arrear Sheet'!Y70=\"\",\"\",IF('Arrear Sheet'!C70=\"TOTAL\",\"\",'Arrear Sheet'!Y70))","v":""},{"$f":"IF('Arrear Sheet'!Z70=\"\",\"\",IF('Arrear Sheet'!C70=\"TOTAL\",\"\",'Arrear Sheet'!Z70))","v":""},{"$f":"IF('Arrear Sheet'!AA70=\"\",\"\",IF('Arrear Sheet'!C70=\"TOTAL\",\"\",'Arrear Sheet'!AA70))","v":""},{"$f":"IF('Arrear Sheet'!AB70=\"\",\"\",IF('Arrear Sheet'!C70=\"TOTAL\",\"\",SUM(N70-Z70)))","v":""}]
[{"$f":"IF('Arrear Sheet'!B71=\"\",\"\",'Arrear Sheet'!B71)","v":""},{"$f":"IF('Arrear Sheet'!C71=\"\",\"\",IF('Arrear Sheet'!C71=\"TOTAL\",\"\",'Arrear Sheet'!C71))","v":""},{"$f":"IF('Arrear Sheet'!D71=\"\",\"\",IF('Arrear Sheet'!C71=\"TOTAL\",\"\",IF('Arrear Sheet'!D71=\"अक्षरें राशि :-\",\"\",'Arrear Sheet'!D71)))","v":""},{"$f":"IF('Arrear Sheet'!E71=\"\",\"\",IF('Arrear Sheet'!C71=\"TOTAL\",\"\",'Arrear Sheet'!E71))","v":""},{"$f":"IF('Arrear Sheet'!F71=\"\",\"\",IF('Arrear Sheet'!C71=\"TOTAL\",\"\",'Arrear Sheet'!F71))","v":""},{"$f":"IF('Arrear Sheet'!G71=\"\",\"\",IF('Arrear Sheet'!C71=\"TOTAL\",\"\",SUM(C71:E71)))","v":""},{"$f":"IF('Arrear Sheet'!H71=\"\",\"\",IF('Arrear Sheet'!C71=\"TOTAL\",\"\",'Arrear Sheet'!H71))","v":""},{"$f":"IF('Arrear Sheet'!I71=\"\",\"\",IF('Arrear Sheet'!C71=\"TOTAL\",\"\",'Arrear Sheet'!I71))","v":""},{"$f":"IF('Arrear Sheet'!J71=\"\",\"\",IF('Arrear Sheet'!C71=\"TOTAL\",\"\",'Arrear Sheet'!J71))","v":""},{"$f":"IF('Arrear Sheet'!K71=\"\",\"\",IF('Arrear Sheet'!C71=\"TOTAL\",\"\",SUM(G71:I71)))","v":""},{"$f":"IF('Arrear Sheet'!L71=\"\",\"\",IF('Arrear Sheet'!C71=\"TOTAL\",\"\",'Arrear Sheet'!L71))","v":""},{"$f":"IF('Arrear Sheet'!M71=\"\",\"\",IF('Arrear Sheet'!C71=\"TOTAL\",\"\",'Arrear Sheet'!M71))","v":""},{"$f":"IF('Arrear Sheet'!N71=\"\",\"\",IF('Arrear Sheet'!C71=\"TOTAL\",\"\",'Arrear Sheet'!N71))","v":""},{"$f":"IF('Arrear Sheet'!O71=\"\",\"\",IF('Arrear Sheet'!C71=\"TOTAL\",\"\",SUM(K71:M71)))","v":""},{"$f":"IF('Arrear Sheet'!P71=\"\",\"\",IF('Arrear Sheet'!C71=\"TOTAL\",\"\",'Arrear Sheet'!P71))","v":""},{"$f":"IF('Arrear Sheet'!Q71=\"\",\"\",IF('Arrear Sheet'!C71=\"TOTAL\",\"\",'Arrear Sheet'!Q71))","v":""},{"$f":"IF('Arrear Sheet'!R71=\"\",\"\",IF('Arrear Sheet'!C71=\"TOTAL\",\"\",'Arrear Sheet'!R71))","v":""},{"$f":"IF('Arrear Sheet'!S71=\"\",\"\",IF('Arrear Sheet'!C71=\"TOTAL\",\"\",'Arrear Sheet'!S71))","v":""},{"$f":"IF('Arrear Sheet'!T71=\"\",\"\",IF('Arrear Sheet'!C71=\"TOTAL\",\"\",'Arrear Sheet'!T71))","v":""},{"$f":"IF('Arrear Sheet'!U71=\"\",\"\",IF('Arrear Sheet'!C71=\"TOTAL\",\"\",'Arrear Sheet'!U71))","v":""},{"$f":"IF('Arrear Sheet'!V71=\"\",\"\",IF('Arrear Sheet'!C71=\"TOTAL\",\"\",'Arrear Sheet'!V71))","v":""},{"$f":"IF('Arrear Sheet'!W71=\"\",\"\",IF('Arrear Sheet'!C71=\"TOTAL\",\"\",'Arrear Sheet'!W71))","v":""},{"$f":"IF('Arrear Sheet'!X71=\"\",\"\",IF('Arrear Sheet'!C71=\"TOTAL\",\"\",'Arrear Sheet'!X71))","v":""},{"$f":"IF('Arrear Sheet'!Y71=\"\",\"\",IF('Arrear Sheet'!C71=\"TOTAL\",\"\",'Arrear Sheet'!Y71))","v":""},{"$f":"IF('Arrear Sheet'!Z71=\"\",\"\",IF('Arrear Sheet'!C71=\"TOTAL\",\"\",'Arrear Sheet'!Z71))","v":""},{"$f":"IF('Arrear Sheet'!AA71=\"\",\"\",IF('Arrear Sheet'!C71=\"TOTAL\",\"\",'Arrear Sheet'!AA71))","v":""},{"$f":"IF('Arrear Sheet'!AB71=\"\",\"\",IF('Arrear Sheet'!C71=\"TOTAL\",\"\",SUM(N71-Z71)))","v":""}]
[{"$f":"IF('Arrear Sheet'!B72=\"\",\"\",'Arrear Sheet'!B72)","v":""},{"$f":"IF('Arrear Sheet'!C72=\"\",\"\",IF('Arrear Sheet'!C72=\"TOTAL\",\"\",'Arrear Sheet'!C72))","v":""},{"$f":"IF('Arrear Sheet'!D72=\"\",\"\",IF('Arrear Sheet'!C72=\"TOTAL\",\"\",IF('Arrear Sheet'!D72=\"अक्षरें राशि :-\",\"\",'Arrear Sheet'!D72)))","v":""},{"$f":"IF('Arrear Sheet'!E72=\"\",\"\",IF('Arrear Sheet'!C72=\"TOTAL\",\"\",'Arrear Sheet'!E72))","v":""},{"$f":"IF('Arrear Sheet'!F72=\"\",\"\",IF('Arrear Sheet'!C72=\"TOTAL\",\"\",'Arrear Sheet'!F72))","v":""},{"$f":"IF('Arrear Sheet'!G72=\"\",\"\",IF('Arrear Sheet'!C72=\"TOTAL\",\"\",SUM(C72:E72)))","v":""},{"$f":"IF('Arrear Sheet'!H72=\"\",\"\",IF('Arrear Sheet'!C72=\"TOTAL\",\"\",'Arrear Sheet'!H72))","v":""},{"$f":"IF('Arrear Sheet'!I72=\"\",\"\",IF('Arrear Sheet'!C72=\"TOTAL\",\"\",'Arrear Sheet'!I72))","v":""},{"$f":"IF('Arrear Sheet'!J72=\"\",\"\",IF('Arrear Sheet'!C72=\"TOTAL\",\"\",'Arrear Sheet'!J72))","v":""},{"$f":"IF('Arrear Sheet'!K72=\"\",\"\",IF('Arrear Sheet'!C72=\"TOTAL\",\"\",SUM(G72:I72)))","v":""},{"$f":"IF('Arrear Sheet'!L72=\"\",\"\",IF('Arrear Sheet'!C72=\"TOTAL\",\"\",'Arrear Sheet'!L72))","v":""},{"$f":"IF('Arrear Sheet'!M72=\"\",\"\",IF('Arrear Sheet'!C72=\"TOTAL\",\"\",'Arrear Sheet'!M72))","v":""},{"$f":"IF('Arrear Sheet'!N72=\"\",\"\",IF('Arrear Sheet'!C72=\"TOTAL\",\"\",'Arrear Sheet'!N72))","v":""},{"$f":"IF('Arrear Sheet'!O72=\"\",\"\",IF('Arrear Sheet'!C72=\"TOTAL\",\"\",SUM(K72:M72)))","v":""},{"$f":"IF('Arrear Sheet'!P72=\"\",\"\",IF('Arrear Sheet'!C72=\"TOTAL\",\"\",'Arrear Sheet'!P72))","v":""},{"$f":"IF('Arrear Sheet'!Q72=\"\",\"\",IF('Arrear Sheet'!C72=\"TOTAL\",\"\",'Arrear Sheet'!Q72))","v":""},{"$f":"IF('Arrear Sheet'!R72=\"\",\"\",IF('Arrear Sheet'!C72=\"TOTAL\",\"\",'Arrear Sheet'!R72))","v":""},{"$f":"IF('Arrear Sheet'!S72=\"\",\"\",IF('Arrear Sheet'!C72=\"TOTAL\",\"\",'Arrear Sheet'!S72))","v":""},{"$f":"IF('Arrear Sheet'!T72=\"\",\"\",IF('Arrear Sheet'!C72=\"TOTAL\",\"\",'Arrear Sheet'!T72))","v":""},{"$f":"IF('Arrear Sheet'!U72=\"\",\"\",IF('Arrear Sheet'!C72=\"TOTAL\",\"\",'Arrear Sheet'!U72))","v":""},{"$f":"IF('Arrear Sheet'!V72=\"\",\"\",IF('Arrear Sheet'!C72=\"TOTAL\",\"\",'Arrear Sheet'!V72))","v":""},{"$f":"IF('Arrear Sheet'!W72=\"\",\"\",IF('Arrear Sheet'!C72=\"TOTAL\",\"\",'Arrear Sheet'!W72))","v":""},{"$f":"IF('Arrear Sheet'!X72=\"\",\"\",IF('Arrear Sheet'!C72=\"TOTAL\",\"\",'Arrear Sheet'!X72))","v":""},{"$f":"IF('Arrear Sheet'!Y72=\"\",\"\",IF('Arrear Sheet'!C72=\"TOTAL\",\"\",'Arrear Sheet'!Y72))","v":""},{"$f":"IF('Arrear Sheet'!Z72=\"\",\"\",IF('Arrear Sheet'!C72=\"TOTAL\",\"\",'Arrear Sheet'!Z72))","v":""},{"$f":"IF('Arrear Sheet'!AA72=\"\",\"\",IF('Arrear Sheet'!C72=\"TOTAL\",\"\",'Arrear Sheet'!AA72))","v":""},{"$f":"IF('Arrear Sheet'!AB72=\"\",\"\",IF('Arrear Sheet'!C72=\"TOTAL\",\"\",SUM(N72-Z72)))","v":""}]
[{"$f":"IF('Arrear Sheet'!B73=\"\",\"\",'Arrear Sheet'!B73)","v":""},{"$f":"IF('Arrear Sheet'!C73=\"\",\"\",IF('Arrear Sheet'!C73=\"TOTAL\",\"\",'Arrear Sheet'!C73))","v":""},{"$f":"IF('Arrear Sheet'!D73=\"\",\"\",IF('Arrear Sheet'!C73=\"TOTAL\",\"\",IF('Arrear Sheet'!D73=\"अक्षरें राशि :-\",\"\",'Arrear Sheet'!D73)))","v":""},{"$f":"IF('Arrear Sheet'!E73=\"\",\"\",IF('Arrear Sheet'!C73=\"TOTAL\",\"\",'Arrear Sheet'!E73))","v":""},{"$f":"IF('Arrear Sheet'!F73=\"\",\"\",IF('Arrear Sheet'!C73=\"TOTAL\",\"\",'Arrear Sheet'!F73))","v":""},{"$f":"IF('Arrear Sheet'!G73=\"\",\"\",IF('Arrear Sheet'!C73=\"TOTAL\",\"\",SUM(C73:E73)))","v":""},{"$f":"IF('Arrear Sheet'!H73=\"\",\"\",IF('Arrear Sheet'!C73=\"TOTAL\",\"\",'Arrear Sheet'!H73))","v":""},{"$f":"IF('Arrear Sheet'!I73=\"\",\"\",IF('Arrear Sheet'!C73=\"TOTAL\",\"\",'Arrear Sheet'!I73))","v":""},{"$f":"IF('Arrear Sheet'!J73=\"\",\"\",IF('Arrear Sheet'!C73=\"TOTAL\",\"\",'Arrear Sheet'!J73))","v":""},{"$f":"IF('Arrear Sheet'!K73=\"\",\"\",IF('Arrear Sheet'!C73=\"TOTAL\",\"\",SUM(G73:I73)))","v":""},{"$f":"IF('Arrear Sheet'!L73=\"\",\"\",IF('Arrear Sheet'!C73=\"TOTAL\",\"\",'Arrear Sheet'!L73))","v":""},{"$f":"IF('Arrear Sheet'!M73=\"\",\"\",IF('Arrear Sheet'!C73=\"TOTAL\",\"\",'Arrear Sheet'!M73))","v":""},{"$f":"IF('Arrear Sheet'!N73=\"\",\"\",IF('Arrear Sheet'!C73=\"TOTAL\",\"\",'Arrear Sheet'!N73))","v":""},{"$f":"IF('Arrear Sheet'!O73=\"\",\"\",IF('Arrear Sheet'!C73=\"TOTAL\",\"\",SUM(K73:M73)))","v":""},{"$f":"IF('Arrear Sheet'!P73=\"\",\"\",IF('Arrear Sheet'!C73=\"TOTAL\",\"\",'Arrear Sheet'!P73))","v":""},{"$f":"IF('Arrear Sheet'!Q73=\"\",\"\",IF('Arrear Sheet'!C73=\"TOTAL\",\"\",'Arrear Sheet'!Q73))","v":""},{"$f":"IF('Arrear Sheet'!R73=\"\",\"\",IF('Arrear Sheet'!C73=\"TOTAL\",\"\",'Arrear Sheet'!R73))","v":""},{"$f":"IF('Arrear Sheet'!S73=\"\",\"\",IF('Arrear Sheet'!C73=\"TOTAL\",\"\",'Arrear Sheet'!S73))","v":""},{"$f":"IF('Arrear Sheet'!T73=\"\",\"\",IF('Arrear Sheet'!C73=\"TOTAL\",\"\",'Arrear Sheet'!T73))","v":""},{"$f":"IF('Arrear Sheet'!U73=\"\",\"\",IF('Arrear Sheet'!C73=\"TOTAL\",\"\",'Arrear Sheet'!U73))","v":""},{"$f":"IF('Arrear Sheet'!V73=\"\",\"\",IF('Arrear Sheet'!C73=\"TOTAL\",\"\",'Arrear Sheet'!V73))","v":""},{"$f":"IF('Arrear Sheet'!W73=\"\",\"\",IF('Arrear Sheet'!C73=\"TOTAL\",\"\",'Arrear Sheet'!W73))","v":""},{"$f":"IF('Arrear Sheet'!X73=\"\",\"\",IF('Arrear Sheet'!C73=\"TOTAL\",\"\",'Arrear Sheet'!X73))","v":""},{"$f":"IF('Arrear Sheet'!Y73=\"\",\"\",IF('Arrear Sheet'!C73=\"TOTAL\",\"\",'Arrear Sheet'!Y73))","v":""},{"$f":"IF('Arrear Sheet'!Z73=\"\",\"\",IF('Arrear Sheet'!C73=\"TOTAL\",\"\",'Arrear Sheet'!Z73))","v":""},{"$f":"IF('Arrear Sheet'!AA73=\"\",\"\",IF('Arrear Sheet'!C73=\"TOTAL\",\"\",'Arrear Sheet'!AA73))","v":""},{"$f":"IF('Arrear Sheet'!AB73=\"\",\"\",IF('Arrear Sheet'!C73=\"TOTAL\",\"\",SUM(N73-Z73)))","v":""}]
[{"$f":"IF('Arrear Sheet'!B74=\"\",\"\",'Arrear Sheet'!B74)","v":""},{"$f":"IF('Arrear Sheet'!C74=\"\",\"\",IF('Arrear Sheet'!C74=\"TOTAL\",\"\",'Arrear Sheet'!C74))","v":""},{"$f":"IF('Arrear Sheet'!D74=\"\",\"\",IF('Arrear Sheet'!C74=\"TOTAL\",\"\",IF('Arrear Sheet'!D74=\"अक्षरें राशि :-\",\"\",'Arrear Sheet'!D74)))","v":""},{"$f":"IF('Arrear Sheet'!E74=\"\",\"\",IF('Arrear Sheet'!C74=\"TOTAL\",\"\",'Arrear Sheet'!E74))","v":""},{"$f":"IF('Arrear Sheet'!F74=\"\",\"\",IF('Arrear Sheet'!C74=\"TOTAL\",\"\",'Arrear Sheet'!F74))","v":""},{"$f":"IF('Arrear Sheet'!G74=\"\",\"\",IF('Arrear Sheet'!C74=\"TOTAL\",\"\",SUM(C74:E74)))","v":""},{"$f":"IF('Arrear Sheet'!H74=\"\",\"\",IF('Arrear Sheet'!C74=\"TOTAL\",\"\",'Arrear Sheet'!H74))","v":""},{"$f":"IF('Arrear Sheet'!I74=\"\",\"\",IF('Arrear Sheet'!C74=\"TOTAL\",\"\",'Arrear Sheet'!I74))","v":""},{"$f":"IF('Arrear Sheet'!J74=\"\",\"\",IF('Arrear Sheet'!C74=\"TOTAL\",\"\",'Arrear Sheet'!J74))","v":""},{"$f":"IF('Arrear Sheet'!K74=\"\",\"\",IF('Arrear Sheet'!C74=\"TOTAL\",\"\",SUM(G74:I74)))","v":""},{"$f":"IF('Arrear Sheet'!L74=\"\",\"\",IF('Arrear Sheet'!C74=\"TOTAL\",\"\",'Arrear Sheet'!L74))","v":""},{"$f":"IF('Arrear Sheet'!M74=\"\",\"\",IF('Arrear Sheet'!C74=\"TOTAL\",\"\",'Arrear Sheet'!M74))","v":""},{"$f":"IF('Arrear Sheet'!N74=\"\",\"\",IF('Arrear Sheet'!C74=\"TOTAL\",\"\",'Arrear Sheet'!N74))","v":""},{"$f":"IF('Arrear Sheet'!O74=\"\",\"\",IF('Arrear Sheet'!C74=\"TOTAL\",\"\",SUM(K74:M74)))","v":""},{"$f":"IF('Arrear Sheet'!P74=\"\",\"\",IF('Arrear Sheet'!C74=\"TOTAL\",\"\",'Arrear Sheet'!P74))","v":""},{"$f":"IF('Arrear Sheet'!Q74=\"\",\"\",IF('Arrear Sheet'!C74=\"TOTAL\",\"\",'Arrear Sheet'!Q74))","v":""},{"$f":"IF('Arrear Sheet'!R74=\"\",\"\",IF('Arrear Sheet'!C74=\"TOTAL\",\"\",'Arrear Sheet'!R74))","v":""},{"$f":"IF('Arrear Sheet'!S74=\"\",\"\",IF('Arrear Sheet'!C74=\"TOTAL\",\"\",'Arrear Sheet'!S74))","v":""},{"$f":"IF('Arrear Sheet'!T74=\"\",\"\",IF('Arrear Sheet'!C74=\"TOTAL\",\"\",'Arrear Sheet'!T74))","v":""},{"$f":"IF('Arrear Sheet'!U74=\"\",\"\",IF('Arrear Sheet'!C74=\"TOTAL\",\"\",'Arrear Sheet'!U74))","v":""},{"$f":"IF('Arrear Sheet'!V74=\"\",\"\",IF('Arrear Sheet'!C74=\"TOTAL\",\"\",'Arrear Sheet'!V74))","v":""},{"$f":"IF('Arrear Sheet'!W74=\"\",\"\",IF('Arrear Sheet'!C74=\"TOTAL\",\"\",'Arrear Sheet'!W74))","v":""},{"$f":"IF('Arrear Sheet'!X74=\"\",\"\",IF('Arrear Sheet'!C74=\"TOTAL\",\"\",'Arrear Sheet'!X74))","v":""},{"$f":"IF('Arrear Sheet'!Y74=\"\",\"\",IF('Arrear Sheet'!C74=\"TOTAL\",\"\",'Arrear Sheet'!Y74))","v":""},{"$f":"IF('Arrear Sheet'!Z74=\"\",\"\",IF('Arrear Sheet'!C74=\"TOTAL\",\"\",'Arrear Sheet'!Z74))","v":""},{"$f":"IF('Arrear Sheet'!AA74=\"\",\"\",IF('Arrear Sheet'!C74=\"TOTAL\",\"\",'Arrear Sheet'!AA74))","v":""},{"$f":"IF('Arrear Sheet'!AB74=\"\",\"\",IF('Arrear Sheet'!C74=\"TOTAL\",\"\",SUM(N74-Z74)))","v":""}]
[{"$f":"IF('Arrear Sheet'!B75=\"\",\"\",'Arrear Sheet'!B75)","v":""},{"$f":"IF('Arrear Sheet'!C75=\"\",\"\",IF('Arrear Sheet'!C75=\"TOTAL\",\"\",'Arrear Sheet'!C75))","v":""},{"$f":"IF('Arrear Sheet'!D75=\"\",\"\",IF('Arrear Sheet'!C75=\"TOTAL\",\"\",IF('Arrear Sheet'!D75=\"अक्षरें राशि :-\",\"\",'Arrear Sheet'!D75)))","v":""},{"$f":"IF('Arrear Sheet'!E75=\"\",\"\",IF('Arrear Sheet'!C75=\"TOTAL\",\"\",'Arrear Sheet'!E75))","v":""},{"$f":"IF('Arrear Sheet'!F75=\"\",\"\",IF('Arrear Sheet'!C75=\"TOTAL\",\"\",'Arrear Sheet'!F75))","v":""},{"$f":"IF('Arrear Sheet'!G75=\"\",\"\",IF('Arrear Sheet'!C75=\"TOTAL\",\"\",SUM(C75:E75)))","v":""},{"$f":"IF('Arrear Sheet'!H75=\"\",\"\",IF('Arrear Sheet'!C75=\"TOTAL\",\"\",'Arrear Sheet'!H75))","v":""},{"$f":"IF('Arrear Sheet'!I75=\"\",\"\",IF('Arrear Sheet'!C75=\"TOTAL\",\"\",'Arrear Sheet'!I75))","v":""},{"$f":"IF('Arrear Sheet'!J75=\"\",\"\",IF('Arrear Sheet'!C75=\"TOTAL\",\"\",'Arrear Sheet'!J75))","v":""},{"$f":"IF('Arrear Sheet'!K75=\"\",\"\",IF('Arrear Sheet'!C75=\"TOTAL\",\"\",SUM(G75:I75)))","v":""},{"$f":"IF('Arrear Sheet'!L75=\"\",\"\",IF('Arrear Sheet'!C75=\"TOTAL\",\"\",'Arrear Sheet'!L75))","v":""},{"$f":"IF('Arrear Sheet'!M75=\"\",\"\",IF('Arrear Sheet'!C75=\"TOTAL\",\"\",'Arrear Sheet'!M75))","v":""},{"$f":"IF('Arrear Sheet'!N75=\"\",\"\",IF('Arrear Sheet'!C75=\"TOTAL\",\"\",'Arrear Sheet'!N75))","v":""},{"$f":"IF('Arrear Sheet'!O75=\"\",\"\",IF('Arrear Sheet'!C75=\"TOTAL\",\"\",SUM(K75:M75)))","v":""},{"$f":"IF('Arrear Sheet'!P75=\"\",\"\",IF('Arrear Sheet'!C75=\"TOTAL\",\"\",'Arrear Sheet'!P75))","v":""},{"$f":"IF('Arrear Sheet'!Q75=\"\",\"\",IF('Arrear Sheet'!C75=\"TOTAL\",\"\",'Arrear Sheet'!Q75))","v":""},{"$f":"IF('Arrear Sheet'!R75=\"\",\"\",IF('Arrear Sheet'!C75=\"TOTAL\",\"\",'Arrear Sheet'!R75))","v":""},{"$f":"IF('Arrear Sheet'!S75=\"\",\"\",IF('Arrear Sheet'!C75=\"TOTAL\",\"\",'Arrear Sheet'!S75))","v":""},{"$f":"IF('Arrear Sheet'!T75=\"\",\"\",IF('Arrear Sheet'!C75=\"TOTAL\",\"\",'Arrear Sheet'!T75))","v":""},{"$f":"IF('Arrear Sheet'!U75=\"\",\"\",IF('Arrear Sheet'!C75=\"TOTAL\",\"\",'Arrear Sheet'!U75))","v":""},{"$f":"IF('Arrear Sheet'!V75=\"\",\"\",IF('Arrear Sheet'!C75=\"TOTAL\",\"\",'Arrear Sheet'!V75))","v":""},{"$f":"IF('Arrear Sheet'!W75=\"\",\"\",IF('Arrear Sheet'!C75=\"TOTAL\",\"\",'Arrear Sheet'!W75))","v":""},{"$f":"IF('Arrear Sheet'!X75=\"\",\"\",IF('Arrear Sheet'!C75=\"TOTAL\",\"\",'Arrear Sheet'!X75))","v":""},{"$f":"IF('Arrear Sheet'!Y75=\"\",\"\",IF('Arrear Sheet'!C75=\"TOTAL\",\"\",'Arrear Sheet'!Y75))","v":""},{"$f":"IF('Arrear Sheet'!Z75=\"\",\"\",IF('Arrear Sheet'!C75=\"TOTAL\",\"\",'Arrear Sheet'!Z75))","v":""},{"$f":"IF('Arrear Sheet'!AA75=\"\",\"\",IF('Arrear Sheet'!C75=\"TOTAL\",\"\",'Arrear Sheet'!AA75))","v":""},{"$f":"IF('Arrear Sheet'!AB75=\"\",\"\",IF('Arrear Sheet'!C75=\"TOTAL\",\"\",SUM(N75-Z75)))","v":""}]
[{"$f":"IF('Arrear Sheet'!B76=\"\",\"\",'Arrear Sheet'!B76)","v":""},{"$f":"IF('Arrear Sheet'!C76=\"\",\"\",IF('Arrear Sheet'!C76=\"TOTAL\",\"\",'Arrear Sheet'!C76))","v":""},{"$f":"IF('Arrear Sheet'!D76=\"\",\"\",IF('Arrear Sheet'!C76=\"TOTAL\",\"\",IF('Arrear Sheet'!D76=\"अक्षरें राशि :-\",\"\",'Arrear Sheet'!D76)))","v":""},{"$f":"IF('Arrear Sheet'!E76=\"\",\"\",IF('Arrear Sheet'!C76=\"TOTAL\",\"\",'Arrear Sheet'!E76))","v":""},{"$f":"IF('Arrear Sheet'!F76=\"\",\"\",IF('Arrear Sheet'!C76=\"TOTAL\",\"\",'Arrear Sheet'!F76))","v":""},{"$f":"IF('Arrear Sheet'!G76=\"\",\"\",IF('Arrear Sheet'!C76=\"TOTAL\",\"\",SUM(C76:E76)))","v":""},{"$f":"IF('Arrear Sheet'!H76=\"\",\"\",IF('Arrear Sheet'!C76=\"TOTAL\",\"\",'Arrear Sheet'!H76))","v":""},{"$f":"IF('Arrear Sheet'!I76=\"\",\"\",IF('Arrear Sheet'!C76=\"TOTAL\",\"\",'Arrear Sheet'!I76))","v":""},{"$f":"IF('Arrear Sheet'!J76=\"\",\"\",IF('Arrear Sheet'!C76=\"TOTAL\",\"\",'Arrear Sheet'!J76))","v":""},{"$f":"IF('Arrear Sheet'!K76=\"\",\"\",IF('Arrear Sheet'!C76=\"TOTAL\",\"\",SUM(G76:I76)))","v":""},{"$f":"IF('Arrear Sheet'!L76=\"\",\"\",IF('Arrear Sheet'!C76=\"TOTAL\",\"\",'Arrear Sheet'!L76))","v":""},{"$f":"IF('Arrear Sheet'!M76=\"\",\"\",IF('Arrear Sheet'!C76=\"TOTAL\",\"\",'Arrear Sheet'!M76))","v":""},{"$f":"IF('Arrear Sheet'!N76=\"\",\"\",IF('Arrear Sheet'!C76=\"TOTAL\",\"\",'Arrear Sheet'!N76))","v":""},{"$f":"IF('Arrear Sheet'!O76=\"\",\"\",IF('Arrear Sheet'!C76=\"TOTAL\",\"\",SUM(K76:M76)))","v":""},{"$f":"IF('Arrear Sheet'!P76=\"\",\"\",IF('Arrear Sheet'!C76=\"TOTAL\",\"\",'Arrear Sheet'!P76))","v":""},{"$f":"IF('Arrear Sheet'!Q76=\"\",\"\",IF('Arrear Sheet'!C76=\"TOTAL\",\"\",'Arrear Sheet'!Q76))","v":""},{"$f":"IF('Arrear Sheet'!R76=\"\",\"\",IF('Arrear Sheet'!C76=\"TOTAL\",\"\",'Arrear Sheet'!R76))","v":""},{"$f":"IF('Arrear Sheet'!S76=\"\",\"\",IF('Arrear Sheet'!C76=\"TOTAL\",\"\",'Arrear Sheet'!S76))","v":""},{"$f":"IF('Arrear Sheet'!T76=\"\",\"\",IF('Arrear Sheet'!C76=\"TOTAL\",\"\",'Arrear Sheet'!T76))","v":""},{"$f":"IF('Arrear Sheet'!U76=\"\",\"\",IF('Arrear Sheet'!C76=\"TOTAL\",\"\",'Arrear Sheet'!U76))","v":""},{"$f":"IF('Arrear Sheet'!V76=\"\",\"\",IF('Arrear Sheet'!C76=\"TOTAL\",\"\",'Arrear Sheet'!V76))","v":""},{"$f":"IF('Arrear Sheet'!W76=\"\",\"\",IF('Arrear Sheet'!C76=\"TOTAL\",\"\",'Arrear Sheet'!W76))","v":""},{"$f":"IF('Arrear Sheet'!X76=\"\",\"\",IF('Arrear Sheet'!C76=\"TOTAL\",\"\",'Arrear Sheet'!X76))","v":""},{"$f":"IF('Arrear Sheet'!Y76=\"\",\"\",IF('Arrear Sheet'!C76=\"TOTAL\",\"\",'Arrear Sheet'!Y76))","v":""},{"$f":"IF('Arrear Sheet'!Z76=\"\",\"\",IF('Arrear Sheet'!C76=\"TOTAL\",\"\",'Arrear Sheet'!Z76))","v":""},{"$f":"IF('Arrear Sheet'!AA76=\"\",\"\",IF('Arrear Sheet'!C76=\"TOTAL\",\"\",'Arrear Sheet'!AA76))","v":""},{"$f":"IF('Arrear Sheet'!AB76=\"\",\"\",IF('Arrear Sheet'!C76=\"TOTAL\",\"\",SUM(N76-Z76)))","v":""}]
[{"$f":"IF('Arrear Sheet'!B77=\"\",\"\",'Arrear Sheet'!B77)","v":""},{"$f":"IF('Arrear Sheet'!C77=\"\",\"\",IF('Arrear Sheet'!C77=\"TOTAL\",\"\",'Arrear Sheet'!C77))","v":""},{"$f":"IF('Arrear Sheet'!D77=\"\",\"\",IF('Arrear Sheet'!C77=\"TOTAL\",\"\",IF('Arrear Sheet'!D77=\"अक्षरें राशि :-\",\"\",'Arrear Sheet'!D77)))","v":""},{"$f":"IF('Arrear Sheet'!E77=\"\",\"\",IF('Arrear Sheet'!C77=\"TOTAL\",\"\",'Arrear Sheet'!E77))","v":""},{"$f":"IF('Arrear Sheet'!F77=\"\",\"\",IF('Arrear Sheet'!C77=\"TOTAL\",\"\",'Arrear Sheet'!F77))","v":""},{"$f":"IF('Arrear Sheet'!G77=\"\",\"\",IF('Arrear Sheet'!C77=\"TOTAL\",\"\",SUM(C77:E77)))","v":""},{"$f":"IF('Arrear Sheet'!H77=\"\",\"\",IF('Arrear Sheet'!C77=\"TOTAL\",\"\",'Arrear Sheet'!H77))","v":""},{"$f":"IF('Arrear Sheet'!I77=\"\",\"\",IF('Arrear Sheet'!C77=\"TOTAL\",\"\",'Arrear Sheet'!I77))","v":""},{"$f":"IF('Arrear Sheet'!J77=\"\",\"\",IF('Arrear Sheet'!C77=\"TOTAL\",\"\",'Arrear Sheet'!J77))","v":""},{"$f":"IF('Arrear Sheet'!K77=\"\",\"\",IF('Arrear Sheet'!C77=\"TOTAL\",\"\",SUM(G77:I77)))","v":""},{"$f":"IF('Arrear Sheet'!L77=\"\",\"\",IF('Arrear Sheet'!C77=\"TOTAL\",\"\",'Arrear Sheet'!L77))","v":""},{"$f":"IF('Arrear Sheet'!M77=\"\",\"\",IF('Arrear Sheet'!C77=\"TOTAL\",\"\",'Arrear Sheet'!M77))","v":""},{"$f":"IF('Arrear Sheet'!N77=\"\",\"\",IF('Arrear Sheet'!C77=\"TOTAL\",\"\",'Arrear Sheet'!N77))","v":""},{"$f":"IF('Arrear Sheet'!O77=\"\",\"\",IF('Arrear Sheet'!C77=\"TOTAL\",\"\",SUM(K77:M77)))","v":""},{"$f":"IF('Arrear Sheet'!P77=\"\",\"\",IF('Arrear Sheet'!C77=\"TOTAL\",\"\",'Arrear Sheet'!P77))","v":""},{"$f":"IF('Arrear Sheet'!Q77=\"\",\"\",IF('Arrear Sheet'!C77=\"TOTAL\",\"\",'Arrear Sheet'!Q77))","v":""},{"$f":"IF('Arrear Sheet'!R77=\"\",\"\",IF('Arrear Sheet'!C77=\"TOTAL\",\"\",'Arrear Sheet'!R77))","v":""},{"$f":"IF('Arrear Sheet'!S77=\"\",\"\",IF('Arrear Sheet'!C77=\"TOTAL\",\"\",'Arrear Sheet'!S77))","v":""},{"$f":"IF('Arrear Sheet'!T77=\"\",\"\",IF('Arrear Sheet'!C77=\"TOTAL\",\"\",'Arrear Sheet'!T77))","v":""},{"$f":"IF('Arrear Sheet'!U77=\"\",\"\",IF('Arrear Sheet'!C77=\"TOTAL\",\"\",'Arrear Sheet'!U77))","v":""},{"$f":"IF('Arrear Sheet'!V77=\"\",\"\",IF('Arrear Sheet'!C77=\"TOTAL\",\"\",'Arrear Sheet'!V77))","v":""},{"$f":"IF('Arrear Sheet'!W77=\"\",\"\",IF('Arrear Sheet'!C77=\"TOTAL\",\"\",'Arrear Sheet'!W77))","v":""},{"$f":"IF('Arrear Sheet'!X77=\"\",\"\",IF('Arrear Sheet'!C77=\"TOTAL\",\"\",'Arrear Sheet'!X77))","v":""},{"$f":"IF('Arrear Sheet'!Y77=\"\",\"\",IF('Arrear Sheet'!C77=\"TOTAL\",\"\",'Arrear Sheet'!Y77))","v":""},{"$f":"IF('Arrear Sheet'!Z77=\"\",\"\",IF('Arrear Sheet'!C77=\"TOTAL\",\"\",'Arrear Sheet'!Z77))","v":""},{"$f":"IF('Arrear Sheet'!AA77=\"\",\"\",IF('Arrear Sheet'!C77=\"TOTAL\",\"\",'Arrear Sheet'!AA77))","v":""},{"$f":"IF('Arrear Sheet'!AB77=\"\",\"\",IF('Arrear Sheet'!C77=\"TOTAL\",\"\",SUM(N77-Z77)))","v":""}]
[{"$f":"IF('Arrear Sheet'!B78=\"\",\"\",'Arrear Sheet'!B78)","v":""},{"$f":"IF('Arrear Sheet'!C78=\"\",\"\",IF('Arrear Sheet'!C78=\"TOTAL\",\"\",'Arrear Sheet'!C78))","v":""},{"$f":"IF('Arrear Sheet'!D78=\"\",\"\",IF('Arrear Sheet'!C78=\"TOTAL\",\"\",IF('Arrear Sheet'!D78=\"अक्षरें राशि :-\",\"\",'Arrear Sheet'!D78)))","v":""},{"$f":"IF('Arrear Sheet'!E78=\"\",\"\",IF('Arrear Sheet'!C78=\"TOTAL\",\"\",'Arrear Sheet'!E78))","v":""},{"$f":"IF('Arrear Sheet'!F78=\"\",\"\",IF('Arrear Sheet'!C78=\"TOTAL\",\"\",'Arrear Sheet'!F78))","v":""},{"$f":"IF('Arrear Sheet'!G78=\"\",\"\",IF('Arrear Sheet'!C78=\"TOTAL\",\"\",SUM(C78:E78)))","v":""},{"$f":"IF('Arrear Sheet'!H78=\"\",\"\",IF('Arrear Sheet'!C78=\"TOTAL\",\"\",'Arrear Sheet'!H78))","v":""},{"$f":"IF('Arrear Sheet'!I78=\"\",\"\",IF('Arrear Sheet'!C78=\"TOTAL\",\"\",'Arrear Sheet'!I78))","v":""},{"$f":"IF('Arrear Sheet'!J78=\"\",\"\",IF('Arrear Sheet'!C78=\"TOTAL\",\"\",'Arrear Sheet'!J78))","v":""},{"$f":"IF('Arrear Sheet'!K78=\"\",\"\",IF('Arrear Sheet'!C78=\"TOTAL\",\"\",SUM(G78:I78)))","v":""},{"$f":"IF('Arrear Sheet'!L78=\"\",\"\",IF('Arrear Sheet'!C78=\"TOTAL\",\"\",'Arrear Sheet'!L78))","v":""},{"$f":"IF('Arrear Sheet'!M78=\"\",\"\",IF('Arrear Sheet'!C78=\"TOTAL\",\"\",'Arrear Sheet'!M78))","v":""},{"$f":"IF('Arrear Sheet'!N78=\"\",\"\",IF('Arrear Sheet'!C78=\"TOTAL\",\"\",'Arrear Sheet'!N78))","v":""},{"$f":"IF('Arrear Sheet'!O78=\"\",\"\",IF('Arrear Sheet'!C78=\"TOTAL\",\"\",SUM(K78:M78)))","v":""},{"$f":"IF('Arrear Sheet'!P78=\"\",\"\",IF('Arrear Sheet'!C78=\"TOTAL\",\"\",'Arrear Sheet'!P78))","v":""},{"$f":"IF('Arrear Sheet'!Q78=\"\",\"\",IF('Arrear Sheet'!C78=\"TOTAL\",\"\",'Arrear Sheet'!Q78))","v":""},{"$f":"IF('Arrear Sheet'!R78=\"\",\"\",IF('Arrear Sheet'!C78=\"TOTAL\",\"\",'Arrear Sheet'!R78))","v":""},{"$f":"IF('Arrear Sheet'!S78=\"\",\"\",IF('Arrear Sheet'!C78=\"TOTAL\",\"\",'Arrear Sheet'!S78))","v":""},{"$f":"IF('Arrear Sheet'!T78=\"\",\"\",IF('Arrear Sheet'!C78=\"TOTAL\",\"\",'Arrear Sheet'!T78))","v":""},{"$f":"IF('Arrear Sheet'!U78=\"\",\"\",IF('Arrear Sheet'!C78=\"TOTAL\",\"\",'Arrear Sheet'!U78))","v":""},{"$f":"IF('Arrear Sheet'!V78=\"\",\"\",IF('Arrear Sheet'!C78=\"TOTAL\",\"\",'Arrear Sheet'!V78))","v":""},{"$f":"IF('Arrear Sheet'!W78=\"\",\"\",IF('Arrear Sheet'!C78=\"TOTAL\",\"\",'Arrear Sheet'!W78))","v":""},{"$f":"IF('Arrear Sheet'!X78=\"\",\"\",IF('Arrear Sheet'!C78=\"TOTAL\",\"\",'Arrear Sheet'!X78))","v":""},{"$f":"IF('Arrear Sheet'!Y78=\"\",\"\",IF('Arrear Sheet'!C78=\"TOTAL\",\"\",'Arrear Sheet'!Y78))","v":""},{"$f":"IF('Arrear Sheet'!Z78=\"\",\"\",IF('Arrear Sheet'!C78=\"TOTAL\",\"\",'Arrear Sheet'!Z78))","v":""},{"$f":"IF('Arrear Sheet'!AA78=\"\",\"\",IF('Arrear Sheet'!C78=\"TOTAL\",\"\",'Arrear Sheet'!AA78))","v":""},{"$f":"IF('Arrear Sheet'!AB78=\"\",\"\",IF('Arrear Sheet'!C78=\"TOTAL\",\"\",SUM(N78-Z78)))","v":""}]
[{"$f":"IF('Arrear Sheet'!B79=\"\",\"\",'Arrear Sheet'!B79)","v":""},{"$f":"IF('Arrear Sheet'!C79=\"\",\"\",IF('Arrear Sheet'!C79=\"TOTAL\",\"\",'Arrear Sheet'!C79))","v":""},{"$f":"IF('Arrear Sheet'!D79=\"\",\"\",IF('Arrear Sheet'!C79=\"TOTAL\",\"\",IF('Arrear Sheet'!D79=\"अक्षरें राशि :-\",\"\",'Arrear Sheet'!D79)))","v":""},{"$f":"IF('Arrear Sheet'!E79=\"\",\"\",IF('Arrear Sheet'!C79=\"TOTAL\",\"\",'Arrear Sheet'!E79))","v":""},{"$f":"IF('Arrear Sheet'!F79=\"\",\"\",IF('Arrear Sheet'!C79=\"TOTAL\",\"\",'Arrear Sheet'!F79))","v":""},{"$f":"IF('Arrear Sheet'!G79=\"\",\"\",IF('Arrear Sheet'!C79=\"TOTAL\",\"\",SUM(C79:E79)))","v":""},{"$f":"IF('Arrear Sheet'!H79=\"\",\"\",IF('Arrear Sheet'!C79=\"TOTAL\",\"\",'Arrear Sheet'!H79))","v":""},{"$f":"IF('Arrear Sheet'!I79=\"\",\"\",IF('Arrear Sheet'!C79=\"TOTAL\",\"\",'Arrear Sheet'!I79))","v":""},{"$f":"IF('Arrear Sheet'!J79=\"\",\"\",IF('Arrear Sheet'!C79=\"TOTAL\",\"\",'Arrear Sheet'!J79))","v":""},{"$f":"IF('Arrear Sheet'!K79=\"\",\"\",IF('Arrear Sheet'!C79=\"TOTAL\",\"\",SUM(G79:I79)))","v":""},{"$f":"IF('Arrear Sheet'!L79=\"\",\"\",IF('Arrear Sheet'!C79=\"TOTAL\",\"\",'Arrear Sheet'!L79))","v":""},{"$f":"IF('Arrear Sheet'!M79=\"\",\"\",IF('Arrear Sheet'!C79=\"TOTAL\",\"\",'Arrear Sheet'!M79))","v":""},{"$f":"IF('Arrear Sheet'!N79=\"\",\"\",IF('Arrear Sheet'!C79=\"TOTAL\",\"\",'Arrear Sheet'!N79))","v":""},{"$f":"IF('Arrear Sheet'!O79=\"\",\"\",IF('Arrear Sheet'!C79=\"TOTAL\",\"\",SUM(K79:M79)))","v":""},{"$f":"IF('Arrear Sheet'!P79=\"\",\"\",IF('Arrear Sheet'!C79=\"TOTAL\",\"\",'Arrear Sheet'!P79))","v":""},{"$f":"IF('Arrear Sheet'!Q79=\"\",\"\",IF('Arrear Sheet'!C79=\"TOTAL\",\"\",'Arrear Sheet'!Q79))","v":""},{"$f":"IF('Arrear Sheet'!R79=\"\",\"\",IF('Arrear Sheet'!C79=\"TOTAL\",\"\",'Arrear Sheet'!R79))","v":""},{"$f":"IF('Arrear Sheet'!S79=\"\",\"\",IF('Arrear Sheet'!C79=\"TOTAL\",\"\",'Arrear Sheet'!S79))","v":""},{"$f":"IF('Arrear Sheet'!T79=\"\",\"\",IF('Arrear Sheet'!C79=\"TOTAL\",\"\",'Arrear Sheet'!T79))","v":""},{"$f":"IF('Arrear Sheet'!U79=\"\",\"\",IF('Arrear Sheet'!C79=\"TOTAL\",\"\",'Arrear Sheet'!U79))","v":""},{"$f":"IF('Arrear Sheet'!V79=\"\",\"\",IF('Arrear Sheet'!C79=\"TOTAL\",\"\",'Arrear Sheet'!V79))","v":""},{"$f":"IF('Arrear Sheet'!W79=\"\",\"\",IF('Arrear Sheet'!C79=\"TOTAL\",\"\",'Arrear Sheet'!W79))","v":""},{"$f":"IF('Arrear Sheet'!X79=\"\",\"\",IF('Arrear Sheet'!C79=\"TOTAL\",\"\",'Arrear Sheet'!X79))","v":""},{"$f":"IF('Arrear Sheet'!Y79=\"\",\"\",IF('Arrear Sheet'!C79=\"TOTAL\",\"\",'Arrear Sheet'!Y79))","v":""},{"$f":"IF('Arrear Sheet'!Z79=\"\",\"\",IF('Arrear Sheet'!C79=\"TOTAL\",\"\",'Arrear Sheet'!Z79))","v":""},{"$f":"IF('Arrear Sheet'!AA79=\"\",\"\",IF('Arrear Sheet'!C79=\"TOTAL\",\"\",'Arrear Sheet'!AA79))","v":""},{"$f":"IF('Arrear Sheet'!AB79=\"\",\"\",IF('Arrear Sheet'!C79=\"TOTAL\",\"\",SUM(N79-Z79)))","v":""}]
["TOTAL",null,{"$f":"IF($E$3=\"\",\"\",SUM(C8:C79))","v":717439},{"$f":"IF($E$3=\"\",\"\",SUM(D8:D79))","v":186693},61571,965703,494642,0,0,494642,222797,186693,61571,471061,82727,48654,34073,0,0,0,1187,666,521,3132,0,3653,467408]
[{"$nulls":6},"In Words:"]
[]
[null,"S.R.",{"$nulls":6},"Date :",{"$f":"TODAY()","v":"2022-07-01"}]
[null,"For Copying And Necessary Action"]
[1,"Treasury Officer / Deputy treasury  Officer",{"$nulls":18},{"$f":"IF(AND(E3=\"\"),\"\",CONCATENATE(\"( \",'Master Sheet'!D5,\" ) \"))","v":"( USHA PALIYA ) "}]
[2,"Related Employee Sh./Smt./Mis.",{"$nulls":3},{"$f":"CONCATENATE(E3,\",\",\"  \",N3)","v":"HEERALAL JAT,  SR. TEACHER"},{"$nulls":14},"Drawing & Despersal Officer"]
[3,"File Register",{"$nulls":18},{"$f":"IF('Master Sheet'!D3=\"\",\"\",'Master Sheet'!D3)","v":"Mahatma Gandhi Government School (English Medium) Bar, PALI"}]
[]
[{"$nulls":10},"."]