{"text_format":"3","workbook":"xlsx","n_sheets":8,"sheets":["Instruction","Master","GA 55 Editable","Other Ded.","Summary","GA 55 For Print","Tax Calculaton Old","Tax Calculaton New"],"not_rendered":{"images":3,"macros":1,"defined_names":7},"read":"whole","date_system":"1900"}

{"sheet":"Instruction","index":0,"n_rows":68,"n_cols":3,"rows_kept":68,"hidden":true,"merged":[[0,0,0,6],[2,0,2,6],[3,2,3,6],[4,2,4,6],[5,2,5,6],[6,2,6,6],[7,2,7,6],[8,2,8,6],[9,2,9,6],[10,2,10,6],[11,2,11,6],[12,2,12,6],[13,2,13,6],[14,2,14,6],[15,2,15,6],[16,2,16,6],[17,2,17,6],[18,2,18,6],[19,2,19,6],[20,2,20,6],[21,2,21,6],[22,2,22,6],[23,2,23,6],[24,2,24,6],[25,2,25,6],[26,2,26,6],[27,2,27,6],[28,2,28,6],[29,2,29,6],[31,0,31,6],[32,1,32,6],[33,1,33,6],[34,1,34,6],[35,1,35,6],[36,1,36,6],[37,1,37,6],[38,1,38,6],[39,1,39,6],[40,1,40,6],[41,1,41,6],[42,1,42,6],[43,1,43,6],[44,1,44,6],[45,1,45,6],[46,1,46,6],[47,1,47,6],[48,1,48,6],[49,1,49,6],[50,1,50,6],[51,1,51,6],[52,1,52,6],[53,1,53,6],[54,1,54,6],[55,1,55,6],[56,1,56,6],[57,1,57,6],[58,1,58,6],[59,1,59,6],[60,1,60,6],[61,1,61,6],[62,1,62,6],[63,1,63,6],[64,1,64,6],[65,1,65,6],[66,1,66,6],[67,1,67,6]]}
["आयकर गणना प्रपत्र 2021-22"]
[]
["Master Sheet Instruction"]
[1,"Employee Name","अपना नाम लिखिए"]
[2,"Post","अपनी पोस्ट ड्राप डाउन लिस्ट में से चयन करे |"]
[3,"Cader","अपना कैडर चयन करे |"]
[4,"Are you in Probation","अगर आप प्रोबेशन में है तो ड्राप डाउन में से YES का चयन करे अन्यथा NO का चयन करे |"]
[5,"PAY-Level","अपना पे लेवल का चयन ड्राप डाउन लिस्ट में से करे |"]
[6,"Employee ID","अपनी एम्प्लोयी आईडी लिखिए |"]
[7,"PAN NO.","अपना पैन नंबर लिखिए |"]
{"$rows_left_out":59}
{"sheet":"Master","index":1,"n_rows":13,"n_cols":6,"rows_kept":13,"merged":[[0,0,0,5],[1,0,1,5]]}
["Office of the Principal DIET Kuchaman City (Nagaur)"]
["आयकर गणना प्रपत्र 2021-22"]
[]
["Employee Name","Ashwini Kumar Sharma","Post","Lecturer","Cader","State Service"]
["Are you in Probation","No","PAY-Level","L-12","Employee ID","RJNA201228008021"]
["PAN NO.","AAAA9456A","SI No.",123456,"GPF/PRAN No.","1234567891011"]
["Bank Account No.","123456789101112","Mobile No.",9166023711,"March 2021 Basic",{"v":52300,"d":"52300.00"}]
["HRA Rate",{"v":0.08,"d":"8%"},"SIP (Monthly Amount)",{"v":3000,"d":"3000.00"},"SI Loan (Monthly Amount)",{"v":0,"d":"0.00"}]
["GPF (Monthly Amount)",{"v":5100,"d":"5100.00"},"GPF Loan (Monthly Amount)",{"v":0,"d":"0.00"},"Are You NPS Employee","Yes"]
["Washing All. Monthly",{"v":0,"d":"0.00"},"Handi. All. Monthly",{"v":0,"d":"0.00"},"CCA (Monthly Amount)",{"v":0,"d":"0.00"}]
{"$rows_left_out":4}
{"sheet":"GA 55 Editable","index":2,"n_rows":31,"n_cols":31,"rows_kept":31,"merged":[[0,1,0,26],[1,1,1,26],[3,2,3,5],[3,7,3,9],[3,11,3,12],[3,13,3,14],[3,15,3,18],[3,19,3,21],[3,22,3,23],[3,25,3,26],[4,2,4,5],[4,7,4,9],[4,11,4,12],[4,13,4,14],[4,15,4,18],[4,19,4,21],[4,22,4,25],[30,1,30,3],[30,24,30,25]]}
[null,{"$f":"Master!A1","v":"Office of the Principal DIET Kuchaman City (Nagaur)"}]
[null,"Salary and Deduction Detail for FY : 2021-22"]
[]
[null,"नाम कर्मचारी-",{"$f":"IF(Master!B4=0,0,Master!B4)","v":"Ashwini Kumar Sharma"},{"$nulls":3},"पद-",{"$f":"IF(Master!D4=0,0,Master!D4)","v":"Lecturer"},null,null,"लेवल-",{"$f":"IF(Master!D5=0,0,Master!D5)","v":"L-12"},null,"Employee ID-",null,{"$f":"IF(Master!F5=0,0,Master!F5)","v":"RJNA201228008021"},{"$nulls":3},"मार्च का बेसिक-",null,null,{"$f":"IF(Master!F7=0,0,Master!F7)","v":{"v":52300,"d":"52300.00"}},null,"TAN No.",{"$f":"IF(Master!F12=0,0,Master!F12)","v":"ABCD1234E"}]
[null,"पैन नं.-",{"$f":"IF(Master!B6=0,0,Master!B6)","v":"AAAA9456A"},{"$nulls":3},"Mobile-",{"$f":"IF(Master!D7=0,0,Master!D7)","v":9166023711},null,null,"SI No.-",{"$f":"IF(Master!D6=0,0,Master!D6)","v":123456},null,"GPF/PRAN No.-",null,{"$f":"IF(Master!F6=0,0,Master!F6)","v":"1234567891011"},{"$nulls":3},"बैंक खाता सं.-",null,null,{"$f":"IF(Master!B7=0,0,Master!B7)","v":"123456789101112"}]
[null,"Month & Year","Basic Pay","DA","HRA","Washing Allow.","Handicaped Allowance","CCA Allowance","Other Allowance","Gross Salary","SIP","GPF","NPS","GPF Loan","RPMF","SI Arrear","SI Loan","GIS","LIC","COVIS-19","GPF 2004","Hitkari Nidhi","Other","ITAX","Total Deduction","NET Payment","Bill No./ Dte"]
[3,"2021-03-01",{"$f":"IF(Master!F7=0,0,Master!F7)","v":{"v":52300,"d":"52,300"}},{"$f":"IF(Master!$B$5=\"Yes\",0,IF(C7=0,0,ROUND(C7*17%,0)))","v":{"v":8891,"d":"8,891"}},{"$f":"IF(Master!$B$8=\"NA\",0,IF(Master!$B$8=8%,ROUND(0.08*C7,0),ROUND(0.16*C7,0)))","v":{"v":4184,"d":"4,184"}},{"$f":"IF(Master!$B$10=0,0,Master!$B$10)","v":0},{"$f":"IF(Master!$D$10=0,0,Master!$D$10)","v":0},{"$f":"IF(Master!$F$10=0,0,Master!$F$10)","v":0},null,{"$f":"SUM(C7:I7)","v":{"v":65375,"d":"65,375"}},{"$f":"IF(Master!D8=0,0,Master!D8)","v":{"v":3000,"d":"3,000"}},{"$f":"IF(Master!$F$9=\"YES\",0,IF(Master!$B$9=0,0,Master!$B$9))","v":0},{"$f":"IF(Master!$F$9=\"YES\",ROUND((C7+D7)*0.1,0),0)","v":{"v":6119,"d":"6,119"}},{"$f":"IF(Master!$D$9=0,0,Master!$D$9)","v":0},{"$f":"IF(Master!$F$9=\"No\",IF(C7<18001,265,IF(C7<33501,440,IF(C7<54001,658,875))),0)","v":0},null,{"$f":"IF(Master!$F$8=0,0,Master!$F$8)","v":0},null,{"$f":"IF(Master!$F$13=0,0,Master!$F$13)","v":0},{"$nulls":5},{"$f":"SUM(K7:X7)","v":{"v":9119,"d":"9,119"}},{"$f":"J7-Y7","v":{"v":56256,"d":"56,256"}}]
[4,"2021-04-01",{"$f":"C7","v":{"v":52300,"d":"52,300"}},{"$f":"IF(Master!$B$5=\"Yes\",0,IF(C8=0,0,ROUND(C8*17%,0)))","v":{"v":8891,"d":"8,891"}},{"$f":"IF(Master!$B$8=\"NA\",0,IF(Master!$B$8=8%,ROUND(0.08*C8,0),ROUND(0.16*C8,0)))","v":{"v":4184,"d":"4,184"}},{"$f":"F7","v":0},{"$f":"G7","v":0},{"$f":"H7","v":0},null,{"v":65375,"d":"65,375"},{"$f":"K7","v":{"v":3000,"d":"3,000"}},{"$f":"L7","v":0},{"$f":"IF(Master!$F$9=\"YES\",ROUND((C8+D8)*0.1,0),0)","v":{"v":6119,"d":"6,119"}},{"$f":"N7","v":0},{"$f":"IF(Master!$F$9=\"No\",IF(C8<18001,265,IF(C8<33501,440,IF(C8<54001,658,875))),0)","v":0},null,{"$f":"Q7","v":0},{"$f":"IF(Master!D13=\"\",0,Master!D13)","v":220},{"$f":"S7","v":0},{"$nulls":4},{"$f":"X7","v":0},{"$f":"SUM(K8:X8)","v":{"v":9339,"d":"9,339"}},{"$f":"J8-Y8","v":{"v":56036,"d":"56,036"}}]
[5,"2021-05-01",{"$f":"C8","v":{"v":52300,"d":"52,300"}},{"$f":"IF(Master!$B$5=\"Yes\",0,IF(C9=0,0,ROUND(C9*17%,0)))","v":{"v":8891,"d":"8,891"}},{"$f":"IF(Master!$B$8=\"NA\",0,IF(Master!$B$8=8%,ROUND(0.08*C9,0),ROUND(0.16*C9,0)))","v":{"v":4184,"d":"4,184"}},{"$f":"F8","v":0},{"$f":"G8","v":0},{"$f":"H8","v":0},null,{"v":65375,"d":"65,375"},{"$f":"K8","v":{"v":3000,"d":"3,000"}},{"$f":"L8","v":0},{"$f":"IF(Master!$F$9=\"YES\",ROUND((C9+D9)*0.1,0),0)","v":{"v":6119,"d":"6,119"}},{"$f":"N8","v":0},{"$f":"IF(Master!$F$9=\"No\",IF(C9<18001,265,IF(C9<33501,440,IF(C9<54001,658,875))),0)","v":0},null,{"$f":"Q8","v":0},null,{"$f":"S8","v":0},{"$nulls":4},{"$f":"X8","v":0},{"v":9119,"d":"9,119"},{"v":56256,"d":"56,256"}]
[6,"2021-06-01",{"$f":"C9","v":{"v":52300,"d":"52,300"}},{"$f":"IF(Master!$B$5=\"Yes\",0,IF(C10=0,0,ROUND(C10*17%,0)))","v":{"v":8891,"d":"8,891"}},{"$f":"IF(Master!$B$8=\"NA\",0,IF(Master!$B$8=8%,ROUND(0.08*C10,0),ROUND(0.16*C10,0)))","v":{"v":4184,"d":"4,184"}},0,0,0,null,{"v":65375,"d":"65,375"},{"v":3000,"d":"3,000"},0,{"$f":"IF(Master!$F$9=\"YES\",ROUND((C10+D10)*0.1,0),0)","v":{"v":6119,"d":"6,119"}},0,{"$f":"IF(Master!$F$9=\"No\",IF(C10<18001,265,IF(C10<33501,440,IF(C10<54001,658,875))),0)","v":0},null,0,null,0,{"$nulls":4},0,{"v":9119,"d":"9,119"},{"v":56256,"d":"56,256"}]
{"$rows_left_out":22}
{"sheet":"Other Ded.","index":3,"n_rows":20,"n_cols":13,"rows_kept":20,"merged":[[0,0,0,6],[1,0,1,6],[3,1,3,2],[4,1,4,2],[5,1,5,2],[6,1,6,2],[7,1,7,2],[8,1,8,2],[9,1,9,2],[10,1,10,2],[11,1,11,2],[12,1,12,2],[13,1,13,2],[14,1,14,2],[15,1,15,2],[16,1,16,2],[17,1,17,2],[18,1,18,2],[19,1,19,2]]}
["Deductions other than Salry"]
[{"$f":"Master!B4&\", \"&Master!D4","v":"Ashwini Kumar Sharma, Lecturer"}]
[1,"मकान किराया भत्ता ( छूट जो लेनी है) YES/NO","NO",{"$f":"IF(C3=\"Yes\",'GA 55 For Print'!E28,0)","v":0},19," Defferred Annuty (स्थगित वार्षिकी)"]
[2,"गृह सम्पति से प्राप्त किराया - आय",null,null,20,"मनोरंजन भता धारा 16 (II) के अन्तर्गत ",{"$nulls":4},{"$f":"SUM(D19,G6)","v":0}]
[3,"गृहकर ",null,null,21,"व्यवयाय कर धारा 16 (III) के अन्तगर्त ",{"$nulls":4},{"$f":"SUM(G7,D19)","v":0}]
[4,"सरकारी पेंशन योजना में कर्मचारी का अंशदान अधिकतम वेतन का 10% धारा 80 CCD(1)",null,{"$f":"IF(J6>0,J6,0)","v":{"v":80964,"d":"80,964"}},22,"एफडी आदि अन्य जमा राशि पर प्राप्त कुल ब्याज (पीपीएफ को छोड़कर)",{"$nulls":3},{"$f":"IF(K6>L6,L6,K6)","v":80964},{"$f":"IF(Master!$F$9=\"No\",0,ROUND(10%*'GA 55 For Print'!$J$28,0))","v":87195},{"$f":"IF(Master!$F$9=\"No\",0,'GA 55 For Print'!$M$28)","v":80964}]
[5,"Covid - 19 (धारा 80G)",null,null,23,"अन्य विभिन्न स्त्रो़त्र (ब्याज के अलावा) से कुल आय",{"$nulls":4},{"$f":"SUM('Tax Calculaton Old'!F21:F30,'Tax Calculaton Old'!L21:L28)","v":{"v":124936,"d":"124936.00"}},{"$f":"IF(Master!$F$9=\"No\",50000,IF(M7>50000,50000,M7))","v":0},{"$f":"IF(K7>150000,K7-150000,0)","v":0}]
[6,"गृह ऋण किस्त मूल (जो वेतन से नहीं काटा गया)",null,null,24,"धारा 80 सी के अन्तर्गत अन्य मद में जमा करायी गयी राशि",{"$nulls":3},{"$f":"IF(Master!$F$11=\"No\",25000,50000)","v":25000}]
[7,"गृह ऋण किस्त ब्याज (जो वेतन से नहीं काटा गया)",null,null,25,"धारा 80 CCC पेंशन प्लान हेतु अंशदान (एन.पी.एस. के अलावा)"]
[8,"LIC जीवन बीमा प्रीमियम (जो वेतन से नही काटा गया)",null,null,26,"धारा 80CCD (1B) नवीन पेंशन योजना में अतिरिक्त अंशदान (अधिकतम रू. 50,000)",0,null,null,{"$f":"IF(Master!$F$11=\"No\",40000,100000)","v":40000}]
{"$rows_left_out":11}
{"sheet":"Summary","index":4,"n_rows":11,"n_cols":5,"rows_kept":11,"merged":[[0,0,0,4],[2,1,2,4],[7,0,7,1],[7,2,7,4],[8,0,8,1],[8,2,8,4],[9,0,9,1],[9,2,9,4],[10,0,10,1],[10,2,10,4]]}
[{"$f":"Master!A1","v":"Office of the Principal DIET Kuchaman City (Nagaur)"}]
[]
["Name Of Employee",{"$f":"Master!B4","v":"Ashwini Kumar Sharma"}]
[]
["Gross Pay","Taxable Amt","Tax Deposit","Rebate Under Section 80C, 80CCC, 80CCD(1)","मकान किराया छूट के लिए रसीद की आवश्यकता"]
[{"$f":"'Tax Calculaton Old'!$M$4","v":{"v":952918,"d":"952918.00"}},{"$f":"'Tax Calculaton Old'!M48","v":{"v":694380,"d":"694380.00"}},{"$f":"'Tax Calculaton Old'!M63","v":{"v":0,"d":"0.00"}},{"$f":"'Tax Calculaton Old'!M31","v":{"v":124936,"d":"124936.00"}},{"$f":"IF('Other Ded.'!D3=0,0,ROUND(0.1*'Other Ded.'!J11,0)+'Other Ded.'!D3)","v":{"v":0,"d":"0.00"}}]
[]
["TAX Position (Old Tax Scheme)",null,{"$f":"'Tax Calculaton Old'!A64&\" = \"&'Tax Calculaton Old'!M64","v":"Income Tax Payable = 53431"}]
["TAX Position (New Tax Scheme)",null,{"$f":"'Tax Calculaton New'!A56&\" = \"&'Tax Calculaton New'!M56","v":"Income Tax Payable = 58025"}]
["Total Rebate Under Section 80C, 80CCC, 80CCD(1)",null,{"$f":"'Tax Calculaton Old'!M31","v":{"v":124936,"d":"124936.00"}}]
{"$rows_left_out":2}
{"sheet":"GA 55 For Print","index":5,"n_rows":31,"n_cols":27,"rows_kept":31,"merged":[[0,1,0,26],[1,1,1,26],[3,2,3,5],[3,7,3,9],[3,11,3,12],[3,13,3,14],[3,15,3,18],[3,19,3,21],[3,22,3,23],[3,25,3,26],[4,2,4,5],[4,7,4,9],[4,11,4,12],[4,13,4,14],[4,15,4,18],[4,19,4,21],[4,22,4,25],[30,1,30,3],[30,24,30,25]]}
[null,{"$f":"Master!A1","v":"Office of the Principal DIET Kuchaman City (Nagaur)"}]
[null,"Salary and Deduction Detail for FY : 2021-22"]
[]
[null,"नाम कर्मचारी-",{"$f":"IF('GA 55 Editable'!C4=\"\",\"\",'GA 55 Editable'!C4)","v":"Ashwini Kumar Sharma"},{"$nulls":3},"पद-",{"$f":"IF('GA 55 Editable'!H4=\"\",\"\",'GA 55 Editable'!H4)","v":"Lecturer"},null,null,"लेवल-",{"$f":"IF('GA 55 Editable'!L4=\"\",\"\",'GA 55 Editable'!L4)","v":"L-12"},null,"Employee ID-",null,{"$f":"IF('GA 55 Editable'!P4=\"\",\"\",'GA 55 Editable'!P4)","v":"RJNA201228008021"},{"$nulls":3},"मार्च का बेसिक-",null,null,{"$f":"IF('GA 55 Editable'!W4=\"\",\"\",'GA 55 Editable'!W4)","v":{"v":52300,"d":"52300.00"}},null,"TAN No.",{"$f":"IF('GA 55 Editable'!Z4=\"\",\"\",'GA 55 Editable'!Z4)","v":"ABCD1234E"}]
[null,"पैन नं.-",{"$f":"IF('GA 55 Editable'!C5=\"\",\"\",'GA 55 Editable'!C5:F5)","v":"AAAA9456A"},{"$nulls":3},"Mobile-",{"$f":"IF('GA 55 Editable'!H5=\"\",\"\",'GA 55 Editable'!H5)","v":9166023711},null,null,"SI No.-",{"$f":"IF('GA 55 Editable'!L5=\"\",\"\",'GA 55 Editable'!L5)","v":123456},null,"GPF/PRAN No.-",null,{"$f":"IF('GA 55 Editable'!P5=\"\",\"\",'GA 55 Editable'!P5)","v":"1234567891011"},{"$nulls":3},"बैंक खाता सं.-",null,null,{"$f":"IF('GA 55 Editable'!W5=\"\",\"\",'GA 55 Editable'!W5)","v":"123456789101112"}]
[null,"Month & Year","Basic Pay","DA","HRA","Washing Allow.","Handicaped Allowance","CCA Allowance","Other Allowance","Gross Salary","SIP","GPF","NPS","GPF Loan","RPMF","SI Arrear","SI Loan","GIS","LIC","COVIS-19","GPF 2004","Hitkari Nidhi","Other","ITAX","Total Deduction","NET Payment","Bill No./ Dte"]
[3,"2021-03-01",{"$f":"IF('GA 55 Editable'!C7=\"\",\"\",'GA 55 Editable'!C7)","v":{"v":52300,"d":"52,300"}},{"$f":"IF('GA 55 Editable'!D7=\"\",\"\",'GA 55 Editable'!D7)","v":{"v":8891,"d":"8,891"}},{"$f":"IF('GA 55 Editable'!E7=\"\",\"\",'GA 55 Editable'!E7)","v":{"v":4184,"d":"4,184"}},{"$f":"IF('GA 55 Editable'!F7=\"\",\"\",'GA 55 Editable'!F7)","v":0},{"$f":"IF('GA 55 Editable'!G7=\"\",\"\",'GA 55 Editable'!G7)","v":0},{"$f":"IF('GA 55 Editable'!H7=\"\",\"\",'GA 55 Editable'!H7)","v":0},{"$f":"IF('GA 55 Editable'!I7=\"\",\"\",'GA 55 Editable'!I7)","v":""},{"$f":"IF('GA 55 Editable'!J7=\"\",\"\",'GA 55 Editable'!J7)","v":{"v":65375,"d":"65,375"}},{"$f":"IF('GA 55 Editable'!K7=\"\",\"\",'GA 55 Editable'!K7)","v":{"v":3000,"d":"3,000"}},{"$f":"IF('GA 55 Editable'!L7=\"\",\"\",'GA 55 Editable'!L7)","v":0},{"$f":"IF('GA 55 Editable'!M7=\"\",\"\",'GA 55 Editable'!M7)","v":{"v":6119,"d":"6,119"}},{"$f":"IF('GA 55 Editable'!N7=\"\",\"\",'GA 55 Editable'!N7)","v":0},{"$f":"IF('GA 55 Editable'!O7=\"\",\"\",'GA 55 Editable'!O7)","v":0},{"$f":"IF('GA 55 Editable'!P7=\"\",\"\",'GA 55 Editable'!P7)","v":""},{"$f":"IF('GA 55 Editable'!Q7=\"\",\"\",'GA 55 Editable'!Q7)","v":0},{"$f":"IF('GA 55 Editable'!R7=\"\",\"\",'GA 55 Editable'!R7)","v":""},{"$f":"IF('GA 55 Editable'!S7=\"\",\"\",'GA 55 Editable'!S7)","v":0},{"$f":"IF('GA 55 Editable'!T7=\"\",\"\",'GA 55 Editable'!T7)","v":""},{"$f":"IF('GA 55 Editable'!U7=\"\",\"\",'GA 55 Editable'!U7)","v":""},{"$f":"IF('GA 55 Editable'!V7=\"\",\"\",'GA 55 Editable'!V7)","v":""},{"$f":"IF('GA 55 Editable'!W7=\"\",\"\",'GA 55 Editable'!W7)","v":""},{"$f":"IF('GA 55 Editable'!X7=\"\",\"\",'GA 55 Editable'!X7)","v":""},{"$f":"IF('GA 55 Editable'!Y7=\"\",\"\",'GA 55 Editable'!Y7)","v":{"v":9119,"d":"9,119"}},{"$f":"IF('GA 55 Editable'!Z7=\"\",\"\",'GA 55 Editable'!Z7)","v":{"v":56256,"d":"56,256"}},{"$f":"IF('GA 55 Editable'!AA7=\"\",\"\",'GA 55 Editable'!AA7)","v":""}]
[4,"2021-04-01",{"$f":"IF('GA 55 Editable'!C8=\"\",\"\",'GA 55 Editable'!C8)","v":{"v":52300,"d":"52,300"}},{"$f":"IF('GA 55 Editable'!D8=\"\",\"\",'GA 55 Editable'!D8)","v":{"v":8891,"d":"8,891"}},{"$f":"IF('GA 55 Editable'!E8=\"\",\"\",'GA 55 Editable'!E8)","v":{"v":4184,"d":"4,184"}},{"$f":"IF('GA 55 Editable'!F8=\"\",\"\",'GA 55 Editable'!F8)","v":0},{"$f":"IF('GA 55 Editable'!G8=\"\",\"\",'GA 55 Editable'!G8)","v":0},{"$f":"IF('GA 55 Editable'!H8=\"\",\"\",'GA 55 Editable'!H8)","v":0},{"$f":"IF('GA 55 Editable'!I8=\"\",\"\",'GA 55 Editable'!I8)","v":""},{"$f":"IF('GA 55 Editable'!J8=\"\",\"\",'GA 55 Editable'!J8)","v":{"v":65375,"d":"65,375"}},{"$f":"IF('GA 55 Editable'!K8=\"\",\"\",'GA 55 Editable'!K8)","v":{"v":3000,"d":"3,000"}},{"$f":"IF('GA 55 Editable'!L8=\"\",\"\",'GA 55 Editable'!L8)","v":0},{"$f":"IF('GA 55 Editable'!M8=\"\",\"\",'GA 55 Editable'!M8)","v":{"v":6119,"d":"6,119"}},{"$f":"IF('GA 55 Editable'!N8=\"\",\"\",'GA 55 Editable'!N8)","v":0},{"$f":"IF('GA 55 Editable'!O8=\"\",\"\",'GA 55 Editable'!O8)","v":0},{"$f":"IF('GA 55 Editable'!P8=\"\",\"\",'GA 55 Editable'!P8)","v":""},{"$f":"IF('GA 55 Editable'!Q8=\"\",\"\",'GA 55 Editable'!Q8)","v":0},{"$f":"IF('GA 55 Editable'!R8=\"\",\"\",'GA 55 Editable'!R8)","v":220},{"$f":"IF('GA 55 Editable'!S8=\"\",\"\",'GA 55 Editable'!S8)","v":0},{"$f":"IF('GA 55 Editable'!T8=\"\",\"\",'GA 55 Editable'!T8)","v":""},{"$f":"IF('GA 55 Editable'!U8=\"\",\"\",'GA 55 Editable'!U8)","v":""},{"$f":"IF('GA 55 Editable'!V8=\"\",\"\",'GA 55 Editable'!V8)","v":""},{"$f":"IF('GA 55 Editable'!W8=\"\",\"\",'GA 55 Editable'!W8)","v":""},{"$f":"IF('GA 55 Editable'!X8=\"\",\"\",'GA 55 Editable'!X8)","v":0},{"$f":"IF('GA 55 Editable'!Y8=\"\",\"\",'GA 55 Editable'!Y8)","v":{"v":9339,"d":"9,339"}},{"$f":"IF('GA 55 Editable'!Z8=\"\",\"\",'GA 55 Editable'!Z8)","v":{"v":56036,"d":"56,036"}},{"$f":"IF('GA 55 Editable'!AA8=\"\",\"\",'GA 55 Editable'!AA8)","v":""}]
[5,"2021-05-01",{"$f":"IF('GA 55 Editable'!C9=\"\",\"\",'GA 55 Editable'!C9)","v":{"v":52300,"d":"52,300"}},{"$f":"IF('GA 55 Editable'!D9=\"\",\"\",'GA 55 Editable'!D9)","v":{"v":8891,"d":"8,891"}},{"$f":"IF('GA 55 Editable'!E9=\"\",\"\",'GA 55 Editable'!E9)","v":{"v":4184,"d":"4,184"}},{"$f":"IF('GA 55 Editable'!F9=\"\",\"\",'GA 55 Editable'!F9)","v":0},{"$f":"IF('GA 55 Editable'!G9=\"\",\"\",'GA 55 Editable'!G9)","v":0},{"$f":"IF('GA 55 Editable'!H9=\"\",\"\",'GA 55 Editable'!H9)","v":0},{"$f":"IF('GA 55 Editable'!I9=\"\",\"\",'GA 55 Editable'!I9)","v":""},{"$f":"IF('GA 55 Editable'!J9=\"\",\"\",'GA 55 Editable'!J9)","v":{"v":65375,"d":"65,375"}},{"$f":"IF('GA 55 Editable'!K9=\"\",\"\",'GA 55 Editable'!K9)","v":{"v":3000,"d":"3,000"}},{"$f":"IF('GA 55 Editable'!L9=\"\",\"\",'GA 55 Editable'!L9)","v":0},{"$f":"IF('GA 55 Editable'!M9=\"\",\"\",'GA 55 Editable'!M9)","v":{"v":6119,"d":"6,119"}},{"$f":"IF('GA 55 Editable'!N9=\"\",\"\",'GA 55 Editable'!N9)","v":0},{"$f":"IF('GA 55 Editable'!O9=\"\",\"\",'GA 55 Editable'!O9)","v":0},{"$f":"IF('GA 55 Editable'!P9=\"\",\"\",'GA 55 Editable'!P9)","v":""},{"$f":"IF('GA 55 Editable'!Q9=\"\",\"\",'GA 55 Editable'!Q9)","v":0},{"$f":"IF('GA 55 Editable'!R9=\"\",\"\",'GA 55 Editable'!R9)","v":""},{"$f":"IF('GA 55 Editable'!S9=\"\",\"\",'GA 55 Editable'!S9)","v":0},{"$f":"IF('GA 55 Editable'!T9=\"\",\"\",'GA 55 Editable'!T9)","v":""},{"$f":"IF('GA 55 Editable'!U9=\"\",\"\",'GA 55 Editable'!U9)","v":""},{"$f":"IF('GA 55 Editable'!V9=\"\",\"\",'GA 55 Editable'!V9)","v":""},{"$f":"IF('GA 55 Editable'!W9=\"\",\"\",'GA 55 Editable'!W9)","v":""},{"$f":"IF('GA 55 Editable'!X9=\"\",\"\",'GA 55 Editable'!X9)","v":0},{"$f":"IF('GA 55 Editable'!Y9=\"\",\"\",'GA 55 Editable'!Y9)","v":{"v":9119,"d":"9,119"}},{"$f":"IF('GA 55 Editable'!Z9=\"\",\"\",'GA 55 Editable'!Z9)","v":{"v":56256,"d":"56,256"}},{"$f":"IF('GA 55 Editable'!AA9=\"\",\"\",'GA 55 Editable'!AA9)","v":""}]
[6,"2021-06-01",{"$f":"IF('GA 55 Editable'!C10=\"\",\"\",'GA 55 Editable'!C10)","v":{"v":52300,"d":"52,300"}},{"$f":"IF('GA 55 Editable'!D10=\"\",\"\",'GA 55 Editable'!D10)","v":{"v":8891,"d":"8,891"}},{"$f":"IF('GA 55 Editable'!E10=\"\",\"\",'GA 55 Editable'!E10)","v":{"v":4184,"d":"4,184"}},{"$f":"IF('GA 55 Editable'!F10=\"\",\"\",'GA 55 Editable'!F10)","v":0},{"$f":"IF('GA 55 Editable'!G10=\"\",\"\",'GA 55 Editable'!G10)","v":0},{"$f":"IF('GA 55 Editable'!H10=\"\",\"\",'GA 55 Editable'!H10)","v":0},{"$f":"IF('GA 55 Editable'!I10=\"\",\"\",'GA 55 Editable'!I10)","v":""},{"$f":"IF('GA 55 Editable'!J10=\"\",\"\",'GA 55 Editable'!J10)","v":{"v":65375,"d":"65,375"}},{"$f":"IF('GA 55 Editable'!K10=\"\",\"\",'GA 55 Editable'!K10)","v":{"v":3000,"d":"3,000"}},{"$f":"IF('GA 55 Editable'!L10=\"\",\"\",'GA 55 Editable'!L10)","v":0},{"$f":"IF('GA 55 Editable'!M10=\"\",\"\",'GA 55 Editable'!M10)","v":{"v":6119,"d":"6,119"}},{"$f":"IF('GA 55 Editable'!N10=\"\",\"\",'GA 55 Editable'!N10)","v":0},{"$f":"IF('GA 55 Editable'!O10=\"\",\"\",'GA 55 Editable'!O10)","v":0},{"$f":"IF('GA 55 Editable'!P10=\"\",\"\",'GA 55 Editable'!P10)","v":""},{"$f":"IF('GA 55 Editable'!Q10=\"\",\"\",'GA 55 Editable'!Q10)","v":0},{"$f":"IF('GA 55 Editable'!R10=\"\",\"\",'GA 55 Editable'!R10)","v":""},{"$f":"IF('GA 55 Editable'!S10=\"\",\"\",'GA 55 Editable'!S10)","v":0},{"$f":"IF('GA 55 Editable'!T10=\"\",\"\",'GA 55 Editable'!T10)","v":""},{"$f":"IF('GA 55 Editable'!U10=\"\",\"\",'GA 55 Editable'!U10)","v":""},{"$f":"IF('GA 55 Editable'!V10=\"\",\"\",'GA 55 Editable'!V10)","v":""},{"$f":"IF('GA 55 Editable'!W10=\"\",\"\",'GA 55 Editable'!W10)","v":""},{"$f":"IF('GA 55 Editable'!X10=\"\",\"\",'GA 55 Editable'!X10)","v":0},{"$f":"IF('GA 55 Editable'!Y10=\"\",\"\",'GA 55 Editable'!Y10)","v":{"v":9119,"d":"9,119"}},{"$f":"IF('GA 55 Editable'!Z10=\"\",\"\",'GA 55 Editable'!Z10)","v":{"v":56256,"d":"56,256"}},{"$f":"IF('GA 55 Editable'!AA10=\"\",\"\",'GA 55 Editable'!AA10)","v":""}]
{"$rows_left_out":22}
{"sheet":"Tax Calculaton Old","index":6,"n_rows":66,"n_cols":13,"rows_kept":66,"merged":[[0,0,0,12],[1,0,1,12],[2,1,2,2],[2,3,2,7],[2,9,2,10],[3,1,3,11],[4,1,4,11],[5,1,5,11],[6,0,9,0],[6,1,6,10],[6,12,8,12],[7,1,7,10],[8,1,8,10],[9,1,9,11],[10,1,10,11],[11,0,14,0],[11,1,11,6],[11,7,11,9],[11,10,11,11],[11,12,13,12],[12,1,13,2],[12,3,12,4],[12,5,12,6],[12,7,12,8],[12,9,12,11],[13,3,13,4],[13,5,13,6],[13,7,13,8],[13,9,13,11],[14,1,14,11],[15,1,15,11],[16,1,16,11],[17,1,17,11],[18,1,18,12],[19,1,19,12],[20,2,20,4],[20,5,20,6],[20,8,20,10],[20,12,29,12],[21,2,21,4],[21,5,21,6],[21,8,21,10],[22,2,22,4],[22,5,22,6],[22,8,22,10],[23,2,23,4],[23,5,23,6],[23,8,23,10],[24,2,24,4],[24,5,24,6],[24,8,24,10],[25,2,25,4],[25,5,25,6],[25,8,25,10],[26,2,26,4],[26,5,26,6],[26,8,26,10],[27,2,27,4],[27,5,27,6],[27,8,27,10],[28,2,28,4],[28,5,28,6],[28,7,29,7],[28,8,29,10],[28,11,29,11],[29,2,29,4],[29,5,29,6],[30,1,30,11],[31,2,31,11],[32,2,32,11],[33,1,33,11],[34,1,34,11],[35,2,35,11],[36,2,36,11],[37,2,37,11],[38,2,38,11],[39,2,39,11],[40,2,40,11],[41,2,41,11],[42,2,42,11],[43,2,43,11],[44,1,44,11],[45,1,45,11],[46,1,46,11],[47,1,47,11],[48,1,48,11],[49,1,49,4],[49,5,49,8],[49,9,49,11],[50,1,50,3],[50,5,50,7],[50,9,50,10],[51,1,51,3],[51,5,51,7],[51,9,51,10],[52,1,52,3],[52,5,52,7],[52,9,52,10],[53,1,53,3],[53,5,53,7],[53,9,53,10],[54,2,54,11],[55,2,55,11],[56,2,56,11],[57,2,57,11],[58,1,58,11],[59,1,59,11],[60,1,60,11],[61,0,62,0],[61,1,62,2],[61,3,61,4],[61,5,61,6],[61,7,61,8],[61,9,61,10],[62,3,62,4],[62,5,62,6],[62,7,62,8],[62,9,62,10],[63,0,63,11],[65,0,65,3],[65,11,65,12]]}
[{"$f":"Master!A1","v":"Office of the Principal DIET Kuchaman City (Nagaur)"}]
["आयकर गणना प्रपत्र वर्ष 2021-22"]
[1,"नाम कर्मचारी",null,{"$f":"IF(Master!B4=\"\",\"\",Master!B4)","v":"Ashwini Kumar Sharma"},{"$nulls":4},"पद",{"$f":"IF(Master!D4=\"\",\"\",Master!D4)","v":"Lecturer"},null,"पैन नं.",{"$f":"IF(Master!B6=\"\",\"\",Master!B6)","v":"AAAA9456A"}]
[2,"आय वर्ष 2020-21 में प्राप्त कुल वेतन -",{"$nulls":10},{"$f":"IF(Master!F9=\"NO\",'GA 55 For Print'!J28,SUM('GA 55 For Print'!J28+'GA 55 For Print'!M28))","v":{"v":952918,"d":"952918.00"}}]
[3,"गृह किराया, धारा 10 (13-A) के अंतर्गत एवं धारा 10 (14) के अंतर्गत अन्य भत्ते जो कर मुक्त है -",{"$nulls":10},{"$f":"SUM('Other Ded.'!D3,'Other Ded.'!G19)","v":{"v":0,"d":"0.00"}}]
[4,"शेष (2-3)",{"$nulls":10},{"$f":"M4-M5","v":{"v":952918,"d":"952918.00"}}]
[5,"(I)Standard Deduction Maxium 50000 धारा 16 (i a)",{"$nulls":9},{"$f":"IF($M$6>50000,50000,$M$6)","v":{"v":50000,"d":"50000.00"}}]
[null,"(II)मनोरंजन भत्ता धारा 16 (ii) के अंतर्गत Maxium 5000",{"$nulls":9},{"$f":"'Other Ded.'!G4","v":{"v":0,"d":"0.00"}}]
[null,"(III)वयवसाय कर धारा 16 (iii) के अंतर्गत",{"$nulls":9},{"$f":"'Other Ded.'!G5","v":{"v":0,"d":"0.00"}}]
[null,"योग 5",{"$nulls":10},{"$f":"SUM(L7:L9)","v":{"v":50000,"d":"50000.00"}}]
{"$rows_left_out":57}
{"sheet":"Tax Calculaton New","index":7,"n_rows":58,"n_cols":13,"rows_kept":58,"merged":[[0,0,0,12],[1,0,1,12],[2,1,2,2],[2,3,2,7],[2,9,2,10],[3,1,3,11],[4,1,4,11],[5,1,5,11],[6,0,9,0],[6,1,6,10],[6,12,8,12],[7,1,7,10],[8,1,8,10],[9,1,9,11],[10,1,10,11],[11,0,14,0],[11,1,11,6],[11,7,11,9],[11,10,11,11],[11,12,13,12],[12,1,13,2],[12,3,12,4],[12,5,12,6],[12,7,12,8],[12,9,12,11],[13,3,13,4],[13,5,13,6],[13,7,13,8],[13,9,13,11],[14,1,14,11],[15,1,15,11],[16,1,16,11],[17,1,17,11],[18,1,18,12],[19,1,19,11],[20,1,20,11],[21,1,21,11],[22,1,22,11],[23,1,23,11],[24,2,24,11],[25,2,25,11],[26,2,26,11],[27,2,27,11],[28,2,28,11],[29,2,29,11],[30,2,30,11],[31,2,31,11],[32,2,32,11],[33,1,33,11],[34,1,34,11],[35,1,35,11],[36,1,36,11],[37,1,37,11],[38,1,38,4],[38,5,38,8],[38,9,38,11],[39,1,39,3],[39,5,39,7],[39,9,39,10],[40,1,40,3],[40,5,40,7],[40,9,40,10],[41,1,41,3],[41,5,41,7],[41,9,41,10],[42,1,42,3],[42,5,42,7],[42,9,42,10],[43,1,43,3],[43,5,43,7],[43,9,43,10],[44,1,44,3],[44,5,44,7],[44,9,44,10],[45,1,45,3],[45,5,45,7],[45,9,45,10],[46,2,46,11],[47,2,47,11],[48,2,48,11],[49,2,49,11],[50,1,50,11],[51,1,51,11],[52,1,52,11],[53,0,54,0],[53,1,54,2],[53,3,53,4],[53,5,53,6],[53,7,53,8],[53,9,53,10],[54,3,54,4],[54,5,54,6],[54,7,54,8],[54,9,54,10],[55,0,55,11],[57,0,57,3],[57,11,57,12]]}
[{"$f":"Master!A1","v":"Office of the Principal DIET Kuchaman City (Nagaur)"}]
["आयकर गणना प्रपत्र वर्ष 2021-22"]
[1,"नाम कर्मचारी",null,{"$f":"Master!B4","v":"Ashwini Kumar Sharma"},{"$nulls":4},"पद",{"$f":"Master!D4","v":"Lecturer"},null,"पैन नं.",{"$f":"Master!B6","v":"AAAA9456A"}]
[2,"आय वर्ष 2020-21 में प्राप्त कुल वेतन -",{"$nulls":10},{"$f":"'Tax Calculaton Old'!M4","v":{"v":952918,"d":"952918.00"}}]
[3,"गृह किराया, धारा 10 (13-A) के अंतर्गत एवं धारा 10 (14) के अंतर्गत अन्य भत्ते जो कर मुक्त है -",{"$nulls":10},{"$f":"SUM('Other Ded.'!D3,'Other Ded.'!G19)","v":{"v":0,"d":"0.00"}}]
[4,"शेष (2-3)",{"$nulls":10},{"$f":"M4-M5","v":{"v":952918,"d":"952918.00"}}]
[5,"(I)Standard Deduction Maxium 50000 धारा 16 (i a)",{"$nulls":9},{"v":0,"d":"0.00"}]
[null,"(II)मनोरंजन भत्ता धारा 16 (ii) के अंतर्गत Maxium 5000",{"$nulls":9},{"$f":"'Other Ded.'!G4","v":{"v":0,"d":"0.00"}}]
[null,"(III)वयवसाय कर धारा 16 (iii) के अंतर्गत",{"$nulls":9},{"$f":"'Other Ded.'!G5","v":{"v":0,"d":"0.00"}}]
[null,"योग 5",{"$nulls":10},{"$f":"SUM(L7:L9)","v":{"v":0,"d":"0.00"}}]
{"$rows_left_out":48}