{"text_format":"3","workbook":"xlsx","n_sheets":5,"sheets":["Master","DA HRA Rate","Allowance","Deductions","GA55 A"],"not_rendered":{"images":2,"macros":1,"defined_names":7},"read":"whole","date_system":"1900"}

{"sheet":"Master","index":0,"n_rows":182,"n_cols":14,"rows_kept":182,"merged":[[0,0,0,1],[0,2,0,5],[0,6,0,7],[0,8,0,9],[1,0,1,1],[1,3,1,5],[1,6,1,7],[1,8,1,9]]}
["Office Name",null,"GSSS Deogarh",{"$nulls":3},"DDO Code",null,18277]
["TAN No.",null,"ZXCVB1234B","GA55 A Offline",null,null,"Financial Year",null,"2021-22"]
[]
["Sr.No.","Employee Name","Designation","GPF/PRAN Number ","Employee ID","Pay Scale","Account No","PAN No.","NPS/GPF","Probation",null,"Post @ Office",null,"Months"]
[{"$f":"IF(Table1[Employee Name]=\"\",\"\",ROWS($A$1:A1))","v":1},"Ashwini Kumar","Lecturer","12345678910","RJNA12345678910","L-12","1234567891011","ABCD1234E","NPS","NO",null,"Pprincipal",null,"March"]
[{"$f":"IF(Table1[Employee Name]=\"\",\"\",ROWS($A$1:A2))","v":""},{"$nulls":10},"Lecturer",null,"April"]
[{"$f":"IF(Table1[Employee Name]=\"\",\"\",ROWS($A$1:A3))","v":""},{"$nulls":10},"Sr. Teacher",null,"May"]
[{"$f":"IF(Table1[Employee Name]=\"\",\"\",ROWS($A$1:A4))","v":""},{"$nulls":10},"LDC",null,"June"]
[{"$f":"IF(Table1[Employee Name]=\"\",\"\",ROWS($A$1:A5))","v":""},{"$nulls":10},"UDC",null,"July"]
[{"$f":"IF(Table1[Employee Name]=\"\",\"\",ROWS($A$1:A6))","v":""},{"$nulls":10},"OA",null,"August"]
[{"$f":"IF(Table1[Employee Name]=\"\",\"\",ROWS($A$1:A7))","v":""},{"$nulls":10},"Peon",null,"September"]
[{"$f":"IF(Table1[Employee Name]=\"\",\"\",ROWS($A$1:A8))","v":""},{"$nulls":10},"Teacher L-1",null,"October"]
[{"$f":"IF(Table1[Employee Name]=\"\",\"\",ROWS($A$1:A9))","v":""},{"$nulls":10},"Teacher L-2",null,"November"]
[{"$f":"IF(Table1[Employee Name]=\"\",\"\",ROWS($A$1:A10))","v":""},{"$nulls":10},"Prabodhak",null,"December"]
[{"$f":"IF(Table1[Employee Name]=\"\",\"\",ROWS($A$1:A11))","v":""},{"$nulls":10},"other",null,"January"]
[{"$f":"IF(Table1[Employee Name]=\"\",\"\",ROWS($A$1:A12))","v":""},{"$nulls":10},"other",null,"February"]
[{"$f":"IF(Table1[Employee Name]=\"\",\"\",ROWS($A$1:A13))","v":""},{"$nulls":10},"other"]
[{"$f":"IF(Table1[Employee Name]=\"\",\"\",ROWS($A$1:A14))","v":""},{"$nulls":10},"other"]
[{"$f":"IF(Table1[Employee Name]=\"\",\"\",ROWS($A$1:A15))","v":""},{"$nulls":10},"other"]
[{"$f":"IF(Table1[Employee Name]=\"\",\"\",ROWS($A$1:A16))","v":""},{"$nulls":10},"other"]
[{"$f":"IF(Table1[Employee Name]=\"\",\"\",ROWS($A$1:A17))","v":""},{"$nulls":10},"other"]
[{"$f":"IF(Table1[Employee Name]=\"\",\"\",ROWS($A$1:A18))","v":""},{"$nulls":10},"other"]
[{"$f":"IF(Table1[Employee Name]=\"\",\"\",ROWS($A$1:A19))","v":""},{"$nulls":10},"other"]
[{"$f":"IF(Table1[Employee Name]=\"\",\"\",ROWS($A$1:A20))","v":""},{"$nulls":10},"other"]
[{"$f":"IF(Table1[Employee Name]=\"\",\"\",ROWS($A$1:A21))","v":""},{"$nulls":10},"other"]
[{"$f":"IF(Table1[Employee Name]=\"\",\"\",ROWS($A$1:A22))","v":""},{"$nulls":10},"other"]
[{"$f":"IF(Table1[Employee Name]=\"\",\"\",ROWS($A$1:A23))","v":""},{"$nulls":10},"other"]
[{"$f":"IF(Table1[Employee Name]=\"\",\"\",ROWS($A$1:A24))","v":""},{"$nulls":10},"other"]
[{"$f":"IF(Table1[Employee Name]=\"\",\"\",ROWS($A$1:A25))","v":""},{"$nulls":10},"other"]
[{"$f":"IF(Table1[Employee Name]=\"\",\"\",ROWS($A$1:A26))","v":""},{"$nulls":10},"other"]
[{"$f":"IF(Table1[Employee Name]=\"\",\"\",ROWS($A$1:A27))","v":""},{"$nulls":10},"other"]
[{"$f":"IF(Table1[Employee Name]=\"\",\"\",ROWS($A$1:A28))","v":""}]
[{"$f":"IF(Table1[Employee Name]=\"\",\"\",ROWS($A$1:A29))","v":""}]
[{"$f":"IF(Table1[Employee Name]=\"\",\"\",ROWS($A$1:A30))","v":""}]
[{"$f":"IF(Table1[Employee Name]=\"\",\"\",ROWS($A$1:A31))","v":""}]
[{"$f":"IF(Table1[Employee Name]=\"\",\"\",ROWS($A$1:A32))","v":""}]
[{"$f":"IF(Table1[Employee Name]=\"\",\"\",ROWS($A$1:A33))","v":""}]
[{"$f":"IF(Table1[Employee Name]=\"\",\"\",ROWS($A$1:A34))","v":""}]
[{"$f":"IF(Table1[Employee Name]=\"\",\"\",ROWS($A$1:A35))","v":""}]
[{"$f":"IF(Table1[Employee Name]=\"\",\"\",ROWS($A$1:A36))","v":""}]
[{"$f":"IF(Table1[Employee Name]=\"\",\"\",ROWS($A$1:A37))","v":""}]
[{"$f":"IF(Table1[Employee Name]=\"\",\"\",ROWS($A$1:A38))","v":""}]
[{"$f":"IF(Table1[Employee Name]=\"\",\"\",ROWS($A$1:A39))","v":""}]
[{"$f":"IF(Table1[Employee Name]=\"\",\"\",ROWS($A$1:A40))","v":""}]
[{"$f":"IF(Table1[Employee Name]=\"\",\"\",ROWS($A$1:A41))","v":""}]
[{"$f":"IF(Table1[Employee Name]=\"\",\"\",ROWS($A$1:A42))","v":""}]
[{"$f":"IF(Table1[Employee Name]=\"\",\"\",ROWS($A$1:A43))","v":""}]
[{"$f":"IF(Table1[Employee Name]=\"\",\"\",ROWS($A$1:A44))","v":""}]
[{"$f":"IF(Table1[Employee Name]=\"\",\"\",ROWS($A$1:A45))","v":""}]
[{"$f":"IF(Table1[Employee Name]=\"\",\"\",ROWS($A$1:A46))","v":""}]
[{"$f":"IF(Table1[Employee Name]=\"\",\"\",ROWS($A$1:A47))","v":""}]
[{"$f":"IF(Table1[Employee Name]=\"\",\"\",ROWS($A$1:A48))","v":""}]
[{"$f":"IF(Table1[Employee Name]=\"\",\"\",ROWS($A$1:A49))","v":""}]
[{"$f":"IF(Table1[Employee Name]=\"\",\"\",ROWS($A$1:A50))","v":""}]
[{"$f":"IF(Table1[Employee Name]=\"\",\"\",ROWS($A$1:A51))","v":""}]
[{"$f":"IF(Table1[Employee Name]=\"\",\"\",ROWS($A$1:A52))","v":""}]
[{"$f":"IF(Table1[Employee Name]=\"\",\"\",ROWS($A$1:A53))","v":""}]
[{"$f":"IF(Table1[Employee Name]=\"\",\"\",ROWS($A$1:A54))","v":""}]
[{"$f":"IF(Table1[Employee Name]=\"\",\"\",ROWS($A$1:A55))","v":""}]
[{"$f":"IF(Table1[Employee Name]=\"\",\"\",ROWS($A$1:A56))","v":""}]
[{"$f":"IF(Table1[Employee Name]=\"\",\"\",ROWS($A$1:A57))","v":""}]
[{"$f":"IF(Table1[Employee Name]=\"\",\"\",ROWS($A$1:A58))","v":""}]
[{"$f":"IF(Table1[Employee Name]=\"\",\"\",ROWS($A$1:A59))","v":""}]
[{"$f":"IF(Table1[Employee Name]=\"\",\"\",ROWS($A$1:A60))","v":""}]
[{"$f":"IF(Table1[Employee Name]=\"\",\"\",ROWS($A$1:A61))","v":""}]
[{"$f":"IF(Table1[Employee Name]=\"\",\"\",ROWS($A$1:A62))","v":""}]
[{"$f":"IF(Table1[Employee Name]=\"\",\"\",ROWS($A$1:A63))","v":""}]
[{"$f":"IF(Table1[Employee Name]=\"\",\"\",ROWS($A$1:A64))","v":""}]
[{"$f":"IF(Table1[Employee Name]=\"\",\"\",ROWS($A$1:A65))","v":""}]
[{"$f":"IF(Table1[Employee Name]=\"\",\"\",ROWS($A$1:A66))","v":""}]
[{"$f":"IF(Table1[Employee Name]=\"\",\"\",ROWS($A$1:A67))","v":""}]
[{"$f":"IF(Table1[Employee Name]=\"\",\"\",ROWS($A$1:A68))","v":""}]
[{"$f":"IF(Table1[Employee Name]=\"\",\"\",ROWS($A$1:A69))","v":""}]
[{"$f":"IF(Table1[Employee Name]=\"\",\"\",ROWS($A$1:A70))","v":""}]
[{"$f":"IF(Table1[Employee Name]=\"\",\"\",ROWS($A$1:A71))","v":""}]
[{"$f":"IF(Table1[Employee Name]=\"\",\"\",ROWS($A$1:A72))","v":""}]
[{"$f":"IF(Table1[Employee Name]=\"\",\"\",ROWS($A$1:A73))","v":""}]
[{"$f":"IF(Table1[Employee Name]=\"\",\"\",ROWS($A$1:A74))","v":""}]
[{"$f":"IF(Table1[Employee Name]=\"\",\"\",ROWS($A$1:A75))","v":""}]
[{"$f":"IF(Table1[Employee Name]=\"\",\"\",ROWS($A$1:A76))","v":""}]
[{"$f":"IF(Table1[Employee Name]=\"\",\"\",ROWS($A$1:A77))","v":""}]
[{"$f":"IF(Table1[Employee Name]=\"\",\"\",ROWS($A$1:A78))","v":""}]
[{"$f":"IF(Table1[Employee Name]=\"\",\"\",ROWS($A$1:A79))","v":""}]
[{"$f":"IF(Table1[Employee Name]=\"\",\"\",ROWS($A$1:A80))","v":""}]
[{"$f":"IF(Table1[Employee Name]=\"\",\"\",ROWS($A$1:A81))","v":""}]
[{"$f":"IF(Table1[Employee Name]=\"\",\"\",ROWS($A$1:A82))","v":""}]
[{"$f":"IF(Table1[Employee Name]=\"\",\"\",ROWS($A$1:A83))","v":""}]
[{"$f":"IF(Table1[Employee Name]=\"\",\"\",ROWS($A$1:A84))","v":""}]
[{"$f":"IF(Table1[Employee Name]=\"\",\"\",ROWS($A$1:A85))","v":""}]
[{"$f":"IF(Table1[Employee Name]=\"\",\"\",ROWS($A$1:A86))","v":""}]
[{"$f":"IF(Table1[Employee Name]=\"\",\"\",ROWS($A$1:A87))","v":""}]
[{"$f":"IF(Table1[Employee Name]=\"\",\"\",ROWS($A$1:A88))","v":""}]
[{"$f":"IF(Table1[Employee Name]=\"\",\"\",ROWS($A$1:A89))","v":""}]
[{"$f":"IF(Table1[Employee Name]=\"\",\"\",ROWS($A$1:A90))","v":""}]
[{"$f":"IF(Table1[Employee Name]=\"\",\"\",ROWS($A$1:A91))","v":""}]
[{"$f":"IF(Table1[Employee Name]=\"\",\"\",ROWS($A$1:A92))","v":""}]
[{"$f":"IF(Table1[Employee Name]=\"\",\"\",ROWS($A$1:A93))","v":""}]
[{"$f":"IF(Table1[Employee Name]=\"\",\"\",ROWS($A$1:A94))","v":""}]
[{"$f":"IF(Table1[Employee Name]=\"\",\"\",ROWS($A$1:A95))","v":""}]
[{"$f":"IF(Table1[Employee Name]=\"\",\"\",ROWS($A$1:A96))","v":""}]
[{"$f":"IF(Table1[Employee Name]=\"\",\"\",ROWS($A$1:A97))","v":""}]
[{"$f":"IF(Table1[Employee Name]=\"\",\"\",ROWS($A$1:A98))","v":""}]
[{"$f":"IF(Table1[Employee Name]=\"\",\"\",ROWS($A$1:A99))","v":""}]
[{"$f":"IF(Table1[Employee Name]=\"\",\"\",ROWS($A$1:A100))","v":""}]
[{"$f":"IF(Table1[Employee Name]=\"\",\"\",ROWS($A$1:A101))","v":""}]
[{"$f":"IF(Table1[Employee Name]=\"\",\"\",ROWS($A$1:A102))","v":""}]
[{"$f":"IF(Table1[Employee Name]=\"\",\"\",ROWS($A$1:A103))","v":""}]
[{"$f":"IF(Table1[Employee Name]=\"\",\"\",ROWS($A$1:A104))","v":""}]
[{"$f":"IF(Table1[Employee Name]=\"\",\"\",ROWS($A$1:A105))","v":""}]
[{"$f":"IF(Table1[Employee Name]=\"\",\"\",ROWS($A$1:A106))","v":""}]
[{"$f":"IF(Table1[Employee Name]=\"\",\"\",ROWS($A$1:A107))","v":""}]
[{"$f":"IF(Table1[Employee Name]=\"\",\"\",ROWS($A$1:A108))","v":""}]
[{"$f":"IF(Table1[Employee Name]=\"\",\"\",ROWS($A$1:A109))","v":""}]
[{"$f":"IF(Table1[Employee Name]=\"\",\"\",ROWS($A$1:A110))","v":""}]
[{"$f":"IF(Table1[Employee Name]=\"\",\"\",ROWS($A$1:A111))","v":""}]
[{"$f":"IF(Table1[Employee Name]=\"\",\"\",ROWS($A$1:A112))","v":""}]
[{"$f":"IF(Table1[Employee Name]=\"\",\"\",ROWS($A$1:A113))","v":""}]
[{"$f":"IF(Table1[Employee Name]=\"\",\"\",ROWS($A$1:A114))","v":""}]
[{"$f":"IF(Table1[Employee Name]=\"\",\"\",ROWS($A$1:A115))","v":""}]
[{"$f":"IF(Table1[Employee Name]=\"\",\"\",ROWS($A$1:A116))","v":""}]
[{"$f":"IF(Table1[Employee Name]=\"\",\"\",ROWS($A$1:A117))","v":""}]
[{"$f":"IF(Table1[Employee Name]=\"\",\"\",ROWS($A$1:A118))","v":""}]
[{"$f":"IF(Table1[Employee Name]=\"\",\"\",ROWS($A$1:A119))","v":""}]
[{"$f":"IF(Table1[Employee Name]=\"\",\"\",ROWS($A$1:A120))","v":""}]
[{"$f":"IF(Table1[Employee Name]=\"\",\"\",ROWS($A$1:A121))","v":""}]
[{"$f":"IF(Table1[Employee Name]=\"\",\"\",ROWS($A$1:A122))","v":""}]
[{"$f":"IF(Table1[Employee Name]=\"\",\"\",ROWS($A$1:A123))","v":""}]
[{"$f":"IF(Table1[Employee Name]=\"\",\"\",ROWS($A$1:A124))","v":""}]
[{"$f":"IF(Table1[Employee Name]=\"\",\"\",ROWS($A$1:A125))","v":""}]
[{"$f":"IF(Table1[Employee Name]=\"\",\"\",ROWS($A$1:A126))","v":""}]
[{"$f":"IF(Table1[Employee Name]=\"\",\"\",ROWS($A$1:A127))","v":""}]
[{"$f":"IF(Table1[Employee Name]=\"\",\"\",ROWS($A$1:A128))","v":""}]
[{"$f":"IF(Table1[Employee Name]=\"\",\"\",ROWS($A$1:A129))","v":""}]
[{"$f":"IF(Table1[Employee Name]=\"\",\"\",ROWS($A$1:A130))","v":""}]
[{"$f":"IF(Table1[Employee Name]=\"\",\"\",ROWS($A$1:A131))","v":""}]
[{"$f":"IF(Table1[Employee Name]=\"\",\"\",ROWS($A$1:A132))","v":""}]
[{"$f":"IF(Table1[Employee Name]=\"\",\"\",ROWS($A$1:A133))","v":""}]
[{"$f":"IF(Table1[Employee Name]=\"\",\"\",ROWS($A$1:A134))","v":""}]
[{"$f":"IF(Table1[Employee Name]=\"\",\"\",ROWS($A$1:A135))","v":""}]
[{"$f":"IF(Table1[Employee Name]=\"\",\"\",ROWS($A$1:A136))","v":""}]
[{"$f":"IF(Table1[Employee Name]=\"\",\"\",ROWS($A$1:A137))","v":""}]
[{"$f":"IF(Table1[Employee Name]=\"\",\"\",ROWS($A$1:A138))","v":""}]
[{"$f":"IF(Table1[Employee Name]=\"\",\"\",ROWS($A$1:A139))","v":""}]
[{"$f":"IF(Table1[Employee Name]=\"\",\"\",ROWS($A$1:A140))","v":""}]
[{"$f":"IF(Table1[Employee Name]=\"\",\"\",ROWS($A$1:A141))","v":""}]
[{"$f":"IF(Table1[Employee Name]=\"\",\"\",ROWS($A$1:A142))","v":""}]
[{"$f":"IF(Table1[Employee Name]=\"\",\"\",ROWS($A$1:A143))","v":""}]
[{"$f":"IF(Table1[Employee Name]=\"\",\"\",ROWS($A$1:A144))","v":""}]
[{"$f":"IF(Table1[Employee Name]=\"\",\"\",ROWS($A$1:A145))","v":""}]
[{"$f":"IF(Table1[Employee Name]=\"\",\"\",ROWS($A$1:A146))","v":""}]
[{"$f":"IF(Table1[Employee Name]=\"\",\"\",ROWS($A$1:A147))","v":""}]
[{"$f":"IF(Table1[Employee Name]=\"\",\"\",ROWS($A$1:A148))","v":""}]
[{"$f":"IF(Table1[Employee Name]=\"\",\"\",ROWS($A$1:A149))","v":""}]
[{"$f":"IF(Table1[Employee Name]=\"\",\"\",ROWS($A$1:A150))","v":""}]
[{"$f":"IF(Table1[Employee Name]=\"\",\"\",ROWS($A$1:A151))","v":""}]
[{"$f":"IF(Table1[Employee Name]=\"\",\"\",ROWS($A$1:A152))","v":""}]
[{"$f":"IF(Table1[Employee Name]=\"\",\"\",ROWS($A$1:A153))","v":""}]
[{"$f":"IF(Table1[Employee Name]=\"\",\"\",ROWS($A$1:A154))","v":""}]
[{"$f":"IF(Table1[Employee Name]=\"\",\"\",ROWS($A$1:A155))","v":""}]
[{"$f":"IF(Table1[Employee Name]=\"\",\"\",ROWS($A$1:A156))","v":""}]
[{"$f":"IF(Table1[Employee Name]=\"\",\"\",ROWS($A$1:A157))","v":""}]
[{"$f":"IF(Table1[Employee Name]=\"\",\"\",ROWS($A$1:A158))","v":""}]
[{"$f":"IF(Table1[Employee Name]=\"\",\"\",ROWS($A$1:A159))","v":""}]
[{"$f":"IF(Table1[Employee Name]=\"\",\"\",ROWS($A$1:A160))","v":""}]
[{"$f":"IF(Table1[Employee Name]=\"\",\"\",ROWS($A$1:A161))","v":""}]
[{"$f":"IF(Table1[Employee Name]=\"\",\"\",ROWS($A$1:A162))","v":""}]
[{"$f":"IF(Table1[Employee Name]=\"\",\"\",ROWS($A$1:A163))","v":""}]
[{"$f":"IF(Table1[Employee Name]=\"\",\"\",ROWS($A$1:A164))","v":""}]
[{"$f":"IF(Table1[Employee Name]=\"\",\"\",ROWS($A$1:A165))","v":""}]
[{"$f":"IF(Table1[Employee Name]=\"\",\"\",ROWS($A$1:A166))","v":""}]
[{"$f":"IF(Table1[Employee Name]=\"\",\"\",ROWS($A$1:A167))","v":""}]
[{"$f":"IF(Table1[Employee Name]=\"\",\"\",ROWS($A$1:A168))","v":""}]
[{"$f":"IF(Table1[Employee Name]=\"\",\"\",ROWS($A$1:A169))","v":""}]
[{"$f":"IF(Table1[Employee Name]=\"\",\"\",ROWS($A$1:A170))","v":""}]
[{"$f":"IF(Table1[Employee Name]=\"\",\"\",ROWS($A$1:A171))","v":""}]
[{"$f":"IF(Table1[Employee Name]=\"\",\"\",ROWS($A$1:A172))","v":""}]
[{"$f":"IF(Table1[Employee Name]=\"\",\"\",ROWS($A$1:A173))","v":""}]
[{"$f":"IF(Table1[Employee Name]=\"\",\"\",ROWS($A$1:A174))","v":""}]
[{"$f":"IF(Table1[Employee Name]=\"\",\"\",ROWS($A$1:A175))","v":""}]
[{"$f":"IF(Table1[Employee Name]=\"\",\"\",ROWS($A$1:A176))","v":""}]
[{"$f":"IF(Table1[Employee Name]=\"\",\"\",ROWS($A$1:A177))","v":""}]
[{"$f":"IF(Table1[Employee Name]=\"\",\"\",ROWS($A$1:A178))","v":""}]

{"sheet":"DA HRA Rate","index":1,"n_rows":16,"n_cols":4,"rows_kept":16,"merged":[[0,0,0,3],[1,0,1,3]]}
[{"$f":"Master!$C$1","v":"GSSS Deogarh"}]
["DA and HRA Rates Monthwise"]
[]
["Sr.No","Month","DA Rate","HRA Rate"]
[3,"March",{"v":0.17,"d":"17.00%"},{"v":0.08,"d":"8.00%"}]
[4,"April",{"v":0.17,"d":"17.00%"},{"v":0.08,"d":"8.00%"}]
[5,"May",{"v":0.17,"d":"17.00%"},{"v":0.08,"d":"8.00%"}]
[6,"June",{"v":0.17,"d":"17.00%"},{"v":0.08,"d":"8.00%"}]
[7,"July",{"v":0.28,"d":"28.00%"},{"v":0.08,"d":"8.00%"}]
[8,"August",{"v":0.28,"d":"28.00%"},{"v":0.09,"d":"9.00%"}]
[9,"September",{"v":0.28,"d":"28.00%"},{"v":0.09,"d":"9.00%"}]
[10,"October",{"v":0.28,"d":"28.00%"},{"v":0.09,"d":"9.00%"}]
[11,"November",{"v":0.28,"d":"28.00%"},{"v":0.09,"d":"9.00%"}]
[12,"December",{"v":0.28,"d":"28.00%"},{"v":0.09,"d":"9.00%"}]
[1,"January",{"v":0.28,"d":"28.00%"},{"v":0.09,"d":"9.00%"}]
[2,"February",{"v":0.28,"d":"28.00%"},{"v":0.09,"d":"9.00%"}]

{"sheet":"Allowance","index":2,"n_rows":182,"n_cols":14,"rows_kept":182,"merged":[[0,0,0,13],[1,0,1,13]]}
[{"$f":"Master!$C$1","v":"GSSS Deogarh"}]
["Allowances Detail Employee wise"]
[]
["Sr.No","Employee Name","March Basic","Handi. All. Amount","Wash All. Amount","CCA Amount","Ot. Allow 1","Ot. Allow 2","Ot. Allow 3","Ot. Allow 4","If Basic Changed Month","Changed Basic","Surrender Month","Surrender DA Rate"]
[{"$f":"IF(Table1[[#This Row],[Sr.No.]]=\"\",\"\",Table1[[#This Row],[Sr.No.]])","v":1},{"$f":"IF(Table1[[#This Row],[Employee Name]]=\"\",\"\",Table1[[#This Row],[Employee Name]])","v":"Ashwini Kumar"},47000,{"$nulls":10},{"$f":"IFERROR(VLOOKUP(Table3[[#This Row],[Surrender Month]],DA_HRA_Rate,3,0),\"\")","v":""}]
[{"$f":"IF(Table1[[#This Row],[Sr.No.]]=\"\",\"\",Table1[[#This Row],[Sr.No.]])","v":""},{"$f":"IF(Table1[[#This Row],[Employee Name]]=\"\",\"\",Table1[[#This Row],[Employee Name]])","v":""},{"$nulls":11},{"$f":"IFERROR(VLOOKUP(Table3[[#This Row],[Surrender Month]],DA_HRA_Rate,3,0),\"\")","v":""}]
[{"$f":"IF(Table1[[#This Row],[Sr.No.]]=\"\",\"\",Table1[[#This Row],[Sr.No.]])","v":""},{"$f":"IF(Table1[[#This Row],[Employee Name]]=\"\",\"\",Table1[[#This Row],[Employee Name]])","v":""},{"$nulls":11},{"$f":"IFERROR(VLOOKUP(Table3[[#This Row],[Surrender Month]],DA_HRA_Rate,3,0),\"\")","v":""}]
[{"$f":"IF(Table1[[#This Row],[Sr.No.]]=\"\",\"\",Table1[[#This Row],[Sr.No.]])","v":""},{"$f":"IF(Table1[[#This Row],[Employee Name]]=\"\",\"\",Table1[[#This Row],[Employee Name]])","v":""},{"$nulls":11},{"$f":"IFERROR(VLOOKUP(Table3[[#This Row],[Surrender Month]],DA_HRA_Rate,3,0),\"\")","v":""}]
[{"$f":"IF(Table1[[#This Row],[Sr.No.]]=\"\",\"\",Table1[[#This Row],[Sr.No.]])","v":""},{"$f":"IF(Table1[[#This Row],[Employee Name]]=\"\",\"\",Table1[[#This Row],[Employee Name]])","v":""},{"$nulls":11},{"$f":"IFERROR(VLOOKUP(Table3[[#This Row],[Surrender Month]],DA_HRA_Rate,3,0),\"\")","v":""}]
[{"$f":"IF(Table1[[#This Row],[Sr.No.]]=\"\",\"\",Table1[[#This Row],[Sr.No.]])","v":""},{"$f":"IF(Table1[[#This Row],[Employee Name]]=\"\",\"\",Table1[[#This Row],[Employee Name]])","v":""},{"$nulls":11},{"$f":"IFERROR(VLOOKUP(Table3[[#This Row],[Surrender Month]],DA_HRA_Rate,3,0),\"\")","v":""}]
[{"$f":"IF(Table1[[#This Row],[Sr.No.]]=\"\",\"\",Table1[[#This Row],[Sr.No.]])","v":""},{"$f":"IF(Table1[[#This Row],[Employee Name]]=\"\",\"\",Table1[[#This Row],[Employee Name]])","v":""},{"$nulls":11},{"$f":"IFERROR(VLOOKUP(Table3[[#This Row],[Surrender Month]],DA_HRA_Rate,3,0),\"\")","v":""}]
[{"$f":"IF(Table1[[#This Row],[Sr.No.]]=\"\",\"\",Table1[[#This Row],[Sr.No.]])","v":""},{"$f":"IF(Table1[[#This Row],[Employee Name]]=\"\",\"\",Table1[[#This Row],[Employee Name]])","v":""},{"$nulls":11},{"$f":"IFERROR(VLOOKUP(Table3[[#This Row],[Surrender Month]],DA_HRA_Rate,3,0),\"\")","v":""}]
[{"$f":"IF(Table1[[#This Row],[Sr.No.]]=\"\",\"\",Table1[[#This Row],[Sr.No.]])","v":""},{"$f":"IF(Table1[[#This Row],[Employee Name]]=\"\",\"\",Table1[[#This Row],[Employee Name]])","v":""},{"$nulls":11},{"$f":"IFERROR(VLOOKUP(Table3[[#This Row],[Surrender Month]],DA_HRA_Rate,3,0),\"\")","v":""}]
[{"$f":"IF(Table1[[#This Row],[Sr.No.]]=\"\",\"\",Table1[[#This Row],[Sr.No.]])","v":""},{"$f":"IF(Table1[[#This Row],[Employee Name]]=\"\",\"\",Table1[[#This Row],[Employee Name]])","v":""},{"$nulls":11},{"$f":"IFERROR(VLOOKUP(Table3[[#This Row],[Surrender Month]],DA_HRA_Rate,3,0),\"\")","v":""}]
[{"$f":"IF(Table1[[#This Row],[Sr.No.]]=\"\",\"\",Table1[[#This Row],[Sr.No.]])","v":""},{"$f":"IF(Table1[[#This Row],[Employee Name]]=\"\",\"\",Table1[[#This Row],[Employee Name]])","v":""},{"$nulls":11},{"$f":"IFERROR(VLOOKUP(Table3[[#This Row],[Surrender Month]],DA_HRA_Rate,3,0),\"\")","v":""}]
[{"$f":"IF(Table1[[#This Row],[Sr.No.]]=\"\",\"\",Table1[[#This Row],[Sr.No.]])","v":""},{"$f":"IF(Table1[[#This Row],[Employee Name]]=\"\",\"\",Table1[[#This Row],[Employee Name]])","v":""},{"$nulls":11},{"$f":"IFERROR(VLOOKUP(Table3[[#This Row],[Surrender Month]],DA_HRA_Rate,3,0),\"\")","v":""}]
[{"$f":"IF(Table1[[#This Row],[Sr.No.]]=\"\",\"\",Table1[[#This Row],[Sr.No.]])","v":""},{"$f":"IF(Table1[[#This Row],[Employee Name]]=\"\",\"\",Table1[[#This Row],[Employee Name]])","v":""},{"$nulls":11},{"$f":"IFERROR(VLOOKUP(Table3[[#This Row],[Surrender Month]],DA_HRA_Rate,3,0),\"\")","v":""}]
[{"$f":"IF(Table1[[#This Row],[Sr.No.]]=\"\",\"\",Table1[[#This Row],[Sr.No.]])","v":""},{"$f":"IF(Table1[[#This Row],[Employee Name]]=\"\",\"\",Table1[[#This Row],[Employee Name]])","v":""},{"$nulls":11},{"$f":"IFERROR(VLOOKUP(Table3[[#This Row],[Surrender Month]],DA_HRA_Rate,3,0),\"\")","v":""}]
[{"$f":"IF(Table1[[#This Row],[Sr.No.]]=\"\",\"\",Table1[[#This Row],[Sr.No.]])","v":""},{"$f":"IF(Table1[[#This Row],[Employee Name]]=\"\",\"\",Table1[[#This Row],[Employee Name]])","v":""},{"$nulls":11},{"$f":"IFERROR(VLOOKUP(Table3[[#This Row],[Surrender Month]],DA_HRA_Rate,3,0),\"\")","v":""}]
[{"$f":"IF(Table1[[#This Row],[Sr.No.]]=\"\",\"\",Table1[[#This Row],[Sr.No.]])","v":""},{"$f":"IF(Table1[[#This Row],[Employee Name]]=\"\",\"\",Table1[[#This Row],[Employee Name]])","v":""},{"$nulls":11},{"$f":"IFERROR(VLOOKUP(Table3[[#This Row],[Surrender Month]],DA_HRA_Rate,3,0),\"\")","v":""}]
[{"$f":"IF(Table1[[#This Row],[Sr.No.]]=\"\",\"\",Table1[[#This Row],[Sr.No.]])","v":""},{"$f":"IF(Table1[[#This Row],[Employee Name]]=\"\",\"\",Table1[[#This Row],[Employee Name]])","v":""},{"$nulls":11},{"$f":"IFERROR(VLOOKUP(Table3[[#This Row],[Surrender Month]],DA_HRA_Rate,3,0),\"\")","v":""}]
[{"$f":"IF(Table1[[#This Row],[Sr.No.]]=\"\",\"\",Table1[[#This Row],[Sr.No.]])","v":""},{"$f":"IF(Table1[[#This Row],[Employee Name]]=\"\",\"\",Table1[[#This Row],[Employee Name]])","v":""},{"$nulls":11},{"$f":"IFERROR(VLOOKUP(Table3[[#This Row],[Surrender Month]],DA_HRA_Rate,3,0),\"\")","v":""}]
[{"$f":"IF(Table1[[#This Row],[Sr.No.]]=\"\",\"\",Table1[[#This Row],[Sr.No.]])","v":""},{"$f":"IF(Table1[[#This Row],[Employee Name]]=\"\",\"\",Table1[[#This Row],[Employee Name]])","v":""},{"$nulls":11},{"$f":"IFERROR(VLOOKUP(Table3[[#This Row],[Surrender Month]],DA_HRA_Rate,3,0),\"\")","v":""}]
[{"$f":"IF(Table1[[#This Row],[Sr.No.]]=\"\",\"\",Table1[[#This Row],[Sr.No.]])","v":""},{"$f":"IF(Table1[[#This Row],[Employee Name]]=\"\",\"\",Table1[[#This Row],[Employee Name]])","v":""},{"$nulls":11},{"$f":"IFERROR(VLOOKUP(Table3[[#This Row],[Surrender Month]],DA_HRA_Rate,3,0),\"\")","v":""}]
[{"$f":"IF(Table1[[#This Row],[Sr.No.]]=\"\",\"\",Table1[[#This Row],[Sr.No.]])","v":""},{"$f":"IF(Table1[[#This Row],[Employee Name]]=\"\",\"\",Table1[[#This Row],[Employee Name]])","v":""},{"$nulls":11},{"$f":"IFERROR(VLOOKUP(Table3[[#This Row],[Surrender Month]],DA_HRA_Rate,3,0),\"\")","v":""}]
[{"$f":"IF(Table1[[#This Row],[Sr.No.]]=\"\",\"\",Table1[[#This Row],[Sr.No.]])","v":""},{"$f":"IF(Table1[[#This Row],[Employee Name]]=\"\",\"\",Table1[[#This Row],[Employee Name]])","v":""},{"$nulls":11},{"$f":"IFERROR(VLOOKUP(Table3[[#This Row],[Surrender Month]],DA_HRA_Rate,3,0),\"\")","v":""}]
[{"$f":"IF(Table1[[#This Row],[Sr.No.]]=\"\",\"\",Table1[[#This Row],[Sr.No.]])","v":""},{"$f":"IF(Table1[[#This Row],[Employee Name]]=\"\",\"\",Table1[[#This Row],[Employee Name]])","v":""},{"$nulls":11},{"$f":"IFERROR(VLOOKUP(Table3[[#This Row],[Surrender Month]],DA_HRA_Rate,3,0),\"\")","v":""}]
[{"$f":"IF(Table1[[#This Row],[Sr.No.]]=\"\",\"\",Table1[[#This Row],[Sr.No.]])","v":""},{"$f":"IF(Table1[[#This Row],[Employee Name]]=\"\",\"\",Table1[[#This Row],[Employee Name]])","v":""},{"$nulls":11},{"$f":"IFERROR(VLOOKUP(Table3[[#This Row],[Surrender Month]],DA_HRA_Rate,3,0),\"\")","v":""}]
[{"$f":"IF(Table1[[#This Row],[Sr.No.]]=\"\",\"\",Table1[[#This Row],[Sr.No.]])","v":""},{"$f":"IF(Table1[[#This Row],[Employee Name]]=\"\",\"\",Table1[[#This Row],[Employee Name]])","v":""},{"$nulls":11},{"$f":"IFERROR(VLOOKUP(Table3[[#This Row],[Surrender Month]],DA_HRA_Rate,3,0),\"\")","v":""}]
[{"$f":"IF(Table1[[#This Row],[Sr.No.]]=\"\",\"\",Table1[[#This Row],[Sr.No.]])","v":""},{"$f":"IF(Table1[[#This Row],[Employee Name]]=\"\",\"\",Table1[[#This Row],[Employee Name]])","v":""},{"$nulls":11},{"$f":"IFERROR(VLOOKUP(Table3[[#This Row],[Surrender Month]],DA_HRA_Rate,3,0),\"\")","v":""}]
[{"$f":"IF(Table1[[#This Row],[Sr.No.]]=\"\",\"\",Table1[[#This Row],[Sr.No.]])","v":""},{"$f":"IF(Table1[[#This Row],[Employee Name]]=\"\",\"\",Table1[[#This Row],[Employee Name]])","v":""},{"$nulls":11},{"$f":"IFERROR(VLOOKUP(Table3[[#This Row],[Surrender Month]],DA_HRA_Rate,3,0),\"\")","v":""}]
[{"$f":"IF(Table1[[#This Row],[Sr.No.]]=\"\",\"\",Table1[[#This Row],[Sr.No.]])","v":""},{"$f":"IF(Table1[[#This Row],[Employee Name]]=\"\",\"\",Table1[[#This Row],[Employee Name]])","v":""},{"$nulls":11},{"$f":"IFERROR(VLOOKUP(Table3[[#This Row],[Surrender Month]],DA_HRA_Rate,3,0),\"\")","v":""}]
[{"$f":"IF(Table1[[#This Row],[Sr.No.]]=\"\",\"\",Table1[[#This Row],[Sr.No.]])","v":""},{"$f":"IF(Table1[[#This Row],[Employee Name]]=\"\",\"\",Table1[[#This Row],[Employee Name]])","v":""},{"$nulls":11},{"$f":"IFERROR(VLOOKUP(Table3[[#This Row],[Surrender Month]],DA_HRA_Rate,3,0),\"\")","v":""}]
[{"$f":"IF(Table1[[#This Row],[Sr.No.]]=\"\",\"\",Table1[[#This Row],[Sr.No.]])","v":""},{"$f":"IF(Table1[[#This Row],[Employee Name]]=\"\",\"\",Table1[[#This Row],[Employee Name]])","v":""},{"$nulls":11},{"$f":"IFERROR(VLOOKUP(Table3[[#This Row],[Surrender Month]],DA_HRA_Rate,3,0),\"\")","v":""}]
[{"$f":"IF(Table1[[#This Row],[Sr.No.]]=\"\",\"\",Table1[[#This Row],[Sr.No.]])","v":""},{"$f":"IF(Table1[[#This Row],[Employee Name]]=\"\",\"\",Table1[[#This Row],[Employee Name]])","v":""},{"$nulls":11},{"$f":"IFERROR(VLOOKUP(Table3[[#This Row],[Surrender Month]],DA_HRA_Rate,3,0),\"\")","v":""}]
[{"$f":"IF(Table1[[#This Row],[Sr.No.]]=\"\",\"\",Table1[[#This Row],[Sr.No.]])","v":""},{"$f":"IF(Table1[[#This Row],[Employee Name]]=\"\",\"\",Table1[[#This Row],[Employee Name]])","v":""},{"$nulls":11},{"$f":"IFERROR(VLOOKUP(Table3[[#This Row],[Surrender Month]],DA_HRA_Rate,3,0),\"\")","v":""}]
[{"$f":"IF(Table1[[#This Row],[Sr.No.]]=\"\",\"\",Table1[[#This Row],[Sr.No.]])","v":""},{"$f":"IF(Table1[[#This Row],[Employee Name]]=\"\",\"\",Table1[[#This Row],[Employee Name]])","v":""},{"$nulls":11},{"$f":"IFERROR(VLOOKUP(Table3[[#This Row],[Surrender Month]],DA_HRA_Rate,3,0),\"\")","v":""}]
[{"$f":"IF(Table1[[#This Row],[Sr.No.]]=\"\",\"\",Table1[[#This Row],[Sr.No.]])","v":""},{"$f":"IF(Table1[[#This Row],[Employee Name]]=\"\",\"\",Table1[[#This Row],[Employee Name]])","v":""},{"$nulls":11},{"$f":"IFERROR(VLOOKUP(Table3[[#This Row],[Surrender Month]],DA_HRA_Rate,3,0),\"\")","v":""}]
[{"$f":"IF(Table1[[#This Row],[Sr.No.]]=\"\",\"\",Table1[[#This Row],[Sr.No.]])","v":""},{"$f":"IF(Table1[[#This Row],[Employee Name]]=\"\",\"\",Table1[[#This Row],[Employee Name]])","v":""},{"$nulls":11},{"$f":"IFERROR(VLOOKUP(Table3[[#This Row],[Surrender Month]],DA_HRA_Rate,3,0),\"\")","v":""}]
[{"$f":"IF(Table1[[#This Row],[Sr.No.]]=\"\",\"\",Table1[[#This Row],[Sr.No.]])","v":""},{"$f":"IF(Table1[[#This Row],[Employee Name]]=\"\",\"\",Table1[[#This Row],[Employee Name]])","v":""},{"$nulls":11},{"$f":"IFERROR(VLOOKUP(Table3[[#This Row],[Surrender Month]],DA_HRA_Rate,3,0),\"\")","v":""}]
[{"$f":"IF(Table1[[#This Row],[Sr.No.]]=\"\",\"\",Table1[[#This Row],[Sr.No.]])","v":""},{"$f":"IF(Table1[[#This Row],[Employee Name]]=\"\",\"\",Table1[[#This Row],[Employee Name]])","v":""},{"$nulls":11},{"$f":"IFERROR(VLOOKUP(Table3[[#This Row],[Surrender Month]],DA_HRA_Rate,3,0),\"\")","v":""}]
[{"$f":"IF(Table1[[#This Row],[Sr.No.]]=\"\",\"\",Table1[[#This Row],[Sr.No.]])","v":""},{"$f":"IF(Table1[[#This Row],[Employee Name]]=\"\",\"\",Table1[[#This Row],[Employee Name]])","v":""},{"$nulls":11},{"$f":"IFERROR(VLOOKUP(Table3[[#This Row],[Surrender Month]],DA_HRA_Rate,3,0),\"\")","v":""}]
[{"$f":"IF(Table1[[#This Row],[Sr.No.]]=\"\",\"\",Table1[[#This Row],[Sr.No.]])","v":""},{"$f":"IF(Table1[[#This Row],[Employee Name]]=\"\",\"\",Table1[[#This Row],[Employee Name]])","v":""},{"$nulls":11},{"$f":"IFERROR(VLOOKUP(Table3[[#This Row],[Surrender Month]],DA_HRA_Rate,3,0),\"\")","v":""}]
[{"$f":"IF(Table1[[#This Row],[Sr.No.]]=\"\",\"\",Table1[[#This Row],[Sr.No.]])","v":""},{"$f":"IF(Table1[[#This Row],[Employee Name]]=\"\",\"\",Table1[[#This Row],[Employee Name]])","v":""},{"$nulls":11},{"$f":"IFERROR(VLOOKUP(Table3[[#This Row],[Surrender Month]],DA_HRA_Rate,3,0),\"\")","v":""}]
[{"$f":"IF(Table1[[#This Row],[Sr.No.]]=\"\",\"\",Table1[[#This Row],[Sr.No.]])","v":""},{"$f":"IF(Table1[[#This Row],[Employee Name]]=\"\",\"\",Table1[[#This Row],[Employee Name]])","v":""},{"$nulls":11},{"$f":"IFERROR(VLOOKUP(Table3[[#This Row],[Surrender Month]],DA_HRA_Rate,3,0),\"\")","v":""}]
[{"$f":"IF(Table1[[#This Row],[Sr.No.]]=\"\",\"\",Table1[[#This Row],[Sr.No.]])","v":""},{"$f":"IF(Table1[[#This Row],[Employee Name]]=\"\",\"\",Table1[[#This Row],[Employee Name]])","v":""},{"$nulls":11},{"$f":"IFERROR(VLOOKUP(Table3[[#This Row],[Surrender Month]],DA_HRA_Rate,3,0),\"\")","v":""}]
[{"$f":"IF(Table1[[#This Row],[Sr.No.]]=\"\",\"\",Table1[[#This Row],[Sr.No.]])","v":""},{"$f":"IF(Table1[[#This Row],[Employee Name]]=\"\",\"\",Table1[[#This Row],[Employee Name]])","v":""},{"$nulls":11},{"$f":"IFERROR(VLOOKUP(Table3[[#This Row],[Surrender Month]],DA_HRA_Rate,3,0),\"\")","v":""}]
[{"$f":"IF(Table1[[#This Row],[Sr.No.]]=\"\",\"\",Table1[[#This Row],[Sr.No.]])","v":""},{"$f":"IF(Table1[[#This Row],[Employee Name]]=\"\",\"\",Table1[[#This Row],[Employee Name]])","v":""},{"$nulls":11},{"$f":"IFERROR(VLOOKUP(Table3[[#This Row],[Surrender Month]],DA_HRA_Rate,3,0),\"\")","v":""}]
[{"$f":"IF(Table1[[#This Row],[Sr.No.]]=\"\",\"\",Table1[[#This Row],[Sr.No.]])","v":""},{"$f":"IF(Table1[[#This Row],[Employee Name]]=\"\",\"\",Table1[[#This Row],[Employee Name]])","v":""},{"$nulls":11},{"$f":"IFERROR(VLOOKUP(Table3[[#This Row],[Surrender Month]],DA_HRA_Rate,3,0),\"\")","v":""}]
[{"$f":"IF(Table1[[#This Row],[Sr.No.]]=\"\",\"\",Table1[[#This Row],[Sr.No.]])","v":""},{"$f":"IF(Table1[[#This Row],[Employee Name]]=\"\",\"\",Table1[[#This Row],[Employee Name]])","v":""},{"$nulls":11},{"$f":"IFERROR(VLOOKUP(Table3[[#This Row],[Surrender Month]],DA_HRA_Rate,3,0),\"\")","v":""}]
[{"$f":"IF(Table1[[#This Row],[Sr.No.]]=\"\",\"\",Table1[[#This Row],[Sr.No.]])","v":""},{"$f":"IF(Table1[[#This Row],[Employee Name]]=\"\",\"\",Table1[[#This Row],[Employee Name]])","v":""},{"$nulls":11},{"$f":"IFERROR(VLOOKUP(Table3[[#This Row],[Surrender Month]],DA_HRA_Rate,3,0),\"\")","v":""}]
[{"$f":"IF(Table1[[#This Row],[Sr.No.]]=\"\",\"\",Table1[[#This Row],[Sr.No.]])","v":""},{"$f":"IF(Table1[[#This Row],[Employee Name]]=\"\",\"\",Table1[[#This Row],[Employee Name]])","v":""},{"$nulls":11},{"$f":"IFERROR(VLOOKUP(Table3[[#This Row],[Surrender Month]],DA_HRA_Rate,3,0),\"\")","v":""}]
[{"$f":"IF(Table1[[#This Row],[Sr.No.]]=\"\",\"\",Table1[[#This Row],[Sr.No.]])","v":""},{"$f":"IF(Table1[[#This Row],[Employee Name]]=\"\",\"\",Table1[[#This Row],[Employee Name]])","v":""},{"$nulls":11},{"$f":"IFERROR(VLOOKUP(Table3[[#This Row],[Surrender Month]],DA_HRA_Rate,3,0),\"\")","v":""}]
[{"$f":"IF(Table1[[#This Row],[Sr.No.]]=\"\",\"\",Table1[[#This Row],[Sr.No.]])","v":""},{"$f":"IF(Table1[[#This Row],[Employee Name]]=\"\",\"\",Table1[[#This Row],[Employee Name]])","v":""},{"$nulls":11},{"$f":"IFERROR(VLOOKUP(Table3[[#This Row],[Surrender Month]],DA_HRA_Rate,3,0),\"\")","v":""}]
[{"$f":"IF(Table1[[#This Row],[Sr.No.]]=\"\",\"\",Table1[[#This Row],[Sr.No.]])","v":""},{"$f":"IF(Table1[[#This Row],[Employee Name]]=\"\",\"\",Table1[[#This Row],[Employee Name]])","v":""},{"$nulls":11},{"$f":"IFERROR(VLOOKUP(Table3[[#This Row],[Surrender Month]],DA_HRA_Rate,3,0),\"\")","v":""}]
[{"$f":"IF(Table1[[#This Row],[Sr.No.]]=\"\",\"\",Table1[[#This Row],[Sr.No.]])","v":""},{"$f":"IF(Table1[[#This Row],[Employee Name]]=\"\",\"\",Table1[[#This Row],[Employee Name]])","v":""},{"$nulls":11},{"$f":"IFERROR(VLOOKUP(Table3[[#This Row],[Surrender Month]],DA_HRA_Rate,3,0),\"\")","v":""}]
[{"$f":"IF(Table1[[#This Row],[Sr.No.]]=\"\",\"\",Table1[[#This Row],[Sr.No.]])","v":""},{"$f":"IF(Table1[[#This Row],[Employee Name]]=\"\",\"\",Table1[[#This Row],[Employee Name]])","v":""},{"$nulls":11},{"$f":"IFERROR(VLOOKUP(Table3[[#This Row],[Surrender Month]],DA_HRA_Rate,3,0),\"\")","v":""}]
[{"$f":"IF(Table1[[#This Row],[Sr.No.]]=\"\",\"\",Table1[[#This Row],[Sr.No.]])","v":""},{"$f":"IF(Table1[[#This Row],[Employee Name]]=\"\",\"\",Table1[[#This Row],[Employee Name]])","v":""},{"$nulls":11},{"$f":"IFERROR(VLOOKUP(Table3[[#This Row],[Surrender Month]],DA_HRA_Rate,3,0),\"\")","v":""}]
[{"$f":"IF(Table1[[#This Row],[Sr.No.]]=\"\",\"\",Table1[[#This Row],[Sr.No.]])","v":""},{"$f":"IF(Table1[[#This Row],[Employee Name]]=\"\",\"\",Table1[[#This Row],[Employee Name]])","v":""},{"$nulls":11},{"$f":"IFERROR(VLOOKUP(Table3[[#This Row],[Surrender Month]],DA_HRA_Rate,3,0),\"\")","v":""}]
[{"$f":"IF(Table1[[#This Row],[Sr.No.]]=\"\",\"\",Table1[[#This Row],[Sr.No.]])","v":""},{"$f":"IF(Table1[[#This Row],[Employee Name]]=\"\",\"\",Table1[[#This Row],[Employee Name]])","v":""},{"$nulls":11},{"$f":"IFERROR(VLOOKUP(Table3[[#This Row],[Surrender Month]],DA_HRA_Rate,3,0),\"\")","v":""}]
[{"$f":"IF(Table1[[#This Row],[Sr.No.]]=\"\",\"\",Table1[[#This Row],[Sr.No.]])","v":""},{"$f":"IF(Table1[[#This Row],[Employee Name]]=\"\",\"\",Table1[[#This Row],[Employee Name]])","v":""},{"$nulls":11},{"$f":"IFERROR(VLOOKUP(Table3[[#This Row],[Surrender Month]],DA_HRA_Rate,3,0),\"\")","v":""}]
[{"$f":"IF(Table1[[#This Row],[Sr.No.]]=\"\",\"\",Table1[[#This Row],[Sr.No.]])","v":""},{"$f":"IF(Table1[[#This Row],[Employee Name]]=\"\",\"\",Table1[[#This Row],[Employee Name]])","v":""},{"$nulls":11},{"$f":"IFERROR(VLOOKUP(Table3[[#This Row],[Surrender Month]],DA_HRA_Rate,3,0),\"\")","v":""}]
[{"$f":"IF(Table1[[#This Row],[Sr.No.]]=\"\",\"\",Table1[[#This Row],[Sr.No.]])","v":""},{"$f":"IF(Table1[[#This Row],[Employee Name]]=\"\",\"\",Table1[[#This Row],[Employee Name]])","v":""},{"$nulls":11},{"$f":"IFERROR(VLOOKUP(Table3[[#This Row],[Surrender Month]],DA_HRA_Rate,3,0),\"\")","v":""}]
[{"$f":"IF(Table1[[#This Row],[Sr.No.]]=\"\",\"\",Table1[[#This Row],[Sr.No.]])","v":""},{"$f":"IF(Table1[[#This Row],[Employee Name]]=\"\",\"\",Table1[[#This Row],[Employee Name]])","v":""},{"$nulls":11},{"$f":"IFERROR(VLOOKUP(Table3[[#This Row],[Surrender Month]],DA_HRA_Rate,3,0),\"\")","v":""}]
[{"$f":"IF(Table1[[#This Row],[Sr.No.]]=\"\",\"\",Table1[[#This Row],[Sr.No.]])","v":""},{"$f":"IF(Table1[[#This Row],[Employee Name]]=\"\",\"\",Table1[[#This Row],[Employee Name]])","v":""},{"$nulls":11},{"$f":"IFERROR(VLOOKUP(Table3[[#This Row],[Surrender Month]],DA_HRA_Rate,3,0),\"\")","v":""}]
[{"$f":"IF(Table1[[#This Row],[Sr.No.]]=\"\",\"\",Table1[[#This Row],[Sr.No.]])","v":""},{"$f":"IF(Table1[[#This Row],[Employee Name]]=\"\",\"\",Table1[[#This Row],[Employee Name]])","v":""},{"$nulls":11},{"$f":"IFERROR(VLOOKUP(Table3[[#This Row],[Surrender Month]],DA_HRA_Rate,3,0),\"\")","v":""}]
[{"$f":"IF(Table1[[#This Row],[Sr.No.]]=\"\",\"\",Table1[[#This Row],[Sr.No.]])","v":""},{"$f":"IF(Table1[[#This Row],[Employee Name]]=\"\",\"\",Table1[[#This Row],[Employee Name]])","v":""},{"$nulls":11},{"$f":"IFERROR(VLOOKUP(Table3[[#This Row],[Surrender Month]],DA_HRA_Rate,3,0),\"\")","v":""}]
[{"$f":"IF(Table1[[#This Row],[Sr.No.]]=\"\",\"\",Table1[[#This Row],[Sr.No.]])","v":""},{"$f":"IF(Table1[[#This Row],[Employee Name]]=\"\",\"\",Table1[[#This Row],[Employee Name]])","v":""},{"$nulls":11},{"$f":"IFERROR(VLOOKUP(Table3[[#This Row],[Surrender Month]],DA_HRA_Rate,3,0),\"\")","v":""}]
[{"$f":"IF(Table1[[#This Row],[Sr.No.]]=\"\",\"\",Table1[[#This Row],[Sr.No.]])","v":""},{"$f":"IF(Table1[[#This Row],[Employee Name]]=\"\",\"\",Table1[[#This Row],[Employee Name]])","v":""},{"$nulls":11},{"$f":"IFERROR(VLOOKUP(Table3[[#This Row],[Surrender Month]],DA_HRA_Rate,3,0),\"\")","v":""}]
[{"$f":"IF(Table1[[#This Row],[Sr.No.]]=\"\",\"\",Table1[[#This Row],[Sr.No.]])","v":""},{"$f":"IF(Table1[[#This Row],[Employee Name]]=\"\",\"\",Table1[[#This Row],[Employee Name]])","v":""},{"$nulls":11},{"$f":"IFERROR(VLOOKUP(Table3[[#This Row],[Surrender Month]],DA_HRA_Rate,3,0),\"\")","v":""}]
[{"$f":"IF(Table1[[#This Row],[Sr.No.]]=\"\",\"\",Table1[[#This Row],[Sr.No.]])","v":""},{"$f":"IF(Table1[[#This Row],[Employee Name]]=\"\",\"\",Table1[[#This Row],[Employee Name]])","v":""},{"$nulls":11},{"$f":"IFERROR(VLOOKUP(Table3[[#This Row],[Surrender Month]],DA_HRA_Rate,3,0),\"\")","v":""}]
[{"$f":"IF(Table1[[#This Row],[Sr.No.]]=\"\",\"\",Table1[[#This Row],[Sr.No.]])","v":""},{"$f":"IF(Table1[[#This Row],[Employee Name]]=\"\",\"\",Table1[[#This Row],[Employee Name]])","v":""},{"$nulls":11},{"$f":"IFERROR(VLOOKUP(Table3[[#This Row],[Surrender Month]],DA_HRA_Rate,3,0),\"\")","v":""}]
[{"$f":"IF(Table1[[#This Row],[Sr.No.]]=\"\",\"\",Table1[[#This Row],[Sr.No.]])","v":""},{"$f":"IF(Table1[[#This Row],[Employee Name]]=\"\",\"\",Table1[[#This Row],[Employee Name]])","v":""},{"$nulls":11},{"$f":"IFERROR(VLOOKUP(Table3[[#This Row],[Surrender Month]],DA_HRA_Rate,3,0),\"\")","v":""}]
[{"$f":"IF(Table1[[#This Row],[Sr.No.]]=\"\",\"\",Table1[[#This Row],[Sr.No.]])","v":""},{"$f":"IF(Table1[[#This Row],[Employee Name]]=\"\",\"\",Table1[[#This Row],[Employee Name]])","v":""},{"$nulls":11},{"$f":"IFERROR(VLOOKUP(Table3[[#This Row],[Surrender Month]],DA_HRA_Rate,3,0),\"\")","v":""}]
[{"$f":"IF(Table1[[#This Row],[Sr.No.]]=\"\",\"\",Table1[[#This Row],[Sr.No.]])","v":""},{"$f":"IF(Table1[[#This Row],[Employee Name]]=\"\",\"\",Table1[[#This Row],[Employee Name]])","v":""},{"$nulls":11},{"$f":"IFERROR(VLOOKUP(Table3[[#This Row],[Surrender Month]],DA_HRA_Rate,3,0),\"\")","v":""}]
[{"$f":"IF(Table1[[#This Row],[Sr.No.]]=\"\",\"\",Table1[[#This Row],[Sr.No.]])","v":""},{"$f":"IF(Table1[[#This Row],[Employee Name]]=\"\",\"\",Table1[[#This Row],[Employee Name]])","v":""},{"$nulls":11},{"$f":"IFERROR(VLOOKUP(Table3[[#This Row],[Surrender Month]],DA_HRA_Rate,3,0),\"\")","v":""}]
[{"$f":"IF(Table1[[#This Row],[Sr.No.]]=\"\",\"\",Table1[[#This Row],[Sr.No.]])","v":""},{"$f":"IF(Table1[[#This Row],[Employee Name]]=\"\",\"\",Table1[[#This Row],[Employee Name]])","v":""},{"$nulls":11},{"$f":"IFERROR(VLOOKUP(Table3[[#This Row],[Surrender Month]],DA_HRA_Rate,3,0),\"\")","v":""}]
[{"$f":"IF(Table1[[#This Row],[Sr.No.]]=\"\",\"\",Table1[[#This Row],[Sr.No.]])","v":""},{"$f":"IF(Table1[[#This Row],[Employee Name]]=\"\",\"\",Table1[[#This Row],[Employee Name]])","v":""},{"$nulls":11},{"$f":"IFERROR(VLOOKUP(Table3[[#This Row],[Surrender Month]],DA_HRA_Rate,3,0),\"\")","v":""}]
[{"$f":"IF(Table1[[#This Row],[Sr.No.]]=\"\",\"\",Table1[[#This Row],[Sr.No.]])","v":""},{"$f":"IF(Table1[[#This Row],[Employee Name]]=\"\",\"\",Table1[[#This Row],[Employee Name]])","v":""},{"$nulls":11},{"$f":"IFERROR(VLOOKUP(Table3[[#This Row],[Surrender Month]],DA_HRA_Rate,3,0),\"\")","v":""}]
[{"$f":"IF(Table1[[#This Row],[Sr.No.]]=\"\",\"\",Table1[[#This Row],[Sr.No.]])","v":""},{"$f":"IF(Table1[[#This Row],[Employee Name]]=\"\",\"\",Table1[[#This Row],[Employee Name]])","v":""},{"$nulls":11},{"$f":"IFERROR(VLOOKUP(Table3[[#This Row],[Surrender Month]],DA_HRA_Rate,3,0),\"\")","v":""}]
[{"$f":"IF(Table1[[#This Row],[Sr.No.]]=\"\",\"\",Table1[[#This Row],[Sr.No.]])","v":""},{"$f":"IF(Table1[[#This Row],[Employee Name]]=\"\",\"\",Table1[[#This Row],[Employee Name]])","v":""},{"$nulls":11},{"$f":"IFERROR(VLOOKUP(Table3[[#This Row],[Surrender Month]],DA_HRA_Rate,3,0),\"\")","v":""}]
[{"$f":"IF(Table1[[#This Row],[Sr.No.]]=\"\",\"\",Table1[[#This Row],[Sr.No.]])","v":""},{"$f":"IF(Table1[[#This Row],[Employee Name]]=\"\",\"\",Table1[[#This Row],[Employee Name]])","v":""},{"$nulls":11},{"$f":"IFERROR(VLOOKUP(Table3[[#This Row],[Surrender Month]],DA_HRA_Rate,3,0),\"\")","v":""}]
[{"$f":"IF(Table1[[#This Row],[Sr.No.]]=\"\",\"\",Table1[[#This Row],[Sr.No.]])","v":""},{"$f":"IF(Table1[[#This Row],[Employee Name]]=\"\",\"\",Table1[[#This Row],[Employee Name]])","v":""},{"$nulls":11},{"$f":"IFERROR(VLOOKUP(Table3[[#This Row],[Surrender Month]],DA_HRA_Rate,3,0),\"\")","v":""}]
[{"$f":"IF(Table1[[#This Row],[Sr.No.]]=\"\",\"\",Table1[[#This Row],[Sr.No.]])","v":""},{"$f":"IF(Table1[[#This Row],[Employee Name]]=\"\",\"\",Table1[[#This Row],[Employee Name]])","v":""},{"$nulls":11},{"$f":"IFERROR(VLOOKUP(Table3[[#This Row],[Surrender Month]],DA_HRA_Rate,3,0),\"\")","v":""}]
[{"$f":"IF(Table1[[#This Row],[Sr.No.]]=\"\",\"\",Table1[[#This Row],[Sr.No.]])","v":""},{"$f":"IF(Table1[[#This Row],[Employee Name]]=\"\",\"\",Table1[[#This Row],[Employee Name]])","v":""},{"$nulls":11},{"$f":"IFERROR(VLOOKUP(Table3[[#This Row],[Surrender Month]],DA_HRA_Rate,3,0),\"\")","v":""}]
[{"$f":"IF(Table1[[#This Row],[Sr.No.]]=\"\",\"\",Table1[[#This Row],[Sr.No.]])","v":""},{"$f":"IF(Table1[[#This Row],[Employee Name]]=\"\",\"\",Table1[[#This Row],[Employee Name]])","v":""},{"$nulls":11},{"$f":"IFERROR(VLOOKUP(Table3[[#This Row],[Surrender Month]],DA_HRA_Rate,3,0),\"\")","v":""}]
[{"$f":"IF(Table1[[#This Row],[Sr.No.]]=\"\",\"\",Table1[[#This Row],[Sr.No.]])","v":""},{"$f":"IF(Table1[[#This Row],[Employee Name]]=\"\",\"\",Table1[[#This Row],[Employee Name]])","v":""},{"$nulls":11},{"$f":"IFERROR(VLOOKUP(Table3[[#This Row],[Surrender Month]],DA_HRA_Rate,3,0),\"\")","v":""}]
[{"$f":"IF(Table1[[#This Row],[Sr.No.]]=\"\",\"\",Table1[[#This Row],[Sr.No.]])","v":""},{"$f":"IF(Table1[[#This Row],[Employee Name]]=\"\",\"\",Table1[[#This Row],[Employee Name]])","v":""},{"$nulls":11},{"$f":"IFERROR(VLOOKUP(Table3[[#This Row],[Surrender Month]],DA_HRA_Rate,3,0),\"\")","v":""}]
[{"$f":"IF(Table1[[#This Row],[Sr.No.]]=\"\",\"\",Table1[[#This Row],[Sr.No.]])","v":""},{"$f":"IF(Table1[[#This Row],[Employee Name]]=\"\",\"\",Table1[[#This Row],[Employee Name]])","v":""},{"$nulls":11},{"$f":"IFERROR(VLOOKUP(Table3[[#This Row],[Surrender Month]],DA_HRA_Rate,3,0),\"\")","v":""}]
[{"$f":"IF(Table1[[#This Row],[Sr.No.]]=\"\",\"\",Table1[[#This Row],[Sr.No.]])","v":""},{"$f":"IF(Table1[[#This Row],[Employee Name]]=\"\",\"\",Table1[[#This Row],[Employee Name]])","v":""},{"$nulls":11},{"$f":"IFERROR(VLOOKUP(Table3[[#This Row],[Surrender Month]],DA_HRA_Rate,3,0),\"\")","v":""}]
[{"$f":"IF(Table1[[#This Row],[Sr.No.]]=\"\",\"\",Table1[[#This Row],[Sr.No.]])","v":""},{"$f":"IF(Table1[[#This Row],[Employee Name]]=\"\",\"\",Table1[[#This Row],[Employee Name]])","v":""},{"$nulls":11},{"$f":"IFERROR(VLOOKUP(Table3[[#This Row],[Surrender Month]],DA_HRA_Rate,3,0),\"\")","v":""}]
[{"$f":"IF(Table1[[#This Row],[Sr.No.]]=\"\",\"\",Table1[[#This Row],[Sr.No.]])","v":""},{"$f":"IF(Table1[[#This Row],[Employee Name]]=\"\",\"\",Table1[[#This Row],[Employee Name]])","v":""},{"$nulls":11},{"$f":"IFERROR(VLOOKUP(Table3[[#This Row],[Surrender Month]],DA_HRA_Rate,3,0),\"\")","v":""}]
[{"$f":"IF(Table1[[#This Row],[Sr.No.]]=\"\",\"\",Table1[[#This Row],[Sr.No.]])","v":""},{"$f":"IF(Table1[[#This Row],[Employee Name]]=\"\",\"\",Table1[[#This Row],[Employee Name]])","v":""},{"$nulls":11},{"$f":"IFERROR(VLOOKUP(Table3[[#This Row],[Surrender Month]],DA_HRA_Rate,3,0),\"\")","v":""}]
[{"$f":"IF(Table1[[#This Row],[Sr.No.]]=\"\",\"\",Table1[[#This Row],[Sr.No.]])","v":""},{"$f":"IF(Table1[[#This Row],[Employee Name]]=\"\",\"\",Table1[[#This Row],[Employee Name]])","v":""},{"$nulls":11},{"$f":"IFERROR(VLOOKUP(Table3[[#This Row],[Surrender Month]],DA_HRA_Rate,3,0),\"\")","v":""}]
[{"$f":"IF(Table1[[#This Row],[Sr.No.]]=\"\",\"\",Table1[[#This Row],[Sr.No.]])","v":""},{"$f":"IF(Table1[[#This Row],[Employee Name]]=\"\",\"\",Table1[[#This Row],[Employee Name]])","v":""},{"$nulls":11},{"$f":"IFERROR(VLOOKUP(Table3[[#This Row],[Surrender Month]],DA_HRA_Rate,3,0),\"\")","v":""}]
[{"$f":"IF(Table1[[#This Row],[Sr.No.]]=\"\",\"\",Table1[[#This Row],[Sr.No.]])","v":""},{"$f":"IF(Table1[[#This Row],[Employee Name]]=\"\",\"\",Table1[[#This Row],[Employee Name]])","v":""},{"$nulls":11},{"$f":"IFERROR(VLOOKUP(Table3[[#This Row],[Surrender Month]],DA_HRA_Rate,3,0),\"\")","v":""}]
[{"$f":"IF(Table1[[#This Row],[Sr.No.]]=\"\",\"\",Table1[[#This Row],[Sr.No.]])","v":""},{"$f":"IF(Table1[[#This Row],[Employee Name]]=\"\",\"\",Table1[[#This Row],[Employee Name]])","v":""},{"$nulls":11},{"$f":"IFERROR(VLOOKUP(Table3[[#This Row],[Surrender Month]],DA_HRA_Rate,3,0),\"\")","v":""}]
[{"$f":"IF(Table1[[#This Row],[Sr.No.]]=\"\",\"\",Table1[[#This Row],[Sr.No.]])","v":""},{"$f":"IF(Table1[[#This Row],[Employee Name]]=\"\",\"\",Table1[[#This Row],[Employee Name]])","v":""},{"$nulls":11},{"$f":"IFERROR(VLOOKUP(Table3[[#This Row],[Surrender Month]],DA_HRA_Rate,3,0),\"\")","v":""}]
[{"$f":"IF(Table1[[#This Row],[Sr.No.]]=\"\",\"\",Table1[[#This Row],[Sr.No.]])","v":""},{"$f":"IF(Table1[[#This Row],[Employee Name]]=\"\",\"\",Table1[[#This Row],[Employee Name]])","v":""},{"$nulls":11},{"$f":"IFERROR(VLOOKUP(Table3[[#This Row],[Surrender Month]],DA_HRA_Rate,3,0),\"\")","v":""}]
[{"$f":"IF(Table1[[#This Row],[Sr.No.]]=\"\",\"\",Table1[[#This Row],[Sr.No.]])","v":""},{"$f":"IF(Table1[[#This Row],[Employee Name]]=\"\",\"\",Table1[[#This Row],[Employee Name]])","v":""},{"$nulls":11},{"$f":"IFERROR(VLOOKUP(Table3[[#This Row],[Surrender Month]],DA_HRA_Rate,3,0),\"\")","v":""}]
[{"$f":"IF(Table1[[#This Row],[Sr.No.]]=\"\",\"\",Table1[[#This Row],[Sr.No.]])","v":""},{"$f":"IF(Table1[[#This Row],[Employee Name]]=\"\",\"\",Table1[[#This Row],[Employee Name]])","v":""},{"$nulls":11},{"$f":"IFERROR(VLOOKUP(Table3[[#This Row],[Surrender Month]],DA_HRA_Rate,3,0),\"\")","v":""}]
[{"$f":"IF(Table1[[#This Row],[Sr.No.]]=\"\",\"\",Table1[[#This Row],[Sr.No.]])","v":""},{"$f":"IF(Table1[[#This Row],[Employee Name]]=\"\",\"\",Table1[[#This Row],[Employee Name]])","v":""},{"$nulls":11},{"$f":"IFERROR(VLOOKUP(Table3[[#This Row],[Surrender Month]],DA_HRA_Rate,3,0),\"\")","v":""}]
[{"$f":"IF(Table1[[#This Row],[Sr.No.]]=\"\",\"\",Table1[[#This Row],[Sr.No.]])","v":""},{"$f":"IF(Table1[[#This Row],[Employee Name]]=\"\",\"\",Table1[[#This Row],[Employee Name]])","v":""},{"$nulls":11},{"$f":"IFERROR(VLOOKUP(Table3[[#This Row],[Surrender Month]],DA_HRA_Rate,3,0),\"\")","v":""}]
[{"$f":"IF(Table1[[#This Row],[Sr.No.]]=\"\",\"\",Table1[[#This Row],[Sr.No.]])","v":""},{"$f":"IF(Table1[[#This Row],[Employee Name]]=\"\",\"\",Table1[[#This Row],[Employee Name]])","v":""},{"$nulls":11},{"$f":"IFERROR(VLOOKUP(Table3[[#This Row],[Surrender Month]],DA_HRA_Rate,3,0),\"\")","v":""}]
[{"$f":"IF(Table1[[#This Row],[Sr.No.]]=\"\",\"\",Table1[[#This Row],[Sr.No.]])","v":""},{"$f":"IF(Table1[[#This Row],[Employee Name]]=\"\",\"\",Table1[[#This Row],[Employee Name]])","v":""},{"$nulls":11},{"$f":"IFERROR(VLOOKUP(Table3[[#This Row],[Surrender Month]],DA_HRA_Rate,3,0),\"\")","v":""}]
[{"$f":"IF(Table1[[#This Row],[Sr.No.]]=\"\",\"\",Table1[[#This Row],[Sr.No.]])","v":""},{"$f":"IF(Table1[[#This Row],[Employee Name]]=\"\",\"\",Table1[[#This Row],[Employee Name]])","v":""},{"$nulls":11},{"$f":"IFERROR(VLOOKUP(Table3[[#This Row],[Surrender Month]],DA_HRA_Rate,3,0),\"\")","v":""}]
[{"$f":"IF(Table1[[#This Row],[Sr.No.]]=\"\",\"\",Table1[[#This Row],[Sr.No.]])","v":""},{"$f":"IF(Table1[[#This Row],[Employee Name]]=\"\",\"\",Table1[[#This Row],[Employee Name]])","v":""},{"$nulls":11},{"$f":"IFERROR(VLOOKUP(Table3[[#This Row],[Surrender Month]],DA_HRA_Rate,3,0),\"\")","v":""}]
[{"$f":"IF(Table1[[#This Row],[Sr.No.]]=\"\",\"\",Table1[[#This Row],[Sr.No.]])","v":""},{"$f":"IF(Table1[[#This Row],[Employee Name]]=\"\",\"\",Table1[[#This Row],[Employee Name]])","v":""},{"$nulls":11},{"$f":"IFERROR(VLOOKUP(Table3[[#This Row],[Surrender Month]],DA_HRA_Rate,3,0),\"\")","v":""}]
[{"$f":"IF(Table1[[#This Row],[Sr.No.]]=\"\",\"\",Table1[[#This Row],[Sr.No.]])","v":""},{"$f":"IF(Table1[[#This Row],[Employee Name]]=\"\",\"\",Table1[[#This Row],[Employee Name]])","v":""},{"$nulls":11},{"$f":"IFERROR(VLOOKUP(Table3[[#This Row],[Surrender Month]],DA_HRA_Rate,3,0),\"\")","v":""}]
[{"$f":"IF(Table1[[#This Row],[Sr.No.]]=\"\",\"\",Table1[[#This Row],[Sr.No.]])","v":""},{"$f":"IF(Table1[[#This Row],[Employee Name]]=\"\",\"\",Table1[[#This Row],[Employee Name]])","v":""},{"$nulls":11},{"$f":"IFERROR(VLOOKUP(Table3[[#This Row],[Surrender Month]],DA_HRA_Rate,3,0),\"\")","v":""}]
[{"$f":"IF(Table1[[#This Row],[Sr.No.]]=\"\",\"\",Table1[[#This Row],[Sr.No.]])","v":""},{"$f":"IF(Table1[[#This Row],[Employee Name]]=\"\",\"\",Table1[[#This Row],[Employee Name]])","v":""},{"$nulls":11},{"$f":"IFERROR(VLOOKUP(Table3[[#This Row],[Surrender Month]],DA_HRA_Rate,3,0),\"\")","v":""}]
[{"$f":"IF(Table1[[#This Row],[Sr.No.]]=\"\",\"\",Table1[[#This Row],[Sr.No.]])","v":""},{"$f":"IF(Table1[[#This Row],[Employee Name]]=\"\",\"\",Table1[[#This Row],[Employee Name]])","v":""},{"$nulls":11},{"$f":"IFERROR(VLOOKUP(Table3[[#This Row],[Surrender Month]],DA_HRA_Rate,3,0),\"\")","v":""}]
[{"$f":"IF(Table1[[#This Row],[Sr.No.]]=\"\",\"\",Table1[[#This Row],[Sr.No.]])","v":""},{"$f":"IF(Table1[[#This Row],[Employee Name]]=\"\",\"\",Table1[[#This Row],[Employee Name]])","v":""},{"$nulls":11},{"$f":"IFERROR(VLOOKUP(Table3[[#This Row],[Surrender Month]],DA_HRA_Rate,3,0),\"\")","v":""}]
[{"$f":"IF(Table1[[#This Row],[Sr.No.]]=\"\",\"\",Table1[[#This Row],[Sr.No.]])","v":""},{"$f":"IF(Table1[[#This Row],[Employee Name]]=\"\",\"\",Table1[[#This Row],[Employee Name]])","v":""},{"$nulls":11},{"$f":"IFERROR(VLOOKUP(Table3[[#This Row],[Surrender Month]],DA_HRA_Rate,3,0),\"\")","v":""}]
[{"$f":"IF(Table1[[#This Row],[Sr.No.]]=\"\",\"\",Table1[[#This Row],[Sr.No.]])","v":""},{"$f":"IF(Table1[[#This Row],[Employee Name]]=\"\",\"\",Table1[[#This Row],[Employee Name]])","v":""},{"$nulls":11},{"$f":"IFERROR(VLOOKUP(Table3[[#This Row],[Surrender Month]],DA_HRA_Rate,3,0),\"\")","v":""}]
[{"$f":"IF(Table1[[#This Row],[Sr.No.]]=\"\",\"\",Table1[[#This Row],[Sr.No.]])","v":""},{"$f":"IF(Table1[[#This Row],[Employee Name]]=\"\",\"\",Table1[[#This Row],[Employee Name]])","v":""},{"$nulls":11},{"$f":"IFERROR(VLOOKUP(Table3[[#This Row],[Surrender Month]],DA_HRA_Rate,3,0),\"\")","v":""}]
[{"$f":"IF(Table1[[#This Row],[Sr.No.]]=\"\",\"\",Table1[[#This Row],[Sr.No.]])","v":""},{"$f":"IF(Table1[[#This Row],[Employee Name]]=\"\",\"\",Table1[[#This Row],[Employee Name]])","v":""},{"$nulls":11},{"$f":"IFERROR(VLOOKUP(Table3[[#This Row],[Surrender Month]],DA_HRA_Rate,3,0),\"\")","v":""}]
[{"$f":"IF(Table1[[#This Row],[Sr.No.]]=\"\",\"\",Table1[[#This Row],[Sr.No.]])","v":""},{"$f":"IF(Table1[[#This Row],[Employee Name]]=\"\",\"\",Table1[[#This Row],[Employee Name]])","v":""},{"$nulls":11},{"$f":"IFERROR(VLOOKUP(Table3[[#This Row],[Surrender Month]],DA_HRA_Rate,3,0),\"\")","v":""}]
[{"$f":"IF(Table1[[#This Row],[Sr.No.]]=\"\",\"\",Table1[[#This Row],[Sr.No.]])","v":""},{"$f":"IF(Table1[[#This Row],[Employee Name]]=\"\",\"\",Table1[[#This Row],[Employee Name]])","v":""},{"$nulls":11},{"$f":"IFERROR(VLOOKUP(Table3[[#This Row],[Surrender Month]],DA_HRA_Rate,3,0),\"\")","v":""}]
[{"$f":"IF(Table1[[#This Row],[Sr.No.]]=\"\",\"\",Table1[[#This Row],[Sr.No.]])","v":""},{"$f":"IF(Table1[[#This Row],[Employee Name]]=\"\",\"\",Table1[[#This Row],[Employee Name]])","v":""},{"$nulls":11},{"$f":"IFERROR(VLOOKUP(Table3[[#This Row],[Surrender Month]],DA_HRA_Rate,3,0),\"\")","v":""}]
[{"$f":"IF(Table1[[#This Row],[Sr.No.]]=\"\",\"\",Table1[[#This Row],[Sr.No.]])","v":""},{"$f":"IF(Table1[[#This Row],[Employee Name]]=\"\",\"\",Table1[[#This Row],[Employee Name]])","v":""},{"$nulls":11},{"$f":"IFERROR(VLOOKUP(Table3[[#This Row],[Surrender Month]],DA_HRA_Rate,3,0),\"\")","v":""}]
[{"$f":"IF(Table1[[#This Row],[Sr.No.]]=\"\",\"\",Table1[[#This Row],[Sr.No.]])","v":""},{"$f":"IF(Table1[[#This Row],[Employee Name]]=\"\",\"\",Table1[[#This Row],[Employee Name]])","v":""},{"$nulls":11},{"$f":"IFERROR(VLOOKUP(Table3[[#This Row],[Surrender Month]],DA_HRA_Rate,3,0),\"\")","v":""}]
[{"$f":"IF(Table1[[#This Row],[Sr.No.]]=\"\",\"\",Table1[[#This Row],[Sr.No.]])","v":""},{"$f":"IF(Table1[[#This Row],[Employee Name]]=\"\",\"\",Table1[[#This Row],[Employee Name]])","v":""},{"$nulls":11},{"$f":"IFERROR(VLOOKUP(Table3[[#This Row],[Surrender Month]],DA_HRA_Rate,3,0),\"\")","v":""}]
[{"$f":"IF(Table1[[#This Row],[Sr.No.]]=\"\",\"\",Table1[[#This Row],[Sr.No.]])","v":""},{"$f":"IF(Table1[[#This Row],[Employee Name]]=\"\",\"\",Table1[[#This Row],[Employee Name]])","v":""},{"$nulls":11},{"$f":"IFERROR(VLOOKUP(Table3[[#This Row],[Surrender Month]],DA_HRA_Rate,3,0),\"\")","v":""}]
[{"$f":"IF(Table1[[#This Row],[Sr.No.]]=\"\",\"\",Table1[[#This Row],[Sr.No.]])","v":""},{"$f":"IF(Table1[[#This Row],[Employee Name]]=\"\",\"\",Table1[[#This Row],[Employee Name]])","v":""},{"$nulls":11},{"$f":"IFERROR(VLOOKUP(Table3[[#This Row],[Surrender Month]],DA_HRA_Rate,3,0),\"\")","v":""}]
[{"$f":"IF(Table1[[#This Row],[Sr.No.]]=\"\",\"\",Table1[[#This Row],[Sr.No.]])","v":""},{"$f":"IF(Table1[[#This Row],[Employee Name]]=\"\",\"\",Table1[[#This Row],[Employee Name]])","v":""},{"$nulls":11},{"$f":"IFERROR(VLOOKUP(Table3[[#This Row],[Surrender Month]],DA_HRA_Rate,3,0),\"\")","v":""}]
[{"$f":"IF(Table1[[#This Row],[Sr.No.]]=\"\",\"\",Table1[[#This Row],[Sr.No.]])","v":""},{"$f":"IF(Table1[[#This Row],[Employee Name]]=\"\",\"\",Table1[[#This Row],[Employee Name]])","v":""},{"$nulls":11},{"$f":"IFERROR(VLOOKUP(Table3[[#This Row],[Surrender Month]],DA_HRA_Rate,3,0),\"\")","v":""}]
[{"$f":"IF(Table1[[#This Row],[Sr.No.]]=\"\",\"\",Table1[[#This Row],[Sr.No.]])","v":""},{"$f":"IF(Table1[[#This Row],[Employee Name]]=\"\",\"\",Table1[[#This Row],[Employee Name]])","v":""},{"$nulls":11},{"$f":"IFERROR(VLOOKUP(Table3[[#This Row],[Surrender Month]],DA_HRA_Rate,3,0),\"\")","v":""}]
[{"$f":"IF(Table1[[#This Row],[Sr.No.]]=\"\",\"\",Table1[[#This Row],[Sr.No.]])","v":""},{"$f":"IF(Table1[[#This Row],[Employee Name]]=\"\",\"\",Table1[[#This Row],[Employee Name]])","v":""},{"$nulls":11},{"$f":"IFERROR(VLOOKUP(Table3[[#This Row],[Surrender Month]],DA_HRA_Rate,3,0),\"\")","v":""}]
[{"$f":"IF(Table1[[#This Row],[Sr.No.]]=\"\",\"\",Table1[[#This Row],[Sr.No.]])","v":""},{"$f":"IF(Table1[[#This Row],[Employee Name]]=\"\",\"\",Table1[[#This Row],[Employee Name]])","v":""},{"$nulls":11},{"$f":"IFERROR(VLOOKUP(Table3[[#This Row],[Surrender Month]],DA_HRA_Rate,3,0),\"\")","v":""}]
[{"$f":"IF(Table1[[#This Row],[Sr.No.]]=\"\",\"\",Table1[[#This Row],[Sr.No.]])","v":""},{"$f":"IF(Table1[[#This Row],[Employee Name]]=\"\",\"\",Table1[[#This Row],[Employee Name]])","v":""},{"$nulls":11},{"$f":"IFERROR(VLOOKUP(Table3[[#This Row],[Surrender Month]],DA_HRA_Rate,3,0),\"\")","v":""}]
[{"$f":"IF(Table1[[#This Row],[Sr.No.]]=\"\",\"\",Table1[[#This Row],[Sr.No.]])","v":""},{"$f":"IF(Table1[[#This Row],[Employee Name]]=\"\",\"\",Table1[[#This Row],[Employee Name]])","v":""},{"$nulls":11},{"$f":"IFERROR(VLOOKUP(Table3[[#This Row],[Surrender Month]],DA_HRA_Rate,3,0),\"\")","v":""}]
[{"$f":"IF(Table1[[#This Row],[Sr.No.]]=\"\",\"\",Table1[[#This Row],[Sr.No.]])","v":""},{"$f":"IF(Table1[[#This Row],[Employee Name]]=\"\",\"\",Table1[[#This Row],[Employee Name]])","v":""},{"$nulls":11},{"$f":"IFERROR(VLOOKUP(Table3[[#This Row],[Surrender Month]],DA_HRA_Rate,3,0),\"\")","v":""}]
[{"$f":"IF(Table1[[#This Row],[Sr.No.]]=\"\",\"\",Table1[[#This Row],[Sr.No.]])","v":""},{"$f":"IF(Table1[[#This Row],[Employee Name]]=\"\",\"\",Table1[[#This Row],[Employee Name]])","v":""},{"$nulls":11},{"$f":"IFERROR(VLOOKUP(Table3[[#This Row],[Surrender Month]],DA_HRA_Rate,3,0),\"\")","v":""}]
[{"$f":"IF(Table1[[#This Row],[Sr.No.]]=\"\",\"\",Table1[[#This Row],[Sr.No.]])","v":""},{"$f":"IF(Table1[[#This Row],[Employee Name]]=\"\",\"\",Table1[[#This Row],[Employee Name]])","v":""},{"$nulls":11},{"$f":"IFERROR(VLOOKUP(Table3[[#This Row],[Surrender Month]],DA_HRA_Rate,3,0),\"\")","v":""}]
[{"$f":"IF(Table1[[#This Row],[Sr.No.]]=\"\",\"\",Table1[[#This Row],[Sr.No.]])","v":""},{"$f":"IF(Table1[[#This Row],[Employee Name]]=\"\",\"\",Table1[[#This Row],[Employee Name]])","v":""},{"$nulls":11},{"$f":"IFERROR(VLOOKUP(Table3[[#This Row],[Surrender Month]],DA_HRA_Rate,3,0),\"\")","v":""}]
[{"$f":"IF(Table1[[#This Row],[Sr.No.]]=\"\",\"\",Table1[[#This Row],[Sr.No.]])","v":""},{"$f":"IF(Table1[[#This Row],[Employee Name]]=\"\",\"\",Table1[[#This Row],[Employee Name]])","v":""},{"$nulls":11},{"$f":"IFERROR(VLOOKUP(Table3[[#This Row],[Surrender Month]],DA_HRA_Rate,3,0),\"\")","v":""}]
[{"$f":"IF(Table1[[#This Row],[Sr.No.]]=\"\",\"\",Table1[[#This Row],[Sr.No.]])","v":""},{"$f":"IF(Table1[[#This Row],[Employee Name]]=\"\",\"\",Table1[[#This Row],[Employee Name]])","v":""},{"$nulls":11},{"$f":"IFERROR(VLOOKUP(Table3[[#This Row],[Surrender Month]],DA_HRA_Rate,3,0),\"\")","v":""}]
[{"$f":"IF(Table1[[#This Row],[Sr.No.]]=\"\",\"\",Table1[[#This Row],[Sr.No.]])","v":""},{"$f":"IF(Table1[[#This Row],[Employee Name]]=\"\",\"\",Table1[[#This Row],[Employee Name]])","v":""},{"$nulls":11},{"$f":"IFERROR(VLOOKUP(Table3[[#This Row],[Surrender Month]],DA_HRA_Rate,3,0),\"\")","v":""}]
[{"$f":"IF(Table1[[#This Row],[Sr.No.]]=\"\",\"\",Table1[[#This Row],[Sr.No.]])","v":""},{"$f":"IF(Table1[[#This Row],[Employee Name]]=\"\",\"\",Table1[[#This Row],[Employee Name]])","v":""},{"$nulls":11},{"$f":"IFERROR(VLOOKUP(Table3[[#This Row],[Surrender Month]],DA_HRA_Rate,3,0),\"\")","v":""}]
[{"$f":"IF(Table1[[#This Row],[Sr.No.]]=\"\",\"\",Table1[[#This Row],[Sr.No.]])","v":""},{"$f":"IF(Table1[[#This Row],[Employee Name]]=\"\",\"\",Table1[[#This Row],[Employee Name]])","v":""},{"$nulls":11},{"$f":"IFERROR(VLOOKUP(Table3[[#This Row],[Surrender Month]],DA_HRA_Rate,3,0),\"\")","v":""}]
[{"$f":"IF(Table1[[#This Row],[Sr.No.]]=\"\",\"\",Table1[[#This Row],[Sr.No.]])","v":""},{"$f":"IF(Table1[[#This Row],[Employee Name]]=\"\",\"\",Table1[[#This Row],[Employee Name]])","v":""},{"$nulls":11},{"$f":"IFERROR(VLOOKUP(Table3[[#This Row],[Surrender Month]],DA_HRA_Rate,3,0),\"\")","v":""}]
[{"$f":"IF(Table1[[#This Row],[Sr.No.]]=\"\",\"\",Table1[[#This Row],[Sr.No.]])","v":""},{"$f":"IF(Table1[[#This Row],[Employee Name]]=\"\",\"\",Table1[[#This Row],[Employee Name]])","v":""},{"$nulls":11},{"$f":"IFERROR(VLOOKUP(Table3[[#This Row],[Surrender Month]],DA_HRA_Rate,3,0),\"\")","v":""}]
[{"$f":"IF(Table1[[#This Row],[Sr.No.]]=\"\",\"\",Table1[[#This Row],[Sr.No.]])","v":""},{"$f":"IF(Table1[[#This Row],[Employee Name]]=\"\",\"\",Table1[[#This Row],[Employee Name]])","v":""},{"$nulls":11},{"$f":"IFERROR(VLOOKUP(Table3[[#This Row],[Surrender Month]],DA_HRA_Rate,3,0),\"\")","v":""}]
[{"$f":"IF(Table1[[#This Row],[Sr.No.]]=\"\",\"\",Table1[[#This Row],[Sr.No.]])","v":""},{"$f":"IF(Table1[[#This Row],[Employee Name]]=\"\",\"\",Table1[[#This Row],[Employee Name]])","v":""},{"$nulls":11},{"$f":"IFERROR(VLOOKUP(Table3[[#This Row],[Surrender Month]],DA_HRA_Rate,3,0),\"\")","v":""}]
[{"$f":"IF(Table1[[#This Row],[Sr.No.]]=\"\",\"\",Table1[[#This Row],[Sr.No.]])","v":""},{"$f":"IF(Table1[[#This Row],[Employee Name]]=\"\",\"\",Table1[[#This Row],[Employee Name]])","v":""},{"$nulls":11},{"$f":"IFERROR(VLOOKUP(Table3[[#This Row],[Surrender Month]],DA_HRA_Rate,3,0),\"\")","v":""}]
[{"$f":"IF(Table1[[#This Row],[Sr.No.]]=\"\",\"\",Table1[[#This Row],[Sr.No.]])","v":""},{"$f":"IF(Table1[[#This Row],[Employee Name]]=\"\",\"\",Table1[[#This Row],[Employee Name]])","v":""},{"$nulls":11},{"$f":"IFERROR(VLOOKUP(Table3[[#This Row],[Surrender Month]],DA_HRA_Rate,3,0),\"\")","v":""}]
[{"$f":"IF(Table1[[#This Row],[Sr.No.]]=\"\",\"\",Table1[[#This Row],[Sr.No.]])","v":""},{"$f":"IF(Table1[[#This Row],[Employee Name]]=\"\",\"\",Table1[[#This Row],[Employee Name]])","v":""},{"$nulls":11},{"$f":"IFERROR(VLOOKUP(Table3[[#This Row],[Surrender Month]],DA_HRA_Rate,3,0),\"\")","v":""}]
[{"$f":"IF(Table1[[#This Row],[Sr.No.]]=\"\",\"\",Table1[[#This Row],[Sr.No.]])","v":""},{"$f":"IF(Table1[[#This Row],[Employee Name]]=\"\",\"\",Table1[[#This Row],[Employee Name]])","v":""},{"$nulls":11},{"$f":"IFERROR(VLOOKUP(Table3[[#This Row],[Surrender Month]],DA_HRA_Rate,3,0),\"\")","v":""}]
[{"$f":"IF(Table1[[#This Row],[Sr.No.]]=\"\",\"\",Table1[[#This Row],[Sr.No.]])","v":""},{"$f":"IF(Table1[[#This Row],[Employee Name]]=\"\",\"\",Table1[[#This Row],[Employee Name]])","v":""},{"$nulls":11},{"$f":"IFERROR(VLOOKUP(Table3[[#This Row],[Surrender Month]],DA_HRA_Rate,3,0),\"\")","v":""}]
[{"$f":"IF(Table1[[#This Row],[Sr.No.]]=\"\",\"\",Table1[[#This Row],[Sr.No.]])","v":""},{"$f":"IF(Table1[[#This Row],[Employee Name]]=\"\",\"\",Table1[[#This Row],[Employee Name]])","v":""},{"$nulls":11},{"$f":"IFERROR(VLOOKUP(Table3[[#This Row],[Surrender Month]],DA_HRA_Rate,3,0),\"\")","v":""}]
[{"$f":"IF(Table1[[#This Row],[Sr.No.]]=\"\",\"\",Table1[[#This Row],[Sr.No.]])","v":""},{"$f":"IF(Table1[[#This Row],[Employee Name]]=\"\",\"\",Table1[[#This Row],[Employee Name]])","v":""},{"$nulls":11},{"$f":"IFERROR(VLOOKUP(Table3[[#This Row],[Surrender Month]],DA_HRA_Rate,3,0),\"\")","v":""}]
[{"$f":"IF(Table1[[#This Row],[Sr.No.]]=\"\",\"\",Table1[[#This Row],[Sr.No.]])","v":""},{"$f":"IF(Table1[[#This Row],[Employee Name]]=\"\",\"\",Table1[[#This Row],[Employee Name]])","v":""},{"$nulls":11},{"$f":"IFERROR(VLOOKUP(Table3[[#This Row],[Surrender Month]],DA_HRA_Rate,3,0),\"\")","v":""}]
[{"$f":"IF(Table1[[#This Row],[Sr.No.]]=\"\",\"\",Table1[[#This Row],[Sr.No.]])","v":""},{"$f":"IF(Table1[[#This Row],[Employee Name]]=\"\",\"\",Table1[[#This Row],[Employee Name]])","v":""},{"$nulls":11},{"$f":"IFERROR(VLOOKUP(Table3[[#This Row],[Surrender Month]],DA_HRA_Rate,3,0),\"\")","v":""}]
[{"$f":"IF(Table1[[#This Row],[Sr.No.]]=\"\",\"\",Table1[[#This Row],[Sr.No.]])","v":""},{"$f":"IF(Table1[[#This Row],[Employee Name]]=\"\",\"\",Table1[[#This Row],[Employee Name]])","v":""},{"$nulls":11},{"$f":"IFERROR(VLOOKUP(Table3[[#This Row],[Surrender Month]],DA_HRA_Rate,3,0),\"\")","v":""}]
[{"$f":"IF(Table1[[#This Row],[Sr.No.]]=\"\",\"\",Table1[[#This Row],[Sr.No.]])","v":""},{"$f":"IF(Table1[[#This Row],[Employee Name]]=\"\",\"\",Table1[[#This Row],[Employee Name]])","v":""},{"$nulls":11},{"$f":"IFERROR(VLOOKUP(Table3[[#This Row],[Surrender Month]],DA_HRA_Rate,3,0),\"\")","v":""}]
[{"$f":"IF(Table1[[#This Row],[Sr.No.]]=\"\",\"\",Table1[[#This Row],[Sr.No.]])","v":""},{"$f":"IF(Table1[[#This Row],[Employee Name]]=\"\",\"\",Table1[[#This Row],[Employee Name]])","v":""},{"$nulls":11},{"$f":"IFERROR(VLOOKUP(Table3[[#This Row],[Surrender Month]],DA_HRA_Rate,3,0),\"\")","v":""}]
[{"$f":"IF(Table1[[#This Row],[Sr.No.]]=\"\",\"\",Table1[[#This Row],[Sr.No.]])","v":""},{"$f":"IF(Table1[[#This Row],[Employee Name]]=\"\",\"\",Table1[[#This Row],[Employee Name]])","v":""},{"$nulls":11},{"$f":"IFERROR(VLOOKUP(Table3[[#This Row],[Surrender Month]],DA_HRA_Rate,3,0),\"\")","v":""}]
[{"$f":"IF(Table1[[#This Row],[Sr.No.]]=\"\",\"\",Table1[[#This Row],[Sr.No.]])","v":""},{"$f":"IF(Table1[[#This Row],[Employee Name]]=\"\",\"\",Table1[[#This Row],[Employee Name]])","v":""},{"$nulls":11},{"$f":"IFERROR(VLOOKUP(Table3[[#This Row],[Surrender Month]],DA_HRA_Rate,3,0),\"\")","v":""}]
[{"$f":"IF(Table1[[#This Row],[Sr.No.]]=\"\",\"\",Table1[[#This Row],[Sr.No.]])","v":""},{"$f":"IF(Table1[[#This Row],[Employee Name]]=\"\",\"\",Table1[[#This Row],[Employee Name]])","v":""},{"$nulls":11},{"$f":"IFERROR(VLOOKUP(Table3[[#This Row],[Surrender Month]],DA_HRA_Rate,3,0),\"\")","v":""}]
[{"$f":"IF(Table1[[#This Row],[Sr.No.]]=\"\",\"\",Table1[[#This Row],[Sr.No.]])","v":""},{"$f":"IF(Table1[[#This Row],[Employee Name]]=\"\",\"\",Table1[[#This Row],[Employee Name]])","v":""},{"$nulls":11},{"$f":"IFERROR(VLOOKUP(Table3[[#This Row],[Surrender Month]],DA_HRA_Rate,3,0),\"\")","v":""}]
[{"$f":"IF(Table1[[#This Row],[Sr.No.]]=\"\",\"\",Table1[[#This Row],[Sr.No.]])","v":""},{"$f":"IF(Table1[[#This Row],[Employee Name]]=\"\",\"\",Table1[[#This Row],[Employee Name]])","v":""},{"$nulls":11},{"$f":"IFERROR(VLOOKUP(Table3[[#This Row],[Surrender Month]],DA_HRA_Rate,3,0),\"\")","v":""}]
[{"$f":"IF(Table1[[#This Row],[Sr.No.]]=\"\",\"\",Table1[[#This Row],[Sr.No.]])","v":""},{"$f":"IF(Table1[[#This Row],[Employee Name]]=\"\",\"\",Table1[[#This Row],[Employee Name]])","v":""},{"$nulls":11},{"$f":"IFERROR(VLOOKUP(Table3[[#This Row],[Surrender Month]],DA_HRA_Rate,3,0),\"\")","v":""}]
[{"$f":"IF(Table1[[#This Row],[Sr.No.]]=\"\",\"\",Table1[[#This Row],[Sr.No.]])","v":""},{"$f":"IF(Table1[[#This Row],[Employee Name]]=\"\",\"\",Table1[[#This Row],[Employee Name]])","v":""},{"$nulls":11},{"$f":"IFERROR(VLOOKUP(Table3[[#This Row],[Surrender Month]],DA_HRA_Rate,3,0),\"\")","v":""}]
[{"$f":"IF(Table1[[#This Row],[Sr.No.]]=\"\",\"\",Table1[[#This Row],[Sr.No.]])","v":""},{"$f":"IF(Table1[[#This Row],[Employee Name]]=\"\",\"\",Table1[[#This Row],[Employee Name]])","v":""},{"$nulls":11},{"$f":"IFERROR(VLOOKUP(Table3[[#This Row],[Surrender Month]],DA_HRA_Rate,3,0),\"\")","v":""}]
[{"$f":"IF(Table1[[#This Row],[Sr.No.]]=\"\",\"\",Table1[[#This Row],[Sr.No.]])","v":""},{"$f":"IF(Table1[[#This Row],[Employee Name]]=\"\",\"\",Table1[[#This Row],[Employee Name]])","v":""},{"$nulls":11},{"$f":"IFERROR(VLOOKUP(Table3[[#This Row],[Surrender Month]],DA_HRA_Rate,3,0),\"\")","v":""}]
[{"$f":"IF(Table1[[#This Row],[Sr.No.]]=\"\",\"\",Table1[[#This Row],[Sr.No.]])","v":""},{"$f":"IF(Table1[[#This Row],[Employee Name]]=\"\",\"\",Table1[[#This Row],[Employee Name]])","v":""},{"$nulls":11},{"$f":"IFERROR(VLOOKUP(Table3[[#This Row],[Surrender Month]],DA_HRA_Rate,3,0),\"\")","v":""}]
[{"$f":"IF(Table1[[#This Row],[Sr.No.]]=\"\",\"\",Table1[[#This Row],[Sr.No.]])","v":""},{"$f":"IF(Table1[[#This Row],[Employee Name]]=\"\",\"\",Table1[[#This Row],[Employee Name]])","v":""},{"$nulls":11},{"$f":"IFERROR(VLOOKUP(Table3[[#This Row],[Surrender Month]],DA_HRA_Rate,3,0),\"\")","v":""}]
[{"$f":"IF(Table1[[#This Row],[Sr.No.]]=\"\",\"\",Table1[[#This Row],[Sr.No.]])","v":""},{"$f":"IF(Table1[[#This Row],[Employee Name]]=\"\",\"\",Table1[[#This Row],[Employee Name]])","v":""},{"$nulls":11},{"$f":"IFERROR(VLOOKUP(Table3[[#This Row],[Surrender Month]],DA_HRA_Rate,3,0),\"\")","v":""}]
[{"$f":"IF(Table1[[#This Row],[Sr.No.]]=\"\",\"\",Table1[[#This Row],[Sr.No.]])","v":""},{"$f":"IF(Table1[[#This Row],[Employee Name]]=\"\",\"\",Table1[[#This Row],[Employee Name]])","v":""},{"$nulls":11},{"$f":"IFERROR(VLOOKUP(Table3[[#This Row],[Surrender Month]],DA_HRA_Rate,3,0),\"\")","v":""}]
[{"$f":"IF(Table1[[#This Row],[Sr.No.]]=\"\",\"\",Table1[[#This Row],[Sr.No.]])","v":""},{"$f":"IF(Table1[[#This Row],[Employee Name]]=\"\",\"\",Table1[[#This Row],[Employee Name]])","v":""},{"$nulls":11},{"$f":"IFERROR(VLOOKUP(Table3[[#This Row],[Surrender Month]],DA_HRA_Rate,3,0),\"\")","v":""}]
[{"$f":"IF(Table1[[#This Row],[Sr.No.]]=\"\",\"\",Table1[[#This Row],[Sr.No.]])","v":""},{"$f":"IF(Table1[[#This Row],[Employee Name]]=\"\",\"\",Table1[[#This Row],[Employee Name]])","v":""},{"$nulls":11},{"$f":"IFERROR(VLOOKUP(Table3[[#This Row],[Surrender Month]],DA_HRA_Rate,3,0),\"\")","v":""}]
[{"$f":"IF(Table1[[#This Row],[Sr.No.]]=\"\",\"\",Table1[[#This Row],[Sr.No.]])","v":""},{"$f":"IF(Table1[[#This Row],[Employee Name]]=\"\",\"\",Table1[[#This Row],[Employee Name]])","v":""},{"$nulls":11},{"$f":"IFERROR(VLOOKUP(Table3[[#This Row],[Surrender Month]],DA_HRA_Rate,3,0),\"\")","v":""}]
[{"$f":"IF(Table1[[#This Row],[Sr.No.]]=\"\",\"\",Table1[[#This Row],[Sr.No.]])","v":""},{"$f":"IF(Table1[[#This Row],[Employee Name]]=\"\",\"\",Table1[[#This Row],[Employee Name]])","v":""},{"$nulls":11},{"$f":"IFERROR(VLOOKUP(Table3[[#This Row],[Surrender Month]],DA_HRA_Rate,3,0),\"\")","v":""}]
[{"$f":"IF(Table1[[#This Row],[Sr.No.]]=\"\",\"\",Table1[[#This Row],[Sr.No.]])","v":""},{"$f":"IF(Table1[[#This Row],[Employee Name]]=\"\",\"\",Table1[[#This Row],[Employee Name]])","v":""},{"$nulls":11},{"$f":"IFERROR(VLOOKUP(Table3[[#This Row],[Surrender Month]],DA_HRA_Rate,3,0),\"\")","v":""}]
[{"$f":"IF(Table1[[#This Row],[Sr.No.]]=\"\",\"\",Table1[[#This Row],[Sr.No.]])","v":""},{"$f":"IF(Table1[[#This Row],[Employee Name]]=\"\",\"\",Table1[[#This Row],[Employee Name]])","v":""},{"$nulls":11},{"$f":"IFERROR(VLOOKUP(Table3[[#This Row],[Surrender Month]],DA_HRA_Rate,3,0),\"\")","v":""}]
[{"$f":"IF(Table1[[#This Row],[Sr.No.]]=\"\",\"\",Table1[[#This Row],[Sr.No.]])","v":""},{"$f":"IF(Table1[[#This Row],[Employee Name]]=\"\",\"\",Table1[[#This Row],[Employee Name]])","v":""},{"$nulls":11},{"$f":"IFERROR(VLOOKUP(Table3[[#This Row],[Surrender Month]],DA_HRA_Rate,3,0),\"\")","v":""}]
[{"$f":"IF(Table1[[#This Row],[Sr.No.]]=\"\",\"\",Table1[[#This Row],[Sr.No.]])","v":""},{"$f":"IF(Table1[[#This Row],[Employee Name]]=\"\",\"\",Table1[[#This Row],[Employee Name]])","v":""},{"$nulls":11},{"$f":"IFERROR(VLOOKUP(Table3[[#This Row],[Surrender Month]],DA_HRA_Rate,3,0),\"\")","v":""}]
[{"$f":"IF(Table1[[#This Row],[Sr.No.]]=\"\",\"\",Table1[[#This Row],[Sr.No.]])","v":""},{"$f":"IF(Table1[[#This Row],[Employee Name]]=\"\",\"\",Table1[[#This Row],[Employee Name]])","v":""},{"$nulls":11},{"$f":"IFERROR(VLOOKUP(Table3[[#This Row],[Surrender Month]],DA_HRA_Rate,3,0),\"\")","v":""}]
[{"$f":"IF(Table1[[#This Row],[Sr.No.]]=\"\",\"\",Table1[[#This Row],[Sr.No.]])","v":""},{"$f":"IF(Table1[[#This Row],[Employee Name]]=\"\",\"\",Table1[[#This Row],[Employee Name]])","v":""},{"$nulls":11},{"$f":"IFERROR(VLOOKUP(Table3[[#This Row],[Surrender Month]],DA_HRA_Rate,3,0),\"\")","v":""}]
[{"$f":"IF(Table1[[#This Row],[Sr.No.]]=\"\",\"\",Table1[[#This Row],[Sr.No.]])","v":""},{"$f":"IF(Table1[[#This Row],[Employee Name]]=\"\",\"\",Table1[[#This Row],[Employee Name]])","v":""},{"$nulls":11},{"$f":"IFERROR(VLOOKUP(Table3[[#This Row],[Surrender Month]],DA_HRA_Rate,3,0),\"\")","v":""}]
[{"$f":"IF(Table1[[#This Row],[Sr.No.]]=\"\",\"\",Table1[[#This Row],[Sr.No.]])","v":""},{"$f":"IF(Table1[[#This Row],[Employee Name]]=\"\",\"\",Table1[[#This Row],[Employee Name]])","v":""},{"$nulls":11},{"$f":"IFERROR(VLOOKUP(Table3[[#This Row],[Surrender Month]],DA_HRA_Rate,3,0),\"\")","v":""}]

{"sheet":"Deductions","index":3,"n_rows":182,"n_cols":11,"rows_kept":182,"merged":[[0,0,0,10],[1,0,1,10]]}
[{"$f":"Master!$C$1","v":"GSSS Deogarh"}]
["Deductions Detail Employee wise"]
[]
["Sr.No","Employee Name","GPF","SIP","RPMF","CM Corona","LIC","GPF Loan","SIL","Itax","Other Ded."]
[{"$f":"IF(Table1[[#This Row],[Sr.No.]]=\"\",\"\",Table1[[#This Row],[Sr.No.]])","v":1},{"$f":"IF(Table1[[#This Row],[Employee Name]]=\"\",\"\",Table1[[#This Row],[Employee Name]])","v":"Ashwini Kumar"},null,3000,{"$nulls":5},100]
[{"$f":"IF(Table1[[#This Row],[Sr.No.]]=\"\",\"\",Table1[[#This Row],[Sr.No.]])","v":""},{"$f":"IF(Table1[[#This Row],[Employee Name]]=\"\",\"\",Table1[[#This Row],[Employee Name]])","v":""}]
[{"$f":"IF(Table1[[#This Row],[Sr.No.]]=\"\",\"\",Table1[[#This Row],[Sr.No.]])","v":""},{"$f":"IF(Table1[[#This Row],[Employee Name]]=\"\",\"\",Table1[[#This Row],[Employee Name]])","v":""}]
[{"$f":"IF(Table1[[#This Row],[Sr.No.]]=\"\",\"\",Table1[[#This Row],[Sr.No.]])","v":""},{"$f":"IF(Table1[[#This Row],[Employee Name]]=\"\",\"\",Table1[[#This Row],[Employee Name]])","v":""}]
[{"$f":"IF(Table1[[#This Row],[Sr.No.]]=\"\",\"\",Table1[[#This Row],[Sr.No.]])","v":""},{"$f":"IF(Table1[[#This Row],[Employee Name]]=\"\",\"\",Table1[[#This Row],[Employee Name]])","v":""}]
[{"$f":"IF(Table1[[#This Row],[Sr.No.]]=\"\",\"\",Table1[[#This Row],[Sr.No.]])","v":""},{"$f":"IF(Table1[[#This Row],[Employee Name]]=\"\",\"\",Table1[[#This Row],[Employee Name]])","v":""}]
[{"$f":"IF(Table1[[#This Row],[Sr.No.]]=\"\",\"\",Table1[[#This Row],[Sr.No.]])","v":""},{"$f":"IF(Table1[[#This Row],[Employee Name]]=\"\",\"\",Table1[[#This Row],[Employee Name]])","v":""}]
[{"$f":"IF(Table1[[#This Row],[Sr.No.]]=\"\",\"\",Table1[[#This Row],[Sr.No.]])","v":""},{"$f":"IF(Table1[[#This Row],[Employee Name]]=\"\",\"\",Table1[[#This Row],[Employee Name]])","v":""}]
[{"$f":"IF(Table1[[#This Row],[Sr.No.]]=\"\",\"\",Table1[[#This Row],[Sr.No.]])","v":""},{"$f":"IF(Table1[[#This Row],[Employee Name]]=\"\",\"\",Table1[[#This Row],[Employee Name]])","v":""}]
[{"$f":"IF(Table1[[#This Row],[Sr.No.]]=\"\",\"\",Table1[[#This Row],[Sr.No.]])","v":""},{"$f":"IF(Table1[[#This Row],[Employee Name]]=\"\",\"\",Table1[[#This Row],[Employee Name]])","v":""}]
[{"$f":"IF(Table1[[#This Row],[Sr.No.]]=\"\",\"\",Table1[[#This Row],[Sr.No.]])","v":""},{"$f":"IF(Table1[[#This Row],[Employee Name]]=\"\",\"\",Table1[[#This Row],[Employee Name]])","v":""}]
[{"$f":"IF(Table1[[#This Row],[Sr.No.]]=\"\",\"\",Table1[[#This Row],[Sr.No.]])","v":""},{"$f":"IF(Table1[[#This Row],[Employee Name]]=\"\",\"\",Table1[[#This Row],[Employee Name]])","v":""}]
[{"$f":"IF(Table1[[#This Row],[Sr.No.]]=\"\",\"\",Table1[[#This Row],[Sr.No.]])","v":""},{"$f":"IF(Table1[[#This Row],[Employee Name]]=\"\",\"\",Table1[[#This Row],[Employee Name]])","v":""}]
[{"$f":"IF(Table1[[#This Row],[Sr.No.]]=\"\",\"\",Table1[[#This Row],[Sr.No.]])","v":""},{"$f":"IF(Table1[[#This Row],[Employee Name]]=\"\",\"\",Table1[[#This Row],[Employee Name]])","v":""}]
[{"$f":"IF(Table1[[#This Row],[Sr.No.]]=\"\",\"\",Table1[[#This Row],[Sr.No.]])","v":""},{"$f":"IF(Table1[[#This Row],[Employee Name]]=\"\",\"\",Table1[[#This Row],[Employee Name]])","v":""}]
[{"$f":"IF(Table1[[#This Row],[Sr.No.]]=\"\",\"\",Table1[[#This Row],[Sr.No.]])","v":""},{"$f":"IF(Table1[[#This Row],[Employee Name]]=\"\",\"\",Table1[[#This Row],[Employee Name]])","v":""}]
[{"$f":"IF(Table1[[#This Row],[Sr.No.]]=\"\",\"\",Table1[[#This Row],[Sr.No.]])","v":""},{"$f":"IF(Table1[[#This Row],[Employee Name]]=\"\",\"\",Table1[[#This Row],[Employee Name]])","v":""}]
[{"$f":"IF(Table1[[#This Row],[Sr.No.]]=\"\",\"\",Table1[[#This Row],[Sr.No.]])","v":""},{"$f":"IF(Table1[[#This Row],[Employee Name]]=\"\",\"\",Table1[[#This Row],[Employee Name]])","v":""}]
[{"$f":"IF(Table1[[#This Row],[Sr.No.]]=\"\",\"\",Table1[[#This Row],[Sr.No.]])","v":""},{"$f":"IF(Table1[[#This Row],[Employee Name]]=\"\",\"\",Table1[[#This Row],[Employee Name]])","v":""}]
[{"$f":"IF(Table1[[#This Row],[Sr.No.]]=\"\",\"\",Table1[[#This Row],[Sr.No.]])","v":""},{"$f":"IF(Table1[[#This Row],[Employee Name]]=\"\",\"\",Table1[[#This Row],[Employee Name]])","v":""}]
[{"$f":"IF(Table1[[#This Row],[Sr.No.]]=\"\",\"\",Table1[[#This Row],[Sr.No.]])","v":""},{"$f":"IF(Table1[[#This Row],[Employee Name]]=\"\",\"\",Table1[[#This Row],[Employee Name]])","v":""}]
[{"$f":"IF(Table1[[#This Row],[Sr.No.]]=\"\",\"\",Table1[[#This Row],[Sr.No.]])","v":""},{"$f":"IF(Table1[[#This Row],[Employee Name]]=\"\",\"\",Table1[[#This Row],[Employee Name]])","v":""}]
[{"$f":"IF(Table1[[#This Row],[Sr.No.]]=\"\",\"\",Table1[[#This Row],[Sr.No.]])","v":""},{"$f":"IF(Table1[[#This Row],[Employee Name]]=\"\",\"\",Table1[[#This Row],[Employee Name]])","v":""}]
[{"$f":"IF(Table1[[#This Row],[Sr.No.]]=\"\",\"\",Table1[[#This Row],[Sr.No.]])","v":""},{"$f":"IF(Table1[[#This Row],[Employee Name]]=\"\",\"\",Table1[[#This Row],[Employee Name]])","v":""}]
[{"$f":"IF(Table1[[#This Row],[Sr.No.]]=\"\",\"\",Table1[[#This Row],[Sr.No.]])","v":""},{"$f":"IF(Table1[[#This Row],[Employee Name]]=\"\",\"\",Table1[[#This Row],[Employee Name]])","v":""}]
[{"$f":"IF(Table1[[#This Row],[Sr.No.]]=\"\",\"\",Table1[[#This Row],[Sr.No.]])","v":""},{"$f":"IF(Table1[[#This Row],[Employee Name]]=\"\",\"\",Table1[[#This Row],[Employee Name]])","v":""}]
[{"$f":"IF(Table1[[#This Row],[Sr.No.]]=\"\",\"\",Table1[[#This Row],[Sr.No.]])","v":""},{"$f":"IF(Table1[[#This Row],[Employee Name]]=\"\",\"\",Table1[[#This Row],[Employee Name]])","v":""}]
[{"$f":"IF(Table1[[#This Row],[Sr.No.]]=\"\",\"\",Table1[[#This Row],[Sr.No.]])","v":""},{"$f":"IF(Table1[[#This Row],[Employee Name]]=\"\",\"\",Table1[[#This Row],[Employee Name]])","v":""}]
[{"$f":"IF(Table1[[#This Row],[Sr.No.]]=\"\",\"\",Table1[[#This Row],[Sr.No.]])","v":""},{"$f":"IF(Table1[[#This Row],[Employee Name]]=\"\",\"\",Table1[[#This Row],[Employee Name]])","v":""}]
[{"$f":"IF(Table1[[#This Row],[Sr.No.]]=\"\",\"\",Table1[[#This Row],[Sr.No.]])","v":""},{"$f":"IF(Table1[[#This Row],[Employee Name]]=\"\",\"\",Table1[[#This Row],[Employee Name]])","v":""}]
[{"$f":"IF(Table1[[#This Row],[Sr.No.]]=\"\",\"\",Table1[[#This Row],[Sr.No.]])","v":""},{"$f":"IF(Table1[[#This Row],[Employee Name]]=\"\",\"\",Table1[[#This Row],[Employee Name]])","v":""}]
[{"$f":"IF(Table1[[#This Row],[Sr.No.]]=\"\",\"\",Table1[[#This Row],[Sr.No.]])","v":""},{"$f":"IF(Table1[[#This Row],[Employee Name]]=\"\",\"\",Table1[[#This Row],[Employee Name]])","v":""}]
[{"$f":"IF(Table1[[#This Row],[Sr.No.]]=\"\",\"\",Table1[[#This Row],[Sr.No.]])","v":""},{"$f":"IF(Table1[[#This Row],[Employee Name]]=\"\",\"\",Table1[[#This Row],[Employee Name]])","v":""}]
[{"$f":"IF(Table1[[#This Row],[Sr.No.]]=\"\",\"\",Table1[[#This Row],[Sr.No.]])","v":""},{"$f":"IF(Table1[[#This Row],[Employee Name]]=\"\",\"\",Table1[[#This Row],[Employee Name]])","v":""}]
[{"$f":"IF(Table1[[#This Row],[Sr.No.]]=\"\",\"\",Table1[[#This Row],[Sr.No.]])","v":""},{"$f":"IF(Table1[[#This Row],[Employee Name]]=\"\",\"\",Table1[[#This Row],[Employee Name]])","v":""}]
[{"$f":"IF(Table1[[#This Row],[Sr.No.]]=\"\",\"\",Table1[[#This Row],[Sr.No.]])","v":""},{"$f":"IF(Table1[[#This Row],[Employee Name]]=\"\",\"\",Table1[[#This Row],[Employee Name]])","v":""}]
[{"$f":"IF(Table1[[#This Row],[Sr.No.]]=\"\",\"\",Table1[[#This Row],[Sr.No.]])","v":""},{"$f":"IF(Table1[[#This Row],[Employee Name]]=\"\",\"\",Table1[[#This Row],[Employee Name]])","v":""}]
[{"$f":"IF(Table1[[#This Row],[Sr.No.]]=\"\",\"\",Table1[[#This Row],[Sr.No.]])","v":""},{"$f":"IF(Table1[[#This Row],[Employee Name]]=\"\",\"\",Table1[[#This Row],[Employee Name]])","v":""}]
[{"$f":"IF(Table1[[#This Row],[Sr.No.]]=\"\",\"\",Table1[[#This Row],[Sr.No.]])","v":""},{"$f":"IF(Table1[[#This Row],[Employee Name]]=\"\",\"\",Table1[[#This Row],[Employee Name]])","v":""}]
[{"$f":"IF(Table1[[#This Row],[Sr.No.]]=\"\",\"\",Table1[[#This Row],[Sr.No.]])","v":""},{"$f":"IF(Table1[[#This Row],[Employee Name]]=\"\",\"\",Table1[[#This Row],[Employee Name]])","v":""}]
[{"$f":"IF(Table1[[#This Row],[Sr.No.]]=\"\",\"\",Table1[[#This Row],[Sr.No.]])","v":""},{"$f":"IF(Table1[[#This Row],[Employee Name]]=\"\",\"\",Table1[[#This Row],[Employee Name]])","v":""}]
[{"$f":"IF(Table1[[#This Row],[Sr.No.]]=\"\",\"\",Table1[[#This Row],[Sr.No.]])","v":""},{"$f":"IF(Table1[[#This Row],[Employee Name]]=\"\",\"\",Table1[[#This Row],[Employee Name]])","v":""}]
[{"$f":"IF(Table1[[#This Row],[Sr.No.]]=\"\",\"\",Table1[[#This Row],[Sr.No.]])","v":""},{"$f":"IF(Table1[[#This Row],[Employee Name]]=\"\",\"\",Table1[[#This Row],[Employee Name]])","v":""}]
[{"$f":"IF(Table1[[#This Row],[Sr.No.]]=\"\",\"\",Table1[[#This Row],[Sr.No.]])","v":""},{"$f":"IF(Table1[[#This Row],[Employee Name]]=\"\",\"\",Table1[[#This Row],[Employee Name]])","v":""}]
[{"$f":"IF(Table1[[#This Row],[Sr.No.]]=\"\",\"\",Table1[[#This Row],[Sr.No.]])","v":""},{"$f":"IF(Table1[[#This Row],[Employee Name]]=\"\",\"\",Table1[[#This Row],[Employee Name]])","v":""}]
[{"$f":"IF(Table1[[#This Row],[Sr.No.]]=\"\",\"\",Table1[[#This Row],[Sr.No.]])","v":""},{"$f":"IF(Table1[[#This Row],[Employee Name]]=\"\",\"\",Table1[[#This Row],[Employee Name]])","v":""}]
[{"$f":"IF(Table1[[#This Row],[Sr.No.]]=\"\",\"\",Table1[[#This Row],[Sr.No.]])","v":""},{"$f":"IF(Table1[[#This Row],[Employee Name]]=\"\",\"\",Table1[[#This Row],[Employee Name]])","v":""}]
[{"$f":"IF(Table1[[#This Row],[Sr.No.]]=\"\",\"\",Table1[[#This Row],[Sr.No.]])","v":""},{"$f":"IF(Table1[[#This Row],[Employee Name]]=\"\",\"\",Table1[[#This Row],[Employee Name]])","v":""}]
[{"$f":"IF(Table1[[#This Row],[Sr.No.]]=\"\",\"\",Table1[[#This Row],[Sr.No.]])","v":""},{"$f":"IF(Table1[[#This Row],[Employee Name]]=\"\",\"\",Table1[[#This Row],[Employee Name]])","v":""}]
[{"$f":"IF(Table1[[#This Row],[Sr.No.]]=\"\",\"\",Table1[[#This Row],[Sr.No.]])","v":""},{"$f":"IF(Table1[[#This Row],[Employee Name]]=\"\",\"\",Table1[[#This Row],[Employee Name]])","v":""}]
[{"$f":"IF(Table1[[#This Row],[Sr.No.]]=\"\",\"\",Table1[[#This Row],[Sr.No.]])","v":""},{"$f":"IF(Table1[[#This Row],[Employee Name]]=\"\",\"\",Table1[[#This Row],[Employee Name]])","v":""}]
[{"$f":"IF(Table1[[#This Row],[Sr.No.]]=\"\",\"\",Table1[[#This Row],[Sr.No.]])","v":""},{"$f":"IF(Table1[[#This Row],[Employee Name]]=\"\",\"\",Table1[[#This Row],[Employee Name]])","v":""}]
[{"$f":"IF(Table1[[#This Row],[Sr.No.]]=\"\",\"\",Table1[[#This Row],[Sr.No.]])","v":""},{"$f":"IF(Table1[[#This Row],[Employee Name]]=\"\",\"\",Table1[[#This Row],[Employee Name]])","v":""}]
[{"$f":"IF(Table1[[#This Row],[Sr.No.]]=\"\",\"\",Table1[[#This Row],[Sr.No.]])","v":""},{"$f":"IF(Table1[[#This Row],[Employee Name]]=\"\",\"\",Table1[[#This Row],[Employee Name]])","v":""}]
[{"$f":"IF(Table1[[#This Row],[Sr.No.]]=\"\",\"\",Table1[[#This Row],[Sr.No.]])","v":""},{"$f":"IF(Table1[[#This Row],[Employee Name]]=\"\",\"\",Table1[[#This Row],[Employee Name]])","v":""}]
[{"$f":"IF(Table1[[#This Row],[Sr.No.]]=\"\",\"\",Table1[[#This Row],[Sr.No.]])","v":""},{"$f":"IF(Table1[[#This Row],[Employee Name]]=\"\",\"\",Table1[[#This Row],[Employee Name]])","v":""}]
[{"$f":"IF(Table1[[#This Row],[Sr.No.]]=\"\",\"\",Table1[[#This Row],[Sr.No.]])","v":""},{"$f":"IF(Table1[[#This Row],[Employee Name]]=\"\",\"\",Table1[[#This Row],[Employee Name]])","v":""}]
[{"$f":"IF(Table1[[#This Row],[Sr.No.]]=\"\",\"\",Table1[[#This Row],[Sr.No.]])","v":""},{"$f":"IF(Table1[[#This Row],[Employee Name]]=\"\",\"\",Table1[[#This Row],[Employee Name]])","v":""}]
[{"$f":"IF(Table1[[#This Row],[Sr.No.]]=\"\",\"\",Table1[[#This Row],[Sr.No.]])","v":""},{"$f":"IF(Table1[[#This Row],[Employee Name]]=\"\",\"\",Table1[[#This Row],[Employee Name]])","v":""}]
[{"$f":"IF(Table1[[#This Row],[Sr.No.]]=\"\",\"\",Table1[[#This Row],[Sr.No.]])","v":""},{"$f":"IF(Table1[[#This Row],[Employee Name]]=\"\",\"\",Table1[[#This Row],[Employee Name]])","v":""}]
[{"$f":"IF(Table1[[#This Row],[Sr.No.]]=\"\",\"\",Table1[[#This Row],[Sr.No.]])","v":""},{"$f":"IF(Table1[[#This Row],[Employee Name]]=\"\",\"\",Table1[[#This Row],[Employee Name]])","v":""}]
[{"$f":"IF(Table1[[#This Row],[Sr.No.]]=\"\",\"\",Table1[[#This Row],[Sr.No.]])","v":""},{"$f":"IF(Table1[[#This Row],[Employee Name]]=\"\",\"\",Table1[[#This Row],[Employee Name]])","v":""}]
[{"$f":"IF(Table1[[#This Row],[Sr.No.]]=\"\",\"\",Table1[[#This Row],[Sr.No.]])","v":""},{"$f":"IF(Table1[[#This Row],[Employee Name]]=\"\",\"\",Table1[[#This Row],[Employee Name]])","v":""}]
[{"$f":"IF(Table1[[#This Row],[Sr.No.]]=\"\",\"\",Table1[[#This Row],[Sr.No.]])","v":""},{"$f":"IF(Table1[[#This Row],[Employee Name]]=\"\",\"\",Table1[[#This Row],[Employee Name]])","v":""}]
[{"$f":"IF(Table1[[#This Row],[Sr.No.]]=\"\",\"\",Table1[[#This Row],[Sr.No.]])","v":""},{"$f":"IF(Table1[[#This Row],[Employee Name]]=\"\",\"\",Table1[[#This Row],[Employee Name]])","v":""}]
[{"$f":"IF(Table1[[#This Row],[Sr.No.]]=\"\",\"\",Table1[[#This Row],[Sr.No.]])","v":""},{"$f":"IF(Table1[[#This Row],[Employee Name]]=\"\",\"\",Table1[[#This Row],[Employee Name]])","v":""}]
[{"$f":"IF(Table1[[#This Row],[Sr.No.]]=\"\",\"\",Table1[[#This Row],[Sr.No.]])","v":""},{"$f":"IF(Table1[[#This Row],[Employee Name]]=\"\",\"\",Table1[[#This Row],[Employee Name]])","v":""}]
[{"$f":"IF(Table1[[#This Row],[Sr.No.]]=\"\",\"\",Table1[[#This Row],[Sr.No.]])","v":""},{"$f":"IF(Table1[[#This Row],[Employee Name]]=\"\",\"\",Table1[[#This Row],[Employee Name]])","v":""}]
[{"$f":"IF(Table1[[#This Row],[Sr.No.]]=\"\",\"\",Table1[[#This Row],[Sr.No.]])","v":""},{"$f":"IF(Table1[[#This Row],[Employee Name]]=\"\",\"\",Table1[[#This Row],[Employee Name]])","v":""}]
[{"$f":"IF(Table1[[#This Row],[Sr.No.]]=\"\",\"\",Table1[[#This Row],[Sr.No.]])","v":""},{"$f":"IF(Table1[[#This Row],[Employee Name]]=\"\",\"\",Table1[[#This Row],[Employee Name]])","v":""}]
[{"$f":"IF(Table1[[#This Row],[Sr.No.]]=\"\",\"\",Table1[[#This Row],[Sr.No.]])","v":""},{"$f":"IF(Table1[[#This Row],[Employee Name]]=\"\",\"\",Table1[[#This Row],[Employee Name]])","v":""}]
[{"$f":"IF(Table1[[#This Row],[Sr.No.]]=\"\",\"\",Table1[[#This Row],[Sr.No.]])","v":""},{"$f":"IF(Table1[[#This Row],[Employee Name]]=\"\",\"\",Table1[[#This Row],[Employee Name]])","v":""}]
[{"$f":"IF(Table1[[#This Row],[Sr.No.]]=\"\",\"\",Table1[[#This Row],[Sr.No.]])","v":""},{"$f":"IF(Table1[[#This Row],[Employee Name]]=\"\",\"\",Table1[[#This Row],[Employee Name]])","v":""}]
[{"$f":"IF(Table1[[#This Row],[Sr.No.]]=\"\",\"\",Table1[[#This Row],[Sr.No.]])","v":""},{"$f":"IF(Table1[[#This Row],[Employee Name]]=\"\",\"\",Table1[[#This Row],[Employee Name]])","v":""}]
[{"$f":"IF(Table1[[#This Row],[Sr.No.]]=\"\",\"\",Table1[[#This Row],[Sr.No.]])","v":""},{"$f":"IF(Table1[[#This Row],[Employee Name]]=\"\",\"\",Table1[[#This Row],[Employee Name]])","v":""}]
[{"$f":"IF(Table1[[#This Row],[Sr.No.]]=\"\",\"\",Table1[[#This Row],[Sr.No.]])","v":""},{"$f":"IF(Table1[[#This Row],[Employee Name]]=\"\",\"\",Table1[[#This Row],[Employee Name]])","v":""}]
[{"$f":"IF(Table1[[#This Row],[Sr.No.]]=\"\",\"\",Table1[[#This Row],[Sr.No.]])","v":""},{"$f":"IF(Table1[[#This Row],[Employee Name]]=\"\",\"\",Table1[[#This Row],[Employee Name]])","v":""}]
[{"$f":"IF(Table1[[#This Row],[Sr.No.]]=\"\",\"\",Table1[[#This Row],[Sr.No.]])","v":""},{"$f":"IF(Table1[[#This Row],[Employee Name]]=\"\",\"\",Table1[[#This Row],[Employee Name]])","v":""}]
[{"$f":"IF(Table1[[#This Row],[Sr.No.]]=\"\",\"\",Table1[[#This Row],[Sr.No.]])","v":""},{"$f":"IF(Table1[[#This Row],[Employee Name]]=\"\",\"\",Table1[[#This Row],[Employee Name]])","v":""}]
[{"$f":"IF(Table1[[#This Row],[Sr.No.]]=\"\",\"\",Table1[[#This Row],[Sr.No.]])","v":""},{"$f":"IF(Table1[[#This Row],[Employee Name]]=\"\",\"\",Table1[[#This Row],[Employee Name]])","v":""}]
[{"$f":"IF(Table1[[#This Row],[Sr.No.]]=\"\",\"\",Table1[[#This Row],[Sr.No.]])","v":""},{"$f":"IF(Table1[[#This Row],[Employee Name]]=\"\",\"\",Table1[[#This Row],[Employee Name]])","v":""}]
[{"$f":"IF(Table1[[#This Row],[Sr.No.]]=\"\",\"\",Table1[[#This Row],[Sr.No.]])","v":""},{"$f":"IF(Table1[[#This Row],[Employee Name]]=\"\",\"\",Table1[[#This Row],[Employee Name]])","v":""}]
[{"$f":"IF(Table1[[#This Row],[Sr.No.]]=\"\",\"\",Table1[[#This Row],[Sr.No.]])","v":""},{"$f":"IF(Table1[[#This Row],[Employee Name]]=\"\",\"\",Table1[[#This Row],[Employee Name]])","v":""}]
[{"$f":"IF(Table1[[#This Row],[Sr.No.]]=\"\",\"\",Table1[[#This Row],[Sr.No.]])","v":""},{"$f":"IF(Table1[[#This Row],[Employee Name]]=\"\",\"\",Table1[[#This Row],[Employee Name]])","v":""}]
[{"$f":"IF(Table1[[#This Row],[Sr.No.]]=\"\",\"\",Table1[[#This Row],[Sr.No.]])","v":""},{"$f":"IF(Table1[[#This Row],[Employee Name]]=\"\",\"\",Table1[[#This Row],[Employee Name]])","v":""}]
[{"$f":"IF(Table1[[#This Row],[Sr.No.]]=\"\",\"\",Table1[[#This Row],[Sr.No.]])","v":""},{"$f":"IF(Table1[[#This Row],[Employee Name]]=\"\",\"\",Table1[[#This Row],[Employee Name]])","v":""}]
[{"$f":"IF(Table1[[#This Row],[Sr.No.]]=\"\",\"\",Table1[[#This Row],[Sr.No.]])","v":""},{"$f":"IF(Table1[[#This Row],[Employee Name]]=\"\",\"\",Table1[[#This Row],[Employee Name]])","v":""}]
[{"$f":"IF(Table1[[#This Row],[Sr.No.]]=\"\",\"\",Table1[[#This Row],[Sr.No.]])","v":""},{"$f":"IF(Table1[[#This Row],[Employee Name]]=\"\",\"\",Table1[[#This Row],[Employee Name]])","v":""}]
[{"$f":"IF(Table1[[#This Row],[Sr.No.]]=\"\",\"\",Table1[[#This Row],[Sr.No.]])","v":""},{"$f":"IF(Table1[[#This Row],[Employee Name]]=\"\",\"\",Table1[[#This Row],[Employee Name]])","v":""}]
[{"$f":"IF(Table1[[#This Row],[Sr.No.]]=\"\",\"\",Table1[[#This Row],[Sr.No.]])","v":""},{"$f":"IF(Table1[[#This Row],[Employee Name]]=\"\",\"\",Table1[[#This Row],[Employee Name]])","v":""}]
[{"$f":"IF(Table1[[#This Row],[Sr.No.]]=\"\",\"\",Table1[[#This Row],[Sr.No.]])","v":""},{"$f":"IF(Table1[[#This Row],[Employee Name]]=\"\",\"\",Table1[[#This Row],[Employee Name]])","v":""}]
[{"$f":"IF(Table1[[#This Row],[Sr.No.]]=\"\",\"\",Table1[[#This Row],[Sr.No.]])","v":""},{"$f":"IF(Table1[[#This Row],[Employee Name]]=\"\",\"\",Table1[[#This Row],[Employee Name]])","v":""}]
[{"$f":"IF(Table1[[#This Row],[Sr.No.]]=\"\",\"\",Table1[[#This Row],[Sr.No.]])","v":""},{"$f":"IF(Table1[[#This Row],[Employee Name]]=\"\",\"\",Table1[[#This Row],[Employee Name]])","v":""}]
[{"$f":"IF(Table1[[#This Row],[Sr.No.]]=\"\",\"\",Table1[[#This Row],[Sr.No.]])","v":""},{"$f":"IF(Table1[[#This Row],[Employee Name]]=\"\",\"\",Table1[[#This Row],[Employee Name]])","v":""}]
[{"$f":"IF(Table1[[#This Row],[Sr.No.]]=\"\",\"\",Table1[[#This Row],[Sr.No.]])","v":""},{"$f":"IF(Table1[[#This Row],[Employee Name]]=\"\",\"\",Table1[[#This Row],[Employee Name]])","v":""}]
[{"$f":"IF(Table1[[#This Row],[Sr.No.]]=\"\",\"\",Table1[[#This Row],[Sr.No.]])","v":""},{"$f":"IF(Table1[[#This Row],[Employee Name]]=\"\",\"\",Table1[[#This Row],[Employee Name]])","v":""}]
[{"$f":"IF(Table1[[#This Row],[Sr.No.]]=\"\",\"\",Table1[[#This Row],[Sr.No.]])","v":""},{"$f":"IF(Table1[[#This Row],[Employee Name]]=\"\",\"\",Table1[[#This Row],[Employee Name]])","v":""}]
[{"$f":"IF(Table1[[#This Row],[Sr.No.]]=\"\",\"\",Table1[[#This Row],[Sr.No.]])","v":""},{"$f":"IF(Table1[[#This Row],[Employee Name]]=\"\",\"\",Table1[[#This Row],[Employee Name]])","v":""}]
[{"$f":"IF(Table1[[#This Row],[Sr.No.]]=\"\",\"\",Table1[[#This Row],[Sr.No.]])","v":""},{"$f":"IF(Table1[[#This Row],[Employee Name]]=\"\",\"\",Table1[[#This Row],[Employee Name]])","v":""}]
[{"$f":"IF(Table1[[#This Row],[Sr.No.]]=\"\",\"\",Table1[[#This Row],[Sr.No.]])","v":""},{"$f":"IF(Table1[[#This Row],[Employee Name]]=\"\",\"\",Table1[[#This Row],[Employee Name]])","v":""}]
[{"$f":"IF(Table1[[#This Row],[Sr.No.]]=\"\",\"\",Table1[[#This Row],[Sr.No.]])","v":""},{"$f":"IF(Table1[[#This Row],[Employee Name]]=\"\",\"\",Table1[[#This Row],[Employee Name]])","v":""}]
[{"$f":"IF(Table1[[#This Row],[Sr.No.]]=\"\",\"\",Table1[[#This Row],[Sr.No.]])","v":""},{"$f":"IF(Table1[[#This Row],[Employee Name]]=\"\",\"\",Table1[[#This Row],[Employee Name]])","v":""}]
[{"$f":"IF(Table1[[#This Row],[Sr.No.]]=\"\",\"\",Table1[[#This Row],[Sr.No.]])","v":""},{"$f":"IF(Table1[[#This Row],[Employee Name]]=\"\",\"\",Table1[[#This Row],[Employee Name]])","v":""}]
[{"$f":"IF(Table1[[#This Row],[Sr.No.]]=\"\",\"\",Table1[[#This Row],[Sr.No.]])","v":""},{"$f":"IF(Table1[[#This Row],[Employee Name]]=\"\",\"\",Table1[[#This Row],[Employee Name]])","v":""}]
[{"$f":"IF(Table1[[#This Row],[Sr.No.]]=\"\",\"\",Table1[[#This Row],[Sr.No.]])","v":""},{"$f":"IF(Table1[[#This Row],[Employee Name]]=\"\",\"\",Table1[[#This Row],[Employee Name]])","v":""}]
[{"$f":"IF(Table1[[#This Row],[Sr.No.]]=\"\",\"\",Table1[[#This Row],[Sr.No.]])","v":""},{"$f":"IF(Table1[[#This Row],[Employee Name]]=\"\",\"\",Table1[[#This Row],[Employee Name]])","v":""}]
[{"$f":"IF(Table1[[#This Row],[Sr.No.]]=\"\",\"\",Table1[[#This Row],[Sr.No.]])","v":""},{"$f":"IF(Table1[[#This Row],[Employee Name]]=\"\",\"\",Table1[[#This Row],[Employee Name]])","v":""}]
[{"$f":"IF(Table1[[#This Row],[Sr.No.]]=\"\",\"\",Table1[[#This Row],[Sr.No.]])","v":""},{"$f":"IF(Table1[[#This Row],[Employee Name]]=\"\",\"\",Table1[[#This Row],[Employee Name]])","v":""}]
[{"$f":"IF(Table1[[#This Row],[Sr.No.]]=\"\",\"\",Table1[[#This Row],[Sr.No.]])","v":""},{"$f":"IF(Table1[[#This Row],[Employee Name]]=\"\",\"\",Table1[[#This Row],[Employee Name]])","v":""}]
[{"$f":"IF(Table1[[#This Row],[Sr.No.]]=\"\",\"\",Table1[[#This Row],[Sr.No.]])","v":""},{"$f":"IF(Table1[[#This Row],[Employee Name]]=\"\",\"\",Table1[[#This Row],[Employee Name]])","v":""}]
[{"$f":"IF(Table1[[#This Row],[Sr.No.]]=\"\",\"\",Table1[[#This Row],[Sr.No.]])","v":""},{"$f":"IF(Table1[[#This Row],[Employee Name]]=\"\",\"\",Table1[[#This Row],[Employee Name]])","v":""}]
[{"$f":"IF(Table1[[#This Row],[Sr.No.]]=\"\",\"\",Table1[[#This Row],[Sr.No.]])","v":""},{"$f":"IF(Table1[[#This Row],[Employee Name]]=\"\",\"\",Table1[[#This Row],[Employee Name]])","v":""}]
[{"$f":"IF(Table1[[#This Row],[Sr.No.]]=\"\",\"\",Table1[[#This Row],[Sr.No.]])","v":""},{"$f":"IF(Table1[[#This Row],[Employee Name]]=\"\",\"\",Table1[[#This Row],[Employee Name]])","v":""}]
[{"$f":"IF(Table1[[#This Row],[Sr.No.]]=\"\",\"\",Table1[[#This Row],[Sr.No.]])","v":""},{"$f":"IF(Table1[[#This Row],[Employee Name]]=\"\",\"\",Table1[[#This Row],[Employee Name]])","v":""}]
[{"$f":"IF(Table1[[#This Row],[Sr.No.]]=\"\",\"\",Table1[[#This Row],[Sr.No.]])","v":""},{"$f":"IF(Table1[[#This Row],[Employee Name]]=\"\",\"\",Table1[[#This Row],[Employee Name]])","v":""}]
[{"$f":"IF(Table1[[#This Row],[Sr.No.]]=\"\",\"\",Table1[[#This Row],[Sr.No.]])","v":""},{"$f":"IF(Table1[[#This Row],[Employee Name]]=\"\",\"\",Table1[[#This Row],[Employee Name]])","v":""}]
[{"$f":"IF(Table1[[#This Row],[Sr.No.]]=\"\",\"\",Table1[[#This Row],[Sr.No.]])","v":""},{"$f":"IF(Table1[[#This Row],[Employee Name]]=\"\",\"\",Table1[[#This Row],[Employee Name]])","v":""}]
[{"$f":"IF(Table1[[#This Row],[Sr.No.]]=\"\",\"\",Table1[[#This Row],[Sr.No.]])","v":""},{"$f":"IF(Table1[[#This Row],[Employee Name]]=\"\",\"\",Table1[[#This Row],[Employee Name]])","v":""}]
[{"$f":"IF(Table1[[#This Row],[Sr.No.]]=\"\",\"\",Table1[[#This Row],[Sr.No.]])","v":""},{"$f":"IF(Table1[[#This Row],[Employee Name]]=\"\",\"\",Table1[[#This Row],[Employee Name]])","v":""}]
[{"$f":"IF(Table1[[#This Row],[Sr.No.]]=\"\",\"\",Table1[[#This Row],[Sr.No.]])","v":""},{"$f":"IF(Table1[[#This Row],[Employee Name]]=\"\",\"\",Table1[[#This Row],[Employee Name]])","v":""}]
[{"$f":"IF(Table1[[#This Row],[Sr.No.]]=\"\",\"\",Table1[[#This Row],[Sr.No.]])","v":""},{"$f":"IF(Table1[[#This Row],[Employee Name]]=\"\",\"\",Table1[[#This Row],[Employee Name]])","v":""}]
[{"$f":"IF(Table1[[#This Row],[Sr.No.]]=\"\",\"\",Table1[[#This Row],[Sr.No.]])","v":""},{"$f":"IF(Table1[[#This Row],[Employee Name]]=\"\",\"\",Table1[[#This Row],[Employee Name]])","v":""}]
[{"$f":"IF(Table1[[#This Row],[Sr.No.]]=\"\",\"\",Table1[[#This Row],[Sr.No.]])","v":""},{"$f":"IF(Table1[[#This Row],[Employee Name]]=\"\",\"\",Table1[[#This Row],[Employee Name]])","v":""}]
[{"$f":"IF(Table1[[#This Row],[Sr.No.]]=\"\",\"\",Table1[[#This Row],[Sr.No.]])","v":""},{"$f":"IF(Table1[[#This Row],[Employee Name]]=\"\",\"\",Table1[[#This Row],[Employee Name]])","v":""}]
[{"$f":"IF(Table1[[#This Row],[Sr.No.]]=\"\",\"\",Table1[[#This Row],[Sr.No.]])","v":""},{"$f":"IF(Table1[[#This Row],[Employee Name]]=\"\",\"\",Table1[[#This Row],[Employee Name]])","v":""}]
[{"$f":"IF(Table1[[#This Row],[Sr.No.]]=\"\",\"\",Table1[[#This Row],[Sr.No.]])","v":""},{"$f":"IF(Table1[[#This Row],[Employee Name]]=\"\",\"\",Table1[[#This Row],[Employee Name]])","v":""}]
[{"$f":"IF(Table1[[#This Row],[Sr.No.]]=\"\",\"\",Table1[[#This Row],[Sr.No.]])","v":""},{"$f":"IF(Table1[[#This Row],[Employee Name]]=\"\",\"\",Table1[[#This Row],[Employee Name]])","v":""}]
[{"$f":"IF(Table1[[#This Row],[Sr.No.]]=\"\",\"\",Table1[[#This Row],[Sr.No.]])","v":""},{"$f":"IF(Table1[[#This Row],[Employee Name]]=\"\",\"\",Table1[[#This Row],[Employee Name]])","v":""}]
[{"$f":"IF(Table1[[#This Row],[Sr.No.]]=\"\",\"\",Table1[[#This Row],[Sr.No.]])","v":""},{"$f":"IF(Table1[[#This Row],[Employee Name]]=\"\",\"\",Table1[[#This Row],[Employee Name]])","v":""}]
[{"$f":"IF(Table1[[#This Row],[Sr.No.]]=\"\",\"\",Table1[[#This Row],[Sr.No.]])","v":""},{"$f":"IF(Table1[[#This Row],[Employee Name]]=\"\",\"\",Table1[[#This Row],[Employee Name]])","v":""}]
[{"$f":"IF(Table1[[#This Row],[Sr.No.]]=\"\",\"\",Table1[[#This Row],[Sr.No.]])","v":""},{"$f":"IF(Table1[[#This Row],[Employee Name]]=\"\",\"\",Table1[[#This Row],[Employee Name]])","v":""}]
[{"$f":"IF(Table1[[#This Row],[Sr.No.]]=\"\",\"\",Table1[[#This Row],[Sr.No.]])","v":""},{"$f":"IF(Table1[[#This Row],[Employee Name]]=\"\",\"\",Table1[[#This Row],[Employee Name]])","v":""}]
[{"$f":"IF(Table1[[#This Row],[Sr.No.]]=\"\",\"\",Table1[[#This Row],[Sr.No.]])","v":""},{"$f":"IF(Table1[[#This Row],[Employee Name]]=\"\",\"\",Table1[[#This Row],[Employee Name]])","v":""}]
[{"$f":"IF(Table1[[#This Row],[Sr.No.]]=\"\",\"\",Table1[[#This Row],[Sr.No.]])","v":""},{"$f":"IF(Table1[[#This Row],[Employee Name]]=\"\",\"\",Table1[[#This Row],[Employee Name]])","v":""}]
[{"$f":"IF(Table1[[#This Row],[Sr.No.]]=\"\",\"\",Table1[[#This Row],[Sr.No.]])","v":""},{"$f":"IF(Table1[[#This Row],[Employee Name]]=\"\",\"\",Table1[[#This Row],[Employee Name]])","v":""}]
[{"$f":"IF(Table1[[#This Row],[Sr.No.]]=\"\",\"\",Table1[[#This Row],[Sr.No.]])","v":""},{"$f":"IF(Table1[[#This Row],[Employee Name]]=\"\",\"\",Table1[[#This Row],[Employee Name]])","v":""}]
[{"$f":"IF(Table1[[#This Row],[Sr.No.]]=\"\",\"\",Table1[[#This Row],[Sr.No.]])","v":""},{"$f":"IF(Table1[[#This Row],[Employee Name]]=\"\",\"\",Table1[[#This Row],[Employee Name]])","v":""}]
[{"$f":"IF(Table1[[#This Row],[Sr.No.]]=\"\",\"\",Table1[[#This Row],[Sr.No.]])","v":""},{"$f":"IF(Table1[[#This Row],[Employee Name]]=\"\",\"\",Table1[[#This Row],[Employee Name]])","v":""}]
[{"$f":"IF(Table1[[#This Row],[Sr.No.]]=\"\",\"\",Table1[[#This Row],[Sr.No.]])","v":""},{"$f":"IF(Table1[[#This Row],[Employee Name]]=\"\",\"\",Table1[[#This Row],[Employee Name]])","v":""}]
[{"$f":"IF(Table1[[#This Row],[Sr.No.]]=\"\",\"\",Table1[[#This Row],[Sr.No.]])","v":""},{"$f":"IF(Table1[[#This Row],[Employee Name]]=\"\",\"\",Table1[[#This Row],[Employee Name]])","v":""}]
[{"$f":"IF(Table1[[#This Row],[Sr.No.]]=\"\",\"\",Table1[[#This Row],[Sr.No.]])","v":""},{"$f":"IF(Table1[[#This Row],[Employee Name]]=\"\",\"\",Table1[[#This Row],[Employee Name]])","v":""}]
[{"$f":"IF(Table1[[#This Row],[Sr.No.]]=\"\",\"\",Table1[[#This Row],[Sr.No.]])","v":""},{"$f":"IF(Table1[[#This Row],[Employee Name]]=\"\",\"\",Table1[[#This Row],[Employee Name]])","v":""}]
[{"$f":"IF(Table1[[#This Row],[Sr.No.]]=\"\",\"\",Table1[[#This Row],[Sr.No.]])","v":""},{"$f":"IF(Table1[[#This Row],[Employee Name]]=\"\",\"\",Table1[[#This Row],[Employee Name]])","v":""}]
[{"$f":"IF(Table1[[#This Row],[Sr.No.]]=\"\",\"\",Table1[[#This Row],[Sr.No.]])","v":""},{"$f":"IF(Table1[[#This Row],[Employee Name]]=\"\",\"\",Table1[[#This Row],[Employee Name]])","v":""}]
[{"$f":"IF(Table1[[#This Row],[Sr.No.]]=\"\",\"\",Table1[[#This Row],[Sr.No.]])","v":""},{"$f":"IF(Table1[[#This Row],[Employee Name]]=\"\",\"\",Table1[[#This Row],[Employee Name]])","v":""}]
[{"$f":"IF(Table1[[#This Row],[Sr.No.]]=\"\",\"\",Table1[[#This Row],[Sr.No.]])","v":""},{"$f":"IF(Table1[[#This Row],[Employee Name]]=\"\",\"\",Table1[[#This Row],[Employee Name]])","v":""}]
[{"$f":"IF(Table1[[#This Row],[Sr.No.]]=\"\",\"\",Table1[[#This Row],[Sr.No.]])","v":""},{"$f":"IF(Table1[[#This Row],[Employee Name]]=\"\",\"\",Table1[[#This Row],[Employee Name]])","v":""}]
[{"$f":"IF(Table1[[#This Row],[Sr.No.]]=\"\",\"\",Table1[[#This Row],[Sr.No.]])","v":""},{"$f":"IF(Table1[[#This Row],[Employee Name]]=\"\",\"\",Table1[[#This Row],[Employee Name]])","v":""}]
[{"$f":"IF(Table1[[#This Row],[Sr.No.]]=\"\",\"\",Table1[[#This Row],[Sr.No.]])","v":""},{"$f":"IF(Table1[[#This Row],[Employee Name]]=\"\",\"\",Table1[[#This Row],[Employee Name]])","v":""}]
[{"$f":"IF(Table1[[#This Row],[Sr.No.]]=\"\",\"\",Table1[[#This Row],[Sr.No.]])","v":""},{"$f":"IF(Table1[[#This Row],[Employee Name]]=\"\",\"\",Table1[[#This Row],[Employee Name]])","v":""}]
[{"$f":"IF(Table1[[#This Row],[Sr.No.]]=\"\",\"\",Table1[[#This Row],[Sr.No.]])","v":""},{"$f":"IF(Table1[[#This Row],[Employee Name]]=\"\",\"\",Table1[[#This Row],[Employee Name]])","v":""}]
[{"$f":"IF(Table1[[#This Row],[Sr.No.]]=\"\",\"\",Table1[[#This Row],[Sr.No.]])","v":""},{"$f":"IF(Table1[[#This Row],[Employee Name]]=\"\",\"\",Table1[[#This Row],[Employee Name]])","v":""}]
[{"$f":"IF(Table1[[#This Row],[Sr.No.]]=\"\",\"\",Table1[[#This Row],[Sr.No.]])","v":""},{"$f":"IF(Table1[[#This Row],[Employee Name]]=\"\",\"\",Table1[[#This Row],[Employee Name]])","v":""}]
[{"$f":"IF(Table1[[#This Row],[Sr.No.]]=\"\",\"\",Table1[[#This Row],[Sr.No.]])","v":""},{"$f":"IF(Table1[[#This Row],[Employee Name]]=\"\",\"\",Table1[[#This Row],[Employee Name]])","v":""}]
[{"$f":"IF(Table1[[#This Row],[Sr.No.]]=\"\",\"\",Table1[[#This Row],[Sr.No.]])","v":""},{"$f":"IF(Table1[[#This Row],[Employee Name]]=\"\",\"\",Table1[[#This Row],[Employee Name]])","v":""}]
[{"$f":"IF(Table1[[#This Row],[Sr.No.]]=\"\",\"\",Table1[[#This Row],[Sr.No.]])","v":""},{"$f":"IF(Table1[[#This Row],[Employee Name]]=\"\",\"\",Table1[[#This Row],[Employee Name]])","v":""}]
[{"$f":"IF(Table1[[#This Row],[Sr.No.]]=\"\",\"\",Table1[[#This Row],[Sr.No.]])","v":""},{"$f":"IF(Table1[[#This Row],[Employee Name]]=\"\",\"\",Table1[[#This Row],[Employee Name]])","v":""}]
[{"$f":"IF(Table1[[#This Row],[Sr.No.]]=\"\",\"\",Table1[[#This Row],[Sr.No.]])","v":""},{"$f":"IF(Table1[[#This Row],[Employee Name]]=\"\",\"\",Table1[[#This Row],[Employee Name]])","v":""}]
[{"$f":"IF(Table1[[#This Row],[Sr.No.]]=\"\",\"\",Table1[[#This Row],[Sr.No.]])","v":""},{"$f":"IF(Table1[[#This Row],[Employee Name]]=\"\",\"\",Table1[[#This Row],[Employee Name]])","v":""}]
[{"$f":"IF(Table1[[#This Row],[Sr.No.]]=\"\",\"\",Table1[[#This Row],[Sr.No.]])","v":""},{"$f":"IF(Table1[[#This Row],[Employee Name]]=\"\",\"\",Table1[[#This Row],[Employee Name]])","v":""}]
[{"$f":"IF(Table1[[#This Row],[Sr.No.]]=\"\",\"\",Table1[[#This Row],[Sr.No.]])","v":""},{"$f":"IF(Table1[[#This Row],[Employee Name]]=\"\",\"\",Table1[[#This Row],[Employee Name]])","v":""}]
[{"$f":"IF(Table1[[#This Row],[Sr.No.]]=\"\",\"\",Table1[[#This Row],[Sr.No.]])","v":""},{"$f":"IF(Table1[[#This Row],[Employee Name]]=\"\",\"\",Table1[[#This Row],[Employee Name]])","v":""}]
[{"$f":"IF(Table1[[#This Row],[Sr.No.]]=\"\",\"\",Table1[[#This Row],[Sr.No.]])","v":""},{"$f":"IF(Table1[[#This Row],[Employee Name]]=\"\",\"\",Table1[[#This Row],[Employee Name]])","v":""}]
[{"$f":"IF(Table1[[#This Row],[Sr.No.]]=\"\",\"\",Table1[[#This Row],[Sr.No.]])","v":""},{"$f":"IF(Table1[[#This Row],[Employee Name]]=\"\",\"\",Table1[[#This Row],[Employee Name]])","v":""}]
[{"$f":"IF(Table1[[#This Row],[Sr.No.]]=\"\",\"\",Table1[[#This Row],[Sr.No.]])","v":""},{"$f":"IF(Table1[[#This Row],[Employee Name]]=\"\",\"\",Table1[[#This Row],[Employee Name]])","v":""}]
[{"$f":"IF(Table1[[#This Row],[Sr.No.]]=\"\",\"\",Table1[[#This Row],[Sr.No.]])","v":""},{"$f":"IF(Table1[[#This Row],[Employee Name]]=\"\",\"\",Table1[[#This Row],[Employee Name]])","v":""}]
[{"$f":"IF(Table1[[#This Row],[Sr.No.]]=\"\",\"\",Table1[[#This Row],[Sr.No.]])","v":""},{"$f":"IF(Table1[[#This Row],[Employee Name]]=\"\",\"\",Table1[[#This Row],[Employee Name]])","v":""}]
[{"$f":"IF(Table1[[#This Row],[Sr.No.]]=\"\",\"\",Table1[[#This Row],[Sr.No.]])","v":""},{"$f":"IF(Table1[[#This Row],[Employee Name]]=\"\",\"\",Table1[[#This Row],[Employee Name]])","v":""}]
[{"$f":"IF(Table1[[#This Row],[Sr.No.]]=\"\",\"\",Table1[[#This Row],[Sr.No.]])","v":""},{"$f":"IF(Table1[[#This Row],[Employee Name]]=\"\",\"\",Table1[[#This Row],[Employee Name]])","v":""}]
[{"$f":"IF(Table1[[#This Row],[Sr.No.]]=\"\",\"\",Table1[[#This Row],[Sr.No.]])","v":""},{"$f":"IF(Table1[[#This Row],[Employee Name]]=\"\",\"\",Table1[[#This Row],[Employee Name]])","v":""}]
[{"$f":"IF(Table1[[#This Row],[Sr.No.]]=\"\",\"\",Table1[[#This Row],[Sr.No.]])","v":""},{"$f":"IF(Table1[[#This Row],[Employee Name]]=\"\",\"\",Table1[[#This Row],[Employee Name]])","v":""}]
[{"$f":"IF(Table1[[#This Row],[Sr.No.]]=\"\",\"\",Table1[[#This Row],[Sr.No.]])","v":""},{"$f":"IF(Table1[[#This Row],[Employee Name]]=\"\",\"\",Table1[[#This Row],[Employee Name]])","v":""}]
[{"$f":"IF(Table1[[#This Row],[Sr.No.]]=\"\",\"\",Table1[[#This Row],[Sr.No.]])","v":""},{"$f":"IF(Table1[[#This Row],[Employee Name]]=\"\",\"\",Table1[[#This Row],[Employee Name]])","v":""}]
[{"$f":"IF(Table1[[#This Row],[Sr.No.]]=\"\",\"\",Table1[[#This Row],[Sr.No.]])","v":""},{"$f":"IF(Table1[[#This Row],[Employee Name]]=\"\",\"\",Table1[[#This Row],[Employee Name]])","v":""}]
[{"$f":"IF(Table1[[#This Row],[Sr.No.]]=\"\",\"\",Table1[[#This Row],[Sr.No.]])","v":""},{"$f":"IF(Table1[[#This Row],[Employee Name]]=\"\",\"\",Table1[[#This Row],[Employee Name]])","v":""}]
[{"$f":"IF(Table1[[#This Row],[Sr.No.]]=\"\",\"\",Table1[[#This Row],[Sr.No.]])","v":""},{"$f":"IF(Table1[[#This Row],[Employee Name]]=\"\",\"\",Table1[[#This Row],[Employee Name]])","v":""}]
[{"$f":"IF(Table1[[#This Row],[Sr.No.]]=\"\",\"\",Table1[[#This Row],[Sr.No.]])","v":""},{"$f":"IF(Table1[[#This Row],[Employee Name]]=\"\",\"\",Table1[[#This Row],[Employee Name]])","v":""}]
[{"$f":"IF(Table1[[#This Row],[Sr.No.]]=\"\",\"\",Table1[[#This Row],[Sr.No.]])","v":""},{"$f":"IF(Table1[[#This Row],[Employee Name]]=\"\",\"\",Table1[[#This Row],[Employee Name]])","v":""}]

{"sheet":"GA55 A","index":4,"n_rows":95,"n_cols":24,"rows_kept":95,"merged":[[0,0,0,8],[0,12,0,13],[0,16,1,16],[0,17,1,18],[1,0,1,8],[1,12,1,13],[2,0,2,1],[2,2,2,3],[2,5,2,6],[2,7,2,10],[2,13,2,14],[2,17,3,17],[2,18,3,18],[3,0,3,1],[3,2,3,6],[3,7,3,8],[3,9,3,14],[4,0,4,1],[4,2,4,6],[4,7,4,8],[4,9,4,14],[4,17,5,17],[4,18,5,18],[5,0,5,1],[5,2,5,6],[5,7,5,8],[5,9,5,11],[5,13,5,14],[6,0,6,1],[6,4,6,7],[6,9,6,12],[7,1,11,1],[12,1,16,1],[17,1,21,1],[22,1,26,1],[27,1,31,1],[32,1,36,1],[37,0,37,8],[37,12,37,13],[38,0,38,8],[38,12,38,13],[39,1,43,1],[44,1,48,1],[49,1,53,1],[54,1,58,1],[59,1,63,1],[64,1,68,1],[73,0,73,8],[73,12,73,13],[74,0,74,8],[74,12,74,13],[75,0,76,0],[75,1,76,1],[75,2,76,2],[75,3,76,3],[77,0,78,0],[77,1,78,1],[77,2,78,2],[77,3,78,3],[79,0,80,0],[79,1,80,1],[79,2,80,2],[79,3,80,3],[81,0,82,0],[81,1,82,1],[81,2,82,2],[81,3,82,3],[83,1,83,4],[83,6,83,9],[84,1,84,2],[84,8,84,9],[84,11,84,12],[85,1,85,2],[85,8,85,9],[85,11,85,12],[86,1,86,2],[86,8,86,9],[86,11,86,12],[87,1,87,2],[87,8,87,9],[87,11,87,12],[88,1,88,2],[88,8,88,9],[88,11,88,12],[89,1,89,2],[89,8,89,9],[89,11,89,12],[90,1,90,2],[90,8,90,9],[90,11,90,12],[91,1,91,2],[91,8,91,9],[91,11,91,12],[92,1,92,2],[92,8,92,9],[92,11,92,12],[93,1,93,2],[93,8,93,9],[93,13,93,14],[94,1,94,2],[94,3,94,4],[94,6,94,7],[94,8,94,9],[94,11,94,12],[94,13,94,14]]}
["Government Of Rajasthan",{"$nulls":11},"Page No.",null,1,null,1,{"$f":"IFERROR(VLOOKUP($Q$1,Emp_data,2,0),\"\")","v":"Ashwini Kumar"}]
["GA55 A",{"$nulls":9},{"$f":"IF(Master!$I$1=\"\",\"\",Master!$I$1)","v":18277},null,"Financial Year : ",null,{"$f":"IF(Master!$I$2=\"\",\"\",Master!$I$2)","v":"2021-22"}]
["DDO Code:",null,{"$f":"IF(Master!$I$1=\"\",\"\",Master!$I$1)","v":18277},null,null,"Office Name :",null,{"$f":"IF(Master!$C$1=\"\",\"\",Master!$C$1)","v":"GSSS Deogarh"},{"$nulls":4},"TAN:",{"$f":"IF(Master!$C$2=\"\",\"\",Master!$C$2)","v":"ZXCVB1234B"},null,null,{"$f":"IF(Master!$I$1=\"\",\"\",Master!$I$1)","v":18277},"July Basic","Bonus"]
["Employee Name :",null,{"$f":"IFERROR(VLOOKUP($Q$1,Emp_data,2,0),\"NoData\")","v":"Ashwini Kumar"},{"$nulls":4},"Employee ID :",null,{"$f":"IFERROR(VLOOKUP($Q$1,Emp_data,5,0),\"NoData\")","v":"RJNA12345678910"}]
["Designation :",null,{"$f":"IFERROR(VLOOKUP($Q$1,Emp_data,3,0),\"NoData\")","v":"Lecturer"},{"$nulls":4},"Pay Scale :",null,{"$f":"IFERROR(VLOOKUP($Q$1,Emp_data,6,0),\"NoData\")","v":"L-12"},{"$nulls":8},"YES"]
["GPF/PRAN Number :",null,{"$f":"IFERROR(VLOOKUP($Q$1,Emp_data,4,0),\"NoData\")","v":"12345678910"},{"$nulls":4},"Account No :",null,{"$f":"IFERROR(VLOOKUP($Q$1,Emp_data,7,0),\"NoData\")","v":"1234567891011"},null,null,"PAN :",{"$f":"IFERROR(VLOOKUP($Q$1,Emp_data,8,0),\"NoData\")","v":"ABCD1234E"}]
["Pay Month\nPay Year",null,"Bill No.\nTV No.","Bill Date\nTV Date","----------------Allowances----------------",{"$nulls":3},"Gross Amount","------------Deductions------------",{"$nulls":3},"Total deduction","NetAmount",null,null,{"$f":"IF(Master!$I$1=\"\",\"\",Master!$I$1)","v":18277}]
[null,"Salary",null,null,"Basic",{"$f":"IFERROR(IF(VLOOKUP($Q$1,Allowance,3,0)=0,\"\",VLOOKUP($Q$1,Allowance,3,0)),\"\")","v":{"v":47000,"d":"47000.00"}},"DA",{"$f":"IFERROR(IF($W$9=\"Yes\",\"\",ROUND(F8*'DA HRA Rate'!$C$5,0)),\"\")","v":{"v":7990,"d":"7990.00"}},{"$f":"ROUND(SUM(F8:F12,H8:H12),0)","v":{"v":58750,"d":"58750.00"}},"ECPenF",{"$f":"IFERROR(IF($W$8=\"GPF\",\"\",ROUND(SUM($F$8,$H$8)*10%,0)),\"\")","v":{"v":5499,"d":"5499.00"}},{"$f":"Table4[[#Headers],[LIC]]","v":"LIC"},{"$f":"IFERROR(IF(VLOOKUP($Q$1,Deductions,7,0)=0,\"\",VLOOKUP($Q$1,Deductions,7,0)),\"\")","v":""},{"$f":"ROUND(SUM(K8:K12,M8:M12),0)","v":{"v":8599,"d":"8599.00"}},{"$f":"ROUND(SUM(I8-N8),0)","v":{"v":50151,"d":"50151.00"}},{"$nulls":7},{"$f":"IFERROR(VLOOKUP($Q$1,Emp_data,9,0),\"\")","v":"NPS"},"NPS/GPF"]
[{"$nulls":4},"HRA",{"$f":"IFERROR(IF($W$9=\"Yes\",\"\",ROUND($F8*'DA HRA Rate'!$D$5,0)),\"\")","v":{"v":3760,"d":"3760.00"}},"Wash All.",{"$f":"IFERROR(IF(VLOOKUP($Q$1,Allowance,5,0)=0,\"\",VLOOKUP($Q$1,Allowance,5,0)),\"\")","v":""},null,{"$f":"Table4[[#Headers],[GPF]]","v":"GPF"},{"$f":"IFERROR(IF($W$8=\"NPS\",\"\",IF(VLOOKUP($Q$1,Deductions,3,0)=0,\"\",VLOOKUP($Q$1,Deductions,3,0))),\"\")","v":""},{"$f":"Table4[[#Headers],[GPF Loan]]","v":"GPF Loan"},{"$f":"IFERROR(IF(VLOOKUP($Q$1,Deductions,8,0)=0,\"\",VLOOKUP($Q$1,Deductions,8,0)),\"\")","v":""},{"$nulls":3},"Deduction","Change Month","Changed Amount",{"$nulls":3},{"$f":"IFERROR(VLOOKUP($Q$1,Emp_data,10,0),\"\")","v":"NO"},"Probation"]
["March",{"$nulls":3},"Handi. All.",{"$f":"IFERROR(IF(VLOOKUP($Q$1,Allowance,4,0)=0,\"\",VLOOKUP($Q$1,Allowance,4,0)),\"\")","v":""},"CCA All.",{"$f":"IFERROR(IF(VLOOKUP($Q$1,Allowance,6,0)=0,\"\",VLOOKUP($Q$1,Allowance,6,0)),\"\")","v":""},null,{"$f":"Table4[[#Headers],[SIP]]","v":"SIP"},{"$f":"IFERROR(IF(VLOOKUP($Q$1,Deductions,4,0)=0,\"\",VLOOKUP($Q$1,Deductions,4,0)),\"\")","v":{"v":3000,"d":"3000.00"}},{"$f":"Table4[[#Headers],[SIL]]","v":"SIL"},{"$f":"IFERROR(IF(VLOOKUP($Q$1,Deductions,9,0)=0,\"\",VLOOKUP($Q$1,Deductions,9,0)),\"\")","v":""},{"$nulls":3},{"$f":"J9","v":"GPF"},{"$nulls":5},{"$f":"IFERROR(VLOOKUP($Q$1,Allowance,11,0),\"\")","v":0},"Basic Change Month"]
[{"$f":"LEFT($O$2,4)","v":"2021"},{"$nulls":3},{"$f":"Table3[[#Headers],[Ot. Allow 1]]","v":"Ot. Allow 1"},{"$f":"IFERROR(IF(VLOOKUP($Q$1,Allowance,7,0)=0,\"\",VLOOKUP($Q$1,Allowance,7,0)),\"\")","v":""},{"$f":"Table3[[#Headers],[Ot. Allow 2]]","v":"Ot. Allow 2"},{"$f":"IFERROR(IF(VLOOKUP($Q$1,Allowance,8,0)=0,\"\",VLOOKUP($Q$1,Allowance,8,0)),\"\")","v":""},null,{"$f":"Table4[[#Headers],[RPMF]]","v":"RPMF"},{"$f":"IFERROR(IF(VLOOKUP($Q$1,Deductions,5,0)=0,\"\",VLOOKUP($Q$1,Deductions,5,0)),\"\")","v":""},{"$f":"Table4[[#Headers],[Itax]]","v":"Itax"},{"$f":"IFERROR(IF(VLOOKUP($Q$1,Deductions,10,0)=0,\"\",VLOOKUP($Q$1,Deductions,10,0)),\"\")","v":{"v":100,"d":"100.00"}},{"$nulls":3},{"$f":"J11","v":"RPMF"},{"$nulls":5},{"$f":"IFERROR(VLOOKUP($Q$1,Allowance,12,0),\"\")","v":0},"Changed Basic"]
[{"$nulls":4},{"$f":"Table3[[#Headers],[Ot. Allow 3]]","v":"Ot. Allow 3"},{"$f":"IFERROR(IF(VLOOKUP($Q$1,Allowance,9,0)=0,\"\",VLOOKUP($Q$1,Allowance,9,0)),\"\")","v":""},{"$f":"Table3[[#Headers],[Ot. Allow 4]]","v":"Ot. Allow 4"},{"$f":"IFERROR(IF(VLOOKUP($Q$1,Allowance,10,0)=0,\"\",VLOOKUP($Q$1,Allowance,10,0)),\"\")","v":""},null,{"$f":"Table4[[#Headers],[CM Corona]]","v":"CM Corona"},{"$f":"IFERROR(IF(VLOOKUP($Q$1,Deductions,6,0)=0,\"\",VLOOKUP($Q$1,Deductions,6,0)),\"\")","v":""},{"$f":"Table4[[#Headers],[Other Ded.]]","v":"Other Ded."},{"$f":"IFERROR(IF(VLOOKUP($Q$1,Deductions,11,0)=0,\"\",VLOOKUP($Q$1,Deductions,11,0)),\"\")","v":""},{"$nulls":3},{"$f":"Table4[[#Headers],[LIC]]","v":"LIC"}]
[null,"Salary",null,null,{"$f":"E8","v":"Basic"},{"$f":"IFERROR(IF($A$15=$W$10,$W$11,F8),\"\")","v":{"v":47000,"d":"47000.00"}},{"$f":"G8","v":"DA"},{"$f":"IFERROR(IF($W$9=\"Yes\",\"\",$F$13*'DA HRA Rate'!$C$6),\"\")","v":{"v":7990.000000000001,"d":"7990.00"}},{"$f":"ROUND(SUM(F13:F17,H13:H17),0)","v":{"v":58750,"d":"58750.00"}},"ECPenF",{"$f":"IF($W$8=\"GPF\",\"\",ROUND(SUM($F$13,$H$13)*10%,0))","v":{"v":5499,"d":"5499.00"}},{"$f":"Table4[[#Headers],[LIC]]","v":"LIC"},{"$f":"IF($A15=$R$12,$S$12,$M8)","v":""},{"$f":"ROUND(SUM(K13:K17,M13:M17),0)","v":{"v":8599,"d":"8599.00"}},{"$f":"ROUND(SUM(I13-N13),0)","v":{"v":50151,"d":"50151.00"}},null,{"$f":"Table4[[#Headers],[GPF Loan]]","v":"GPF Loan"}]
[{"$nulls":4},{"$f":"E9","v":"HRA"},{"$f":"IFERROR(IF($W$9=\"Yes\",\"\",ROUND($F13*'DA HRA Rate'!$D$6,0)),\"\")","v":{"v":3760,"d":"3760.00"}},{"$f":"G9","v":"Wash All."},{"$f":"IFERROR(IF(VLOOKUP($Q$1,Allowance,5,0)=0,\"\",VLOOKUP($Q$1,Allowance,5,0)),\"\")","v":""},null,{"$f":"Table4[[#Headers],[GPF]]","v":"GPF"},{"$f":"IF($A$15=$R$10,$S$10,IF($W$8=\"NPS\",\"\",$K$9))","v":""},{"$f":"Table4[[#Headers],[GPF Loan]]","v":"GPF Loan"},{"$f":"IF($A15=$R$13,$S$13,$M9)","v":""},{"$nulls":3},{"$f":"Table4[[#Headers],[SIL]]","v":"SIL"}]
["April",{"$nulls":3},"Handi. All.",{"$f":"IFERROR(IF(VLOOKUP($Q$1,Allowance,4,0)=0,\"\",VLOOKUP($Q$1,Allowance,4,0)),\"\")","v":""},{"$f":"G10","v":"CCA All."},{"$f":"IFERROR(IF(VLOOKUP($Q$1,Allowance,6,0)=0,\"\",VLOOKUP($Q$1,Allowance,6,0)),\"\")","v":""},null,{"$f":"Table4[[#Headers],[SIP]]","v":"SIP"},{"$f":"IF($K10=\"\",\"\",$K10)","v":{"v":3000,"d":"3000.00"}},{"$f":"Table4[[#Headers],[SIL]]","v":"SIL"},{"$f":"IF($A15=$R$14,$S$14,$M10)","v":""},{"$nulls":3},{"$f":"Table4[[#Headers],[Itax]]","v":"Itax"},"June",2000]
[{"$f":"LEFT($O$2,4)","v":"2021"},{"$nulls":3},"Ot. Allow 1",{"$f":"IFERROR(IF(VLOOKUP($Q$1,Allowance,7,0)=0,\"\",VLOOKUP($Q$1,Allowance,7,0)),\"\")","v":""},{"$f":"G11","v":"Ot. Allow 2"},{"$f":"IFERROR(IF(VLOOKUP($Q$1,Allowance,8,0)=0,\"\",VLOOKUP($Q$1,Allowance,8,0)),\"\")","v":""},null,{"$f":"Table4[[#Headers],[RPMF]]","v":"RPMF"},{"$f":"IF($A15=$R$11,$S$11,IF($W$8=\"NPS\",\"\",$K11))","v":""},{"$f":"Table4[[#Headers],[Itax]]","v":"Itax"},{"$f":"IF($A15=$R$15,$S$15,$M11)","v":{"v":100,"d":"100.00"}},{"$nulls":3},{"$f":"Table4[[#Headers],[Other Ded.]]","v":"Other Ded."}]
[{"$nulls":4},"Ot. Allow 3",{"$f":"IFERROR(IF(VLOOKUP($Q$1,Allowance,9,0)=0,\"\",VLOOKUP($Q$1,Allowance,9,0)),\"\")","v":""},"Ot. Allow 4",{"$f":"IFERROR(IF(VLOOKUP($Q$1,Allowance,10,0)=0,\"\",VLOOKUP($Q$1,Allowance,10,0)),\"\")","v":""},null,{"$f":"Table4[[#Headers],[CM Corona]]","v":"CM Corona"},{"$f":"IF($A15=$R$17,$S$17,$K12)","v":""},{"$f":"Table4[[#Headers],[Other Ded.]]","v":"Other Ded."},{"$f":"IF($A15=$R$16,$S$16,$M12)","v":""},{"$nulls":3},{"$f":"Table4[[#Headers],[CM Corona]]","v":"CM Corona"}]
[null,"Salary",null,null,{"$f":"E13","v":"Basic"},{"$f":"IFERROR(IF($A$20=$W$10,$W$11,F13),\"\")","v":{"v":47000,"d":"47000.00"}},{"$f":"G13","v":"DA"},{"$f":"IFERROR(IF($W$9=\"Yes\",\"\",$F$18*'DA HRA Rate'!$C$7),\"\")","v":{"v":7990.000000000001,"d":"7990.00"}},{"$f":"ROUND(SUM(F18:F22,H18:H22),0)","v":{"v":58750,"d":"58750.00"}},"ECPenF",{"$f":"IF($W$8=\"GPF\",\"\",ROUND(SUM($F$18,$H$18)*10%,0))","v":{"v":5499,"d":"5499.00"}},{"$f":"Table4[[#Headers],[LIC]]","v":"LIC"},{"$f":"IF($A20=$R$12,$S$12,$M13)","v":""},{"$f":"ROUND(SUM(K18:K22,M18:M22),0)","v":{"v":8599,"d":"8599.00"}},{"$f":"ROUND(SUM(I18-N18),0)","v":{"v":50151,"d":"50151.00"}}]
[{"$nulls":4},"HRA",{"$f":"IFERROR(IF($W$9=\"Yes\",\"\",ROUND($F18*'DA HRA Rate'!$D$7,0)),\"\")","v":{"v":3760,"d":"3760.00"}},"Wash All.",{"$f":"IFERROR(IF(VLOOKUP($Q$1,Allowance,5,0)=0,\"\",VLOOKUP($Q$1,Allowance,5,0)),\"\")","v":""},null,{"$f":"Table4[[#Headers],[GPF]]","v":"GPF"},{"$f":"IF($A$20=$R$10,$S$10,IF($W$8=\"NPS\",\"\",$K$14))","v":""},{"$f":"Table4[[#Headers],[GPF Loan]]","v":"GPF Loan"},{"$f":"IF($A20=$R$13,$S$13,$M14)","v":""}]
["May",{"$nulls":3},"Handi. All.",{"$f":"IFERROR(IF(VLOOKUP($Q$1,Allowance,4,0)=0,\"\",VLOOKUP($Q$1,Allowance,4,0)),\"\")","v":""},"CCA All.",{"$f":"IFERROR(IF(VLOOKUP($Q$1,Allowance,6,0)=0,\"\",VLOOKUP($Q$1,Allowance,6,0)),\"\")","v":""},null,{"$f":"Table4[[#Headers],[SIP]]","v":"SIP"},{"$f":"IF($K15=\"\",\"\",$K15)","v":{"v":3000,"d":"3000.00"}},{"$f":"Table4[[#Headers],[SIL]]","v":"SIL"},{"$f":"IF($A20=$R$14,$S$14,$M15)","v":""}]
[{"$f":"LEFT($O$2,4)","v":"2021"},{"$nulls":3},"Ot. Allow 1",{"$f":"IFERROR(IF(VLOOKUP($Q$1,Allowance,7,0)=0,\"\",VLOOKUP($Q$1,Allowance,7,0)),\"\")","v":""},"Ot. Allow 2",{"$f":"IFERROR(IF(VLOOKUP($Q$1,Allowance,8,0)=0,\"\",VLOOKUP($Q$1,Allowance,8,0)),\"\")","v":""},null,{"$f":"Table4[[#Headers],[RPMF]]","v":"RPMF"},{"$f":"IF($A20=$R$11,$S$11,IF($W$8=\"NPS\",\"\",$K16))","v":""},{"$f":"Table4[[#Headers],[Itax]]","v":"Itax"},{"$f":"IF($A20=$R$15,$S$15,$M16)","v":{"v":100,"d":"100.00"}}]
[{"$nulls":4},"Ot. Allow 3",{"$f":"IFERROR(IF(VLOOKUP($Q$1,Allowance,9,0)=0,\"\",VLOOKUP($Q$1,Allowance,9,0)),\"\")","v":""},"Ot. Allow 4",{"$f":"IFERROR(IF(VLOOKUP($Q$1,Allowance,10,0)=0,\"\",VLOOKUP($Q$1,Allowance,10,0)),\"\")","v":""},null,{"$f":"Table4[[#Headers],[CM Corona]]","v":"CM Corona"},{"$f":"IF($A20=$R$17,$S$17,$K17)","v":""},{"$f":"Table4[[#Headers],[Other Ded.]]","v":"Other Ded."},{"$f":"IF($A20=$R$16,$S$16,$M17)","v":""}]
[null,"Salary",null,null,{"$f":"E18","v":"Basic"},{"$f":"IFERROR(IF($A$25=$W$10,$W$11,F18),\"\")","v":{"v":47000,"d":"47000.00"}},{"$f":"G18","v":"DA"},{"$f":"IFERROR(IF($W$9=\"Yes\",\"\",$F$23*'DA HRA Rate'!$C$8),\"\")","v":{"v":7990.000000000001,"d":"7990.00"}},{"$f":"ROUND(SUM(F23:F27,H23:H27),0)","v":{"v":58750,"d":"58750.00"}},"ECPenF",{"$f":"IF($W$8=\"GPF\",\"\",ROUND(SUM($F$23,$H$23)*10%,0))","v":{"v":5499,"d":"5499.00"}},{"$f":"Table4[[#Headers],[LIC]]","v":"LIC"},{"$f":"IF($A25=$R$12,$S$12,$M18)","v":""},{"$f":"ROUND(SUM(K23:K27,M23:M27),0)","v":{"v":10499,"d":"10499.00"}},{"$f":"ROUND(SUM(I23-N23),0)","v":{"v":48251,"d":"48251.00"}}]
[{"$nulls":4},"HRA",{"$f":"IFERROR(IF($W$9=\"Yes\",\"\",ROUND($F23*'DA HRA Rate'!$D$8,0)),\"\")","v":{"v":3760,"d":"3760.00"}},"Wash All.",{"$f":"IFERROR(IF(VLOOKUP($Q$1,Allowance,5,0)=0,\"\",VLOOKUP($Q$1,Allowance,5,0)),\"\")","v":""},null,{"$f":"Table4[[#Headers],[GPF]]","v":"GPF"},{"$f":"IF($A$25=$R$10,$S$10,IF($W$8=\"NPS\",\"\",$K$19))","v":""},{"$f":"Table4[[#Headers],[GPF Loan]]","v":"GPF Loan"},{"$f":"IF($A25=$R$13,$S$13,$M19)","v":""}]
["June",{"$nulls":3},"Handi. All.",{"$f":"IFERROR(IF(VLOOKUP($Q$1,Allowance,4,0)=0,\"\",VLOOKUP($Q$1,Allowance,4,0)),\"\")","v":""},"CCA All.",{"$f":"IFERROR(IF(VLOOKUP($Q$1,Allowance,6,0)=0,\"\",VLOOKUP($Q$1,Allowance,6,0)),\"\")","v":""},null,{"$f":"Table4[[#Headers],[SIP]]","v":"SIP"},{"$f":"IF($K20=\"\",\"\",$K20)","v":{"v":3000,"d":"3000.00"}},{"$f":"Table4[[#Headers],[SIL]]","v":"SIL"},{"$f":"IF($A25=$R$14,$S$14,$M20)","v":""}]
[{"$f":"LEFT($O$2,4)","v":"2021"},{"$nulls":3},"Ot. Allow 1",{"$f":"IFERROR(IF(VLOOKUP($Q$1,Allowance,7,0)=0,\"\",VLOOKUP($Q$1,Allowance,7,0)),\"\")","v":""},"Ot. Allow 2",{"$f":"IFERROR(IF(VLOOKUP($Q$1,Allowance,8,0)=0,\"\",VLOOKUP($Q$1,Allowance,8,0)),\"\")","v":""},null,{"$f":"Table4[[#Headers],[RPMF]]","v":"RPMF"},{"$f":"IF($A25=$R$11,$S$11,IF($W$8=\"NPS\",\"\",$K21))","v":""},{"$f":"Table4[[#Headers],[Itax]]","v":"Itax"},{"$f":"IF($A25=$R$15,$S$15,$M21)","v":{"v":2000,"d":"2000.00"}}]
[{"$nulls":4},"Ot. Allow 3",{"$f":"IFERROR(IF(VLOOKUP($Q$1,Allowance,9,0)=0,\"\",VLOOKUP($Q$1,Allowance,9,0)),\"\")","v":""},"Ot. Allow 4",{"$f":"IFERROR(IF(VLOOKUP($Q$1,Allowance,10,0)=0,\"\",VLOOKUP($Q$1,Allowance,10,0)),\"\")","v":""},null,{"$f":"Table4[[#Headers],[CM Corona]]","v":"CM Corona"},{"$f":"IF($A25=$R$17,$S$17,$K22)","v":""},{"$f":"Table4[[#Headers],[Other Ded.]]","v":"Other Ded."},{"$f":"IF($A25=$R$16,$S$16,$M22)","v":""}]
[null,"Salary",null,null,{"$f":"E23","v":"Basic"},{"$f":"IFERROR(IF($R$5=\"\",IF($W$9=\"Yes\",F23,IF($A$30=$W$10,$W$11,MROUND(F23*1.03,100))),$R$5),\"\")","v":{"v":48400,"d":"48400.00"}},{"$f":"G23","v":"DA"},{"$f":"IFERROR(IF($W$9=\"Yes\",\"\",$F$28*'DA HRA Rate'!$C$9),\"\")","v":{"v":13552.000000000002,"d":"13552.00"}},{"$f":"ROUND(SUM(F28:F32,H28:H32),0)","v":{"v":65824,"d":"65824.00"}},"ECPenF",{"$f":"IF($W$8=\"GPF\",\"\",ROUND(SUM($F$28,$H$28)*10%,0))","v":{"v":6195,"d":"6195.00"}},{"$f":"Table4[[#Headers],[LIC]]","v":"LIC"},{"$f":"IF($A30=$R$12,$S$12,$M23)","v":""},{"$f":"ROUND(SUM(K28:K32,M28:M32),0)","v":{"v":11195,"d":"11195.00"}},{"$f":"ROUND(SUM(I28-N28),0)","v":{"v":54629,"d":"54629.00"}}]
[{"$nulls":4},"HRA",{"$f":"IFERROR(IF($W$9=\"Yes\",\"\",ROUND($F28*'DA HRA Rate'!$D$9,0)),\"\")","v":{"v":3872,"d":"3872.00"}},"Wash All.",{"$f":"IFERROR(IF(VLOOKUP($Q$1,Allowance,5,0)=0,\"\",VLOOKUP($Q$1,Allowance,5,0)),\"\")","v":""},null,{"$f":"Table4[[#Headers],[GPF]]","v":"GPF"},{"$f":"IF($A$30=$R$10,$S$10,IF($W$8=\"NPS\",\"\",$K$24))","v":""},{"$f":"Table4[[#Headers],[GPF Loan]]","v":"GPF Loan"},{"$f":"IF($A30=$R$13,$S$13,$M24)","v":""}]
["July",{"$nulls":3},"Handi. All.",{"$f":"IFERROR(IF(VLOOKUP($Q$1,Allowance,4,0)=0,\"\",VLOOKUP($Q$1,Allowance,4,0)),\"\")","v":""},"CCA All.",{"$f":"IFERROR(IF(VLOOKUP($Q$1,Allowance,6,0)=0,\"\",VLOOKUP($Q$1,Allowance,6,0)),\"\")","v":""},null,{"$f":"Table4[[#Headers],[SIP]]","v":"SIP"},{"$f":"IF($K25=\"\",\"\",$K25)","v":{"v":3000,"d":"3000.00"}},{"$f":"Table4[[#Headers],[SIL]]","v":"SIL"},{"$f":"IF($A30=$R$14,$S$14,$M25)","v":""}]
[{"$f":"LEFT($O$2,4)","v":"2021"},{"$nulls":3},"Ot. Allow 1",{"$f":"IFERROR(IF(VLOOKUP($Q$1,Allowance,7,0)=0,\"\",VLOOKUP($Q$1,Allowance,7,0)),\"\")","v":""},"Ot. Allow 2",{"$f":"IFERROR(IF(VLOOKUP($Q$1,Allowance,8,0)=0,\"\",VLOOKUP($Q$1,Allowance,8,0)),\"\")","v":""},null,{"$f":"Table4[[#Headers],[RPMF]]","v":"RPMF"},{"$f":"IF($A30=$R$11,$S$11,IF($W$8=\"NPS\",\"\",$K26))","v":""},{"$f":"Table4[[#Headers],[Itax]]","v":"Itax"},{"$f":"IF($A30=$R$15,$S$15,$M26)","v":{"v":2000,"d":"2000.00"}}]
[{"$nulls":4},"Ot. Allow 3",{"$f":"IFERROR(IF(VLOOKUP($Q$1,Allowance,9,0)=0,\"\",VLOOKUP($Q$1,Allowance,9,0)),\"\")","v":""},"Ot. Allow 4",{"$f":"IFERROR(IF(VLOOKUP($Q$1,Allowance,10,0)=0,\"\",VLOOKUP($Q$1,Allowance,10,0)),\"\")","v":""},null,{"$f":"Table4[[#Headers],[CM Corona]]","v":"CM Corona"},{"$f":"IF($A30=$R$17,$S$17,$K27)","v":""},{"$f":"Table4[[#Headers],[Other Ded.]]","v":"Other Ded."},{"$f":"IF($A30=$R$16,$S$16,$M27)","v":""}]
[null,"Salary",null,null,{"$f":"E28","v":"Basic"},{"$f":"IFERROR(IF($A$35=$W$10,$W$11,F28),\"\")","v":{"v":48400,"d":"48400.00"}},{"$f":"G28","v":"DA"},{"$f":"IFERROR(IF($W$9=\"Yes\",\"\",$F$33*'DA HRA Rate'!$C$10),\"\")","v":{"v":13552.000000000002,"d":"13552.00"}},{"$f":"ROUND(SUM(F33:F37,H33:H37),0)","v":{"v":66308,"d":"66308.00"}},"ECPenF",{"$f":"IF($W$8=\"GPF\",\"\",ROUND(SUM($F$33,$H$33)*10%,0))","v":{"v":6195,"d":"6195.00"}},{"$f":"Table4[[#Headers],[LIC]]","v":"LIC"},{"$f":"IF($A35=$R$12,$S$12,$M28)","v":""},{"$f":"ROUND(SUM(K33:K37,M33:M37),0)","v":{"v":11195,"d":"11195.00"}},{"$f":"ROUND(SUM(I33-N33),0)","v":{"v":55113,"d":"55113.00"}}]
[{"$nulls":4},"HRA",{"$f":"IFERROR(IF($W$9=\"Yes\",\"\",ROUND($F33*'DA HRA Rate'!$D$10,0)),\"\")","v":{"v":4356,"d":"4356.00"}},"Wash All.",{"$f":"IFERROR(IF(VLOOKUP($Q$1,Allowance,5,0)=0,\"\",VLOOKUP($Q$1,Allowance,5,0)),\"\")","v":""},null,{"$f":"Table4[[#Headers],[GPF]]","v":"GPF"},{"$f":"IF($A$35=$R$10,$S$10,IF($W$8=\"NPS\",\"\",$K$29))","v":""},{"$f":"Table4[[#Headers],[GPF Loan]]","v":"GPF Loan"},{"$f":"IF($A35=$R$13,$S$13,$M29)","v":""}]
["August",{"$nulls":3},"Handi. All.",{"$f":"IFERROR(IF(VLOOKUP($Q$1,Allowance,4,0)=0,\"\",VLOOKUP($Q$1,Allowance,4,0)),\"\")","v":""},"CCA All.",{"$f":"IFERROR(IF(VLOOKUP($Q$1,Allowance,6,0)=0,\"\",VLOOKUP($Q$1,Allowance,6,0)),\"\")","v":""},null,{"$f":"Table4[[#Headers],[SIP]]","v":"SIP"},{"$f":"IF($K30=\"\",\"\",$K30)","v":{"v":3000,"d":"3000.00"}},{"$f":"Table4[[#Headers],[SIL]]","v":"SIL"},{"$f":"IF($A35=$R$14,$S$14,$M30)","v":""}]
[{"$f":"LEFT($O$2,4)","v":"2021"},{"$nulls":3},"Ot. Allow 1",{"$f":"IFERROR(IF(VLOOKUP($Q$1,Allowance,7,0)=0,\"\",VLOOKUP($Q$1,Allowance,7,0)),\"\")","v":""},"Ot. Allow 2",{"$f":"IFERROR(IF(VLOOKUP($Q$1,Allowance,8,0)=0,\"\",VLOOKUP($Q$1,Allowance,8,0)),\"\")","v":""},null,{"$f":"Table4[[#Headers],[RPMF]]","v":"RPMF"},{"$f":"IF($A35=$R$11,$S$11,IF($W$8=\"NPS\",\"\",$K31))","v":""},{"$f":"Table4[[#Headers],[Itax]]","v":"Itax"},{"$f":"IF($A35=$R$15,$S$15,$M31)","v":{"v":2000,"d":"2000.00"}}]
[{"$nulls":4},"Ot. Allow 3",{"$f":"IFERROR(IF(VLOOKUP($Q$1,Allowance,9,0)=0,\"\",VLOOKUP($Q$1,Allowance,9,0)),\"\")","v":""},"Ot. Allow 4",{"$f":"IFERROR(IF(VLOOKUP($Q$1,Allowance,10,0)=0,\"\",VLOOKUP($Q$1,Allowance,10,0)),\"\")","v":""},null,{"$f":"Table4[[#Headers],[CM Corona]]","v":"CM Corona"},{"$f":"IF($A35=$R$17,$S$17,$K32)","v":""},{"$f":"Table4[[#Headers],[Other Ded.]]","v":"Other Ded."},{"$f":"IF($A35=$R$16,$S$16,$M32)","v":""}]
["Government Of Rajasthan",{"$nulls":11},"Page No.",null,2]
["GA55 A",{"$nulls":11},"Financial Year : ",null,{"$f":"IF(Master!$I$2=\"\",\"\",Master!$I$2)","v":"2021-22"}]
[null,"Salary",null,null,{"$f":"E33","v":"Basic"},{"$f":"IFERROR(IF($A$42=$W$10,$W$11,F33),\"\")","v":{"v":48400,"d":"48400.00"}},{"$f":"G33","v":"DA"},{"$f":"IFERROR(IF($W$9=\"Yes\",\"\",$F$40*'DA HRA Rate'!$C$11),\"\")","v":{"v":13552.000000000002,"d":"13552.00"}},{"$f":"ROUND(SUM(F40:F44,H40:H44),0)","v":{"v":66308,"d":"66308.00"}},"ECPenF",{"$f":"IF($W$8=\"GPF\",\"\",ROUND(SUM($F$40,$H$40)*10%,0))","v":{"v":6195,"d":"6195.00"}},{"$f":"Table4[[#Headers],[LIC]]","v":"LIC"},{"$f":"IF($A42=$R$12,$S$12,$M33)","v":""},{"$f":"ROUND(SUM(K40:K44,M40:M44),0)","v":{"v":11195,"d":"11195.00"}},{"$f":"ROUND(SUM(I40-N40),0)","v":{"v":55113,"d":"55113.00"}}]
[{"$nulls":4},{"$f":"E34","v":"HRA"},{"$f":"IFERROR(IF($W$9=\"Yes\",\"\",ROUND($F40*'DA HRA Rate'!$D$11,0)),\"\")","v":{"v":4356,"d":"4356.00"}},{"$f":"G34","v":"Wash All."},{"$f":"IFERROR(IF(VLOOKUP($Q$1,Allowance,5,0)=0,\"\",VLOOKUP($Q$1,Allowance,5,0)),\"\")","v":""},null,{"$f":"Table4[[#Headers],[GPF]]","v":"GPF"},{"$f":"IF($A$42=$R$10,$S$10,IF($W$8=\"NPS\",\"\",$K$34))","v":""},{"$f":"Table4[[#Headers],[GPF Loan]]","v":"GPF Loan"},{"$f":"IF($A42=$R$13,$S$13,$M34)","v":""}]
["September",{"$nulls":3},"Handi. All.",{"$f":"IFERROR(IF(VLOOKUP($Q$1,Allowance,4,0)=0,\"\",VLOOKUP($Q$1,Allowance,4,0)),\"\")","v":""},"CCA All.",{"$f":"IFERROR(IF(VLOOKUP($Q$1,Allowance,6,0)=0,\"\",VLOOKUP($Q$1,Allowance,6,0)),\"\")","v":""},null,{"$f":"Table4[[#Headers],[SIP]]","v":"SIP"},{"$f":"IF($K35=\"\",\"\",$K35)","v":{"v":3000,"d":"3000.00"}},{"$f":"Table4[[#Headers],[SIL]]","v":"SIL"},{"$f":"IF($A42=$R$14,$S$14,$M35)","v":""}]
[{"$f":"LEFT($O$2,4)","v":"2021"},{"$nulls":3},"Ot. Allow 1",{"$f":"IFERROR(IF(VLOOKUP($Q$1,Allowance,7,0)=0,\"\",VLOOKUP($Q$1,Allowance,7,0)),\"\")","v":""},"Ot. Allow 2",{"$f":"IFERROR(IF(VLOOKUP($Q$1,Allowance,8,0)=0,\"\",VLOOKUP($Q$1,Allowance,8,0)),\"\")","v":""},null,{"$f":"Table4[[#Headers],[RPMF]]","v":"RPMF"},{"$f":"IF($A42=$R$11,$S$11,IF($W$8=\"NPS\",\"\",$K36))","v":""},{"$f":"Table4[[#Headers],[Itax]]","v":"Itax"},{"$f":"IF($A42=$R$15,$S$15,$M36)","v":{"v":2000,"d":"2000.00"}}]
[{"$nulls":4},"Ot. Allow 3",{"$f":"IFERROR(IF(VLOOKUP($Q$1,Allowance,9,0)=0,\"\",VLOOKUP($Q$1,Allowance,9,0)),\"\")","v":""},"Ot. Allow 4",{"$f":"IFERROR(IF(VLOOKUP($Q$1,Allowance,10,0)=0,\"\",VLOOKUP($Q$1,Allowance,10,0)),\"\")","v":""},null,{"$f":"Table4[[#Headers],[CM Corona]]","v":"CM Corona"},{"$f":"IF($A42=$R$17,$S$17,$K37)","v":""},{"$f":"Table4[[#Headers],[Other Ded.]]","v":"Other Ded."},{"$f":"IF($A42=$R$16,$S$16,$M37)","v":""}]
[null,"Salary",null,null,{"$f":"E40","v":"Basic"},{"$f":"IFERROR(IF($A$47=$W$10,$W$11,F40),\"\")","v":{"v":48400,"d":"48400.00"}},{"$f":"G40","v":"DA"},{"$f":"IFERROR(IF($W$9=\"Yes\",\"\",$F$45*'DA HRA Rate'!$C$12),\"\")","v":{"v":13552.000000000002,"d":"13552.00"}},{"$f":"ROUND(SUM(F45:F49,H45:H49),0)","v":{"v":66308,"d":"66308.00"}},"ECPenF",{"$f":"IF($W$8=\"GPF\",\"\",ROUND(SUM($F$45,$H$45)*10%,0))","v":{"v":6195,"d":"6195.00"}},{"$f":"Table4[[#Headers],[LIC]]","v":"LIC"},{"$f":"IF($A47=$R$12,$S$12,$M40)","v":""},{"$f":"ROUND(SUM(K45:K49,M45:M49),0)","v":{"v":11195,"d":"11195.00"}},{"$f":"ROUND(SUM(I45-N45),0)","v":{"v":55113,"d":"55113.00"}}]
[{"$nulls":4},{"$f":"E41","v":"HRA"},{"$f":"IFERROR(IF($W$9=\"Yes\",\"\",ROUND($F45*'DA HRA Rate'!$D$12,0)),\"\")","v":{"v":4356,"d":"4356.00"}},{"$f":"G41","v":"Wash All."},{"$f":"IFERROR(IF(VLOOKUP($Q$1,Allowance,5,0)=0,\"\",VLOOKUP($Q$1,Allowance,5,0)),\"\")","v":""},null,{"$f":"Table4[[#Headers],[GPF]]","v":"GPF"},{"$f":"IF($A$47=$R$10,$S$10,IF($W$8=\"NPS\",\"\",$K$41))","v":""},{"$f":"Table4[[#Headers],[GPF Loan]]","v":"GPF Loan"},{"$f":"IF($A47=$R$13,$S$13,$M41)","v":""}]
["October",{"$nulls":3},"Handi. All.",{"$f":"IFERROR(IF(VLOOKUP($Q$1,Allowance,4,0)=0,\"\",VLOOKUP($Q$1,Allowance,4,0)),\"\")","v":""},"CCA All.",{"$f":"IFERROR(IF(VLOOKUP($Q$1,Allowance,6,0)=0,\"\",VLOOKUP($Q$1,Allowance,6,0)),\"\")","v":""},null,{"$f":"Table4[[#Headers],[SIP]]","v":"SIP"},{"$f":"IF($K42=\"\",\"\",$K42)","v":{"v":3000,"d":"3000.00"}},{"$f":"Table4[[#Headers],[SIL]]","v":"SIL"},{"$f":"IF($A47=$R$14,$S$14,$M42)","v":""}]
[{"$f":"LEFT($O$2,4)","v":"2021"},{"$nulls":3},"Ot. Allow 1",{"$f":"IFERROR(IF(VLOOKUP($Q$1,Allowance,7,0)=0,\"\",VLOOKUP($Q$1,Allowance,7,0)),\"\")","v":""},"Ot. Allow 2",{"$f":"IFERROR(IF(VLOOKUP($Q$1,Allowance,8,0)=0,\"\",VLOOKUP($Q$1,Allowance,8,0)),\"\")","v":""},null,{"$f":"Table4[[#Headers],[RPMF]]","v":"RPMF"},{"$f":"IF($A47=$R$11,$S$11,IF($W$8=\"NPS\",\"\",$K43))","v":""},{"$f":"Table4[[#Headers],[Itax]]","v":"Itax"},{"$f":"IF($A47=$R$15,$S$15,$M43)","v":{"v":2000,"d":"2000.00"}}]
[{"$nulls":4},"Ot. Allow 3",{"$f":"IFERROR(IF(VLOOKUP($Q$1,Allowance,9,0)=0,\"\",VLOOKUP($Q$1,Allowance,9,0)),\"\")","v":""},"Ot. Allow 4",{"$f":"IFERROR(IF(VLOOKUP($Q$1,Allowance,10,0)=0,\"\",VLOOKUP($Q$1,Allowance,10,0)),\"\")","v":""},null,{"$f":"Table4[[#Headers],[CM Corona]]","v":"CM Corona"},{"$f":"IF($A47=$R$17,$S$17,$K44)","v":""},{"$f":"Table4[[#Headers],[Other Ded.]]","v":"Other Ded."},{"$f":"IF($A47=$R$16,$S$16,$M44)","v":""}]
[null,"Salary",null,null,{"$f":"E45","v":"Basic"},{"$f":"IFERROR(IF($A$52=$W$10,$W$11,F45),\"\")","v":{"v":48400,"d":"48400.00"}},{"$f":"G45","v":"DA"},{"$f":"IFERROR(IF($W$9=\"Yes\",\"\",$F$50*'DA HRA Rate'!$C$13),\"\")","v":{"v":13552.000000000002,"d":"13552.00"}},{"$f":"ROUND(SUM(F50:F54,H50:H54),0)","v":{"v":66308,"d":"66308.00"}},"ECPenF",{"$f":"IF($W$8=\"GPF\",\"\",ROUND(SUM($F$50,$H$50)*10%,0))","v":{"v":6195,"d":"6195.00"}},{"$f":"Table4[[#Headers],[LIC]]","v":"LIC"},{"$f":"IF($A52=$R$12,$S$12,$M45)","v":""},{"$f":"ROUND(SUM(K50:K54,M50:M54),0)","v":{"v":11195,"d":"11195.00"}},{"$f":"ROUND(SUM(I50-N50),0)","v":{"v":55113,"d":"55113.00"}}]
[{"$nulls":4},"HRA",{"$f":"IFERROR(IF($W$9=\"Yes\",\"\",ROUND($F50*'DA HRA Rate'!$D$13,0)),\"\")","v":{"v":4356,"d":"4356.00"}},"Wash All.",{"$f":"IFERROR(IF(VLOOKUP($Q$1,Allowance,5,0)=0,\"\",VLOOKUP($Q$1,Allowance,5,0)),\"\")","v":""},null,{"$f":"Table4[[#Headers],[GPF]]","v":"GPF"},{"$f":"IF($A$52=$R$10,$S$10,IF($W$8=\"NPS\",\"\",$K$46))","v":""},{"$f":"Table4[[#Headers],[GPF Loan]]","v":"GPF Loan"},{"$f":"IF($A52=$R$13,$S$13,$M46)","v":""}]
["November",{"$nulls":3},"Handi. All.",{"$f":"IFERROR(IF(VLOOKUP($Q$1,Allowance,4,0)=0,\"\",VLOOKUP($Q$1,Allowance,4,0)),\"\")","v":""},"CCA All.",{"$f":"IFERROR(IF(VLOOKUP($Q$1,Allowance,6,0)=0,\"\",VLOOKUP($Q$1,Allowance,6,0)),\"\")","v":""},null,{"$f":"Table4[[#Headers],[SIP]]","v":"SIP"},{"$f":"IF($K47=\"\",\"\",$K47)","v":{"v":3000,"d":"3000.00"}},{"$f":"Table4[[#Headers],[SIL]]","v":"SIL"},{"$f":"IF($A52=$R$14,$S$14,$M47)","v":""}]
[{"$f":"LEFT($O$2,4)","v":"2021"},{"$nulls":3},"Ot. Allow 1",{"$f":"IFERROR(IF(VLOOKUP($Q$1,Allowance,7,0)=0,\"\",VLOOKUP($Q$1,Allowance,7,0)),\"\")","v":""},"Ot. Allow 2",{"$f":"IFERROR(IF(VLOOKUP($Q$1,Allowance,8,0)=0,\"\",VLOOKUP($Q$1,Allowance,8,0)),\"\")","v":""},null,{"$f":"Table4[[#Headers],[RPMF]]","v":"RPMF"},{"$f":"IF($A52=$R$11,$S$11,IF($W$8=\"NPS\",\"\",$K48))","v":""},{"$f":"Table4[[#Headers],[Itax]]","v":"Itax"},{"$f":"IF($A52=$R$15,$S$15,$M48)","v":{"v":2000,"d":"2000.00"}}]
[{"$nulls":4},"Ot. Allow 3",{"$f":"IFERROR(IF(VLOOKUP($Q$1,Allowance,9,0)=0,\"\",VLOOKUP($Q$1,Allowance,9,0)),\"\")","v":""},"Ot. Allow 4",{"$f":"IFERROR(IF(VLOOKUP($Q$1,Allowance,10,0)=0,\"\",VLOOKUP($Q$1,Allowance,10,0)),\"\")","v":""},null,{"$f":"Table4[[#Headers],[CM Corona]]","v":"CM Corona"},{"$f":"IF($A52=$R$17,$S$17,$K49)","v":""},{"$f":"Table4[[#Headers],[Other Ded.]]","v":"Other Ded."},{"$f":"IF($A52=$R$16,$S$16,$M49)","v":""}]
[null,"Salary",null,null,{"$f":"E50","v":"Basic"},{"$f":"IFERROR(IF($A$57=$W$10,$W$11,F50),\"\")","v":{"v":48400,"d":"48400.00"}},{"$f":"G50","v":"DA"},{"$f":"IFERROR(IF($W$9=\"Yes\",\"\",$F$55*'DA HRA Rate'!$C$14),\"\")","v":{"v":13552.000000000002,"d":"13552.00"}},{"$f":"ROUND(SUM(F55:F59,H55:H59),)","v":{"v":66308,"d":"66308.00"}},"ECPenF",{"$f":"IF($W$8=\"GPF\",\"\",ROUND(SUM($F$55,$H$55)*10%,0))","v":{"v":6195,"d":"6195.00"}},{"$f":"Table4[[#Headers],[LIC]]","v":"LIC"},{"$f":"IF($A57=$R$12,$S$12,$M50)","v":""},{"$f":"ROUND(SUM(K55:K59,M55:M59),0)","v":{"v":11195,"d":"11195.00"}},{"$f":"ROUND(SUM(I55-N55),0)","v":{"v":55113,"d":"55113.00"}}]
[{"$nulls":4},"HRA",{"$f":"IFERROR(IF($W$9=\"Yes\",\"\",ROUND($F55*'DA HRA Rate'!$D$14,0)),\"\")","v":{"v":4356,"d":"4356.00"}},"Wash All.",{"$f":"IFERROR(IF(VLOOKUP($Q$1,Allowance,5,0)=0,\"\",VLOOKUP($Q$1,Allowance,5,0)),\"\")","v":""},null,{"$f":"Table4[[#Headers],[GPF]]","v":"GPF"},{"$f":"IF($A$57=$R$10,$S$10,IF($W$8=\"NPS\",\"\",$K$51))","v":""},{"$f":"Table4[[#Headers],[GPF Loan]]","v":"GPF Loan"},{"$f":"IF($A57=$R$13,$S$13,$M51)","v":""}]
["December",{"$nulls":3},"Handi. All.",{"$f":"IFERROR(IF(VLOOKUP($Q$1,Allowance,4,0)=0,\"\",VLOOKUP($Q$1,Allowance,4,0)),\"\")","v":""},"CCA All.",{"$f":"IFERROR(IF(VLOOKUP($Q$1,Allowance,6,0)=0,\"\",VLOOKUP($Q$1,Allowance,6,0)),\"\")","v":""},null,{"$f":"Table4[[#Headers],[SIP]]","v":"SIP"},{"$f":"IF($K52=\"\",\"\",$K52)","v":{"v":3000,"d":"3000.00"}},{"$f":"Table4[[#Headers],[SIL]]","v":"SIL"},{"$f":"IF($A57=$R$14,$S$14,$M52)","v":""}]
[{"$f":"LEFT($O$2,4)","v":"2021"},{"$nulls":3},"Ot. Allow 1",{"$f":"IFERROR(IF(VLOOKUP($Q$1,Allowance,7,0)=0,\"\",VLOOKUP($Q$1,Allowance,7,0)),\"\")","v":""},"Ot. Allow 2",{"$f":"IFERROR(IF(VLOOKUP($Q$1,Allowance,8,0)=0,\"\",VLOOKUP($Q$1,Allowance,8,0)),\"\")","v":""},null,{"$f":"Table4[[#Headers],[RPMF]]","v":"RPMF"},{"$f":"IF($A57=$R$11,$S$11,IF($W$8=\"NPS\",\"\",$K53))","v":""},{"$f":"Table4[[#Headers],[Itax]]","v":"Itax"},{"$f":"IF($A57=$R$15,$S$15,$M53)","v":{"v":2000,"d":"2000.00"}}]
[{"$nulls":4},"Ot. Allow 3",{"$f":"IFERROR(IF(VLOOKUP($Q$1,Allowance,9,0)=0,\"\",VLOOKUP($Q$1,Allowance,9,0)),\"\")","v":""},"Ot. Allow 4",{"$f":"IFERROR(IF(VLOOKUP($Q$1,Allowance,10,0)=0,\"\",VLOOKUP($Q$1,Allowance,10,0)),\"\")","v":""},null,{"$f":"Table4[[#Headers],[CM Corona]]","v":"CM Corona"},{"$f":"IF($A57=$R$17,$S$17,$K54)","v":""},{"$f":"Table4[[#Headers],[Other Ded.]]","v":"Other Ded."},{"$f":"IF($A57=$R$16,$S$16,$M54)","v":""}]
[null,"Salary",null,null,{"$f":"E55","v":"Basic"},{"$f":"IFERROR(IF($A$62=$W$10,$W$11,F55),\"\")","v":{"v":48400,"d":"48400.00"}},{"$f":"G55","v":"DA"},{"$f":"IFERROR(IF($W$9=\"Yes\",\"\",$F$60*'DA HRA Rate'!$C$15),\"\")","v":{"v":13552.000000000002,"d":"13552.00"}},{"$f":"ROUND(SUM(F60:F64,H60:H64),)","v":{"v":66308,"d":"66308.00"}},"ECPenF",{"$f":"IF($W$8=\"GPF\",\"\",ROUND(SUM($F$60,$H$60)*10%,0))","v":{"v":6195,"d":"6195.00"}},{"$f":"Table4[[#Headers],[LIC]]","v":"LIC"},{"$f":"IF($A62=$R$12,$S$12,$M55)","v":""},{"$f":"ROUND(SUM(K60:K64,M60:M64),0)","v":{"v":11195,"d":"11195.00"}},{"$f":"ROUND(SUM(I60-N60),0)","v":{"v":55113,"d":"55113.00"}}]
[{"$nulls":4},"HRA",{"$f":"IFERROR(IF($W$9=\"Yes\",\"\",ROUND($F60*'DA HRA Rate'!$D$15,0)),\"\")","v":{"v":4356,"d":"4356.00"}},"Wash All.",{"$f":"IFERROR(IF(VLOOKUP($Q$1,Allowance,5,0)=0,\"\",VLOOKUP($Q$1,Allowance,5,0)),\"\")","v":""},null,{"$f":"Table4[[#Headers],[GPF]]","v":"GPF"},{"$f":"IF($A$62=$R$10,$S$10,IF($W$8=\"NPS\",\"\",$K$56))","v":""},{"$f":"Table4[[#Headers],[GPF Loan]]","v":"GPF Loan"},{"$f":"IF($A62=$R$13,$S$13,$M56)","v":""}]
["January",{"$nulls":3},"Handi. All.",{"$f":"IFERROR(IF(VLOOKUP($Q$1,Allowance,4,0)=0,\"\",VLOOKUP($Q$1,Allowance,4,0)),\"\")","v":""},"CCA All.",{"$f":"IFERROR(IF(VLOOKUP($Q$1,Allowance,6,0)=0,\"\",VLOOKUP($Q$1,Allowance,6,0)),\"\")","v":""},null,{"$f":"Table4[[#Headers],[SIP]]","v":"SIP"},{"$f":"IF($K57=\"\",\"\",$K57)","v":{"v":3000,"d":"3000.00"}},{"$f":"Table4[[#Headers],[SIL]]","v":"SIL"},{"$f":"IF($A62=$R$14,$S$14,$M57)","v":""}]
[{"$f":"LEFT($O$2,2)&RIGHT($O$2,2)","v":"2022"},{"$nulls":3},"Ot. Allow 1",{"$f":"IFERROR(IF(VLOOKUP($Q$1,Allowance,7,0)=0,\"\",VLOOKUP($Q$1,Allowance,7,0)),\"\")","v":""},"Ot. Allow 2",{"$f":"IFERROR(IF(VLOOKUP($Q$1,Allowance,8,0)=0,\"\",VLOOKUP($Q$1,Allowance,8,0)),\"\")","v":""},null,{"$f":"Table4[[#Headers],[RPMF]]","v":"RPMF"},{"$f":"IF($A62=$R$11,$S$11,IF($W$8=\"NPS\",\"\",$K58))","v":""},{"$f":"Table4[[#Headers],[Itax]]","v":"Itax"},{"$f":"IF($A62=$R$15,$S$15,$M58)","v":{"v":2000,"d":"2000.00"}}]
[{"$nulls":4},"Ot. Allow 3",{"$f":"IFERROR(IF(VLOOKUP($Q$1,Allowance,9,0)=0,\"\",VLOOKUP($Q$1,Allowance,9,0)),\"\")","v":""},"Ot. Allow 4",{"$f":"IFERROR(IF(VLOOKUP($Q$1,Allowance,10,0)=0,\"\",VLOOKUP($Q$1,Allowance,10,0)),\"\")","v":""},null,{"$f":"Table4[[#Headers],[CM Corona]]","v":"CM Corona"},{"$f":"IF($A62=$R$17,$S$17,$K59)","v":""},{"$f":"Table4[[#Headers],[Other Ded.]]","v":"Other Ded."},{"$f":"IF($A62=$R$16,$S$16,$M59)","v":""}]
[null,"Salary",null,null,{"$f":"E60","v":"Basic"},{"$f":"IFERROR(IF($A$67=$W$10,$W$11,F60),\"\")","v":{"v":48400,"d":"48400.00"}},{"$f":"G60","v":"DA"},{"$f":"IFERROR(IF($W$9=\"Yes\",\"\",$F$65*'DA HRA Rate'!$C$16),\"\")","v":{"v":13552.000000000002,"d":"13552.00"}},{"$f":"ROUND(SUM(F65:F69,H65:H69),)","v":{"v":66308,"d":"66308.00"}},"ECPenF",{"$f":"IF($W$8=\"GPF\",\"\",ROUND(SUM($F$65,$H$65)*10%,0))","v":{"v":6195,"d":"6195.00"}},{"$f":"Table4[[#Headers],[LIC]]","v":"LIC"},{"$f":"IF($A67=$R$12,$S$12,$M60)","v":""},{"$f":"ROUND(SUM(K65:K69,M65:M69),0)","v":{"v":11195,"d":"11195.00"}},{"$f":"ROUND(SUM(I65-N65),0)","v":{"v":55113,"d":"55113.00"}}]
[{"$nulls":4},"HRA",{"$f":"IFERROR(IF($W$9=\"Yes\",\"\",ROUND($F65*'DA HRA Rate'!$D$16,0)),\"\")","v":{"v":4356,"d":"4356.00"}},"Wash All.",{"$f":"IFERROR(IF(VLOOKUP($Q$1,Allowance,5,0)=0,\"\",VLOOKUP($Q$1,Allowance,5,0)),\"\")","v":""},null,{"$f":"Table4[[#Headers],[GPF]]","v":"GPF"},{"$f":"IF($A$67=$R$10,$S$10,IF($W$8=\"NPS\",\"\",$K$61))","v":""},{"$f":"Table4[[#Headers],[GPF Loan]]","v":"GPF Loan"},{"$f":"IF($A67=$R$13,$S$13,$M61)","v":""}]
["February",{"$nulls":3},"Handi. All.",{"$f":"IFERROR(IF(VLOOKUP($Q$1,Allowance,4,0)=0,\"\",VLOOKUP($Q$1,Allowance,4,0)),\"\")","v":""},"CCA All.",{"$f":"IFERROR(IF(VLOOKUP($Q$1,Allowance,6,0)=0,\"\",VLOOKUP($Q$1,Allowance,6,0)),\"\")","v":""},null,{"$f":"Table4[[#Headers],[SIP]]","v":"SIP"},{"$f":"IF($K62=\"\",\"\",$K62)","v":{"v":3000,"d":"3000.00"}},{"$f":"Table4[[#Headers],[SIL]]","v":"SIL"},{"$f":"IF($A67=$R$14,$S$14,$M62)","v":""}]
[{"$f":"LEFT($O$2,2)&RIGHT($O$2,2)","v":"2022"},{"$nulls":3},"Ot. Allow 1",{"$f":"IFERROR(IF(VLOOKUP($Q$1,Allowance,7,0)=0,\"\",VLOOKUP($Q$1,Allowance,7,0)),\"\")","v":""},"Ot. Allow 2",{"$f":"IFERROR(IF(VLOOKUP($Q$1,Allowance,8,0)=0,\"\",VLOOKUP($Q$1,Allowance,8,0)),\"\")","v":""},null,{"$f":"Table4[[#Headers],[RPMF]]","v":"RPMF"},{"$f":"IF($A67=$R$11,$S$11,IF($W$8=\"NPS\",\"\",$K63))","v":""},{"$f":"Table4[[#Headers],[Itax]]","v":"Itax"},{"$f":"IF($A67=$R$15,$S$15,$M63)","v":{"v":2000,"d":"2000.00"}}]
[{"$nulls":4},"Ot. Allow 3",{"$f":"IFERROR(IF(VLOOKUP($Q$1,Allowance,9,0)=0,\"\",VLOOKUP($Q$1,Allowance,9,0)),\"\")","v":""},"Ot. Allow 4",{"$f":"IFERROR(IF(VLOOKUP($Q$1,Allowance,10,0)=0,\"\",VLOOKUP($Q$1,Allowance,10,0)),\"\")","v":""},null,{"$f":"Table4[[#Headers],[CM Corona]]","v":"CM Corona"},{"$f":"IF($A67=$R$17,$S$17,$K64)","v":""},{"$f":"Table4[[#Headers],[Other Ded.]]","v":"Other Ded."},{"$f":"IF($A67=$R$16,$S$16,$M64)","v":""}]
["Month","Bonus",null,null,"Bouns",{"$f":"IF(R1=\"\",\"\",IF($S$5=\"YES\",6774,\"\"))","v":{"v":6774,"d":"6774.00"}},null,null,{"$f":"ROUND(SUM(F70,H70),0)","v":{"v":6774,"d":"6774.00"}},"GPF 2004",null,{"$f":"Table4[[#Headers],[Other Ded.]]","v":"Other Ded."},null,{"$f":"ROUND(SUM(K70,M70),0)","v":{"v":0,"d":"0.00"}},{"$f":"ROUND(SUM(I70-N70),0)","v":{"v":6774,"d":"6774.00"}}]
["Month","DA",null,null,"DA",null,"DA",null,{"$f":"ROUND(SUM(F71,H71),0)","v":{"v":0,"d":"0.00"}},"ECPenF",{"$f":"IF($W$8=\"GPF\",\"\",ROUND(SUM(F71,H71)*10%,0))","v":{"v":0,"d":"0.00"}},{"$f":"Table4[[#Headers],[Other Ded.]]","v":"Other Ded."},null,{"$f":"ROUND(SUM(K71,M71),0)","v":{"v":0,"d":"0.00"}},{"$f":"ROUND(SUM(I71-N71),0)","v":{"v":0,"d":"0.00"}}]
["Month","DA",null,null,"DA",null,"DA",null,{"$f":"ROUND(SUM(F72,H72),0)","v":{"v":0,"d":"0.00"}},"ECPenF",{"$f":"IF($W$8=\"GPF\",\"\",ROUND(SUM(F72,H72)*10%,0))","v":{"v":0,"d":"0.00"}},{"$f":"Table4[[#Headers],[Other Ded.]]","v":"Other Ded."},null,{"$f":"ROUND(SUM(K72,M72),0)","v":{"v":0,"d":"0.00"}},{"$f":"ROUND(SUM(I72-N72),0)","v":{"v":0,"d":"0.00"}}]
["Month","Surrender",null,null,"Basic",{"$f":"IFERROR(IF(VLOOKUP($Q$1,Allowance,13,0)=\"\",\"\",IF(VLOOKUP($Q$1,Allowance,13,0)=3,ROUND(F8/2,0),IF(VLOOKUP($Q$1,Allowance,13,0)=4,ROUND(F13/2,0),IF(VLOOKUP($Q$1,Allowance,13,0)=5,ROUND(F18/2,0),IF(VLOOKUP($Q$1,Allowance,13,0)=6,ROUND(F23/2,0),IF(VLOOKUP($Q$1,Allowance,13,0)=7,ROUND(F28/2,0),IF(VLOOKUP($Q$1,Allowance,13,0)=8,ROUND(F33/2,0),IF(VLOOKUP($Q$1,Allowance,13,0)=9,ROUND(F40/2,0),IF(VLOOKUP($Q$1,Allowance,13,0)=10,ROUND(F45/2,0),IF(VLOOKUP($Q$1,Allowance,13,0)=11,ROUND(F50/2,0),IF(VLOOKUP($Q$1,Allowance,13,0)=12,ROUND(F55/2,0),IF(VLOOKUP($Q$1,Allowance,13,0)=1,ROUND(F60/2,0),IF(VLOOKUP($Q$1,Allowance,13,0)=2,ROUND(F65/2,0),\"\"))))))))))))),\"\")","v":""},"DA",{"$f":"IF(F73=\"\",\"\",F73*VLOOKUP($Q$1,Allowance,14,0))","v":""},{"$f":"ROUND(SUM(F73,H73),0)","v":{"v":0,"d":"0.00"}},{"$f":"Table4[[#Headers],[Itax]]","v":"Itax"},null,{"$f":"Table4[[#Headers],[Other Ded.]]","v":"Other Ded."},null,{"$f":"ROUND(SUM(K73,M73),0)","v":{"v":0,"d":"0.00"}},{"$f":"ROUND(SUM(I73-N73),0)","v":{"v":0,"d":"0.00"}}]
["Government Of Rajasthan",{"$nulls":11},"Page No.",null,3]
["GA55 A",{"$nulls":11},"Financial Year : ",null,{"$f":"IF(Master!$I$2=\"\",\"\",Master!$I$2)","v":"2021-22"}]
["Month","Salary Arrear",null,null,"Basic",null,"DA",null,{"$f":"ROUND(SUM(F76:F77,H76:H77),0)","v":{"v":0,"d":"0.00"}},"ECPenF",{"$f":"IF($W$8=\"GPF\",\"\",ROUND(SUM(F76,H76)*10%,0))","v":{"v":0,"d":"0.00"}},{"$f":"Table4[[#Headers],[Itax]]","v":"Itax"},null,{"$f":"ROUND(SUM(K76:K77,M76:M77),0)","v":{"v":0,"d":"0.00"}},{"$f":"ROUND(SUM(I76-N76),0)","v":{"v":0,"d":"0.00"}}]
[{"$nulls":4},"HRA",null,"Other",null,null,{"$f":"Table4[[#Headers],[GPF]]","v":"GPF"},null,{"$f":"Table4[[#Headers],[Other Ded.]]","v":"Other Ded."}]
["Month","Other Arrear",null,null,"Basic",null,"DA",null,{"$f":"ROUND(SUM(F78:F79,H78:H79),0)","v":{"v":0,"d":"0.00"}},"ECPenF",{"$f":"IF($W$8=\"GPF\",\"\",ROUND(SUM(F78,H78)*10%,0))","v":{"v":0,"d":"0.00"}},{"$f":"Table4[[#Headers],[Itax]]","v":"Itax"},null,{"$f":"ROUND(SUM(K78:K79,M78:M79),0)","v":{"v":0,"d":"0.00"}},{"$f":"ROUND(SUM(I78-N78),0)","v":{"v":0,"d":"0.00"}}]
[{"$nulls":4},"HRA",null,"Other",null,null,{"$f":"Table4[[#Headers],[GPF]]","v":"GPF"},null,{"$f":"Table4[[#Headers],[Other Ded.]]","v":"Other Ded."}]
["Month","Other Arrear",null,null,"Basic",null,"DA",null,{"$f":"ROUND(SUM(F80:F81,H80:H81),0)","v":{"v":0,"d":"0.00"}},"ECPenF",{"$f":"IF($W$8=\"GPF\",\"\",ROUND(SUM(F80,H80)*10%,0))","v":{"v":0,"d":"0.00"}},{"$f":"Table4[[#Headers],[Itax]]","v":"Itax"},null,{"$f":"ROUND(SUM(K80:K81,M80:M81),0)","v":{"v":0,"d":"0.00"}},{"$f":"ROUND(SUM(I80-N80),0)","v":{"v":0,"d":"0.00"}}]
[{"$nulls":4},"HRA",null,"Other",null,null,{"$f":"Table4[[#Headers],[GPF]]","v":"GPF"},null,{"$f":"Table4[[#Headers],[Other Ded.]]","v":"Other Ded."}]
["Month","Other Arrear",null,null,"Basic",null,"DA",null,{"$f":"ROUND(SUM(F82:F83,H82:H83),0)","v":{"v":0,"d":"0.00"}},"ECPenF",{"$f":"IF($W$8=\"GPF\",\"\",ROUND(SUM(F82,H82)*10%,0))","v":{"v":0,"d":"0.00"}},{"$f":"Table4[[#Headers],[Itax]]","v":"Itax"},null,{"$f":"ROUND(SUM(K82:K83,M82:M83),0)","v":{"v":0,"d":"0.00"}},{"$f":"ROUND(SUM(I82-N82),0)","v":{"v":0,"d":"0.00"}}]
[{"$nulls":4},"HRA",null,"Other",null,null,{"$f":"Table4[[#Headers],[GPF]]","v":"GPF"},null,{"$f":"Table4[[#Headers],[Other Ded.]]","v":"Other Ded."}]
[null,"Total Allowances",{"$nulls":4},"Total Allowances"]
[null,{"$f":"E8","v":"Basic"},null,100,{"$f":"ROUND(SUMIF($E$8:$E$37,B85,$F$8:$F$37)+SUMIF($E$40:$E$73,B85,$F$40:$F$73)+SUMIF($E$76:$E$83,B85,$F$76:$F$83)+SUMIF($G$8:$G$37,B85,$H$8:$H$37)+SUMIF($G$40:$G$73,B85,$H$40:$H$73)+SUMIF($G$76:$G$83,B85,$H$76:$H$83),0)","v":{"v":575200,"d":"575200.00"}},null,"ECPenF",null,{"$f":"ROUND(SUMIF($J$8:$J$37,G85,$K$8:$K$37)+SUMIF($J$40:$J$73,G85,$K$40:$K$73)+SUMIF($J$76:$J$83,G85,$K$76:$K$83)+SUMIF($L$8:$L$37,G85,$M$8:$M$37)+SUMIF($L$40:$L$73,G85,$M$40:$M$73)+SUMIF($L$76:$L$83,G85,$M$76:$M$83),0)","v":{"v":71556,"d":"71556.00"}}]
[null,{"$f":"E9","v":"HRA"},null,107,{"$f":"ROUND(SUMIF($E$8:$E$37,B86,$F$8:$F$37)+SUMIF($E$40:$E$73,B86,$F$40:$F$73)+SUMIF($E$76:$E$83,B86,$F$76:$F$83)+SUMIF($G$8:$G$37,B86,$H$8:$H$37)+SUMIF($G$40:$G$73,B86,$H$40:$H$73)+SUMIF($G$76:$G$83,B86,$H$76:$H$83),0)","v":{"v":49404,"d":"49404.00"}},null,{"$f":"Table4[[#Headers],[GPF]]","v":"GPF"},null,{"$f":"ROUND(SUMIF($J$8:$J$37,G86,$K$8:$K$37)+SUMIF($J$40:$J$73,G86,$K$40:$K$73)+SUMIF($J$76:$J$83,G86,$K$76:$K$83)+SUMIF($L$8:$L$37,G86,$M$8:$M$37)+SUMIF($L$40:$L$73,G86,$M$40:$M$73)+SUMIF($L$76:$L$83,G86,$M$76:$M$83),0)","v":{"v":0,"d":"0.00"}}]
[null,{"$f":"E10","v":"Handi. All."},null,null,{"$f":"ROUND(SUMIF($E$8:$E$37,B87,$F$8:$F$37)+SUMIF($E$40:$E$73,B87,$F$40:$F$73)+SUMIF($E$76:$E$83,B87,$F$76:$F$83)+SUMIF($G$8:$G$37,B87,$H$8:$H$37)+SUMIF($G$40:$G$73,B87,$H$40:$H$73)+SUMIF($G$76:$G$83,B87,$H$76:$H$83),0)","v":{"v":0,"d":"0.00"}},null,{"$f":"Table4[[#Headers],[SIP]]","v":"SIP"},null,{"$f":"ROUND(SUMIF($J$8:$J$37,G87,$K$8:$K$37)+SUMIF($J$40:$J$73,G87,$K$40:$K$73)+SUMIF($J$76:$J$83,G87,$K$76:$K$83)+SUMIF($L$8:$L$37,G87,$M$8:$M$37)+SUMIF($L$40:$L$73,G87,$M$40:$M$73)+SUMIF($L$76:$L$83,G87,$M$76:$M$83),0)","v":{"v":36000,"d":"36000.00"}}]
[null,{"$f":"G8","v":"DA"},null,104,{"$f":"ROUND(SUMIF($E$8:$E$37,B88,$F$8:$F$37)+SUMIF($E$40:$E$73,B88,$F$40:$F$73)+SUMIF($E$76:$E$83,B88,$F$76:$F$83)+SUMIF($G$8:$G$37,B88,$H$8:$H$37)+SUMIF($G$40:$G$73,B88,$H$40:$H$73)+SUMIF($G$76:$G$83,B88,$H$76:$H$83),0)","v":{"v":140376,"d":"140376.00"}},null,{"$f":"Table4[[#Headers],[RPMF]]","v":"RPMF"},null,{"$f":"ROUND(SUMIF($J$8:$J$37,G88,$K$8:$K$37)+SUMIF($J$40:$J$73,G88,$K$40:$K$73)+SUMIF($J$76:$J$83,G88,$K$76:$K$83)+SUMIF($L$8:$L$37,G88,$M$8:$M$37)+SUMIF($L$40:$L$73,G88,$M$40:$M$73)+SUMIF($L$76:$L$83,G88,$M$76:$M$83),0)","v":{"v":0,"d":"0.00"}}]
[null,{"$f":"G9","v":"Wash All."},null,null,{"$f":"ROUND(SUMIF($E$8:$E$37,B89,$F$8:$F$37)+SUMIF($E$40:$E$73,B89,$F$40:$F$73)+SUMIF($E$76:$E$83,B89,$F$76:$F$83)+SUMIF($G$8:$G$37,B89,$H$8:$H$37)+SUMIF($G$40:$G$73,B89,$H$40:$H$73)+SUMIF($G$76:$G$83,B89,$H$76:$H$83),0)","v":{"v":0,"d":"0.00"}},null,{"$f":"Table4[[#Headers],[CM Corona]]","v":"CM Corona"},null,{"$f":"ROUND(SUMIF($J$8:$J$37,G89,$K$8:$K$37)+SUMIF($J$40:$J$73,G89,$K$40:$K$73)+SUMIF($J$76:$J$83,G89,$K$76:$K$83)+SUMIF($L$8:$L$37,G89,$M$8:$M$37)+SUMIF($L$40:$L$73,G89,$M$40:$M$73)+SUMIF($L$76:$L$83,G89,$M$76:$M$83),0)","v":{"v":0,"d":"0.00"}}]
[null,{"$f":"G10","v":"CCA All."},null,null,{"$f":"ROUND(SUMIF($E$8:$E$37,B90,$F$8:$F$37)+SUMIF($E$40:$E$73,B90,$F$40:$F$73)+SUMIF($E$76:$E$83,B90,$F$76:$F$83)+SUMIF($G$8:$G$37,B90,$H$8:$H$37)+SUMIF($G$40:$G$73,B90,$H$40:$H$73)+SUMIF($G$76:$G$83,B90,$H$76:$H$83),0)","v":{"v":0,"d":"0.00"}},null,{"$f":"Table4[[#Headers],[LIC]]","v":"LIC"},null,{"$f":"ROUND(SUMIF($J$8:$J$37,G90,$K$8:$K$37)+SUMIF($J$40:$J$73,G90,$K$40:$K$73)+SUMIF($J$76:$J$83,G90,$K$76:$K$83)+SUMIF($L$8:$L$37,G90,$M$8:$M$37)+SUMIF($L$40:$L$73,G90,$M$40:$M$73)+SUMIF($L$76:$L$83,G90,$M$76:$M$83),0)","v":{"v":0,"d":"0.00"}}]
[null,{"$f":"E70","v":"Bouns"},null,null,{"$f":"ROUND(SUMIF($E$8:$E$37,B91,$F$8:$F$37)+SUMIF($E$40:$E$73,B91,$F$40:$F$73)+SUMIF($E$76:$E$83,B91,$F$76:$F$83)+SUMIF($G$8:$G$37,B91,$H$8:$H$37)+SUMIF($G$40:$G$73,B91,$H$40:$H$73)+SUMIF($G$76:$G$83,B91,$H$76:$H$83),0)","v":{"v":6774,"d":"6774.00"}},null,{"$f":"Table4[[#Headers],[GPF Loan]]","v":"GPF Loan"},null,{"$f":"ROUND(SUMIF($J$8:$J$37,G91,$K$8:$K$37)+SUMIF($J$40:$J$73,G91,$K$40:$K$73)+SUMIF($J$76:$J$83,G91,$K$76:$K$83)+SUMIF($L$8:$L$37,G91,$M$8:$M$37)+SUMIF($L$40:$L$73,G91,$M$40:$M$73)+SUMIF($L$76:$L$83,G91,$M$76:$M$83),0)","v":{"v":0,"d":"0.00"}}]
[null,{"$f":"Table3[[#Headers],[Ot. Allow 1]]","v":"Ot. Allow 1"},null,null,{"$f":"ROUND(SUMIF($E$8:$E$37,B92,$F$8:$F$37)+SUMIF($E$40:$E$73,B92,$F$40:$F$73)+SUMIF($E$76:$E$83,B92,$F$76:$F$83)+SUMIF($G$8:$G$37,B92,$H$8:$H$37)+SUMIF($G$40:$G$73,B92,$H$40:$H$73)+SUMIF($G$76:$G$83,B92,$H$76:$H$83),0)","v":{"v":0,"d":"0.00"}},null,{"$f":"Table4[[#Headers],[SIL]]","v":"SIL"},null,{"$f":"ROUND(SUMIF($J$8:$J$37,G92,$K$8:$K$37)+SUMIF($J$40:$J$73,G92,$K$40:$K$73)+SUMIF($J$76:$J$83,G92,$K$76:$K$83)+SUMIF($L$8:$L$37,G92,$M$8:$M$37)+SUMIF($L$40:$L$73,G92,$M$40:$M$73)+SUMIF($L$76:$L$83,G92,$M$76:$M$83),0)","v":{"v":0,"d":"0.00"}}]
[null,{"$f":"Table3[[#Headers],[Ot. Allow 2]]","v":"Ot. Allow 2"},null,null,{"$f":"ROUND(SUMIF($E$8:$E$37,B93,$F$8:$F$37)+SUMIF($E$40:$E$73,B93,$F$40:$F$73)+SUMIF($E$76:$E$83,B93,$F$76:$F$83)+SUMIF($G$8:$G$37,B93,$H$8:$H$37)+SUMIF($G$40:$G$73,B93,$H$40:$H$73)+SUMIF($G$76:$G$83,B93,$H$76:$H$83),0)","v":{"v":0,"d":"0.00"}},null,{"$f":"Table4[[#Headers],[Itax]]","v":"Itax"},null,{"$f":"ROUND(SUMIF($J$8:$J$37,G93,$K$8:$K$37)+SUMIF($J$40:$J$73,G93,$K$40:$K$73)+SUMIF($J$76:$J$83,G93,$K$76:$K$83)+SUMIF($L$8:$L$37,G93,$M$8:$M$37)+SUMIF($L$40:$L$73,G93,$M$40:$M$73)+SUMIF($L$76:$L$83,G93,$M$76:$M$83),0)","v":{"v":18300,"d":"18300.00"}}]
[null,{"$f":"Table3[[#Headers],[Ot. Allow 3]]","v":"Ot. Allow 3"},null,null,{"$f":"ROUND(SUMIF($E$8:$E$37,B94,$F$8:$F$37)+SUMIF($E$40:$E$73,B94,$F$40:$F$73)+SUMIF($E$76:$E$83,B94,$F$76:$F$83)+SUMIF($G$8:$G$37,B94,$H$8:$H$37)+SUMIF($G$40:$G$73,B94,$H$40:$H$73)+SUMIF($G$76:$G$83,B94,$H$76:$H$83),0)","v":{"v":0,"d":"0.00"}},null,{"$f":"Table4[[#Headers],[Other Ded.]]","v":"Other Ded."},null,{"$f":"ROUND(SUMIF($J$8:$J$37,G94,$K$8:$K$37)+SUMIF($J$40:$J$73,G94,$K$40:$K$73)+SUMIF($J$76:$J$83,G94,$K$76:$K$83)+SUMIF($L$8:$L$37,G94,$M$8:$M$37)+SUMIF($L$40:$L$73,G94,$M$40:$M$73)+SUMIF($L$76:$L$83,G94,$M$76:$M$83),0)","v":{"v":0,"d":"0.00"}}]
[null,"Total Allowances:",null,{"$f":"ROUND(SUM(E85:E93),0)","v":{"v":771754,"d":"771754.00"}},null,null,"Total Deduction:",null,{"$f":"ROUND(SUM(I85:J94),0)","v":{"v":125856,"d":"125856.00"}},null,null,"Total Net Amount :",null,{"$f":"ROUND(SUM(D95-I95),0)","v":{"v":645898,"d":"645898.00"}}]