{"text_format":"3","workbook":"xlsx","n_sheets":5,"sheets":["Master","DA HRA Rate","Allowance","Deductions","GA55 A"],"not_rendered":{"images":2,"macros":1,"defined_names":7},"read":"whole","date_system":"1900"}

{"sheet":"Master","index":0,"n_rows":182,"n_cols":14,"rows_kept":182,"merged":[[0,0,0,1],[0,2,0,5],[0,6,0,7],[0,8,0,9],[1,0,1,1],[1,3,1,5],[1,6,1,7],[1,8,1,9]]}
["Office Name",null,"GSSS Deogarh",{"$nulls":3},"DDO Code",null,18277]
["TAN No.",null,"ZXCVB1234B","GA55 A Offline",null,null,"Financial Year",null,"2021-22"]
[]
["Sr.No.","Employee Name","Designation","GPF/PRAN Number ","Employee ID","Pay Scale","Account No","PAN No.","NPS/GPF","Probation",null,"Post @ Office",null,"Months"]
[{"$f":"IF(Table1[Employee Name]=\"\",\"\",ROWS($A$1:A1))","v":1},"Ashwini Kumar","Lecturer","12345678910","RJNA12345678910","L-12","1234567891011","ABCD1234E","NPS","NO",null,"Pprincipal",null,"March"]
[{"$f":"IF(Table1[Employee Name]=\"\",\"\",ROWS($A$1:A2))","v":""},{"$nulls":10},"Lecturer",null,"April"]
[{"$f":"IF(Table1[Employee Name]=\"\",\"\",ROWS($A$1:A3))","v":""},{"$nulls":10},"Sr. Teacher",null,"May"]
[{"$f":"IF(Table1[Employee Name]=\"\",\"\",ROWS($A$1:A4))","v":""},{"$nulls":10},"LDC",null,"June"]
[{"$f":"IF(Table1[Employee Name]=\"\",\"\",ROWS($A$1:A5))","v":""},{"$nulls":10},"UDC",null,"July"]
[{"$f":"IF(Table1[Employee Name]=\"\",\"\",ROWS($A$1:A6))","v":""},{"$nulls":10},"OA",null,"August"]
[{"$f":"IF(Table1[Employee Name]=\"\",\"\",ROWS($A$1:A7))","v":""},{"$nulls":10},"Peon",null,"September"]
[{"$f":"IF(Table1[Employee Name]=\"\",\"\",ROWS($A$1:A8))","v":""},{"$nulls":10},"Teacher L-1",null,"October"]
[{"$f":"IF(Table1[Employee Name]=\"\",\"\",ROWS($A$1:A9))","v":""},{"$nulls":10},"Teacher L-2",null,"November"]
[{"$f":"IF(Table1[Employee Name]=\"\",\"\",ROWS($A$1:A10))","v":""},{"$nulls":10},"Prabodhak",null,"December"]
[{"$f":"IF(Table1[Employee Name]=\"\",\"\",ROWS($A$1:A11))","v":""},{"$nulls":10},"other",null,"January"]
[{"$f":"IF(Table1[Employee Name]=\"\",\"\",ROWS($A$1:A12))","v":""},{"$nulls":10},"other",null,"February"]
[{"$f":"IF(Table1[Employee Name]=\"\",\"\",ROWS($A$1:A13))","v":""},{"$nulls":10},"other"]
[{"$f":"IF(Table1[Employee Name]=\"\",\"\",ROWS($A$1:A14))","v":""},{"$nulls":10},"other"]
[{"$f":"IF(Table1[Employee Name]=\"\",\"\",ROWS($A$1:A15))","v":""},{"$nulls":10},"other"]
[{"$f":"IF(Table1[Employee Name]=\"\",\"\",ROWS($A$1:A16))","v":""},{"$nulls":10},"other"]
{"$rows_left_out":163}
{"sheet":"DA HRA Rate","index":1,"n_rows":16,"n_cols":4,"rows_kept":16,"merged":[[0,0,0,3],[1,0,1,3]]}
[{"$f":"Master!$C$1","v":"GSSS Deogarh"}]
["DA and HRA Rates Monthwise"]
[]
["Sr.No","Month","DA Rate","HRA Rate"]
[3,"March",{"v":0.17,"d":"17.00%"},{"v":0.08,"d":"8.00%"}]
[4,"April",{"v":0.17,"d":"17.00%"},{"v":0.08,"d":"8.00%"}]
[5,"May",{"v":0.17,"d":"17.00%"},{"v":0.08,"d":"8.00%"}]
[6,"June",{"v":0.17,"d":"17.00%"},{"v":0.08,"d":"8.00%"}]
[7,"July",{"v":0.28,"d":"28.00%"},{"v":0.08,"d":"8.00%"}]
[8,"August",{"v":0.28,"d":"28.00%"},{"v":0.09,"d":"9.00%"}]
[9,"September",{"v":0.28,"d":"28.00%"},{"v":0.09,"d":"9.00%"}]
[10,"October",{"v":0.28,"d":"28.00%"},{"v":0.09,"d":"9.00%"}]
[11,"November",{"v":0.28,"d":"28.00%"},{"v":0.09,"d":"9.00%"}]
[12,"December",{"v":0.28,"d":"28.00%"},{"v":0.09,"d":"9.00%"}]
[1,"January",{"v":0.28,"d":"28.00%"},{"v":0.09,"d":"9.00%"}]
[2,"February",{"v":0.28,"d":"28.00%"},{"v":0.09,"d":"9.00%"}]

{"sheet":"Allowance","index":2,"n_rows":182,"n_cols":14,"rows_kept":182,"merged":[[0,0,0,13],[1,0,1,13]]}
[{"$f":"Master!$C$1","v":"GSSS Deogarh"}]
["Allowances Detail Employee wise"]
[]
["Sr.No","Employee Name","March Basic","Handi. All. Amount","Wash All. Amount","CCA Amount","Ot. Allow 1","Ot. Allow 2","Ot. Allow 3","Ot. Allow 4","If Basic Changed Month","Changed Basic","Surrender Month","Surrender DA Rate"]
[{"$f":"IF(Table1[[#This Row],[Sr.No.]]=\"\",\"\",Table1[[#This Row],[Sr.No.]])","v":1},{"$f":"IF(Table1[[#This Row],[Employee Name]]=\"\",\"\",Table1[[#This Row],[Employee Name]])","v":"Ashwini Kumar"},47000,{"$nulls":10},{"$f":"IFERROR(VLOOKUP(Table3[[#This Row],[Surrender Month]],DA_HRA_Rate,3,0),\"\")","v":""}]
[{"$f":"IF(Table1[[#This Row],[Sr.No.]]=\"\",\"\",Table1[[#This Row],[Sr.No.]])","v":""},{"$f":"IF(Table1[[#This Row],[Employee Name]]=\"\",\"\",Table1[[#This Row],[Employee Name]])","v":""},{"$nulls":11},{"$f":"IFERROR(VLOOKUP(Table3[[#This Row],[Surrender Month]],DA_HRA_Rate,3,0),\"\")","v":""}]
[{"$f":"IF(Table1[[#This Row],[Sr.No.]]=\"\",\"\",Table1[[#This Row],[Sr.No.]])","v":""},{"$f":"IF(Table1[[#This Row],[Employee Name]]=\"\",\"\",Table1[[#This Row],[Employee Name]])","v":""},{"$nulls":11},{"$f":"IFERROR(VLOOKUP(Table3[[#This Row],[Surrender Month]],DA_HRA_Rate,3,0),\"\")","v":""}]
[{"$f":"IF(Table1[[#This Row],[Sr.No.]]=\"\",\"\",Table1[[#This Row],[Sr.No.]])","v":""},{"$f":"IF(Table1[[#This Row],[Employee Name]]=\"\",\"\",Table1[[#This Row],[Employee Name]])","v":""},{"$nulls":11},{"$f":"IFERROR(VLOOKUP(Table3[[#This Row],[Surrender Month]],DA_HRA_Rate,3,0),\"\")","v":""}]
[{"$f":"IF(Table1[[#This Row],[Sr.No.]]=\"\",\"\",Table1[[#This Row],[Sr.No.]])","v":""},{"$f":"IF(Table1[[#This Row],[Employee Name]]=\"\",\"\",Table1[[#This Row],[Employee Name]])","v":""},{"$nulls":11},{"$f":"IFERROR(VLOOKUP(Table3[[#This Row],[Surrender Month]],DA_HRA_Rate,3,0),\"\")","v":""}]
[{"$f":"IF(Table1[[#This Row],[Sr.No.]]=\"\",\"\",Table1[[#This Row],[Sr.No.]])","v":""},{"$f":"IF(Table1[[#This Row],[Employee Name]]=\"\",\"\",Table1[[#This Row],[Employee Name]])","v":""},{"$nulls":11},{"$f":"IFERROR(VLOOKUP(Table3[[#This Row],[Surrender Month]],DA_HRA_Rate,3,0),\"\")","v":""}]
[{"$f":"IF(Table1[[#This Row],[Sr.No.]]=\"\",\"\",Table1[[#This Row],[Sr.No.]])","v":""},{"$f":"IF(Table1[[#This Row],[Employee Name]]=\"\",\"\",Table1[[#This Row],[Employee Name]])","v":""},{"$nulls":11},{"$f":"IFERROR(VLOOKUP(Table3[[#This Row],[Surrender Month]],DA_HRA_Rate,3,0),\"\")","v":""}]
[{"$f":"IF(Table1[[#This Row],[Sr.No.]]=\"\",\"\",Table1[[#This Row],[Sr.No.]])","v":""},{"$f":"IF(Table1[[#This Row],[Employee Name]]=\"\",\"\",Table1[[#This Row],[Employee Name]])","v":""},{"$nulls":11},{"$f":"IFERROR(VLOOKUP(Table3[[#This Row],[Surrender Month]],DA_HRA_Rate,3,0),\"\")","v":""}]
[{"$f":"IF(Table1[[#This Row],[Sr.No.]]=\"\",\"\",Table1[[#This Row],[Sr.No.]])","v":""},{"$f":"IF(Table1[[#This Row],[Employee Name]]=\"\",\"\",Table1[[#This Row],[Employee Name]])","v":""},{"$nulls":11},{"$f":"IFERROR(VLOOKUP(Table3[[#This Row],[Surrender Month]],DA_HRA_Rate,3,0),\"\")","v":""}]
[{"$f":"IF(Table1[[#This Row],[Sr.No.]]=\"\",\"\",Table1[[#This Row],[Sr.No.]])","v":""},{"$f":"IF(Table1[[#This Row],[Employee Name]]=\"\",\"\",Table1[[#This Row],[Employee Name]])","v":""},{"$nulls":11},{"$f":"IFERROR(VLOOKUP(Table3[[#This Row],[Surrender Month]],DA_HRA_Rate,3,0),\"\")","v":""}]
[{"$f":"IF(Table1[[#This Row],[Sr.No.]]=\"\",\"\",Table1[[#This Row],[Sr.No.]])","v":""},{"$f":"IF(Table1[[#This Row],[Employee Name]]=\"\",\"\",Table1[[#This Row],[Employee Name]])","v":""},{"$nulls":11},{"$f":"IFERROR(VLOOKUP(Table3[[#This Row],[Surrender Month]],DA_HRA_Rate,3,0),\"\")","v":""}]
[{"$f":"IF(Table1[[#This Row],[Sr.No.]]=\"\",\"\",Table1[[#This Row],[Sr.No.]])","v":""},{"$f":"IF(Table1[[#This Row],[Employee Name]]=\"\",\"\",Table1[[#This Row],[Employee Name]])","v":""},{"$nulls":11},{"$f":"IFERROR(VLOOKUP(Table3[[#This Row],[Surrender Month]],DA_HRA_Rate,3,0),\"\")","v":""}]
[{"$f":"IF(Table1[[#This Row],[Sr.No.]]=\"\",\"\",Table1[[#This Row],[Sr.No.]])","v":""},{"$f":"IF(Table1[[#This Row],[Employee Name]]=\"\",\"\",Table1[[#This Row],[Employee Name]])","v":""},{"$nulls":11},{"$f":"IFERROR(VLOOKUP(Table3[[#This Row],[Surrender Month]],DA_HRA_Rate,3,0),\"\")","v":""}]
[{"$f":"IF(Table1[[#This Row],[Sr.No.]]=\"\",\"\",Table1[[#This Row],[Sr.No.]])","v":""},{"$f":"IF(Table1[[#This Row],[Employee Name]]=\"\",\"\",Table1[[#This Row],[Employee Name]])","v":""},{"$nulls":11},{"$f":"IFERROR(VLOOKUP(Table3[[#This Row],[Surrender Month]],DA_HRA_Rate,3,0),\"\")","v":""}]
[{"$f":"IF(Table1[[#This Row],[Sr.No.]]=\"\",\"\",Table1[[#This Row],[Sr.No.]])","v":""},{"$f":"IF(Table1[[#This Row],[Employee Name]]=\"\",\"\",Table1[[#This Row],[Employee Name]])","v":""},{"$nulls":11},{"$f":"IFERROR(VLOOKUP(Table3[[#This Row],[Surrender Month]],DA_HRA_Rate,3,0),\"\")","v":""}]
[{"$f":"IF(Table1[[#This Row],[Sr.No.]]=\"\",\"\",Table1[[#This Row],[Sr.No.]])","v":""},{"$f":"IF(Table1[[#This Row],[Employee Name]]=\"\",\"\",Table1[[#This Row],[Employee Name]])","v":""},{"$nulls":11},{"$f":"IFERROR(VLOOKUP(Table3[[#This Row],[Surrender Month]],DA_HRA_Rate,3,0),\"\")","v":""}]
{"$rows_left_out":163}
{"sheet":"Deductions","index":3,"n_rows":182,"n_cols":11,"rows_kept":182,"merged":[[0,0,0,10],[1,0,1,10]]}
[{"$f":"Master!$C$1","v":"GSSS Deogarh"}]
["Deductions Detail Employee wise"]
[]
["Sr.No","Employee Name","GPF","SIP","RPMF","CM Corona","LIC","GPF Loan","SIL","Itax","Other Ded."]
[{"$f":"IF(Table1[[#This Row],[Sr.No.]]=\"\",\"\",Table1[[#This Row],[Sr.No.]])","v":1},{"$f":"IF(Table1[[#This Row],[Employee Name]]=\"\",\"\",Table1[[#This Row],[Employee Name]])","v":"Ashwini Kumar"},null,3000,{"$nulls":5},100]
[{"$f":"IF(Table1[[#This Row],[Sr.No.]]=\"\",\"\",Table1[[#This Row],[Sr.No.]])","v":""},{"$f":"IF(Table1[[#This Row],[Employee Name]]=\"\",\"\",Table1[[#This Row],[Employee Name]])","v":""}]
[{"$f":"IF(Table1[[#This Row],[Sr.No.]]=\"\",\"\",Table1[[#This Row],[Sr.No.]])","v":""},{"$f":"IF(Table1[[#This Row],[Employee Name]]=\"\",\"\",Table1[[#This Row],[Employee Name]])","v":""}]
[{"$f":"IF(Table1[[#This Row],[Sr.No.]]=\"\",\"\",Table1[[#This Row],[Sr.No.]])","v":""},{"$f":"IF(Table1[[#This Row],[Employee Name]]=\"\",\"\",Table1[[#This Row],[Employee Name]])","v":""}]
[{"$f":"IF(Table1[[#This Row],[Sr.No.]]=\"\",\"\",Table1[[#This Row],[Sr.No.]])","v":""},{"$f":"IF(Table1[[#This Row],[Employee Name]]=\"\",\"\",Table1[[#This Row],[Employee Name]])","v":""}]
[{"$f":"IF(Table1[[#This Row],[Sr.No.]]=\"\",\"\",Table1[[#This Row],[Sr.No.]])","v":""},{"$f":"IF(Table1[[#This Row],[Employee Name]]=\"\",\"\",Table1[[#This Row],[Employee Name]])","v":""}]
[{"$f":"IF(Table1[[#This Row],[Sr.No.]]=\"\",\"\",Table1[[#This Row],[Sr.No.]])","v":""},{"$f":"IF(Table1[[#This Row],[Employee Name]]=\"\",\"\",Table1[[#This Row],[Employee Name]])","v":""}]
[{"$f":"IF(Table1[[#This Row],[Sr.No.]]=\"\",\"\",Table1[[#This Row],[Sr.No.]])","v":""},{"$f":"IF(Table1[[#This Row],[Employee Name]]=\"\",\"\",Table1[[#This Row],[Employee Name]])","v":""}]
[{"$f":"IF(Table1[[#This Row],[Sr.No.]]=\"\",\"\",Table1[[#This Row],[Sr.No.]])","v":""},{"$f":"IF(Table1[[#This Row],[Employee Name]]=\"\",\"\",Table1[[#This Row],[Employee Name]])","v":""}]
[{"$f":"IF(Table1[[#This Row],[Sr.No.]]=\"\",\"\",Table1[[#This Row],[Sr.No.]])","v":""},{"$f":"IF(Table1[[#This Row],[Employee Name]]=\"\",\"\",Table1[[#This Row],[Employee Name]])","v":""}]
[{"$f":"IF(Table1[[#This Row],[Sr.No.]]=\"\",\"\",Table1[[#This Row],[Sr.No.]])","v":""},{"$f":"IF(Table1[[#This Row],[Employee Name]]=\"\",\"\",Table1[[#This Row],[Employee Name]])","v":""}]
[{"$f":"IF(Table1[[#This Row],[Sr.No.]]=\"\",\"\",Table1[[#This Row],[Sr.No.]])","v":""},{"$f":"IF(Table1[[#This Row],[Employee Name]]=\"\",\"\",Table1[[#This Row],[Employee Name]])","v":""}]
[{"$f":"IF(Table1[[#This Row],[Sr.No.]]=\"\",\"\",Table1[[#This Row],[Sr.No.]])","v":""},{"$f":"IF(Table1[[#This Row],[Employee Name]]=\"\",\"\",Table1[[#This Row],[Employee Name]])","v":""}]
[{"$f":"IF(Table1[[#This Row],[Sr.No.]]=\"\",\"\",Table1[[#This Row],[Sr.No.]])","v":""},{"$f":"IF(Table1[[#This Row],[Employee Name]]=\"\",\"\",Table1[[#This Row],[Employee Name]])","v":""}]
[{"$f":"IF(Table1[[#This Row],[Sr.No.]]=\"\",\"\",Table1[[#This Row],[Sr.No.]])","v":""},{"$f":"IF(Table1[[#This Row],[Employee Name]]=\"\",\"\",Table1[[#This Row],[Employee Name]])","v":""}]
[{"$f":"IF(Table1[[#This Row],[Sr.No.]]=\"\",\"\",Table1[[#This Row],[Sr.No.]])","v":""},{"$f":"IF(Table1[[#This Row],[Employee Name]]=\"\",\"\",Table1[[#This Row],[Employee Name]])","v":""}]
{"$rows_left_out":163}
{"sheet":"GA55 A","index":4,"n_rows":95,"n_cols":24,"rows_kept":95,"merged":[[0,0,0,8],[0,12,0,13],[0,16,1,16],[0,17,1,18],[1,0,1,8],[1,12,1,13],[2,0,2,1],[2,2,2,3],[2,5,2,6],[2,7,2,10],[2,13,2,14],[2,17,3,17],[2,18,3,18],[3,0,3,1],[3,2,3,6],[3,7,3,8],[3,9,3,14],[4,0,4,1],[4,2,4,6],[4,7,4,8],[4,9,4,14],[4,17,5,17],[4,18,5,18],[5,0,5,1],[5,2,5,6],[5,7,5,8],[5,9,5,11],[5,13,5,14],[6,0,6,1],[6,4,6,7],[6,9,6,12],[7,1,11,1],[12,1,16,1],[17,1,21,1],[22,1,26,1],[27,1,31,1],[32,1,36,1],[37,0,37,8],[37,12,37,13],[38,0,38,8],[38,12,38,13],[39,1,43,1],[44,1,48,1],[49,1,53,1],[54,1,58,1],[59,1,63,1],[64,1,68,1],[73,0,73,8],[73,12,73,13],[74,0,74,8],[74,12,74,13],[75,0,76,0],[75,1,76,1],[75,2,76,2],[75,3,76,3],[77,0,78,0],[77,1,78,1],[77,2,78,2],[77,3,78,3],[79,0,80,0],[79,1,80,1],[79,2,80,2],[79,3,80,3],[81,0,82,0],[81,1,82,1],[81,2,82,2],[81,3,82,3],[83,1,83,4],[83,6,83,9],[84,1,84,2],[84,8,84,9],[84,11,84,12],[85,1,85,2],[85,8,85,9],[85,11,85,12],[86,1,86,2],[86,8,86,9],[86,11,86,12],[87,1,87,2],[87,8,87,9],[87,11,87,12],[88,1,88,2],[88,8,88,9],[88,11,88,12],[89,1,89,2],[89,8,89,9],[89,11,89,12],[90,1,90,2],[90,8,90,9],[90,11,90,12],[91,1,91,2],[91,8,91,9],[91,11,91,12],[92,1,92,2],[92,8,92,9],[92,11,92,12],[93,1,93,2],[93,8,93,9],[93,13,93,14],[94,1,94,2],[94,3,94,4],[94,6,94,7],[94,8,94,9],[94,11,94,12],[94,13,94,14]]}
["Government Of Rajasthan",{"$nulls":11},"Page No.",null,1,null,1,{"$f":"IFERROR(VLOOKUP($Q$1,Emp_data,2,0),\"\")","v":"Ashwini Kumar"}]
["GA55 A",{"$nulls":9},{"$f":"IF(Master!$I$1=\"\",\"\",Master!$I$1)","v":18277},null,"Financial Year : ",null,{"$f":"IF(Master!$I$2=\"\",\"\",Master!$I$2)","v":"2021-22"}]
["DDO Code:",null,{"$f":"IF(Master!$I$1=\"\",\"\",Master!$I$1)","v":18277},null,null,"Office Name :",null,{"$f":"IF(Master!$C$1=\"\",\"\",Master!$C$1)","v":"GSSS Deogarh"},{"$nulls":4},"TAN:",{"$f":"IF(Master!$C$2=\"\",\"\",Master!$C$2)","v":"ZXCVB1234B"},null,null,{"$f":"IF(Master!$I$1=\"\",\"\",Master!$I$1)","v":18277},"July Basic","Bonus"]
["Employee Name :",null,{"$f":"IFERROR(VLOOKUP($Q$1,Emp_data,2,0),\"NoData\")","v":"Ashwini Kumar"},{"$nulls":4},"Employee ID :",null,{"$f":"IFERROR(VLOOKUP($Q$1,Emp_data,5,0),\"NoData\")","v":"RJNA12345678910"}]
["Designation :",null,{"$f":"IFERROR(VLOOKUP($Q$1,Emp_data,3,0),\"NoData\")","v":"Lecturer"},{"$nulls":4},"Pay Scale :",null,{"$f":"IFERROR(VLOOKUP($Q$1,Emp_data,6,0),\"NoData\")","v":"L-12"},{"$nulls":8},"YES"]
["GPF/PRAN Number :",null,{"$f":"IFERROR(VLOOKUP($Q$1,Emp_data,4,0),\"NoData\")","v":"12345678910"},{"$nulls":4},"Account No :",null,{"$f":"IFERROR(VLOOKUP($Q$1,Emp_data,7,0),\"NoData\")","v":"1234567891011"},null,null,"PAN :",{"$f":"IFERROR(VLOOKUP($Q$1,Emp_data,8,0),\"NoData\")","v":"ABCD1234E"}]
["Pay Month\nPay Year",null,"Bill No.\nTV No.","Bill Date\nTV Date","----------------Allowances----------------",{"$nulls":3},"Gross Amount","------------Deductions------------",{"$nulls":3},"Total deduction","NetAmount",null,null,{"$f":"IF(Master!$I$1=\"\",\"\",Master!$I$1)","v":18277}]
[null,"Salary",null,null,"Basic",{"$f":"IFERROR(IF(VLOOKUP($Q$1,Allowance,3,0)=0,\"\",VLOOKUP($Q$1,Allowance,3,0)),\"\")","v":{"v":47000,"d":"47000.00"}},"DA",{"$f":"IFERROR(IF($W$9=\"Yes\",\"\",ROUND(F8*'DA HRA Rate'!$C$5,0)),\"\")","v":{"v":7990,"d":"7990.00"}},{"$f":"ROUND(SUM(F8:F12,H8:H12),0)","v":{"v":58750,"d":"58750.00"}},"ECPenF",{"$f":"IFERROR(IF($W$8=\"GPF\",\"\",ROUND(SUM($F$8,$H$8)*10%,0)),\"\")","v":{"v":5499,"d":"5499.00"}},{"$f":"Table4[[#Headers],[LIC]]","v":"LIC"},{"$f":"IFERROR(IF(VLOOKUP($Q$1,Deductions,7,0)=0,\"\",VLOOKUP($Q$1,Deductions,7,0)),\"\")","v":""},{"$f":"ROUND(SUM(K8:K12,M8:M12),0)","v":{"v":8599,"d":"8599.00"}},{"$f":"ROUND(SUM(I8-N8),0)","v":{"v":50151,"d":"50151.00"}},{"$nulls":7},{"$f":"IFERROR(VLOOKUP($Q$1,Emp_data,9,0),\"\")","v":"NPS"},"NPS/GPF"]
[{"$nulls":4},"HRA",{"$f":"IFERROR(IF($W$9=\"Yes\",\"\",ROUND($F8*'DA HRA Rate'!$D$5,0)),\"\")","v":{"v":3760,"d":"3760.00"}},"Wash All.",{"$f":"IFERROR(IF(VLOOKUP($Q$1,Allowance,5,0)=0,\"\",VLOOKUP($Q$1,Allowance,5,0)),\"\")","v":""},null,{"$f":"Table4[[#Headers],[GPF]]","v":"GPF"},{"$f":"IFERROR(IF($W$8=\"NPS\",\"\",IF(VLOOKUP($Q$1,Deductions,3,0)=0,\"\",VLOOKUP($Q$1,Deductions,3,0))),\"\")","v":""},{"$f":"Table4[[#Headers],[GPF Loan]]","v":"GPF Loan"},{"$f":"IFERROR(IF(VLOOKUP($Q$1,Deductions,8,0)=0,\"\",VLOOKUP($Q$1,Deductions,8,0)),\"\")","v":""},{"$nulls":3},"Deduction","Change Month","Changed Amount",{"$nulls":3},{"$f":"IFERROR(VLOOKUP($Q$1,Emp_data,10,0),\"\")","v":"NO"},"Probation"]
["March",{"$nulls":3},"Handi. All.",{"$f":"IFERROR(IF(VLOOKUP($Q$1,Allowance,4,0)=0,\"\",VLOOKUP($Q$1,Allowance,4,0)),\"\")","v":""},"CCA All.",{"$f":"IFERROR(IF(VLOOKUP($Q$1,Allowance,6,0)=0,\"\",VLOOKUP($Q$1,Allowance,6,0)),\"\")","v":""},null,{"$f":"Table4[[#Headers],[SIP]]","v":"SIP"},{"$f":"IFERROR(IF(VLOOKUP($Q$1,Deductions,4,0)=0,\"\",VLOOKUP($Q$1,Deductions,4,0)),\"\")","v":{"v":3000,"d":"3000.00"}},{"$f":"Table4[[#Headers],[SIL]]","v":"SIL"},{"$f":"IFERROR(IF(VLOOKUP($Q$1,Deductions,9,0)=0,\"\",VLOOKUP($Q$1,Deductions,9,0)),\"\")","v":""},{"$nulls":3},{"$f":"J9","v":"GPF"},{"$nulls":5},{"$f":"IFERROR(VLOOKUP($Q$1,Allowance,11,0),\"\")","v":0},"Basic Change Month"]
[{"$f":"LEFT($O$2,4)","v":"2021"},{"$nulls":3},{"$f":"Table3[[#Headers],[Ot. Allow 1]]","v":"Ot. Allow 1"},{"$f":"IFERROR(IF(VLOOKUP($Q$1,Allowance,7,0)=0,\"\",VLOOKUP($Q$1,Allowance,7,0)),\"\")","v":""},{"$f":"Table3[[#Headers],[Ot. Allow 2]]","v":"Ot. Allow 2"},{"$f":"IFERROR(IF(VLOOKUP($Q$1,Allowance,8,0)=0,\"\",VLOOKUP($Q$1,Allowance,8,0)),\"\")","v":""},null,{"$f":"Table4[[#Headers],[RPMF]]","v":"RPMF"},{"$f":"IFERROR(IF(VLOOKUP($Q$1,Deductions,5,0)=0,\"\",VLOOKUP($Q$1,Deductions,5,0)),\"\")","v":""},{"$f":"Table4[[#Headers],[Itax]]","v":"Itax"},{"$f":"IFERROR(IF(VLOOKUP($Q$1,Deductions,10,0)=0,\"\",VLOOKUP($Q$1,Deductions,10,0)),\"\")","v":{"v":100,"d":"100.00"}},{"$nulls":3},{"$f":"J11","v":"RPMF"},{"$nulls":5},{"$f":"IFERROR(VLOOKUP($Q$1,Allowance,12,0),\"\")","v":0},"Changed Basic"]
[{"$nulls":4},{"$f":"Table3[[#Headers],[Ot. Allow 3]]","v":"Ot. Allow 3"},{"$f":"IFERROR(IF(VLOOKUP($Q$1,Allowance,9,0)=0,\"\",VLOOKUP($Q$1,Allowance,9,0)),\"\")","v":""},{"$f":"Table3[[#Headers],[Ot. Allow 4]]","v":"Ot. Allow 4"},{"$f":"IFERROR(IF(VLOOKUP($Q$1,Allowance,10,0)=0,\"\",VLOOKUP($Q$1,Allowance,10,0)),\"\")","v":""},null,{"$f":"Table4[[#Headers],[CM Corona]]","v":"CM Corona"},{"$f":"IFERROR(IF(VLOOKUP($Q$1,Deductions,6,0)=0,\"\",VLOOKUP($Q$1,Deductions,6,0)),\"\")","v":""},{"$f":"Table4[[#Headers],[Other Ded.]]","v":"Other Ded."},{"$f":"IFERROR(IF(VLOOKUP($Q$1,Deductions,11,0)=0,\"\",VLOOKUP($Q$1,Deductions,11,0)),\"\")","v":""},{"$nulls":3},{"$f":"Table4[[#Headers],[LIC]]","v":"LIC"}]
[null,"Salary",null,null,{"$f":"E8","v":"Basic"},{"$f":"IFERROR(IF($A$15=$W$10,$W$11,F8),\"\")","v":{"v":47000,"d":"47000.00"}},{"$f":"G8","v":"DA"},{"$f":"IFERROR(IF($W$9=\"Yes\",\"\",$F$13*'DA HRA Rate'!$C$6),\"\")","v":{"v":7990.000000000001,"d":"7990.00"}},{"$f":"ROUND(SUM(F13:F17,H13:H17),0)","v":{"v":58750,"d":"58750.00"}},"ECPenF",{"$f":"IF($W$8=\"GPF\",\"\",ROUND(SUM($F$13,$H$13)*10%,0))","v":{"v":5499,"d":"5499.00"}},{"$f":"Table4[[#Headers],[LIC]]","v":"LIC"},{"$f":"IF($A15=$R$12,$S$12,$M8)","v":""},{"$f":"ROUND(SUM(K13:K17,M13:M17),0)","v":{"v":8599,"d":"8599.00"}},{"$f":"ROUND(SUM(I13-N13),0)","v":{"v":50151,"d":"50151.00"}},null,{"$f":"Table4[[#Headers],[GPF Loan]]","v":"GPF Loan"}]
[{"$nulls":4},{"$f":"E9","v":"HRA"},{"$f":"IFERROR(IF($W$9=\"Yes\",\"\",ROUND($F13*'DA HRA Rate'!$D$6,0)),\"\")","v":{"v":3760,"d":"3760.00"}},{"$f":"G9","v":"Wash All."},{"$f":"IFERROR(IF(VLOOKUP($Q$1,Allowance,5,0)=0,\"\",VLOOKUP($Q$1,Allowance,5,0)),\"\")","v":""},null,{"$f":"Table4[[#Headers],[GPF]]","v":"GPF"},{"$f":"IF($A$15=$R$10,$S$10,IF($W$8=\"NPS\",\"\",$K$9))","v":""},{"$f":"Table4[[#Headers],[GPF Loan]]","v":"GPF Loan"},{"$f":"IF($A15=$R$13,$S$13,$M9)","v":""},{"$nulls":3},{"$f":"Table4[[#Headers],[SIL]]","v":"SIL"}]
["April",{"$nulls":3},"Handi. All.",{"$f":"IFERROR(IF(VLOOKUP($Q$1,Allowance,4,0)=0,\"\",VLOOKUP($Q$1,Allowance,4,0)),\"\")","v":""},{"$f":"G10","v":"CCA All."},{"$f":"IFERROR(IF(VLOOKUP($Q$1,Allowance,6,0)=0,\"\",VLOOKUP($Q$1,Allowance,6,0)),\"\")","v":""},null,{"$f":"Table4[[#Headers],[SIP]]","v":"SIP"},{"$f":"IF($K10=\"\",\"\",$K10)","v":{"v":3000,"d":"3000.00"}},{"$f":"Table4[[#Headers],[SIL]]","v":"SIL"},{"$f":"IF($A15=$R$14,$S$14,$M10)","v":""},{"$nulls":3},{"$f":"Table4[[#Headers],[Itax]]","v":"Itax"},"June",2000]
[{"$f":"LEFT($O$2,4)","v":"2021"},{"$nulls":3},"Ot. Allow 1",{"$f":"IFERROR(IF(VLOOKUP($Q$1,Allowance,7,0)=0,\"\",VLOOKUP($Q$1,Allowance,7,0)),\"\")","v":""},{"$f":"G11","v":"Ot. Allow 2"},{"$f":"IFERROR(IF(VLOOKUP($Q$1,Allowance,8,0)=0,\"\",VLOOKUP($Q$1,Allowance,8,0)),\"\")","v":""},null,{"$f":"Table4[[#Headers],[RPMF]]","v":"RPMF"},{"$f":"IF($A15=$R$11,$S$11,IF($W$8=\"NPS\",\"\",$K11))","v":""},{"$f":"Table4[[#Headers],[Itax]]","v":"Itax"},{"$f":"IF($A15=$R$15,$S$15,$M11)","v":{"v":100,"d":"100.00"}},{"$nulls":3},{"$f":"Table4[[#Headers],[Other Ded.]]","v":"Other Ded."}]
[{"$nulls":4},"Ot. Allow 3",{"$f":"IFERROR(IF(VLOOKUP($Q$1,Allowance,9,0)=0,\"\",VLOOKUP($Q$1,Allowance,9,0)),\"\")","v":""},"Ot. Allow 4",{"$f":"IFERROR(IF(VLOOKUP($Q$1,Allowance,10,0)=0,\"\",VLOOKUP($Q$1,Allowance,10,0)),\"\")","v":""},null,{"$f":"Table4[[#Headers],[CM Corona]]","v":"CM Corona"},{"$f":"IF($A15=$R$17,$S$17,$K12)","v":""},{"$f":"Table4[[#Headers],[Other Ded.]]","v":"Other Ded."},{"$f":"IF($A15=$R$16,$S$16,$M12)","v":""},{"$nulls":3},{"$f":"Table4[[#Headers],[CM Corona]]","v":"CM Corona"}]
[null,"Salary",null,null,{"$f":"E13","v":"Basic"},{"$f":"IFERROR(IF($A$20=$W$10,$W$11,F13),\"\")","v":{"v":47000,"d":"47000.00"}},{"$f":"G13","v":"DA"},{"$f":"IFERROR(IF($W$9=\"Yes\",\"\",$F$18*'DA HRA Rate'!$C$7),\"\")","v":{"v":7990.000000000001,"d":"7990.00"}},{"$f":"ROUND(SUM(F18:F22,H18:H22),0)","v":{"v":58750,"d":"58750.00"}},"ECPenF",{"$f":"IF($W$8=\"GPF\",\"\",ROUND(SUM($F$18,$H$18)*10%,0))","v":{"v":5499,"d":"5499.00"}},{"$f":"Table4[[#Headers],[LIC]]","v":"LIC"},{"$f":"IF($A20=$R$12,$S$12,$M13)","v":""},{"$f":"ROUND(SUM(K18:K22,M18:M22),0)","v":{"v":8599,"d":"8599.00"}},{"$f":"ROUND(SUM(I18-N18),0)","v":{"v":50151,"d":"50151.00"}}]
[{"$nulls":4},"HRA",{"$f":"IFERROR(IF($W$9=\"Yes\",\"\",ROUND($F18*'DA HRA Rate'!$D$7,0)),\"\")","v":{"v":3760,"d":"3760.00"}},"Wash All.",{"$f":"IFERROR(IF(VLOOKUP($Q$1,Allowance,5,0)=0,\"\",VLOOKUP($Q$1,Allowance,5,0)),\"\")","v":""},null,{"$f":"Table4[[#Headers],[GPF]]","v":"GPF"},{"$f":"IF($A$20=$R$10,$S$10,IF($W$8=\"NPS\",\"\",$K$14))","v":""},{"$f":"Table4[[#Headers],[GPF Loan]]","v":"GPF Loan"},{"$f":"IF($A20=$R$13,$S$13,$M14)","v":""}]
["May",{"$nulls":3},"Handi. All.",{"$f":"IFERROR(IF(VLOOKUP($Q$1,Allowance,4,0)=0,\"\",VLOOKUP($Q$1,Allowance,4,0)),\"\")","v":""},"CCA All.",{"$f":"IFERROR(IF(VLOOKUP($Q$1,Allowance,6,0)=0,\"\",VLOOKUP($Q$1,Allowance,6,0)),\"\")","v":""},null,{"$f":"Table4[[#Headers],[SIP]]","v":"SIP"},{"$f":"IF($K15=\"\",\"\",$K15)","v":{"v":3000,"d":"3000.00"}},{"$f":"Table4[[#Headers],[SIL]]","v":"SIL"},{"$f":"IF($A20=$R$14,$S$14,$M15)","v":""}]
{"$rows_left_out":75}