{"text_format":"3","workbook":"xlsx","n_sheets":5,"sheets":["Master Sheet","DA HRA RATE","Deductions","GA55 A Paymanager","Single Page"],"not_rendered":{"images":3,"macros":1,"defined_names":2},"read":"whole","date_system":"1900"}

{"sheet":"Master Sheet","index":0,"n_rows":13,"n_cols":5,"rows_kept":13,"merged":[[0,0,0,4],[1,0,1,4],[2,3,2,4]]}
["Government Senior Secondary School, Deogarh (Rajsamand)"]
["GA 55A Offline"]
["Session","2019-20","DDO CODE::",26887]
["Employee Name","Designation","Employee ID","Pay Scale","NPS/GPF"]
["Ashwini Kumar","Lecturer","RJNA12345678910","L-12","GPF"]
["GPF/PRAN Number ","Account No","PAN No.","TAN No","Probation"]
[12345678910,"1234567891011","ABCD1234E","ABCD1234E","NO"]
["March Basic","Handi. All.","Wash All.","CCA Amount","Surrender Month"]
[69200,{"$nulls":3},"November"]
["Ot. Allow 1","Ot. Allow 2","Ot. Allow 3","Bonus","Bonus Months"]
[{"$nulls":3},"NO"]
["If Basic Changed Month","Changed Basic","July Basic Incriment Other Than 7th Pay","Mobile No","SI No"]
[{"$nulls":3},9024823712,12345678]

{"sheet":"DA HRA RATE","index":1,"n_rows":16,"n_cols":4,"rows_kept":16,"merged":[[0,0,0,3],[1,0,1,3]]}
[{"$f":"'Master Sheet'!A1","v":"Government Senior Secondary School, Deogarh (Rajsamand)"}]
["DA and HRA Rates Monthwise"]
[]
["Sr.No","Month","DA Rate","HRA Rate"]
[3,"March",{"v":0.12,"d":"12.00%"},{"v":0.08,"d":"8.00%"}]
[4,"April",{"v":0.12,"d":"12.00%"},{"v":0.08,"d":"8.00%"}]
[5,"May",{"v":0.12,"d":"12.00%"},{"v":0.08,"d":"8.00%"}]
[6,"June",{"v":0.12,"d":"12.00%"},{"v":0.08,"d":"8.00%"}]
[7,"July",{"v":0.12,"d":"12.00%"},{"v":0.08,"d":"8.00%"}]
[8,"August",{"v":0.12,"d":"12.00%"},{"v":0.08,"d":"8.00%"}]
[9,"September",{"v":0.12,"d":"12.00%"},{"v":0.08,"d":"8.00%"}]
[10,"October",{"v":0.12,"d":"12.00%"},{"v":0.08,"d":"8.00%"}]
[11,"November",{"v":0.12,"d":"12.00%"},{"v":0.08,"d":"8.00%"}]
[12,"December",{"v":0.12,"d":"12.00%"},{"v":0.08,"d":"8.00%"}]
[1,"January",{"v":0.12,"d":"12.00%"},{"v":0.08,"d":"8.00%"}]
{"$rows_left_out":2}
{"sheet":"Deductions","index":2,"n_rows":177,"n_cols":4,"rows_kept":177,"merged":[[0,0,0,3],[1,0,1,3],[14,0,14,3],[15,2,15,3],[16,2,16,3],[17,2,17,3],[18,2,18,3],[19,2,19,3],[20,2,20,3],[21,2,21,3],[22,2,22,3],[23,2,23,3],[24,2,24,3],[25,2,25,3],[26,2,26,3],[27,2,27,3]]}
[{"$f":"'Master Sheet'!A1","v":"Government Senior Secondary School, Deogarh (Rajsamand)"}]
["Deductions Detail"]
[]
["Deduction Name","Deduction Amount","If Changed than Month","Changed Amount"]
["GPF",5100,"July",5500]
["GPF Loan",100,"November",200]
["RPMF/RGHS",700,"November",800]
["SIP",3000]
["SIL",5000,"November",6000]
["SII",100,"November",200]
["LIC",100,"November",200]
["CM Corona"]
["Other Ded.",""]
["",""]
["Itax Amount"]
{"$rows_left_out":163}
{"sheet":"GA55 A Paymanager","index":3,"n_rows":96,"n_cols":24,"rows_kept":96,"merged":[[0,0,0,8],[0,12,0,13],[1,0,1,8],[1,12,1,13],[2,0,2,1],[2,2,2,3],[2,5,2,6],[2,7,2,10],[2,13,2,14],[3,0,3,1],[3,2,3,6],[3,7,3,8],[3,9,3,14],[4,0,4,1],[4,2,4,6],[4,7,4,8],[4,9,4,14],[5,0,5,1],[5,2,5,6],[5,7,5,8],[5,9,5,11],[5,13,5,14],[6,0,6,1],[6,4,6,7],[6,9,6,12],[7,1,11,1],[12,1,16,1],[17,1,21,1],[22,1,26,1],[27,1,31,1],[32,1,36,1],[37,0,37,8],[37,12,37,13],[38,0,38,8],[38,12,38,13],[39,1,43,1],[44,1,48,1],[49,1,53,1],[54,1,58,1],[59,1,63,1],[64,1,68,1],[73,0,73,8],[73,12,73,13],[74,0,74,8],[74,12,74,13],[75,0,76,0],[75,1,76,1],[75,2,76,2],[75,3,76,3],[77,0,78,0],[77,1,78,1],[77,2,78,2],[77,3,78,3],[79,0,80,0],[79,1,80,1],[79,2,80,2],[79,3,80,3],[81,0,82,0],[81,1,82,1],[81,2,82,2],[81,3,82,3],[84,1,84,5],[84,6,84,8],[85,1,85,2],[85,8,85,9],[85,11,85,12],[86,1,86,2],[86,8,86,9],[86,11,86,12],[87,1,87,2],[87,8,87,9],[87,11,87,12],[88,1,88,2],[88,8,88,9],[88,11,88,12],[89,1,89,2],[89,8,89,9],[89,11,89,12],[90,1,90,2],[90,8,90,9],[90,11,90,12],[91,1,91,2],[91,8,91,9],[91,11,91,12],[92,1,92,2],[92,8,92,9],[92,11,92,12],[93,1,93,2],[93,8,93,9],[93,11,93,12],[94,1,94,2],[94,8,94,9],[94,13,94,14],[95,1,95,2],[95,3,95,4],[95,6,95,7],[95,8,95,9],[95,11,95,12],[95,13,95,14]]}
["Government Of Rajasthan",{"$nulls":11},"Page No.",null,1]
["GA55 A",{"$nulls":11},"Financial Year : ",null,{"$f":"IF('Master Sheet'!B3=\"\",\"\",'Master Sheet'!B3)","v":"2019-20"}]
["DDO Code:",null,{"$f":"IF('Master Sheet'!D3=\"\",\"\",'Master Sheet'!D3)","v":26887},null,null,"Office Name :",null,"GSSS Deogarh",{"$nulls":4},"TAN:",{"$f":"IF('Master Sheet'!D7=\"\",\"\",'Master Sheet'!D7)","v":"ABCD1234E"}]
["Employee Name :",null,{"$f":"IF('Master Sheet'!A5=\"\",\"\",UPPER('Master Sheet'!A5))","v":"ASHWINI KUMAR"},{"$nulls":4},"Employee ID :",null,{"$f":"IF('Master Sheet'!C5=\"\",\"\",'Master Sheet'!C5)","v":"RJNA12345678910"}]
["Designation :",null,{"$f":"IF('Master Sheet'!B5=\"\",\"\",'Master Sheet'!B5)","v":"Lecturer"},{"$nulls":4},"Pay Scale :",null,{"$f":"IF('Master Sheet'!D5=\"\",\"\",'Master Sheet'!D5)","v":"L-12"}]
["GPF/PRAN Number :",null,{"$f":"IF('Master Sheet'!A7=\"\",\"\",'Master Sheet'!A7)","v":12345678910},{"$nulls":4},"Account No :",null,{"$f":"IF('Master Sheet'!B7=\"\",\"\",'Master Sheet'!B7)","v":"1234567891011"},null,null,"PAN :",{"$f":"IF('Master Sheet'!C7=\"\",\"\",'Master Sheet'!C7)","v":"ABCD1234E"}]
["Pay Month\nPay Year",null,"Bill No.\nTV No.","Bill Date\nTV Date","----------------Allowances----------------",{"$nulls":3},"Gross Amount","------------Deductions------------",{"$nulls":3},"Total deduction","NetAmount"]
[null,"Salary",null,null,"Basic",{"$f":"IF('Master Sheet'!$A$9=\"\",\"\",'Master Sheet'!$A$9)","v":{"v":69200,"d":"69200.00"}},"DA",{"$f":"IF('Master Sheet'!$E$7=\"YES\",\"\",IF(F8=\"\",\"\",ROUND(F8*'DA HRA RATE'!$C$5,0)))","v":{"v":8304,"d":"8304.00"}},{"$f":"SUM(F8:F12,H8:H12)","v":{"v":83040,"d":"83040.00"}},"ECPenF",{"$f":"IFERROR(IF('Master Sheet'!$E$5=\"GPF\",\"\",ROUND(SUM(F8,H8)*10%,0)),\"\")","v":""},{"$f":"Deductions!A9","v":"SIL"},{"$f":"IF(Deductions!B9=\"\",\"\",Deductions!B9)","v":{"v":5000,"d":"5000.00"}},{"$f":"SUM(M8:M12,K8:K12)","v":{"v":14201,"d":"14201.00"}},{"$f":"SUM(I8-N8)","v":{"v":68839,"d":"68839.00"}},{"$nulls":7},{"$f":"A10","v":"March"},{"$f":"F8","v":{"v":69200,"d":"69200.00"}}]
[{"$nulls":4},"HRA",{"$f":"IF('Master Sheet'!$E$7=\"Yes\",\"\",IF(F8=\"\",\"\",ROUND(F8*'DA HRA RATE'!$D$5,0)))","v":{"v":5536,"d":"5536.00"}},"Wash All.",{"$f":"IF('Master Sheet'!$C$9=\"\",\"\",'Master Sheet'!$C$9)","v":""},null,{"$f":"Deductions!A5","v":"GPF"},{"$f":"IF(Deductions!B5=\"\",\"\",Deductions!B5)","v":{"v":5100,"d":"5100.00"}},{"$f":"Deductions!A10","v":"SII"},{"$f":"IF(Deductions!B10=\"\",\"\",Deductions!B10)","v":{"v":100,"d":"100.00"}},{"$nulls":9},{"$f":"A15","v":"April"},{"$f":"F13","v":{"v":69200,"d":"69200.00"}}]
["March",{"$nulls":3},"Handi. All.",{"$f":"IF('Master Sheet'!$B$9=\"\",\"\",'Master Sheet'!$B$9)","v":""},"CCA",{"$f":"IF('Master Sheet'!$D$9=\"\",\"\",'Master Sheet'!$D$9)","v":""},null,{"$f":"Deductions!A6","v":"GPF Loan"},{"$f":"IF(Deductions!B6=\"\",\"\",Deductions!B6)","v":{"v":100,"d":"100.00"}},{"$f":"Deductions!A11","v":"LIC"},{"$f":"IF(Deductions!B11=\"\",\"\",Deductions!B11)","v":{"v":100,"d":"100.00"}},{"$nulls":9},{"$f":"A20","v":"May"},{"$f":"F18","v":{"v":69200,"d":"69200.00"}}]
[{"$f":"LEFT($O$2,4)","v":"2019"},{"$nulls":3},{"$f":"'Master Sheet'!$A$10","v":"Ot. Allow 1"},{"$f":"IF('Master Sheet'!$A$11=\"\",\"\",'Master Sheet'!$A$11)","v":""},{"$f":"'Master Sheet'!$B$10","v":"Ot. Allow 2"},{"$f":"IF('Master Sheet'!$B$11=\"\",\"\",'Master Sheet'!$B$11)","v":""},null,{"$f":"Deductions!A7","v":"RPMF/RGHS"},{"$f":"IF(Deductions!B7=\"\",\"\",Deductions!B7)","v":{"v":700,"d":"700.00"}},"Itax",{"$f":"IF(A10=Deductions!B17,Deductions!C17,\"\")","v":{"v":101,"d":"101.00"}},{"$nulls":9},{"$f":"A25","v":"June"},{"$f":"F23","v":{"v":69200,"d":"69200.00"}}]
[{"$nulls":4},{"$f":"'Master Sheet'!$C$10","v":"Ot. Allow 3"},{"$f":"IF('Master Sheet'!$C$11=\"\",\"\",'Master Sheet'!$C$11)","v":""},"Ot. Allow 4",null,null,{"$f":"Deductions!A8","v":"SIP"},{"$f":"IF(Deductions!B8=\"\",\"\",Deductions!B8)","v":{"v":3000,"d":"3000.00"}},{"$f":"Deductions!A12","v":"CM Corona"},{"$f":"IF(Deductions!B12=\"\",\"\",Deductions!B12)","v":""},{"$nulls":9},{"$f":"A30","v":"July"},{"$f":"F28","v":{"v":71300,"d":"71300.00"}}]
[null,"Salary",null,null,"Basic",{"$f":"IF(A15='Master Sheet'!$A$13,'Master Sheet'!$B$13,F8)","v":{"v":69200,"d":"69200.00"}},"DA",{"$f":"IF('Master Sheet'!$E$7=\"YES\",\"\",IF(F13=\"\",\"\",ROUND(F13*'DA HRA RATE'!$C$6,0)))","v":{"v":8304,"d":"8304.00"}},{"$f":"SUM(F13:F17,H13:H17)","v":{"v":83040,"d":"83040.00"}},"ECPenF",{"$f":"IFERROR(IF('Master Sheet'!$E$5=\"GPF\",\"\",ROUND(SUM(F13,H13)*10%,0)),\"\")","v":""},{"$f":"L8","v":"SIL"},{"$f":"IF(A15=Deductions!$C$9,Deductions!$D$9,M8)","v":{"v":5000,"d":"5000.00"}},{"$f":"SUM(M13:M17,K13:K17)","v":{"v":14202,"d":"14202.00"}},{"$f":"SUM(I13-N13)","v":{"v":68838,"d":"68838.00"}},{"$nulls":7},{"$f":"A35","v":"August"},{"$f":"F33","v":{"v":71300,"d":"71300.00"}}]
[{"$nulls":4},"HRA",{"$f":"IF('Master Sheet'!$E$7=\"Yes\",\"\",IF(F13=\"\",\"\",ROUND(F13*'DA HRA RATE'!$D$6,0)))","v":{"v":5536,"d":"5536.00"}},"Wash All.",{"$f":"H9","v":""},null,{"$f":"J9","v":"GPF"},{"$f":"IF(A15=Deductions!$C$5,Deductions!$D$5,K9)","v":{"v":5100,"d":"5100.00"}},{"$f":"L9","v":"SII"},{"$f":"IF(A15=Deductions!$C$10,Deductions!$D$10,M9)","v":{"v":100,"d":"100.00"}},{"$nulls":9},{"$f":"A42","v":"September"},{"$f":"F40","v":{"v":71300,"d":"71300.00"}}]
["April",{"$nulls":3},"Handi. All.",{"$f":"F10","v":""},"CCA",{"$f":"H10","v":""},null,{"$f":"J10","v":"GPF Loan"},{"$f":"IF(A15=Deductions!$C$6,Deductions!$D$6,K10)","v":{"v":100,"d":"100.00"}},"LIC",{"$f":"IF(A15=Deductions!$C$11,Deductions!$D$11,M10)","v":{"v":100,"d":"100.00"}},{"$nulls":9},{"$f":"A47","v":"October"},{"$f":"F45","v":{"v":71300,"d":"71300.00"}}]
{"$rows_left_out":82}
{"sheet":"Single Page","index":4,"n_rows":30,"n_cols":36,"rows_kept":30,"merged":[[0,0,0,25],[1,0,1,24],[3,1,3,4],[3,6,3,8],[3,10,3,11],[3,12,3,13],[3,14,3,17],[3,18,3,20],[3,21,3,22],[3,24,3,25],[4,1,4,4],[4,6,4,8],[4,10,4,11],[4,12,4,13],[4,14,4,17],[4,18,4,20],[4,21,4,24],[29,0,29,2],[29,23,29,24]]}
[{"$f":"IF('Master Sheet'!A1=\"\",\"\",'Master Sheet'!A1)","v":"Government Senior Secondary School, Deogarh (Rajsamand)"}]
[{"$f":"\"वेतन एवं कटौतियों का ब्यौरा सत्र\"&\" - \"&'Master Sheet'!$B$3","v":"वेतन एवं कटौतियों का ब्यौरा सत्र - 2019-20"}]
[]
["नाम कर्मचारी-",{"$f":"IF('Master Sheet'!A5=\"\",\"\",'Master Sheet'!A5)","v":"Ashwini Kumar"},{"$nulls":3},"पद-",{"$f":"IF('Master Sheet'!B5=\"\",\"\",'Master Sheet'!B5)","v":"Lecturer"},null,null,"लेवल-",{"$f":"IF('Master Sheet'!D5=\"\",\"\",'Master Sheet'!D5)","v":"L-12"},null,"Employee ID-",null,{"$f":"IF('Master Sheet'!C5=\"\",\"\",'Master Sheet'!C5)","v":"RJNA12345678910"},{"$nulls":3},"मार्च का बेसिक-",null,null,{"$f":"IF('Master Sheet'!A9=\"\",\"\",'Master Sheet'!A9)","v":{"v":69200,"d":"69200.00"}},null,"TAN No.",{"$f":"IF('Master Sheet'!D7=\"\",\"\",'Master Sheet'!D7)","v":"ABCD1234E"}]
["पैन नं.-",{"$f":"IF('Master Sheet'!C7=\"\",\"\",'Master Sheet'!C7)","v":"ABCD1234E"},{"$nulls":3},"Mobile-",{"$f":"IF('Master Sheet'!D13=\"\",\"\",'Master Sheet'!D13)","v":9024823712},null,null,"SI No.-",{"$f":"IF('Master Sheet'!E13=\"\",\"\",'Master Sheet'!E13)","v":12345678},null,"GPF/PRAN No.-",null,{"$f":"IF('Master Sheet'!A7=\"\",\"\",'Master Sheet'!A7)","v":12345678910},{"$nulls":3},"बैंक खाता सं.-",null,null,{"$f":"IF('Master Sheet'!B7=\"\",\"\",'Master Sheet'!B7)","v":"1234567891011"}]
["Month & Year","Basic Pay","DA","HRA","Washing Allow.","Handicaped Allowance","CCA Allowance",{"$f":"'Master Sheet'!A10","v":"Ot. Allow 1"},"Gross Salary","SIP","GPF","NPS","GPF Loan","RPMF","SIL","SII","GIS","LIC","COVIS-19","GPF 2004","Hitkari Nidhi",{"$f":"Deductions!A13","v":"Other Ded."},"ITAX","Total Deduction","NET Payment","Bill No./ Date",{"$nulls":8},{"$f":"'Master Sheet'!E9","v":"November"}]
["March",{"$f":"IF('Master Sheet'!$A$9=\"\",\"\",'Master Sheet'!$A$9)","v":{"v":69200,"d":"69,200"}},{"$f":"IF('Master Sheet'!$E$7=\"Yes\",\"\",IF(B7=\"\",\"\",ROUND(B7*'DA HRA RATE'!$C5,0)))","v":{"v":8304,"d":"8,304"}},{"$f":"IF('Master Sheet'!$E$7=\"Yes\",\"\",IF(B7=\"\",\"\",ROUND(B7*'DA HRA RATE'!$D5,0)))","v":{"v":5536,"d":"5,536"}},{"$f":"IF('Master Sheet'!$C$9=\"\",\"\",'Master Sheet'!$C$9)","v":""},{"$f":"IF('Master Sheet'!$B$9=\"\",\"\",'Master Sheet'!$B$9)","v":""},{"$f":"IF('Master Sheet'!$D$9=\"\",\"\",'Master Sheet'!$D$9)","v":""},{"$f":"IF('Master Sheet'!$A$11=\"\",\"\",'Master Sheet'!$A$11)","v":""},{"$f":"SUM(B7:H7)","v":{"v":83040,"d":"83,040"}},{"$f":"IF(Deductions!B8=\"\",\"\",Deductions!B8)","v":{"v":3000,"d":"3,000"}},{"$f":"IF(Deductions!B5=\"\",\"\",Deductions!B5)","v":{"v":5100,"d":"5,100"}},{"$f":"IFERROR(IF('Master Sheet'!$E$5=\"GPF\",\"\",ROUND(SUM(B7:C7)*10%,0)),\"\")","v":""},{"$f":"IF(Deductions!B6=\"\",\"\",Deductions!B6)","v":100},{"$f":"IF(Deductions!B7=\"\",\"\",Deductions!B7)","v":700},{"$f":"IF(Deductions!B9=\"\",\"\",Deductions!B9)","v":{"v":5000,"d":"5,000"}},{"$f":"IF(Deductions!B10=\"\",\"\",Deductions!B10)","v":100},null,{"$f":"IF(Deductions!B11=\"\",\"\",Deductions!B11)","v":100},{"$nulls":4},{"$f":"IF(A7=Deductions!B17,Deductions!C17,\"\")","v":101},{"$f":"SUM(J7:W7)","v":{"v":14201,"d":"14,201"}},{"$f":"SUM(I7-X7)","v":{"v":68839,"d":"68,839"}},{"$nulls":9},{"$f":"A7","v":"March"},{"$f":"B7","v":69200}]
["April",{"$f":"IF(A8='Master Sheet'!$A$13,'Master Sheet'!$B$13,B7)","v":{"v":69200,"d":"69,200"}},{"$f":"IF('Master Sheet'!$E$7=\"Yes\",\"\",IF(B8=\"\",\"\",ROUND(B8*'DA HRA RATE'!$C6,0)))","v":{"v":8304,"d":"8,304"}},{"$f":"IF('Master Sheet'!$E$7=\"Yes\",\"\",IF(B8=\"\",\"\",ROUND(B8*'DA HRA RATE'!$D6,0)))","v":{"v":5536,"d":"5,536"}},{"$f":"E7","v":""},{"$f":"F7","v":""},{"$f":"G7","v":""},{"$f":"H7","v":""},{"$f":"SUM(B8:H8)","v":{"v":83040,"d":"83,040"}},{"$f":"J7","v":{"v":3000,"d":"3,000"}},{"$f":"IF(A8=Deductions!$C$5,Deductions!$D$5,K7)","v":{"v":5100,"d":"5,100"}},{"$f":"IFERROR(IF('Master Sheet'!$E$5=\"GPF\",\"\",ROUND(SUM(B8:C8)*10%,0)),\"\")","v":""},{"$f":"IF(A8=Deductions!$C$6,Deductions!$D$6,M7)","v":100},{"$f":"IF(A8=Deductions!$C$7,Deductions!$D$7,N7)","v":700},{"$f":"IF(A8=Deductions!$C$9,Deductions!$D$9,O7)","v":{"v":5000,"d":"5,000"}},{"$f":"IF(A8=Deductions!$C$10,Deductions!$D$10,P7)","v":100},220,{"$f":"IF(A8=Deductions!$C$11,Deductions!$D$11,R7)","v":100},{"$nulls":4},{"$f":"IF(A8=Deductions!B18,Deductions!C18,\"\")","v":102},{"$f":"SUM(J8:W8)","v":{"v":14422,"d":"14,422"}},{"$f":"SUM(I8-X8)","v":{"v":68618,"d":"68,618"}},{"$nulls":9},{"$f":"A8","v":"April"},{"$f":"B8","v":69200}]
["May",{"$f":"IF(A9='Master Sheet'!$A$13,'Master Sheet'!$B$13,B8)","v":{"v":69200,"d":"69,200"}},{"$f":"IF('Master Sheet'!$E$7=\"Yes\",\"\",IF(B9=\"\",\"\",ROUND(B9*'DA HRA RATE'!$C7,0)))","v":{"v":8304,"d":"8,304"}},{"$f":"IF('Master Sheet'!$E$7=\"Yes\",\"\",IF(B9=\"\",\"\",ROUND(B9*'DA HRA RATE'!$D7,0)))","v":{"v":5536,"d":"5,536"}},{"$f":"E8","v":""},{"$f":"F8","v":""},{"$f":"G8","v":""},{"$f":"H8","v":""},{"$f":"SUM(B9:H9)","v":{"v":83040,"d":"83,040"}},{"$f":"J8","v":{"v":3000,"d":"3,000"}},{"$f":"IF(A9=Deductions!$C$5,Deductions!$D$5,K8)","v":{"v":5100,"d":"5,100"}},{"$f":"IFERROR(IF('Master Sheet'!$E$5=\"GPF\",\"\",ROUND(SUM(B9:C9)*10%,0)),\"\")","v":""},{"$f":"IF(A9=Deductions!$C$6,Deductions!$D$6,M8)","v":100},{"$f":"IF(A9=Deductions!$C$7,Deductions!$D$7,N8)","v":700},{"$f":"IF(A9=Deductions!$C$9,Deductions!$D$9,O8)","v":{"v":5000,"d":"5,000"}},{"$f":"IF(A9=Deductions!$C$10,Deductions!$D$10,P8)","v":100},null,{"$f":"IF(A9=Deductions!$C$11,Deductions!$D$11,R8)","v":100},{"$nulls":4},{"$f":"IF(A9=Deductions!B19,Deductions!C19,\"\")","v":103},{"$f":"SUM(J9:W9)","v":{"v":14203,"d":"14,203"}},{"$f":"SUM(I9-X9)","v":{"v":68837,"d":"68,837"}},{"$nulls":9},"May",69200]
["June",{"$f":"IF(A10='Master Sheet'!$A$13,'Master Sheet'!$B$13,B9)","v":{"v":69200,"d":"69,200"}},{"$f":"IF('Master Sheet'!$E$7=\"Yes\",\"\",IF(B10=\"\",\"\",ROUND(B10*'DA HRA RATE'!$C8,0)))","v":{"v":8304,"d":"8,304"}},{"$f":"IF('Master Sheet'!$E$7=\"Yes\",\"\",IF(B10=\"\",\"\",ROUND(B10*'DA HRA RATE'!$D8,0)))","v":{"v":5536,"d":"5,536"}},{"$f":"E9","v":""},{"$f":"F9","v":""},{"$f":"G9","v":""},{"$f":"H9","v":""},{"$f":"SUM(B10:H10)","v":{"v":83040,"d":"83,040"}},{"$f":"J9","v":{"v":3000,"d":"3,000"}},{"$f":"IF(A10=Deductions!$C$5,Deductions!$D$5,K9)","v":{"v":5100,"d":"5,100"}},{"$f":"IFERROR(IF('Master Sheet'!$E$5=\"GPF\",\"\",ROUND(SUM(B10:C10)*10%,0)),\"\")","v":""},{"$f":"IF(A10=Deductions!$C$6,Deductions!$D$6,M9)","v":100},{"$f":"IF(A10=Deductions!$C$7,Deductions!$D$7,N9)","v":700},{"$f":"IF(A10=Deductions!$C$9,Deductions!$D$9,O9)","v":{"v":5000,"d":"5,000"}},{"$f":"IF(A10=Deductions!$C$10,Deductions!$D$10,P9)","v":100},null,{"$f":"IF(A10=Deductions!$C$11,Deductions!$D$11,R9)","v":100},{"$nulls":4},{"$f":"IF(A10=Deductions!B20,Deductions!C20,\"\")","v":104},{"$f":"SUM(J10:W10)","v":{"v":14204,"d":"14,204"}},{"$f":"SUM(I10-X10)","v":{"v":68836,"d":"68,836"}},{"$nulls":9},"June",69200]
["July",{"$f":"IF('Master Sheet'!$C$13=\"\",IF('Master Sheet'!$E$7=\"Yes\",$B$9,MROUND($B$9*1.03,100)),'Master Sheet'!$C$13)","v":{"v":71300,"d":"71,300"}},{"$f":"IF('Master Sheet'!$E$7=\"Yes\",\"\",IF(B11=\"\",\"\",ROUND(B11*'DA HRA RATE'!$C9,0)))","v":{"v":8556,"d":"8,556"}},{"$f":"IF('Master Sheet'!$E$7=\"Yes\",\"\",IF(B11=\"\",\"\",ROUND(B11*'DA HRA RATE'!$D9,0)))","v":{"v":5704,"d":"5,704"}},{"$f":"E10","v":""},{"$f":"F10","v":""},{"$f":"G10","v":""},{"$f":"H10","v":""},{"$f":"SUM(B11:H11)","v":{"v":85560,"d":"85,560"}},{"$f":"J10","v":{"v":3000,"d":"3,000"}},{"$f":"IF(A11=Deductions!$C$5,Deductions!$D$5,K10)","v":{"v":5500,"d":"5,500"}},{"$f":"IFERROR(IF('Master Sheet'!$E$5=\"GPF\",\"\",ROUND(SUM(B11:C11)*10%,0)),\"\")","v":""},{"$f":"IF(A11=Deductions!$C$6,Deductions!$D$6,M10)","v":100},{"$f":"IF(A11=Deductions!$C$7,Deductions!$D$7,N10)","v":700},{"$f":"IF(A11=Deductions!$C$9,Deductions!$D$9,O10)","v":{"v":5000,"d":"5,000"}},{"$f":"IF(A11=Deductions!$C$10,Deductions!$D$10,P10)","v":100},null,{"$f":"IF(A11=Deductions!$C$11,Deductions!$D$11,R10)","v":100},{"$nulls":4},{"$f":"IF(A11=Deductions!B21,Deductions!C21,\"\")","v":105},{"$f":"SUM(J11:W11)","v":{"v":14605,"d":"14,605"}},{"$f":"SUM(I11-X11)","v":{"v":70955,"d":"70,955"}},{"$nulls":9},"July",71300]
["August",{"$f":"IF(A12='Master Sheet'!$A$13,'Master Sheet'!$B$13,B11)","v":{"v":71300,"d":"71,300"}},{"$f":"IF('Master Sheet'!$E$7=\"Yes\",\"\",IF(B12=\"\",\"\",ROUND(B12*'DA HRA RATE'!$C10,0)))","v":{"v":8556,"d":"8,556"}},{"$f":"IF('Master Sheet'!$E$7=\"Yes\",\"\",IF(B12=\"\",\"\",ROUND(B12*'DA HRA RATE'!$D10,0)))","v":{"v":5704,"d":"5,704"}},{"$f":"E11","v":""},{"$f":"F11","v":""},{"$f":"G11","v":""},{"$f":"H11","v":""},{"$f":"SUM(B12:H12)","v":{"v":85560,"d":"85,560"}},{"$f":"J11","v":{"v":3000,"d":"3,000"}},{"$f":"IF(A12=Deductions!$C$5,Deductions!$D$5,K11)","v":{"v":5500,"d":"5,500"}},{"$f":"IFERROR(IF('Master Sheet'!$E$5=\"GPF\",\"\",ROUND(SUM(B12:C12)*10%,0)),\"\")","v":""},{"$f":"IF(A12=Deductions!$C$6,Deductions!$D$6,M11)","v":100},{"$f":"IF(A12=Deductions!$C$7,Deductions!$D$7,N11)","v":700},{"$f":"IF(A12=Deductions!$C$9,Deductions!$D$9,O11)","v":{"v":5000,"d":"5,000"}},{"$f":"IF(A12=Deductions!$C$10,Deductions!$D$10,P11)","v":100},null,{"$f":"IF(A12=Deductions!$C$11,Deductions!$D$11,R11)","v":100},{"$nulls":4},{"$f":"IF(A12=Deductions!B22,Deductions!C22,\"\")","v":106},{"$f":"SUM(J12:W12)","v":{"v":14606,"d":"14,606"}},{"$f":"SUM(I12-X12)","v":{"v":70954,"d":"70,954"}},{"$nulls":9},"August",71300]
["September",{"$f":"IF(A13='Master Sheet'!$A$13,'Master Sheet'!$B$13,B12)","v":{"v":71300,"d":"71,300"}},{"$f":"IF('Master Sheet'!$E$7=\"Yes\",\"\",IF(B13=\"\",\"\",ROUND(B13*'DA HRA RATE'!$C11,0)))","v":{"v":8556,"d":"8,556"}},{"$f":"IF('Master Sheet'!$E$7=\"Yes\",\"\",IF(B13=\"\",\"\",ROUND(B13*'DA HRA RATE'!$D11,0)))","v":{"v":5704,"d":"5,704"}},{"$f":"E12","v":""},{"$f":"F12","v":""},{"$f":"G12","v":""},{"$f":"H12","v":""},{"$f":"SUM(B13:H13)","v":{"v":85560,"d":"85,560"}},{"$f":"J12","v":{"v":3000,"d":"3,000"}},{"$f":"IF(A13=Deductions!$C$5,Deductions!$D$5,K12)","v":{"v":5500,"d":"5,500"}},{"$f":"IFERROR(IF('Master Sheet'!$E$5=\"GPF\",\"\",ROUND(SUM(B13:C13)*10%,0)),\"\")","v":""},{"$f":"IF(A13=Deductions!$C$6,Deductions!$D$6,M12)","v":100},{"$f":"IF(A13=Deductions!$C$7,Deductions!$D$7,N12)","v":700},{"$f":"IF(A13=Deductions!$C$9,Deductions!$D$9,O12)","v":{"v":5000,"d":"5,000"}},{"$f":"IF(A13=Deductions!$C$10,Deductions!$D$10,P12)","v":100},null,{"$f":"IF(A13=Deductions!$C$11,Deductions!$D$11,R12)","v":100},{"$nulls":4},{"$f":"IF(A13=Deductions!B23,Deductions!C23,\"\")","v":107},{"$f":"SUM(J13:W13)","v":{"v":14607,"d":"14,607"}},{"$f":"SUM(I13-X13)","v":{"v":70953,"d":"70,953"}},{"$nulls":9},"September",71300]
["October",{"$f":"IF(A14='Master Sheet'!$A$13,'Master Sheet'!$B$13,B13)","v":{"v":71300,"d":"71,300"}},{"$f":"IF('Master Sheet'!$E$7=\"Yes\",\"\",IF(B14=\"\",\"\",ROUND(B14*'DA HRA RATE'!$C12,0)))","v":{"v":8556,"d":"8,556"}},{"$f":"IF('Master Sheet'!$E$7=\"Yes\",\"\",IF(B14=\"\",\"\",ROUND(B14*'DA HRA RATE'!$D12,0)))","v":{"v":5704,"d":"5,704"}},{"$f":"E13","v":""},{"$f":"F13","v":""},{"$f":"G13","v":""},{"$f":"H13","v":""},{"$f":"SUM(B14:H14)","v":{"v":85560,"d":"85,560"}},{"$f":"J13","v":{"v":3000,"d":"3,000"}},{"$f":"IF(A14=Deductions!$C$5,Deductions!$D$5,K13)","v":{"v":5500,"d":"5,500"}},{"$f":"IFERROR(IF('Master Sheet'!$E$5=\"GPF\",\"\",ROUND(SUM(B14:C14)*10%,0)),\"\")","v":""},{"$f":"IF(A14=Deductions!$C$6,Deductions!$D$6,M13)","v":100},{"$f":"IF(A14=Deductions!$C$7,Deductions!$D$7,N13)","v":700},{"$f":"IF(A14=Deductions!$C$9,Deductions!$D$9,O13)","v":{"v":5000,"d":"5,000"}},{"$f":"IF(A14=Deductions!$C$10,Deductions!$D$10,P13)","v":100},null,{"$f":"IF(A14=Deductions!$C$11,Deductions!$D$11,R13)","v":100},{"$nulls":4},{"$f":"IF(A14=Deductions!B24,Deductions!C24,\"\")","v":108},{"$f":"SUM(J14:W14)","v":{"v":14608,"d":"14,608"}},{"$f":"SUM(I14-X14)","v":{"v":70952,"d":"70,952"}},{"$nulls":9},"October",71300]
["November",{"$f":"IF(A15='Master Sheet'!$A$13,'Master Sheet'!$B$13,B14)","v":{"v":71300,"d":"71,300"}},{"$f":"IF('Master Sheet'!$E$7=\"Yes\",\"\",IF(B15=\"\",\"\",ROUND(B15*'DA HRA RATE'!$C13,0)))","v":{"v":8556,"d":"8,556"}},{"$f":"IF('Master Sheet'!$E$7=\"Yes\",\"\",IF(B15=\"\",\"\",ROUND(B15*'DA HRA RATE'!$D13,0)))","v":{"v":5704,"d":"5,704"}},{"$f":"E14","v":""},{"$f":"F14","v":""},{"$f":"G14","v":""},{"$f":"H14","v":""},{"$f":"SUM(B15:H15)","v":{"v":85560,"d":"85,560"}},{"$f":"J14","v":{"v":3000,"d":"3,000"}},{"$f":"IF(A15=Deductions!$C$5,Deductions!$D$5,K14)","v":{"v":5500,"d":"5,500"}},{"$f":"IFERROR(IF('Master Sheet'!$E$5=\"GPF\",\"\",ROUND(SUM(B15:C15)*10%,0)),\"\")","v":""},{"$f":"IF(A15=Deductions!$C$6,Deductions!$D$6,M14)","v":200},{"$f":"IF(A15=Deductions!$C$7,Deductions!$D$7,N14)","v":800},{"$f":"IF(A15=Deductions!$C$9,Deductions!$D$9,O14)","v":{"v":6000,"d":"6,000"}},{"$f":"IF(A15=Deductions!$C$10,Deductions!$D$10,P14)","v":200},null,{"$f":"IF(A15=Deductions!$C$11,Deductions!$D$11,R14)","v":200},{"$nulls":4},{"$f":"IF(A15=Deductions!B25,Deductions!C25,\"\")","v":109},{"$f":"SUM(J15:W15)","v":{"v":16009,"d":"16,009"}},{"$f":"SUM(I15-X15)","v":{"v":69551,"d":"69,551"}},{"$nulls":9},"November",71300]
{"$rows_left_out":15}