{"text_format":"3","workbook":"xlsx","n_sheets":7,"sheets":["SD Teacher's Data","Emp. Data","Bill and TV No.","Allowances","Deductions","Edit Pay Posting","Print Pay Posting"],"not_rendered":{"images":2,"macros":1,"defined_names":3},"read":"whole","date_system":"1900"}

{"sheet":"SD Teacher's Data","index":0,"n_rows":17,"n_cols":13,"rows_kept":17}
["Name","EmployeeID","FatherName","Gender","DOB","Post","Subject","Date Of Joining","Address","Aadhar No","PAN No","Mobile No","Blood Group"]
["ADITYA JAKHAD","RJBN201803008697","OM PRAKASH JAKHAD","M","1994-06-16","Junior Assistant","---","2018-10-26","200 K, BAPU NAGAR BEHIND KALYAN MANDAP KUCHAMAN CITY","XXXXXXXX7055","XXXXJ2498M","XXXXXX2067","A+"]
["ASHWINI KUMAR","RJNA201228008021","Meghraj Sharma","M","1988-02-06","Senior Teacher (II Gr.)","English","2012-04-05","Shree Ram Marg, New Colony, Kuchaman City","XXXXXXXX6191","XXXXK5921Q","XXXXXX3711","O+"]
["BANWARI","RJJP200818021434","HEERA LAL","M","1977-07-13","Teacher (III Gr.) Level 2","Social Studies","2018-07-14","VPO -DHANKOLI TAH.- DEEDWANA","XXXXXXXX2855","XXXXB9607K","XXXXXX4263","O+"]
["CHETAN RAM RIYAR","RJNA199828007951","NARAYAN RAM RIYAR","M","1976-01-01","Lecturer (I Gr.)","History","2017-01-18","NEAR GEETANJALI SCHOOL,MIRDHA NAGAR, DEEDWANA ROAD,KUCHAMAN CITY, DIST-NAGAUR (RAJASTHAN)","XXXXXXXX2018","XXXXR0248H","XXXXXX5001","A+"]
["CHHOTOO SINGH","RJNA199328019992","BHAGIRATH SINGH","M","1966-06-15","Senior Teacher (II Gr.)","Hindi","2018-06-26","VILLAGE RANW POST BARWALA VIA MAKRANA DISTIC NAGOUR","XXXXXXXX5283","XXXXR5691G","XXXXXX0541","AB+"]
["HEMLATA SHARMA","RJNA200828043421","RADHYSHYAM SHARMA","F","1978-08-31","Teacher (III Gr.) Level 2","English","2016-06-09","TIWARI BHAWAN NEAR GANDI PARK KUCHAMAN CITY","XXXXXXXX6054","XXXXS2123M","XXXXXX7081","O+"]
["Kamla Barupal","RJNA199728020199","Lacchi Ram","F","1973-02-09","Senior Teacher (II Gr.)","Sanskrit","2016-12-15","57/A Jasol NAgar, Station Road, Vard NO. 11, Kuchaman city","XXXXXXXX5772","XXXXB7337G","XXXXXX6935","B+"]
["KAMLA SESMA","RJNA201828017689","NARAYAN RAM","F","1988-09-13","Lecturer (I Gr.)","Political Science","2018-08-25","LAPLI KI DHANI, NIMAS POST- MUWANA","XXXXXXXX8357","XXXXs2977h","XXXXXX0954","O+"]
["PRAMOD KANWAR","RJBM201905021820","Pappu Singh","F","1996-08-10","Senior Teacher (II Gr.)","Mathematics","2020-09-02","Village syalu kalan post ramrikh ki dhani tehsil surajgarh district jhunjhunu","XXXXXXXX9492","XXXXK0742Q","XXXXXX4400","O+"]
["RAJKUMARI JHHALA","RJNA199828007781","KISTUR CHAND CHOUHAN","F","1976-08-15","Teacher (III Gr.) Level 1","---","2016-06-08","BUNKAR BASTI BHAWTA ROAD KUCHAMAN CITY","XXXXXXXX0431","XXXXJ5923K","XXXXXX2521","O+"]
["RAMESHWAR LAL","RJNA200528011759","BANNA RAM","M","1975-01-05","Senior Teacher (II Gr.)","Science","2017-11-02","VPO-JUSARI (BHAKRON KI DHANI) TEH - MAKRANA DIST- NAGAUR","XXXXXXXX2930","XXXXL2950R","XXXXXX6360","A+"]
["RANDHEER SINGH SHEKHAWAT","RJNA199128021077","RICHHPAL SINGH","M","1966-02-11","PET (III Gr.)","---","2015-09-16","BEHIND KRISHI MANDI, AMBEY COLONY, V.T. SCHOOL ROAD, KUHAMAN CITY","XXXXXXXX6382","XXXXS9053R","XXXXXX2183","A+"]
["Santosh Mohanpuriya","RJNA199828007841","KHIVRAJ GOSWAMI","F","1973-08-21","Teacher (III Gr.) Level 1","---","2016-05-24","DALLA BALAJI RAOD KUCHAMAN CITY","XXXXXXXX2806","XXXXM6069K","XXXXXX3499","O+"]
["SAROJ SUNARIWAL","RJNA199928008033","DHANA RAM JATOLIYA","F","1970-08-07","Teacher (III Gr.) Level 2","Hindi","2016-06-06","ASHOK NAGAR DALA BALAJI ROAD KUCHAMAN CITY","XXXXXXXX7166","XXXXS9205L","XXXXXX0003","O-"]
["SITA RAM BALAI","RJNA198828013771","KALU RAM","M","1965-09-01","Principal & Equivalent","---","2019-03-09","VPO- RULANA VIA- BAYA TEH- DANTA RAMGARH DIST- SIKAR","XXXXXXXX5282","XXXXB2351H","XXXXXX2795","O+"]
["SUKHA RAM MUHAL","RJNA201128019576","HARI RAM MUHAL","M","1986-07-07","Lecturer (I Gr.)","Geography","2021-01-07","VILL - LIKHAMASAR POST - RASAL VIA - KUCHAMAN CITY DIST - NAGAUR","XXXXXXXX3811","XXXXM7372J","XXXXXX9738","O+"]

{"sheet":"Emp. Data","index":1,"n_rows":299,"n_cols":16,"rows_kept":299,"merged":[[0,0,0,15],[1,0,1,15]]}
["Government Senior Secondary School, Rooppura"]
["Employee Data"]
["क्र.सं.","नाम","पद","DOB","पैन नंबर","Emp. ID","Nps Employee","HRA Rate","SI No.","GPF No.","PRAN No.","आधार कार्ड नंबर","बैंक नाम","IFSC Code","बैंक A/c","Is in Probation"]
[{"$f":"IF(Table1[[#This Row],[नाम]]=\"\",\"\",ROWS($A$1:A1))","v":1},{"$f":"PROPER(IF('SD Teacher''s Data'!A2=\"\",\"\",'SD Teacher''s Data'!A2))","v":"Aditya Jakhad"},{"$f":"PROPER(IF('SD Teacher''s Data'!F2=\"\",\"\",'SD Teacher''s Data'!F2))","v":"Junior Assistant"},{"$f":"IF('SD Teacher''s Data'!E2=\"\",\"\",'SD Teacher''s Data'!E2)","v":"1994-06-16"},{"$f":"IF('SD Teacher''s Data'!K2=\"\",\"\",'SD Teacher''s Data'!K2)","v":"XXXXJ2498M"},{"$f":"IF('SD Teacher''s Data'!B2=\"\",\"\",'SD Teacher''s Data'!B2)","v":"RJBN201803008697"},"Yes",{"v":0.08,"d":"8%"},123,1234,1234567891011,{"$f":"IF('SD Teacher''s Data'!J2=\"\",\"\",'SD Teacher''s Data'!J2)","v":"XXXXXXXX7055"},"SBI","SBIN0031733",1234567891011,"No"]
[{"$f":"IF(Table1[[#This Row],[नाम]]=\"\",\"\",ROWS($A$1:A2))","v":2},{"$f":"PROPER(IF('SD Teacher''s Data'!A3=\"\",\"\",'SD Teacher''s Data'!A3))","v":"Ashwini Kumar"},{"$f":"PROPER(IF('SD Teacher''s Data'!F3=\"\",\"\",'SD Teacher''s Data'!F3))","v":"Senior Teacher (Ii Gr.)"},{"$f":"IF('SD Teacher''s Data'!E3=\"\",\"\",'SD Teacher''s Data'!E3)","v":"1988-02-06"},{"$f":"IF('SD Teacher''s Data'!K3=\"\",\"\",'SD Teacher''s Data'!K3)","v":"XXXXK5921Q"},{"$f":"IF('SD Teacher''s Data'!B3=\"\",\"\",'SD Teacher''s Data'!B3)","v":"RJNA201228008021"},"Yes",{"v":0.08,"d":"8%"},123,1234,1234567891011,{"$f":"IF('SD Teacher''s Data'!J3=\"\",\"\",'SD Teacher''s Data'!J3)","v":"XXXXXXXX6191"},"SBI","SBIN0031733",1234567891011,"No"]
[{"$f":"IF(Table1[[#This Row],[नाम]]=\"\",\"\",ROWS($A$1:A3))","v":3},{"$f":"PROPER(IF('SD Teacher''s Data'!A4=\"\",\"\",'SD Teacher''s Data'!A4))","v":"Banwari"},{"$f":"PROPER(IF('SD Teacher''s Data'!F4=\"\",\"\",'SD Teacher''s Data'!F4))","v":"Teacher (Iii Gr.) Level 2"},{"$f":"IF('SD Teacher''s Data'!E4=\"\",\"\",'SD Teacher''s Data'!E4)","v":"1977-07-13"},{"$f":"IF('SD Teacher''s Data'!K4=\"\",\"\",'SD Teacher''s Data'!K4)","v":"XXXXB9607K"},{"$f":"IF('SD Teacher''s Data'!B4=\"\",\"\",'SD Teacher''s Data'!B4)","v":"RJJP200818021434"},"Yes",{"v":0.16,"d":"16%"},{"$nulls":3},{"$f":"IF('SD Teacher''s Data'!J4=\"\",\"\",'SD Teacher''s Data'!J4)","v":"XXXXXXXX2855"},{"$nulls":3},"Yes"]
[{"$f":"IF(Table1[[#This Row],[नाम]]=\"\",\"\",ROWS($A$1:A4))","v":4},{"$f":"PROPER(IF('SD Teacher''s Data'!A5=\"\",\"\",'SD Teacher''s Data'!A5))","v":"Chetan Ram Riyar"},{"$f":"PROPER(IF('SD Teacher''s Data'!F5=\"\",\"\",'SD Teacher''s Data'!F5))","v":"Lecturer (I Gr.)"},{"$f":"IF('SD Teacher''s Data'!E5=\"\",\"\",'SD Teacher''s Data'!E5)","v":"1976-01-01"},{"$f":"IF('SD Teacher''s Data'!K5=\"\",\"\",'SD Teacher''s Data'!K5)","v":"XXXXR0248H"},{"$f":"IF('SD Teacher''s Data'!B5=\"\",\"\",'SD Teacher''s Data'!B5)","v":"RJNA199828007951"},"No",{"$nulls":4},{"$f":"IF('SD Teacher''s Data'!J5=\"\",\"\",'SD Teacher''s Data'!J5)","v":"XXXXXXXX2018"}]
[{"$f":"IF(Table1[[#This Row],[नाम]]=\"\",\"\",ROWS($A$1:A5))","v":5},{"$f":"PROPER(IF('SD Teacher''s Data'!A6=\"\",\"\",'SD Teacher''s Data'!A6))","v":"Chhotoo Singh"},{"$f":"PROPER(IF('SD Teacher''s Data'!F6=\"\",\"\",'SD Teacher''s Data'!F6))","v":"Senior Teacher (Ii Gr.)"},{"$f":"IF('SD Teacher''s Data'!E6=\"\",\"\",'SD Teacher''s Data'!E6)","v":"1966-06-15"},{"$f":"IF('SD Teacher''s Data'!K6=\"\",\"\",'SD Teacher''s Data'!K6)","v":"XXXXR5691G"},{"$f":"IF('SD Teacher''s Data'!B6=\"\",\"\",'SD Teacher''s Data'!B6)","v":"RJNA199328019992"},{"$nulls":5},{"$f":"IF('SD Teacher''s Data'!J6=\"\",\"\",'SD Teacher''s Data'!J6)","v":"XXXXXXXX5283"}]
[{"$f":"IF(Table1[[#This Row],[नाम]]=\"\",\"\",ROWS($A$1:A6))","v":6},{"$f":"PROPER(IF('SD Teacher''s Data'!A7=\"\",\"\",'SD Teacher''s Data'!A7))","v":"Hemlata Sharma"},{"$f":"PROPER(IF('SD Teacher''s Data'!F7=\"\",\"\",'SD Teacher''s Data'!F7))","v":"Teacher (Iii Gr.) Level 2"},{"$f":"IF('SD Teacher''s Data'!E7=\"\",\"\",'SD Teacher''s Data'!E7)","v":"1978-08-31"},{"$f":"IF('SD Teacher''s Data'!K7=\"\",\"\",'SD Teacher''s Data'!K7)","v":"XXXXS2123M"},{"$f":"IF('SD Teacher''s Data'!B7=\"\",\"\",'SD Teacher''s Data'!B7)","v":"RJNA200828043421"},{"$nulls":5},{"$f":"IF('SD Teacher''s Data'!J7=\"\",\"\",'SD Teacher''s Data'!J7)","v":"XXXXXXXX6054"}]
[{"$f":"IF(Table1[[#This Row],[नाम]]=\"\",\"\",ROWS($A$1:A7))","v":7},{"$f":"PROPER(IF('SD Teacher''s Data'!A8=\"\",\"\",'SD Teacher''s Data'!A8))","v":"Kamla Barupal"},{"$f":"PROPER(IF('SD Teacher''s Data'!F8=\"\",\"\",'SD Teacher''s Data'!F8))","v":"Senior Teacher (Ii Gr.)"},{"$f":"IF('SD Teacher''s Data'!E8=\"\",\"\",'SD Teacher''s Data'!E8)","v":"1973-02-09"},{"$f":"IF('SD Teacher''s Data'!K8=\"\",\"\",'SD Teacher''s Data'!K8)","v":"XXXXB7337G"},{"$f":"IF('SD Teacher''s Data'!B8=\"\",\"\",'SD Teacher''s Data'!B8)","v":"RJNA199728020199"},{"$nulls":5},{"$f":"IF('SD Teacher''s Data'!J8=\"\",\"\",'SD Teacher''s Data'!J8)","v":"XXXXXXXX5772"}]
[{"$f":"IF(Table1[[#This Row],[नाम]]=\"\",\"\",ROWS($A$1:A8))","v":8},{"$f":"PROPER(IF('SD Teacher''s Data'!A9=\"\",\"\",'SD Teacher''s Data'!A9))","v":"Kamla Sesma"},{"$f":"PROPER(IF('SD Teacher''s Data'!F9=\"\",\"\",'SD Teacher''s Data'!F9))","v":"Lecturer (I Gr.)"},{"$f":"IF('SD Teacher''s Data'!E9=\"\",\"\",'SD Teacher''s Data'!E9)","v":"1988-09-13"},{"$f":"IF('SD Teacher''s Data'!K9=\"\",\"\",'SD Teacher''s Data'!K9)","v":"XXXXs2977h"},{"$f":"IF('SD Teacher''s Data'!B9=\"\",\"\",'SD Teacher''s Data'!B9)","v":"RJNA201828017689"},{"$nulls":5},{"$f":"IF('SD Teacher''s Data'!J9=\"\",\"\",'SD Teacher''s Data'!J9)","v":"XXXXXXXX8357"}]
[{"$f":"IF(Table1[[#This Row],[नाम]]=\"\",\"\",ROWS($A$1:A9))","v":9},{"$f":"PROPER(IF('SD Teacher''s Data'!A10=\"\",\"\",'SD Teacher''s Data'!A10))","v":"Pramod Kanwar"},{"$f":"PROPER(IF('SD Teacher''s Data'!F10=\"\",\"\",'SD Teacher''s Data'!F10))","v":"Senior Teacher (Ii Gr.)"},{"$f":"IF('SD Teacher''s Data'!E10=\"\",\"\",'SD Teacher''s Data'!E10)","v":"1996-08-10"},{"$f":"IF('SD Teacher''s Data'!K10=\"\",\"\",'SD Teacher''s Data'!K10)","v":"XXXXK0742Q"},{"$f":"IF('SD Teacher''s Data'!B10=\"\",\"\",'SD Teacher''s Data'!B10)","v":"RJBM201905021820"},{"$nulls":5},{"$f":"IF('SD Teacher''s Data'!J10=\"\",\"\",'SD Teacher''s Data'!J10)","v":"XXXXXXXX9492"}]
[{"$f":"IF(Table1[[#This Row],[नाम]]=\"\",\"\",ROWS($A$1:A10))","v":10},{"$f":"PROPER(IF('SD Teacher''s Data'!A11=\"\",\"\",'SD Teacher''s Data'!A11))","v":"Rajkumari Jhhala"},{"$f":"PROPER(IF('SD Teacher''s Data'!F11=\"\",\"\",'SD Teacher''s Data'!F11))","v":"Teacher (Iii Gr.) Level 1"},{"$f":"IF('SD Teacher''s Data'!E11=\"\",\"\",'SD Teacher''s Data'!E11)","v":"1976-08-15"},{"$f":"IF('SD Teacher''s Data'!K11=\"\",\"\",'SD Teacher''s Data'!K11)","v":"XXXXJ5923K"},{"$f":"IF('SD Teacher''s Data'!B11=\"\",\"\",'SD Teacher''s Data'!B11)","v":"RJNA199828007781"},{"$nulls":5},{"$f":"IF('SD Teacher''s Data'!J11=\"\",\"\",'SD Teacher''s Data'!J11)","v":"XXXXXXXX0431"}]
[{"$f":"IF(Table1[[#This Row],[नाम]]=\"\",\"\",ROWS($A$1:A11))","v":11},{"$f":"PROPER(IF('SD Teacher''s Data'!A12=\"\",\"\",'SD Teacher''s Data'!A12))","v":"Rameshwar Lal"},{"$f":"PROPER(IF('SD Teacher''s Data'!F12=\"\",\"\",'SD Teacher''s Data'!F12))","v":"Senior Teacher (Ii Gr.)"},{"$f":"IF('SD Teacher''s Data'!E12=\"\",\"\",'SD Teacher''s Data'!E12)","v":"1975-01-05"},{"$f":"IF('SD Teacher''s Data'!K12=\"\",\"\",'SD Teacher''s Data'!K12)","v":"XXXXL2950R"},{"$f":"IF('SD Teacher''s Data'!B12=\"\",\"\",'SD Teacher''s Data'!B12)","v":"RJNA200528011759"},{"$nulls":5},{"$f":"IF('SD Teacher''s Data'!J12=\"\",\"\",'SD Teacher''s Data'!J12)","v":"XXXXXXXX2930"}]
[{"$f":"IF(Table1[[#This Row],[नाम]]=\"\",\"\",ROWS($A$1:A12))","v":12},{"$f":"PROPER(IF('SD Teacher''s Data'!A13=\"\",\"\",'SD Teacher''s Data'!A13))","v":"Randheer Singh Shekhawat"},{"$f":"PROPER(IF('SD Teacher''s Data'!F13=\"\",\"\",'SD Teacher''s Data'!F13))","v":"Pet (Iii Gr.)"},{"$f":"IF('SD Teacher''s Data'!E13=\"\",\"\",'SD Teacher''s Data'!E13)","v":"1966-02-11"},{"$f":"IF('SD Teacher''s Data'!K13=\"\",\"\",'SD Teacher''s Data'!K13)","v":"XXXXS9053R"},{"$f":"IF('SD Teacher''s Data'!B13=\"\",\"\",'SD Teacher''s Data'!B13)","v":"RJNA199128021077"},{"$nulls":5},{"$f":"IF('SD Teacher''s Data'!J13=\"\",\"\",'SD Teacher''s Data'!J13)","v":"XXXXXXXX6382"}]
[{"$f":"IF(Table1[[#This Row],[नाम]]=\"\",\"\",ROWS($A$1:A13))","v":13},{"$f":"PROPER(IF('SD Teacher''s Data'!A14=\"\",\"\",'SD Teacher''s Data'!A14))","v":"Santosh Mohanpuriya"},{"$f":"PROPER(IF('SD Teacher''s Data'!F14=\"\",\"\",'SD Teacher''s Data'!F14))","v":"Teacher (Iii Gr.) Level 1"},{"$f":"IF('SD Teacher''s Data'!E14=\"\",\"\",'SD Teacher''s Data'!E14)","v":"1973-08-21"},{"$f":"IF('SD Teacher''s Data'!K14=\"\",\"\",'SD Teacher''s Data'!K14)","v":"XXXXM6069K"},{"$f":"IF('SD Teacher''s Data'!B14=\"\",\"\",'SD Teacher''s Data'!B14)","v":"RJNA199828007841"},{"$nulls":5},{"$f":"IF('SD Teacher''s Data'!J14=\"\",\"\",'SD Teacher''s Data'!J14)","v":"XXXXXXXX2806"}]
[{"$f":"IF(Table1[[#This Row],[नाम]]=\"\",\"\",ROWS($A$1:A14))","v":14},{"$f":"PROPER(IF('SD Teacher''s Data'!A15=\"\",\"\",'SD Teacher''s Data'!A15))","v":"Saroj Sunariwal"},{"$f":"PROPER(IF('SD Teacher''s Data'!F15=\"\",\"\",'SD Teacher''s Data'!F15))","v":"Teacher (Iii Gr.) Level 2"},{"$f":"IF('SD Teacher''s Data'!E15=\"\",\"\",'SD Teacher''s Data'!E15)","v":"1970-08-07"},{"$f":"IF('SD Teacher''s Data'!K15=\"\",\"\",'SD Teacher''s Data'!K15)","v":"XXXXS9205L"},{"$f":"IF('SD Teacher''s Data'!B15=\"\",\"\",'SD Teacher''s Data'!B15)","v":"RJNA199928008033"},{"$nulls":5},{"$f":"IF('SD Teacher''s Data'!J15=\"\",\"\",'SD Teacher''s Data'!J15)","v":"XXXXXXXX7166"}]
[{"$f":"IF(Table1[[#This Row],[नाम]]=\"\",\"\",ROWS($A$1:A15))","v":15},{"$f":"PROPER(IF('SD Teacher''s Data'!A16=\"\",\"\",'SD Teacher''s Data'!A16))","v":"Sita Ram Balai"},{"$f":"PROPER(IF('SD Teacher''s Data'!F16=\"\",\"\",'SD Teacher''s Data'!F16))","v":"Principal & Equivalent"},{"$f":"IF('SD Teacher''s Data'!E16=\"\",\"\",'SD Teacher''s Data'!E16)","v":"1965-09-01"},{"$f":"IF('SD Teacher''s Data'!K16=\"\",\"\",'SD Teacher''s Data'!K16)","v":"XXXXB2351H"},{"$f":"IF('SD Teacher''s Data'!B16=\"\",\"\",'SD Teacher''s Data'!B16)","v":"RJNA198828013771"},{"$nulls":5},{"$f":"IF('SD Teacher''s Data'!J16=\"\",\"\",'SD Teacher''s Data'!J16)","v":"XXXXXXXX5282"}]
[{"$f":"IF(Table1[[#This Row],[नाम]]=\"\",\"\",ROWS($A$1:A16))","v":16},{"$f":"PROPER(IF('SD Teacher''s Data'!A17=\"\",\"\",'SD Teacher''s Data'!A17))","v":"Sukha Ram Muhal"},{"$f":"PROPER(IF('SD Teacher''s Data'!F17=\"\",\"\",'SD Teacher''s Data'!F17))","v":"Lecturer (I Gr.)"},{"$f":"IF('SD Teacher''s Data'!E17=\"\",\"\",'SD Teacher''s Data'!E17)","v":"1986-07-07"},{"$f":"IF('SD Teacher''s Data'!K17=\"\",\"\",'SD Teacher''s Data'!K17)","v":"XXXXM7372J"},{"$f":"IF('SD Teacher''s Data'!B17=\"\",\"\",'SD Teacher''s Data'!B17)","v":"RJNA201128019576"},{"$nulls":5},{"$f":"IF('SD Teacher''s Data'!J17=\"\",\"\",'SD Teacher''s Data'!J17)","v":"XXXXXXXX3811"}]
[{"$f":"IF(Table1[[#This Row],[नाम]]=\"\",\"\",ROWS($A$1:A17))","v":""},{"$f":"PROPER(IF('SD Teacher''s Data'!A18=\"\",\"\",'SD Teacher''s Data'!A18))","v":""},{"$f":"PROPER(IF('SD Teacher''s Data'!F18=\"\",\"\",'SD Teacher''s Data'!F18))","v":""},{"$f":"IF('SD Teacher''s Data'!E18=\"\",\"\",'SD Teacher''s Data'!E18)","v":""},{"$f":"IF('SD Teacher''s Data'!K18=\"\",\"\",'SD Teacher''s Data'!K18)","v":""},{"$f":"IF('SD Teacher''s Data'!B18=\"\",\"\",'SD Teacher''s Data'!B18)","v":""},{"$nulls":5},{"$f":"IF('SD Teacher''s Data'!J18=\"\",\"\",'SD Teacher''s Data'!J18)","v":""}]
[{"$f":"IF(Table1[[#This Row],[नाम]]=\"\",\"\",ROWS($A$1:A18))","v":""},{"$f":"PROPER(IF('SD Teacher''s Data'!A19=\"\",\"\",'SD Teacher''s Data'!A19))","v":""},{"$f":"PROPER(IF('SD Teacher''s Data'!F19=\"\",\"\",'SD Teacher''s Data'!F19))","v":""},{"$f":"IF('SD Teacher''s Data'!E19=\"\",\"\",'SD Teacher''s Data'!E19)","v":""},{"$f":"IF('SD Teacher''s Data'!K19=\"\",\"\",'SD Teacher''s Data'!K19)","v":""},{"$f":"IF('SD Teacher''s Data'!B19=\"\",\"\",'SD Teacher''s Data'!B19)","v":""},{"$nulls":5},{"$f":"IF('SD Teacher''s Data'!J19=\"\",\"\",'SD Teacher''s Data'!J19)","v":""}]
[{"$f":"IF(Table1[[#This Row],[नाम]]=\"\",\"\",ROWS($A$1:A19))","v":""},{"$f":"PROPER(IF('SD Teacher''s Data'!A20=\"\",\"\",'SD Teacher''s Data'!A20))","v":""},{"$f":"PROPER(IF('SD Teacher''s Data'!F20=\"\",\"\",'SD Teacher''s Data'!F20))","v":""},{"$f":"IF('SD Teacher''s Data'!E20=\"\",\"\",'SD Teacher''s Data'!E20)","v":""},{"$f":"IF('SD Teacher''s Data'!K20=\"\",\"\",'SD Teacher''s Data'!K20)","v":""},{"$f":"IF('SD Teacher''s Data'!B20=\"\",\"\",'SD Teacher''s Data'!B20)","v":""},{"$nulls":5},{"$f":"IF('SD Teacher''s Data'!J20=\"\",\"\",'SD Teacher''s Data'!J20)","v":""}]
[{"$f":"IF(Table1[[#This Row],[नाम]]=\"\",\"\",ROWS($A$1:A20))","v":""},{"$f":"PROPER(IF('SD Teacher''s Data'!A21=\"\",\"\",'SD Teacher''s Data'!A21))","v":""},{"$f":"PROPER(IF('SD Teacher''s Data'!F21=\"\",\"\",'SD Teacher''s Data'!F21))","v":""},{"$f":"IF('SD Teacher''s Data'!E21=\"\",\"\",'SD Teacher''s Data'!E21)","v":""},{"$f":"IF('SD Teacher''s Data'!K21=\"\",\"\",'SD Teacher''s Data'!K21)","v":""},{"$f":"IF('SD Teacher''s Data'!B21=\"\",\"\",'SD Teacher''s Data'!B21)","v":""},{"$nulls":5},{"$f":"IF('SD Teacher''s Data'!J21=\"\",\"\",'SD Teacher''s Data'!J21)","v":""}]
[{"$f":"IF(Table1[[#This Row],[नाम]]=\"\",\"\",ROWS($A$1:A21))","v":""},{"$f":"PROPER(IF('SD Teacher''s Data'!A22=\"\",\"\",'SD Teacher''s Data'!A22))","v":""},{"$f":"PROPER(IF('SD Teacher''s Data'!F22=\"\",\"\",'SD Teacher''s Data'!F22))","v":""},{"$f":"IF('SD Teacher''s Data'!E22=\"\",\"\",'SD Teacher''s Data'!E22)","v":""},{"$f":"IF('SD Teacher''s Data'!K22=\"\",\"\",'SD Teacher''s Data'!K22)","v":""},{"$f":"IF('SD Teacher''s Data'!B22=\"\",\"\",'SD Teacher''s Data'!B22)","v":""},{"$nulls":5},{"$f":"IF('SD Teacher''s Data'!J22=\"\",\"\",'SD Teacher''s Data'!J22)","v":""}]
[{"$f":"IF(Table1[[#This Row],[नाम]]=\"\",\"\",ROWS($A$1:A22))","v":""},{"$f":"PROPER(IF('SD Teacher''s Data'!A23=\"\",\"\",'SD Teacher''s Data'!A23))","v":""},{"$f":"PROPER(IF('SD Teacher''s Data'!F23=\"\",\"\",'SD Teacher''s Data'!F23))","v":""},{"$f":"IF('SD Teacher''s Data'!E23=\"\",\"\",'SD Teacher''s Data'!E23)","v":""},{"$f":"IF('SD Teacher''s Data'!K23=\"\",\"\",'SD Teacher''s Data'!K23)","v":""},{"$f":"IF('SD Teacher''s Data'!B23=\"\",\"\",'SD Teacher''s Data'!B23)","v":""},{"$nulls":5},{"$f":"IF('SD Teacher''s Data'!J23=\"\",\"\",'SD Teacher''s Data'!J23)","v":""}]
[{"$f":"IF(Table1[[#This Row],[नाम]]=\"\",\"\",ROWS($A$1:A23))","v":""},{"$f":"PROPER(IF('SD Teacher''s Data'!A24=\"\",\"\",'SD Teacher''s Data'!A24))","v":""},{"$f":"PROPER(IF('SD Teacher''s Data'!F24=\"\",\"\",'SD Teacher''s Data'!F24))","v":""},{"$f":"IF('SD Teacher''s Data'!E24=\"\",\"\",'SD Teacher''s Data'!E24)","v":""},{"$f":"IF('SD Teacher''s Data'!K24=\"\",\"\",'SD Teacher''s Data'!K24)","v":""},{"$f":"IF('SD Teacher''s Data'!B24=\"\",\"\",'SD Teacher''s Data'!B24)","v":""},{"$nulls":5},{"$f":"IF('SD Teacher''s Data'!J24=\"\",\"\",'SD Teacher''s Data'!J24)","v":""}]
[{"$f":"IF(Table1[[#This Row],[नाम]]=\"\",\"\",ROWS($A$1:A24))","v":""},{"$f":"PROPER(IF('SD Teacher''s Data'!A25=\"\",\"\",'SD Teacher''s Data'!A25))","v":""},{"$f":"PROPER(IF('SD Teacher''s Data'!F25=\"\",\"\",'SD Teacher''s Data'!F25))","v":""},{"$f":"IF('SD Teacher''s Data'!E25=\"\",\"\",'SD Teacher''s Data'!E25)","v":""},{"$f":"IF('SD Teacher''s Data'!K25=\"\",\"\",'SD Teacher''s Data'!K25)","v":""},{"$f":"IF('SD Teacher''s Data'!B25=\"\",\"\",'SD Teacher''s Data'!B25)","v":""},{"$nulls":5},{"$f":"IF('SD Teacher''s Data'!J25=\"\",\"\",'SD Teacher''s Data'!J25)","v":""}]
[{"$f":"IF(Table1[[#This Row],[नाम]]=\"\",\"\",ROWS($A$1:A25))","v":""},{"$f":"PROPER(IF('SD Teacher''s Data'!A26=\"\",\"\",'SD Teacher''s Data'!A26))","v":""},{"$f":"PROPER(IF('SD Teacher''s Data'!F26=\"\",\"\",'SD Teacher''s Data'!F26))","v":""},{"$f":"IF('SD Teacher''s Data'!E26=\"\",\"\",'SD Teacher''s Data'!E26)","v":""},{"$f":"IF('SD Teacher''s Data'!K26=\"\",\"\",'SD Teacher''s Data'!K26)","v":""},{"$f":"IF('SD Teacher''s Data'!B26=\"\",\"\",'SD Teacher''s Data'!B26)","v":""},{"$nulls":5},{"$f":"IF('SD Teacher''s Data'!J26=\"\",\"\",'SD Teacher''s Data'!J26)","v":""}]
[{"$f":"IF(Table1[[#This Row],[नाम]]=\"\",\"\",ROWS($A$1:A26))","v":""},{"$f":"PROPER(IF('SD Teacher''s Data'!A27=\"\",\"\",'SD Teacher''s Data'!A27))","v":""},{"$f":"PROPER(IF('SD Teacher''s Data'!F27=\"\",\"\",'SD Teacher''s Data'!F27))","v":""},{"$f":"IF('SD Teacher''s Data'!E27=\"\",\"\",'SD Teacher''s Data'!E27)","v":""},{"$f":"IF('SD Teacher''s Data'!K27=\"\",\"\",'SD Teacher''s Data'!K27)","v":""},{"$f":"IF('SD Teacher''s Data'!B27=\"\",\"\",'SD Teacher''s Data'!B27)","v":""},{"$nulls":5},{"$f":"IF('SD Teacher''s Data'!J27=\"\",\"\",'SD Teacher''s Data'!J27)","v":""}]
[{"$f":"IF(Table1[[#This Row],[नाम]]=\"\",\"\",ROWS($A$1:A27))","v":""},{"$f":"PROPER(IF('SD Teacher''s Data'!A28=\"\",\"\",'SD Teacher''s Data'!A28))","v":""},{"$f":"PROPER(IF('SD Teacher''s Data'!F28=\"\",\"\",'SD Teacher''s Data'!F28))","v":""},{"$f":"IF('SD Teacher''s Data'!E28=\"\",\"\",'SD Teacher''s Data'!E28)","v":""},{"$f":"IF('SD Teacher''s Data'!K28=\"\",\"\",'SD Teacher''s Data'!K28)","v":""},{"$f":"IF('SD Teacher''s Data'!B28=\"\",\"\",'SD Teacher''s Data'!B28)","v":""},{"$nulls":5},{"$f":"IF('SD Teacher''s Data'!J28=\"\",\"\",'SD Teacher''s Data'!J28)","v":""}]
[{"$f":"IF(Table1[[#This Row],[नाम]]=\"\",\"\",ROWS($A$1:A28))","v":""},{"$f":"PROPER(IF('SD Teacher''s Data'!A29=\"\",\"\",'SD Teacher''s Data'!A29))","v":""},{"$f":"PROPER(IF('SD Teacher''s Data'!F29=\"\",\"\",'SD Teacher''s Data'!F29))","v":""},{"$f":"IF('SD Teacher''s Data'!E29=\"\",\"\",'SD Teacher''s Data'!E29)","v":""},{"$f":"IF('SD Teacher''s Data'!K29=\"\",\"\",'SD Teacher''s Data'!K29)","v":""},{"$f":"IF('SD Teacher''s Data'!B29=\"\",\"\",'SD Teacher''s Data'!B29)","v":""},{"$nulls":5},{"$f":"IF('SD Teacher''s Data'!J29=\"\",\"\",'SD Teacher''s Data'!J29)","v":""}]
[{"$f":"IF(Table1[[#This Row],[नाम]]=\"\",\"\",ROWS($A$1:A29))","v":""},{"$f":"PROPER(IF('SD Teacher''s Data'!A30=\"\",\"\",'SD Teacher''s Data'!A30))","v":""},{"$f":"PROPER(IF('SD Teacher''s Data'!F30=\"\",\"\",'SD Teacher''s Data'!F30))","v":""},{"$f":"IF('SD Teacher''s Data'!E30=\"\",\"\",'SD Teacher''s Data'!E30)","v":""},{"$f":"IF('SD Teacher''s Data'!K30=\"\",\"\",'SD Teacher''s Data'!K30)","v":""},{"$f":"IF('SD Teacher''s Data'!B30=\"\",\"\",'SD Teacher''s Data'!B30)","v":""},{"$nulls":5},{"$f":"IF('SD Teacher''s Data'!J30=\"\",\"\",'SD Teacher''s Data'!J30)","v":""}]
[{"$f":"IF(Table1[[#This Row],[नाम]]=\"\",\"\",ROWS($A$1:A30))","v":""},{"$f":"PROPER(IF('SD Teacher''s Data'!A31=\"\",\"\",'SD Teacher''s Data'!A31))","v":""},{"$f":"PROPER(IF('SD Teacher''s Data'!F31=\"\",\"\",'SD Teacher''s Data'!F31))","v":""},{"$f":"IF('SD Teacher''s Data'!E31=\"\",\"\",'SD Teacher''s Data'!E31)","v":""},{"$f":"IF('SD Teacher''s Data'!K31=\"\",\"\",'SD Teacher''s Data'!K31)","v":""},{"$f":"IF('SD Teacher''s Data'!B31=\"\",\"\",'SD Teacher''s Data'!B31)","v":""},{"$nulls":5},{"$f":"IF('SD Teacher''s Data'!J31=\"\",\"\",'SD Teacher''s Data'!J31)","v":""}]
[{"$f":"IF(Table1[[#This Row],[नाम]]=\"\",\"\",ROWS($A$1:A31))","v":""},{"$f":"PROPER(IF('SD Teacher''s Data'!A32=\"\",\"\",'SD Teacher''s Data'!A32))","v":""},{"$f":"PROPER(IF('SD Teacher''s Data'!F32=\"\",\"\",'SD Teacher''s Data'!F32))","v":""},{"$f":"IF('SD Teacher''s Data'!E32=\"\",\"\",'SD Teacher''s Data'!E32)","v":""},{"$f":"IF('SD Teacher''s Data'!K32=\"\",\"\",'SD Teacher''s Data'!K32)","v":""},{"$f":"IF('SD Teacher''s Data'!B32=\"\",\"\",'SD Teacher''s Data'!B32)","v":""},{"$nulls":5},{"$f":"IF('SD Teacher''s Data'!J32=\"\",\"\",'SD Teacher''s Data'!J32)","v":""}]
[{"$f":"IF(Table1[[#This Row],[नाम]]=\"\",\"\",ROWS($A$1:A32))","v":""},{"$f":"PROPER(IF('SD Teacher''s Data'!A33=\"\",\"\",'SD Teacher''s Data'!A33))","v":""},{"$f":"PROPER(IF('SD Teacher''s Data'!F33=\"\",\"\",'SD Teacher''s Data'!F33))","v":""},{"$f":"IF('SD Teacher''s Data'!E33=\"\",\"\",'SD Teacher''s Data'!E33)","v":""},{"$f":"IF('SD Teacher''s Data'!K33=\"\",\"\",'SD Teacher''s Data'!K33)","v":""},{"$f":"IF('SD Teacher''s Data'!B33=\"\",\"\",'SD Teacher''s Data'!B33)","v":""},{"$nulls":5},{"$f":"IF('SD Teacher''s Data'!J33=\"\",\"\",'SD Teacher''s Data'!J33)","v":""}]
[{"$f":"IF(Table1[[#This Row],[नाम]]=\"\",\"\",ROWS($A$1:A33))","v":""},{"$f":"PROPER(IF('SD Teacher''s Data'!A34=\"\",\"\",'SD Teacher''s Data'!A34))","v":""},{"$f":"PROPER(IF('SD Teacher''s Data'!F34=\"\",\"\",'SD Teacher''s Data'!F34))","v":""},{"$f":"IF('SD Teacher''s Data'!E34=\"\",\"\",'SD Teacher''s Data'!E34)","v":""},{"$f":"IF('SD Teacher''s Data'!K34=\"\",\"\",'SD Teacher''s Data'!K34)","v":""},{"$f":"IF('SD Teacher''s Data'!B34=\"\",\"\",'SD Teacher''s Data'!B34)","v":""},{"$nulls":5},{"$f":"IF('SD Teacher''s Data'!J34=\"\",\"\",'SD Teacher''s Data'!J34)","v":""}]
[{"$f":"IF(Table1[[#This Row],[नाम]]=\"\",\"\",ROWS($A$1:A34))","v":""},{"$f":"PROPER(IF('SD Teacher''s Data'!A35=\"\",\"\",'SD Teacher''s Data'!A35))","v":""},{"$f":"PROPER(IF('SD Teacher''s Data'!F35=\"\",\"\",'SD Teacher''s Data'!F35))","v":""},{"$f":"IF('SD Teacher''s Data'!E35=\"\",\"\",'SD Teacher''s Data'!E35)","v":""},{"$f":"IF('SD Teacher''s Data'!K35=\"\",\"\",'SD Teacher''s Data'!K35)","v":""},{"$f":"IF('SD Teacher''s Data'!B35=\"\",\"\",'SD Teacher''s Data'!B35)","v":""},{"$nulls":5},{"$f":"IF('SD Teacher''s Data'!J35=\"\",\"\",'SD Teacher''s Data'!J35)","v":""}]
[{"$f":"IF(Table1[[#This Row],[नाम]]=\"\",\"\",ROWS($A$1:A35))","v":""},{"$f":"PROPER(IF('SD Teacher''s Data'!A36=\"\",\"\",'SD Teacher''s Data'!A36))","v":""},{"$f":"PROPER(IF('SD Teacher''s Data'!F36=\"\",\"\",'SD Teacher''s Data'!F36))","v":""},{"$f":"IF('SD Teacher''s Data'!E36=\"\",\"\",'SD Teacher''s Data'!E36)","v":""},{"$f":"IF('SD Teacher''s Data'!K36=\"\",\"\",'SD Teacher''s Data'!K36)","v":""},{"$f":"IF('SD Teacher''s Data'!B36=\"\",\"\",'SD Teacher''s Data'!B36)","v":""},{"$nulls":5},{"$f":"IF('SD Teacher''s Data'!J36=\"\",\"\",'SD Teacher''s Data'!J36)","v":""}]
[{"$f":"IF(Table1[[#This Row],[नाम]]=\"\",\"\",ROWS($A$1:A36))","v":""},{"$f":"PROPER(IF('SD Teacher''s Data'!A37=\"\",\"\",'SD Teacher''s Data'!A37))","v":""},{"$f":"PROPER(IF('SD Teacher''s Data'!F37=\"\",\"\",'SD Teacher''s Data'!F37))","v":""},{"$f":"IF('SD Teacher''s Data'!E37=\"\",\"\",'SD Teacher''s Data'!E37)","v":""},{"$f":"IF('SD Teacher''s Data'!K37=\"\",\"\",'SD Teacher''s Data'!K37)","v":""},{"$f":"IF('SD Teacher''s Data'!B37=\"\",\"\",'SD Teacher''s Data'!B37)","v":""},{"$nulls":5},{"$f":"IF('SD Teacher''s Data'!J37=\"\",\"\",'SD Teacher''s Data'!J37)","v":""}]
[{"$f":"IF(Table1[[#This Row],[नाम]]=\"\",\"\",ROWS($A$1:A37))","v":""},{"$f":"PROPER(IF('SD Teacher''s Data'!A38=\"\",\"\",'SD Teacher''s Data'!A38))","v":""},{"$f":"PROPER(IF('SD Teacher''s Data'!F38=\"\",\"\",'SD Teacher''s Data'!F38))","v":""},{"$f":"IF('SD Teacher''s Data'!E38=\"\",\"\",'SD Teacher''s Data'!E38)","v":""},{"$f":"IF('SD Teacher''s Data'!K38=\"\",\"\",'SD Teacher''s Data'!K38)","v":""},{"$f":"IF('SD Teacher''s Data'!B38=\"\",\"\",'SD Teacher''s Data'!B38)","v":""},{"$nulls":5},{"$f":"IF('SD Teacher''s Data'!J38=\"\",\"\",'SD Teacher''s Data'!J38)","v":""}]
[{"$f":"IF(Table1[[#This Row],[नाम]]=\"\",\"\",ROWS($A$1:A38))","v":""},{"$f":"PROPER(IF('SD Teacher''s Data'!A39=\"\",\"\",'SD Teacher''s Data'!A39))","v":""},{"$f":"PROPER(IF('SD Teacher''s Data'!F39=\"\",\"\",'SD Teacher''s Data'!F39))","v":""},{"$f":"IF('SD Teacher''s Data'!E39=\"\",\"\",'SD Teacher''s Data'!E39)","v":""},{"$f":"IF('SD Teacher''s Data'!K39=\"\",\"\",'SD Teacher''s Data'!K39)","v":""},{"$f":"IF('SD Teacher''s Data'!B39=\"\",\"\",'SD Teacher''s Data'!B39)","v":""},{"$nulls":5},{"$f":"IF('SD Teacher''s Data'!J39=\"\",\"\",'SD Teacher''s Data'!J39)","v":""}]
[{"$f":"IF(Table1[[#This Row],[नाम]]=\"\",\"\",ROWS($A$1:A39))","v":""},{"$f":"PROPER(IF('SD Teacher''s Data'!A40=\"\",\"\",'SD Teacher''s Data'!A40))","v":""},{"$f":"PROPER(IF('SD Teacher''s Data'!F40=\"\",\"\",'SD Teacher''s Data'!F40))","v":""},{"$f":"IF('SD Teacher''s Data'!E40=\"\",\"\",'SD Teacher''s Data'!E40)","v":""},{"$f":"IF('SD Teacher''s Data'!K40=\"\",\"\",'SD Teacher''s Data'!K40)","v":""},{"$f":"IF('SD Teacher''s Data'!B40=\"\",\"\",'SD Teacher''s Data'!B40)","v":""},{"$nulls":5},{"$f":"IF('SD Teacher''s Data'!J40=\"\",\"\",'SD Teacher''s Data'!J40)","v":""}]
[{"$f":"IF(Table1[[#This Row],[नाम]]=\"\",\"\",ROWS($A$1:A40))","v":""},{"$f":"PROPER(IF('SD Teacher''s Data'!A41=\"\",\"\",'SD Teacher''s Data'!A41))","v":""},{"$f":"PROPER(IF('SD Teacher''s Data'!F41=\"\",\"\",'SD Teacher''s Data'!F41))","v":""},{"$f":"IF('SD Teacher''s Data'!E41=\"\",\"\",'SD Teacher''s Data'!E41)","v":""},{"$f":"IF('SD Teacher''s Data'!K41=\"\",\"\",'SD Teacher''s Data'!K41)","v":""},{"$f":"IF('SD Teacher''s Data'!B41=\"\",\"\",'SD Teacher''s Data'!B41)","v":""},{"$nulls":5},{"$f":"IF('SD Teacher''s Data'!J41=\"\",\"\",'SD Teacher''s Data'!J41)","v":""}]
[{"$f":"IF(Table1[[#This Row],[नाम]]=\"\",\"\",ROWS($A$1:A41))","v":""},{"$f":"PROPER(IF('SD Teacher''s Data'!A42=\"\",\"\",'SD Teacher''s Data'!A42))","v":""},{"$f":"PROPER(IF('SD Teacher''s Data'!F42=\"\",\"\",'SD Teacher''s Data'!F42))","v":""},{"$f":"IF('SD Teacher''s Data'!E42=\"\",\"\",'SD Teacher''s Data'!E42)","v":""},{"$f":"IF('SD Teacher''s Data'!K42=\"\",\"\",'SD Teacher''s Data'!K42)","v":""},{"$f":"IF('SD Teacher''s Data'!B42=\"\",\"\",'SD Teacher''s Data'!B42)","v":""},{"$nulls":5},{"$f":"IF('SD Teacher''s Data'!J42=\"\",\"\",'SD Teacher''s Data'!J42)","v":""}]
[{"$f":"IF(Table1[[#This Row],[नाम]]=\"\",\"\",ROWS($A$1:A42))","v":""},{"$f":"PROPER(IF('SD Teacher''s Data'!A43=\"\",\"\",'SD Teacher''s Data'!A43))","v":""},{"$f":"PROPER(IF('SD Teacher''s Data'!F43=\"\",\"\",'SD Teacher''s Data'!F43))","v":""},{"$f":"IF('SD Teacher''s Data'!E43=\"\",\"\",'SD Teacher''s Data'!E43)","v":""},{"$f":"IF('SD Teacher''s Data'!K43=\"\",\"\",'SD Teacher''s Data'!K43)","v":""},{"$f":"IF('SD Teacher''s Data'!B43=\"\",\"\",'SD Teacher''s Data'!B43)","v":""},{"$nulls":5},{"$f":"IF('SD Teacher''s Data'!J43=\"\",\"\",'SD Teacher''s Data'!J43)","v":""}]
[{"$f":"IF(Table1[[#This Row],[नाम]]=\"\",\"\",ROWS($A$1:A43))","v":""},{"$f":"PROPER(IF('SD Teacher''s Data'!A44=\"\",\"\",'SD Teacher''s Data'!A44))","v":""},{"$f":"PROPER(IF('SD Teacher''s Data'!F44=\"\",\"\",'SD Teacher''s Data'!F44))","v":""},{"$f":"IF('SD Teacher''s Data'!E44=\"\",\"\",'SD Teacher''s Data'!E44)","v":""},{"$f":"IF('SD Teacher''s Data'!K44=\"\",\"\",'SD Teacher''s Data'!K44)","v":""},{"$f":"IF('SD Teacher''s Data'!B44=\"\",\"\",'SD Teacher''s Data'!B44)","v":""},{"$nulls":5},{"$f":"IF('SD Teacher''s Data'!J44=\"\",\"\",'SD Teacher''s Data'!J44)","v":""}]
[{"$f":"IF(Table1[[#This Row],[नाम]]=\"\",\"\",ROWS($A$1:A44))","v":""},{"$f":"PROPER(IF('SD Teacher''s Data'!A45=\"\",\"\",'SD Teacher''s Data'!A45))","v":""},{"$f":"PROPER(IF('SD Teacher''s Data'!F45=\"\",\"\",'SD Teacher''s Data'!F45))","v":""},{"$f":"IF('SD Teacher''s Data'!E45=\"\",\"\",'SD Teacher''s Data'!E45)","v":""},{"$f":"IF('SD Teacher''s Data'!K45=\"\",\"\",'SD Teacher''s Data'!K45)","v":""},{"$f":"IF('SD Teacher''s Data'!B45=\"\",\"\",'SD Teacher''s Data'!B45)","v":""},{"$nulls":5},{"$f":"IF('SD Teacher''s Data'!J45=\"\",\"\",'SD Teacher''s Data'!J45)","v":""}]
[{"$f":"IF(Table1[[#This Row],[नाम]]=\"\",\"\",ROWS($A$1:A45))","v":""},{"$f":"PROPER(IF('SD Teacher''s Data'!A46=\"\",\"\",'SD Teacher''s Data'!A46))","v":""},{"$f":"PROPER(IF('SD Teacher''s Data'!F46=\"\",\"\",'SD Teacher''s Data'!F46))","v":""},{"$f":"IF('SD Teacher''s Data'!E46=\"\",\"\",'SD Teacher''s Data'!E46)","v":""},{"$f":"IF('SD Teacher''s Data'!K46=\"\",\"\",'SD Teacher''s Data'!K46)","v":""},{"$f":"IF('SD Teacher''s Data'!B46=\"\",\"\",'SD Teacher''s Data'!B46)","v":""},{"$nulls":5},{"$f":"IF('SD Teacher''s Data'!J46=\"\",\"\",'SD Teacher''s Data'!J46)","v":""}]
[{"$f":"IF(Table1[[#This Row],[नाम]]=\"\",\"\",ROWS($A$1:A46))","v":""},{"$f":"PROPER(IF('SD Teacher''s Data'!A47=\"\",\"\",'SD Teacher''s Data'!A47))","v":""},{"$f":"PROPER(IF('SD Teacher''s Data'!F47=\"\",\"\",'SD Teacher''s Data'!F47))","v":""},{"$f":"IF('SD Teacher''s Data'!E47=\"\",\"\",'SD Teacher''s Data'!E47)","v":""},{"$f":"IF('SD Teacher''s Data'!K47=\"\",\"\",'SD Teacher''s Data'!K47)","v":""},{"$f":"IF('SD Teacher''s Data'!B47=\"\",\"\",'SD Teacher''s Data'!B47)","v":""},{"$nulls":5},{"$f":"IF('SD Teacher''s Data'!J47=\"\",\"\",'SD Teacher''s Data'!J47)","v":""}]
[{"$f":"IF(Table1[[#This Row],[नाम]]=\"\",\"\",ROWS($A$1:A47))","v":""},{"$f":"PROPER(IF('SD Teacher''s Data'!A48=\"\",\"\",'SD Teacher''s Data'!A48))","v":""},{"$f":"PROPER(IF('SD Teacher''s Data'!F48=\"\",\"\",'SD Teacher''s Data'!F48))","v":""},{"$f":"IF('SD Teacher''s Data'!E48=\"\",\"\",'SD Teacher''s Data'!E48)","v":""},{"$f":"IF('SD Teacher''s Data'!K48=\"\",\"\",'SD Teacher''s Data'!K48)","v":""},{"$f":"IF('SD Teacher''s Data'!B48=\"\",\"\",'SD Teacher''s Data'!B48)","v":""},{"$nulls":5},{"$f":"IF('SD Teacher''s Data'!J48=\"\",\"\",'SD Teacher''s Data'!J48)","v":""}]
[{"$f":"IF(Table1[[#This Row],[नाम]]=\"\",\"\",ROWS($A$1:A48))","v":""},{"$f":"PROPER(IF('SD Teacher''s Data'!A49=\"\",\"\",'SD Teacher''s Data'!A49))","v":""},{"$f":"PROPER(IF('SD Teacher''s Data'!F49=\"\",\"\",'SD Teacher''s Data'!F49))","v":""},{"$f":"IF('SD Teacher''s Data'!E49=\"\",\"\",'SD Teacher''s Data'!E49)","v":""},{"$f":"IF('SD Teacher''s Data'!K49=\"\",\"\",'SD Teacher''s Data'!K49)","v":""},{"$f":"IF('SD Teacher''s Data'!B49=\"\",\"\",'SD Teacher''s Data'!B49)","v":""},{"$nulls":5},{"$f":"IF('SD Teacher''s Data'!J49=\"\",\"\",'SD Teacher''s Data'!J49)","v":""}]
[{"$f":"IF(Table1[[#This Row],[नाम]]=\"\",\"\",ROWS($A$1:A49))","v":""},{"$f":"PROPER(IF('SD Teacher''s Data'!A50=\"\",\"\",'SD Teacher''s Data'!A50))","v":""},{"$f":"PROPER(IF('SD Teacher''s Data'!F50=\"\",\"\",'SD Teacher''s Data'!F50))","v":""},{"$f":"IF('SD Teacher''s Data'!E50=\"\",\"\",'SD Teacher''s Data'!E50)","v":""},{"$f":"IF('SD Teacher''s Data'!K50=\"\",\"\",'SD Teacher''s Data'!K50)","v":""},{"$f":"IF('SD Teacher''s Data'!B50=\"\",\"\",'SD Teacher''s Data'!B50)","v":""},{"$nulls":5},{"$f":"IF('SD Teacher''s Data'!J50=\"\",\"\",'SD Teacher''s Data'!J50)","v":""}]
[{"$f":"IF(Table1[[#This Row],[नाम]]=\"\",\"\",ROWS($A$1:A50))","v":""},{"$f":"PROPER(IF('SD Teacher''s Data'!A51=\"\",\"\",'SD Teacher''s Data'!A51))","v":""},{"$f":"PROPER(IF('SD Teacher''s Data'!F51=\"\",\"\",'SD Teacher''s Data'!F51))","v":""},{"$f":"IF('SD Teacher''s Data'!E51=\"\",\"\",'SD Teacher''s Data'!E51)","v":""},{"$f":"IF('SD Teacher''s Data'!K51=\"\",\"\",'SD Teacher''s Data'!K51)","v":""},{"$f":"IF('SD Teacher''s Data'!B51=\"\",\"\",'SD Teacher''s Data'!B51)","v":""},{"$nulls":5},{"$f":"IF('SD Teacher''s Data'!J51=\"\",\"\",'SD Teacher''s Data'!J51)","v":""}]
[{"$f":"IF(Table1[[#This Row],[नाम]]=\"\",\"\",ROWS($A$1:A51))","v":""},{"$f":"PROPER(IF('SD Teacher''s Data'!A52=\"\",\"\",'SD Teacher''s Data'!A52))","v":""},{"$f":"PROPER(IF('SD Teacher''s Data'!F52=\"\",\"\",'SD Teacher''s Data'!F52))","v":""},{"$f":"IF('SD Teacher''s Data'!E52=\"\",\"\",'SD Teacher''s Data'!E52)","v":""},{"$f":"IF('SD Teacher''s Data'!K52=\"\",\"\",'SD Teacher''s Data'!K52)","v":""},{"$f":"IF('SD Teacher''s Data'!B52=\"\",\"\",'SD Teacher''s Data'!B52)","v":""},{"$nulls":5},{"$f":"IF('SD Teacher''s Data'!J52=\"\",\"\",'SD Teacher''s Data'!J52)","v":""}]
[{"$f":"IF(Table1[[#This Row],[नाम]]=\"\",\"\",ROWS($A$1:A52))","v":""},{"$f":"PROPER(IF('SD Teacher''s Data'!A53=\"\",\"\",'SD Teacher''s Data'!A53))","v":""},{"$f":"PROPER(IF('SD Teacher''s Data'!F53=\"\",\"\",'SD Teacher''s Data'!F53))","v":""},{"$f":"IF('SD Teacher''s Data'!E53=\"\",\"\",'SD Teacher''s Data'!E53)","v":""},{"$f":"IF('SD Teacher''s Data'!K53=\"\",\"\",'SD Teacher''s Data'!K53)","v":""},{"$f":"IF('SD Teacher''s Data'!B53=\"\",\"\",'SD Teacher''s Data'!B53)","v":""},{"$nulls":5},{"$f":"IF('SD Teacher''s Data'!J53=\"\",\"\",'SD Teacher''s Data'!J53)","v":""}]
[{"$f":"IF(Table1[[#This Row],[नाम]]=\"\",\"\",ROWS($A$1:A53))","v":""},{"$f":"PROPER(IF('SD Teacher''s Data'!A54=\"\",\"\",'SD Teacher''s Data'!A54))","v":""},{"$f":"PROPER(IF('SD Teacher''s Data'!F54=\"\",\"\",'SD Teacher''s Data'!F54))","v":""},{"$f":"IF('SD Teacher''s Data'!E54=\"\",\"\",'SD Teacher''s Data'!E54)","v":""},{"$f":"IF('SD Teacher''s Data'!K54=\"\",\"\",'SD Teacher''s Data'!K54)","v":""},{"$f":"IF('SD Teacher''s Data'!B54=\"\",\"\",'SD Teacher''s Data'!B54)","v":""},{"$nulls":5},{"$f":"IF('SD Teacher''s Data'!J54=\"\",\"\",'SD Teacher''s Data'!J54)","v":""}]
[{"$f":"IF(Table1[[#This Row],[नाम]]=\"\",\"\",ROWS($A$1:A54))","v":""},{"$f":"PROPER(IF('SD Teacher''s Data'!A55=\"\",\"\",'SD Teacher''s Data'!A55))","v":""},{"$f":"PROPER(IF('SD Teacher''s Data'!F55=\"\",\"\",'SD Teacher''s Data'!F55))","v":""},{"$f":"IF('SD Teacher''s Data'!E55=\"\",\"\",'SD Teacher''s Data'!E55)","v":""},{"$f":"IF('SD Teacher''s Data'!K55=\"\",\"\",'SD Teacher''s Data'!K55)","v":""},{"$f":"IF('SD Teacher''s Data'!B55=\"\",\"\",'SD Teacher''s Data'!B55)","v":""},{"$nulls":5},{"$f":"IF('SD Teacher''s Data'!J55=\"\",\"\",'SD Teacher''s Data'!J55)","v":""}]
[{"$f":"IF(Table1[[#This Row],[नाम]]=\"\",\"\",ROWS($A$1:A55))","v":""},{"$f":"PROPER(IF('SD Teacher''s Data'!A56=\"\",\"\",'SD Teacher''s Data'!A56))","v":""},{"$f":"PROPER(IF('SD Teacher''s Data'!F56=\"\",\"\",'SD Teacher''s Data'!F56))","v":""},{"$f":"IF('SD Teacher''s Data'!E56=\"\",\"\",'SD Teacher''s Data'!E56)","v":""},{"$f":"IF('SD Teacher''s Data'!K56=\"\",\"\",'SD Teacher''s Data'!K56)","v":""},{"$f":"IF('SD Teacher''s Data'!B56=\"\",\"\",'SD Teacher''s Data'!B56)","v":""},{"$nulls":5},{"$f":"IF('SD Teacher''s Data'!J56=\"\",\"\",'SD Teacher''s Data'!J56)","v":""}]
[{"$f":"IF(Table1[[#This Row],[नाम]]=\"\",\"\",ROWS($A$1:A56))","v":""},{"$f":"PROPER(IF('SD Teacher''s Data'!A57=\"\",\"\",'SD Teacher''s Data'!A57))","v":""},{"$f":"PROPER(IF('SD Teacher''s Data'!F57=\"\",\"\",'SD Teacher''s Data'!F57))","v":""},{"$f":"IF('SD Teacher''s Data'!E57=\"\",\"\",'SD Teacher''s Data'!E57)","v":""},{"$f":"IF('SD Teacher''s Data'!K57=\"\",\"\",'SD Teacher''s Data'!K57)","v":""},{"$f":"IF('SD Teacher''s Data'!B57=\"\",\"\",'SD Teacher''s Data'!B57)","v":""},{"$nulls":5},{"$f":"IF('SD Teacher''s Data'!J57=\"\",\"\",'SD Teacher''s Data'!J57)","v":""}]
[{"$f":"IF(Table1[[#This Row],[नाम]]=\"\",\"\",ROWS($A$1:A57))","v":""},{"$f":"PROPER(IF('SD Teacher''s Data'!A58=\"\",\"\",'SD Teacher''s Data'!A58))","v":""},{"$f":"PROPER(IF('SD Teacher''s Data'!F58=\"\",\"\",'SD Teacher''s Data'!F58))","v":""},{"$f":"IF('SD Teacher''s Data'!E58=\"\",\"\",'SD Teacher''s Data'!E58)","v":""},{"$f":"IF('SD Teacher''s Data'!K58=\"\",\"\",'SD Teacher''s Data'!K58)","v":""},{"$f":"IF('SD Teacher''s Data'!B58=\"\",\"\",'SD Teacher''s Data'!B58)","v":""},{"$nulls":5},{"$f":"IF('SD Teacher''s Data'!J58=\"\",\"\",'SD Teacher''s Data'!J58)","v":""}]
[{"$f":"IF(Table1[[#This Row],[नाम]]=\"\",\"\",ROWS($A$1:A58))","v":""},{"$f":"PROPER(IF('SD Teacher''s Data'!A59=\"\",\"\",'SD Teacher''s Data'!A59))","v":""},{"$f":"PROPER(IF('SD Teacher''s Data'!F59=\"\",\"\",'SD Teacher''s Data'!F59))","v":""},{"$f":"IF('SD Teacher''s Data'!E59=\"\",\"\",'SD Teacher''s Data'!E59)","v":""},{"$f":"IF('SD Teacher''s Data'!K59=\"\",\"\",'SD Teacher''s Data'!K59)","v":""},{"$f":"IF('SD Teacher''s Data'!B59=\"\",\"\",'SD Teacher''s Data'!B59)","v":""},{"$nulls":5},{"$f":"IF('SD Teacher''s Data'!J59=\"\",\"\",'SD Teacher''s Data'!J59)","v":""}]
[{"$f":"IF(Table1[[#This Row],[नाम]]=\"\",\"\",ROWS($A$1:A59))","v":""},{"$f":"PROPER(IF('SD Teacher''s Data'!A60=\"\",\"\",'SD Teacher''s Data'!A60))","v":""},{"$f":"PROPER(IF('SD Teacher''s Data'!F60=\"\",\"\",'SD Teacher''s Data'!F60))","v":""},{"$f":"IF('SD Teacher''s Data'!E60=\"\",\"\",'SD Teacher''s Data'!E60)","v":""},{"$f":"IF('SD Teacher''s Data'!K60=\"\",\"\",'SD Teacher''s Data'!K60)","v":""},{"$f":"IF('SD Teacher''s Data'!B60=\"\",\"\",'SD Teacher''s Data'!B60)","v":""},{"$nulls":5},{"$f":"IF('SD Teacher''s Data'!J60=\"\",\"\",'SD Teacher''s Data'!J60)","v":""}]
[{"$f":"IF(Table1[[#This Row],[नाम]]=\"\",\"\",ROWS($A$1:A60))","v":""},{"$f":"PROPER(IF('SD Teacher''s Data'!A61=\"\",\"\",'SD Teacher''s Data'!A61))","v":""},{"$f":"PROPER(IF('SD Teacher''s Data'!F61=\"\",\"\",'SD Teacher''s Data'!F61))","v":""},{"$f":"IF('SD Teacher''s Data'!E61=\"\",\"\",'SD Teacher''s Data'!E61)","v":""},{"$f":"IF('SD Teacher''s Data'!K61=\"\",\"\",'SD Teacher''s Data'!K61)","v":""},{"$f":"IF('SD Teacher''s Data'!B61=\"\",\"\",'SD Teacher''s Data'!B61)","v":""},{"$nulls":5},{"$f":"IF('SD Teacher''s Data'!J61=\"\",\"\",'SD Teacher''s Data'!J61)","v":""}]
[{"$f":"IF(Table1[[#This Row],[नाम]]=\"\",\"\",ROWS($A$1:A61))","v":""},{"$f":"PROPER(IF('SD Teacher''s Data'!A62=\"\",\"\",'SD Teacher''s Data'!A62))","v":""},{"$f":"PROPER(IF('SD Teacher''s Data'!F62=\"\",\"\",'SD Teacher''s Data'!F62))","v":""},{"$f":"IF('SD Teacher''s Data'!E62=\"\",\"\",'SD Teacher''s Data'!E62)","v":""},{"$f":"IF('SD Teacher''s Data'!K62=\"\",\"\",'SD Teacher''s Data'!K62)","v":""},{"$f":"IF('SD Teacher''s Data'!B62=\"\",\"\",'SD Teacher''s Data'!B62)","v":""},{"$nulls":5},{"$f":"IF('SD Teacher''s Data'!J62=\"\",\"\",'SD Teacher''s Data'!J62)","v":""}]
[{"$f":"IF(Table1[[#This Row],[नाम]]=\"\",\"\",ROWS($A$1:A62))","v":""},{"$f":"PROPER(IF('SD Teacher''s Data'!A63=\"\",\"\",'SD Teacher''s Data'!A63))","v":""},{"$f":"PROPER(IF('SD Teacher''s Data'!F63=\"\",\"\",'SD Teacher''s Data'!F63))","v":""},{"$f":"IF('SD Teacher''s Data'!E63=\"\",\"\",'SD Teacher''s Data'!E63)","v":""},{"$f":"IF('SD Teacher''s Data'!K63=\"\",\"\",'SD Teacher''s Data'!K63)","v":""},{"$f":"IF('SD Teacher''s Data'!B63=\"\",\"\",'SD Teacher''s Data'!B63)","v":""},{"$nulls":5},{"$f":"IF('SD Teacher''s Data'!J63=\"\",\"\",'SD Teacher''s Data'!J63)","v":""}]
[{"$f":"IF(Table1[[#This Row],[नाम]]=\"\",\"\",ROWS($A$1:A63))","v":""},{"$f":"PROPER(IF('SD Teacher''s Data'!A64=\"\",\"\",'SD Teacher''s Data'!A64))","v":""},{"$f":"PROPER(IF('SD Teacher''s Data'!F64=\"\",\"\",'SD Teacher''s Data'!F64))","v":""},{"$f":"IF('SD Teacher''s Data'!E64=\"\",\"\",'SD Teacher''s Data'!E64)","v":""},{"$f":"IF('SD Teacher''s Data'!K64=\"\",\"\",'SD Teacher''s Data'!K64)","v":""},{"$f":"IF('SD Teacher''s Data'!B64=\"\",\"\",'SD Teacher''s Data'!B64)","v":""},{"$nulls":5},{"$f":"IF('SD Teacher''s Data'!J64=\"\",\"\",'SD Teacher''s Data'!J64)","v":""}]
[{"$f":"IF(Table1[[#This Row],[नाम]]=\"\",\"\",ROWS($A$1:A64))","v":""},{"$f":"PROPER(IF('SD Teacher''s Data'!A65=\"\",\"\",'SD Teacher''s Data'!A65))","v":""},{"$f":"PROPER(IF('SD Teacher''s Data'!F65=\"\",\"\",'SD Teacher''s Data'!F65))","v":""},{"$f":"IF('SD Teacher''s Data'!E65=\"\",\"\",'SD Teacher''s Data'!E65)","v":""},{"$f":"IF('SD Teacher''s Data'!K65=\"\",\"\",'SD Teacher''s Data'!K65)","v":""},{"$f":"IF('SD Teacher''s Data'!B65=\"\",\"\",'SD Teacher''s Data'!B65)","v":""},{"$nulls":5},{"$f":"IF('SD Teacher''s Data'!J65=\"\",\"\",'SD Teacher''s Data'!J65)","v":""}]
[{"$f":"IF(Table1[[#This Row],[नाम]]=\"\",\"\",ROWS($A$1:A65))","v":""},{"$f":"PROPER(IF('SD Teacher''s Data'!A66=\"\",\"\",'SD Teacher''s Data'!A66))","v":""},{"$f":"PROPER(IF('SD Teacher''s Data'!F66=\"\",\"\",'SD Teacher''s Data'!F66))","v":""},{"$f":"IF('SD Teacher''s Data'!E66=\"\",\"\",'SD Teacher''s Data'!E66)","v":""},{"$f":"IF('SD Teacher''s Data'!K66=\"\",\"\",'SD Teacher''s Data'!K66)","v":""},{"$f":"IF('SD Teacher''s Data'!B66=\"\",\"\",'SD Teacher''s Data'!B66)","v":""},{"$nulls":5},{"$f":"IF('SD Teacher''s Data'!J66=\"\",\"\",'SD Teacher''s Data'!J66)","v":""}]
[{"$f":"IF(Table1[[#This Row],[नाम]]=\"\",\"\",ROWS($A$1:A66))","v":""},{"$f":"PROPER(IF('SD Teacher''s Data'!A67=\"\",\"\",'SD Teacher''s Data'!A67))","v":""},{"$f":"PROPER(IF('SD Teacher''s Data'!F67=\"\",\"\",'SD Teacher''s Data'!F67))","v":""},{"$f":"IF('SD Teacher''s Data'!E67=\"\",\"\",'SD Teacher''s Data'!E67)","v":""},{"$f":"IF('SD Teacher''s Data'!K67=\"\",\"\",'SD Teacher''s Data'!K67)","v":""},{"$f":"IF('SD Teacher''s Data'!B67=\"\",\"\",'SD Teacher''s Data'!B67)","v":""},{"$nulls":5},{"$f":"IF('SD Teacher''s Data'!J67=\"\",\"\",'SD Teacher''s Data'!J67)","v":""}]
[{"$f":"IF(Table1[[#This Row],[नाम]]=\"\",\"\",ROWS($A$1:A67))","v":""},{"$f":"PROPER(IF('SD Teacher''s Data'!A68=\"\",\"\",'SD Teacher''s Data'!A68))","v":""},{"$f":"PROPER(IF('SD Teacher''s Data'!F68=\"\",\"\",'SD Teacher''s Data'!F68))","v":""},{"$f":"IF('SD Teacher''s Data'!E68=\"\",\"\",'SD Teacher''s Data'!E68)","v":""},{"$f":"IF('SD Teacher''s Data'!K68=\"\",\"\",'SD Teacher''s Data'!K68)","v":""},{"$f":"IF('SD Teacher''s Data'!B68=\"\",\"\",'SD Teacher''s Data'!B68)","v":""},{"$nulls":5},{"$f":"IF('SD Teacher''s Data'!J68=\"\",\"\",'SD Teacher''s Data'!J68)","v":""}]
[{"$f":"IF(Table1[[#This Row],[नाम]]=\"\",\"\",ROWS($A$1:A68))","v":""},{"$f":"PROPER(IF('SD Teacher''s Data'!A69=\"\",\"\",'SD Teacher''s Data'!A69))","v":""},{"$f":"PROPER(IF('SD Teacher''s Data'!F69=\"\",\"\",'SD Teacher''s Data'!F69))","v":""},{"$f":"IF('SD Teacher''s Data'!E69=\"\",\"\",'SD Teacher''s Data'!E69)","v":""},{"$f":"IF('SD Teacher''s Data'!K69=\"\",\"\",'SD Teacher''s Data'!K69)","v":""},{"$f":"IF('SD Teacher''s Data'!B69=\"\",\"\",'SD Teacher''s Data'!B69)","v":""},{"$nulls":5},{"$f":"IF('SD Teacher''s Data'!J69=\"\",\"\",'SD Teacher''s Data'!J69)","v":""}]
[{"$f":"IF(Table1[[#This Row],[नाम]]=\"\",\"\",ROWS($A$1:A69))","v":""},{"$f":"PROPER(IF('SD Teacher''s Data'!A70=\"\",\"\",'SD Teacher''s Data'!A70))","v":""},{"$f":"PROPER(IF('SD Teacher''s Data'!F70=\"\",\"\",'SD Teacher''s Data'!F70))","v":""},{"$f":"IF('SD Teacher''s Data'!E70=\"\",\"\",'SD Teacher''s Data'!E70)","v":""},{"$f":"IF('SD Teacher''s Data'!K70=\"\",\"\",'SD Teacher''s Data'!K70)","v":""},{"$f":"IF('SD Teacher''s Data'!B70=\"\",\"\",'SD Teacher''s Data'!B70)","v":""},{"$nulls":5},{"$f":"IF('SD Teacher''s Data'!J70=\"\",\"\",'SD Teacher''s Data'!J70)","v":""}]
[{"$f":"IF(Table1[[#This Row],[नाम]]=\"\",\"\",ROWS($A$1:A70))","v":""},{"$f":"PROPER(IF('SD Teacher''s Data'!A71=\"\",\"\",'SD Teacher''s Data'!A71))","v":""},{"$f":"PROPER(IF('SD Teacher''s Data'!F71=\"\",\"\",'SD Teacher''s Data'!F71))","v":""},{"$f":"IF('SD Teacher''s Data'!E71=\"\",\"\",'SD Teacher''s Data'!E71)","v":""},{"$f":"IF('SD Teacher''s Data'!K71=\"\",\"\",'SD Teacher''s Data'!K71)","v":""},{"$f":"IF('SD Teacher''s Data'!B71=\"\",\"\",'SD Teacher''s Data'!B71)","v":""},{"$nulls":5},{"$f":"IF('SD Teacher''s Data'!J71=\"\",\"\",'SD Teacher''s Data'!J71)","v":""}]
[{"$f":"IF(Table1[[#This Row],[नाम]]=\"\",\"\",ROWS($A$1:A71))","v":""},{"$f":"PROPER(IF('SD Teacher''s Data'!A72=\"\",\"\",'SD Teacher''s Data'!A72))","v":""},{"$f":"PROPER(IF('SD Teacher''s Data'!F72=\"\",\"\",'SD Teacher''s Data'!F72))","v":""},{"$f":"IF('SD Teacher''s Data'!E72=\"\",\"\",'SD Teacher''s Data'!E72)","v":""},{"$f":"IF('SD Teacher''s Data'!K72=\"\",\"\",'SD Teacher''s Data'!K72)","v":""},{"$f":"IF('SD Teacher''s Data'!B72=\"\",\"\",'SD Teacher''s Data'!B72)","v":""},{"$nulls":5},{"$f":"IF('SD Teacher''s Data'!J72=\"\",\"\",'SD Teacher''s Data'!J72)","v":""}]
[{"$f":"IF(Table1[[#This Row],[नाम]]=\"\",\"\",ROWS($A$1:A72))","v":""},{"$f":"PROPER(IF('SD Teacher''s Data'!A73=\"\",\"\",'SD Teacher''s Data'!A73))","v":""},{"$f":"PROPER(IF('SD Teacher''s Data'!F73=\"\",\"\",'SD Teacher''s Data'!F73))","v":""},{"$f":"IF('SD Teacher''s Data'!E73=\"\",\"\",'SD Teacher''s Data'!E73)","v":""},{"$f":"IF('SD Teacher''s Data'!K73=\"\",\"\",'SD Teacher''s Data'!K73)","v":""},{"$f":"IF('SD Teacher''s Data'!B73=\"\",\"\",'SD Teacher''s Data'!B73)","v":""},{"$nulls":5},{"$f":"IF('SD Teacher''s Data'!J73=\"\",\"\",'SD Teacher''s Data'!J73)","v":""}]
[{"$f":"IF(Table1[[#This Row],[नाम]]=\"\",\"\",ROWS($A$1:A73))","v":""},{"$f":"PROPER(IF('SD Teacher''s Data'!A74=\"\",\"\",'SD Teacher''s Data'!A74))","v":""},{"$f":"PROPER(IF('SD Teacher''s Data'!F74=\"\",\"\",'SD Teacher''s Data'!F74))","v":""},{"$f":"IF('SD Teacher''s Data'!E74=\"\",\"\",'SD Teacher''s Data'!E74)","v":""},{"$f":"IF('SD Teacher''s Data'!K74=\"\",\"\",'SD Teacher''s Data'!K74)","v":""},{"$f":"IF('SD Teacher''s Data'!B74=\"\",\"\",'SD Teacher''s Data'!B74)","v":""},{"$nulls":5},{"$f":"IF('SD Teacher''s Data'!J74=\"\",\"\",'SD Teacher''s Data'!J74)","v":""}]
[{"$f":"IF(Table1[[#This Row],[नाम]]=\"\",\"\",ROWS($A$1:A74))","v":""},{"$f":"PROPER(IF('SD Teacher''s Data'!A75=\"\",\"\",'SD Teacher''s Data'!A75))","v":""},{"$f":"PROPER(IF('SD Teacher''s Data'!F75=\"\",\"\",'SD Teacher''s Data'!F75))","v":""},{"$f":"IF('SD Teacher''s Data'!E75=\"\",\"\",'SD Teacher''s Data'!E75)","v":""},{"$f":"IF('SD Teacher''s Data'!K75=\"\",\"\",'SD Teacher''s Data'!K75)","v":""},{"$f":"IF('SD Teacher''s Data'!B75=\"\",\"\",'SD Teacher''s Data'!B75)","v":""},{"$nulls":5},{"$f":"IF('SD Teacher''s Data'!J75=\"\",\"\",'SD Teacher''s Data'!J75)","v":""}]
[{"$f":"IF(Table1[[#This Row],[नाम]]=\"\",\"\",ROWS($A$1:A75))","v":""},{"$f":"PROPER(IF('SD Teacher''s Data'!A76=\"\",\"\",'SD Teacher''s Data'!A76))","v":""},{"$f":"PROPER(IF('SD Teacher''s Data'!F76=\"\",\"\",'SD Teacher''s Data'!F76))","v":""},{"$f":"IF('SD Teacher''s Data'!E76=\"\",\"\",'SD Teacher''s Data'!E76)","v":""},{"$f":"IF('SD Teacher''s Data'!K76=\"\",\"\",'SD Teacher''s Data'!K76)","v":""},{"$f":"IF('SD Teacher''s Data'!B76=\"\",\"\",'SD Teacher''s Data'!B76)","v":""},{"$nulls":5},{"$f":"IF('SD Teacher''s Data'!J76=\"\",\"\",'SD Teacher''s Data'!J76)","v":""}]
[{"$f":"IF(Table1[[#This Row],[नाम]]=\"\",\"\",ROWS($A$1:A76))","v":""},{"$f":"PROPER(IF('SD Teacher''s Data'!A77=\"\",\"\",'SD Teacher''s Data'!A77))","v":""},{"$f":"PROPER(IF('SD Teacher''s Data'!F77=\"\",\"\",'SD Teacher''s Data'!F77))","v":""},{"$f":"IF('SD Teacher''s Data'!E77=\"\",\"\",'SD Teacher''s Data'!E77)","v":""},{"$f":"IF('SD Teacher''s Data'!K77=\"\",\"\",'SD Teacher''s Data'!K77)","v":""},{"$f":"IF('SD Teacher''s Data'!B77=\"\",\"\",'SD Teacher''s Data'!B77)","v":""},{"$nulls":5},{"$f":"IF('SD Teacher''s Data'!J77=\"\",\"\",'SD Teacher''s Data'!J77)","v":""}]
[{"$f":"IF(Table1[[#This Row],[नाम]]=\"\",\"\",ROWS($A$1:A77))","v":""},{"$f":"PROPER(IF('SD Teacher''s Data'!A78=\"\",\"\",'SD Teacher''s Data'!A78))","v":""},{"$f":"PROPER(IF('SD Teacher''s Data'!F78=\"\",\"\",'SD Teacher''s Data'!F78))","v":""},{"$f":"IF('SD Teacher''s Data'!E78=\"\",\"\",'SD Teacher''s Data'!E78)","v":""},{"$f":"IF('SD Teacher''s Data'!K78=\"\",\"\",'SD Teacher''s Data'!K78)","v":""},{"$f":"IF('SD Teacher''s Data'!B78=\"\",\"\",'SD Teacher''s Data'!B78)","v":""},{"$nulls":5},{"$f":"IF('SD Teacher''s Data'!J78=\"\",\"\",'SD Teacher''s Data'!J78)","v":""}]
[{"$f":"IF(Table1[[#This Row],[नाम]]=\"\",\"\",ROWS($A$1:A78))","v":""},{"$f":"PROPER(IF('SD Teacher''s Data'!A79=\"\",\"\",'SD Teacher''s Data'!A79))","v":""},{"$f":"PROPER(IF('SD Teacher''s Data'!F79=\"\",\"\",'SD Teacher''s Data'!F79))","v":""},{"$f":"IF('SD Teacher''s Data'!E79=\"\",\"\",'SD Teacher''s Data'!E79)","v":""},{"$f":"IF('SD Teacher''s Data'!K79=\"\",\"\",'SD Teacher''s Data'!K79)","v":""},{"$f":"IF('SD Teacher''s Data'!B79=\"\",\"\",'SD Teacher''s Data'!B79)","v":""},{"$nulls":5},{"$f":"IF('SD Teacher''s Data'!J79=\"\",\"\",'SD Teacher''s Data'!J79)","v":""}]
[{"$f":"IF(Table1[[#This Row],[नाम]]=\"\",\"\",ROWS($A$1:A79))","v":""},{"$f":"PROPER(IF('SD Teacher''s Data'!A80=\"\",\"\",'SD Teacher''s Data'!A80))","v":""},{"$f":"PROPER(IF('SD Teacher''s Data'!F80=\"\",\"\",'SD Teacher''s Data'!F80))","v":""},{"$f":"IF('SD Teacher''s Data'!E80=\"\",\"\",'SD Teacher''s Data'!E80)","v":""},{"$f":"IF('SD Teacher''s Data'!K80=\"\",\"\",'SD Teacher''s Data'!K80)","v":""},{"$f":"IF('SD Teacher''s Data'!B80=\"\",\"\",'SD Teacher''s Data'!B80)","v":""},{"$nulls":5},{"$f":"IF('SD Teacher''s Data'!J80=\"\",\"\",'SD Teacher''s Data'!J80)","v":""}]
[{"$f":"IF(Table1[[#This Row],[नाम]]=\"\",\"\",ROWS($A$1:A80))","v":""},{"$f":"PROPER(IF('SD Teacher''s Data'!A81=\"\",\"\",'SD Teacher''s Data'!A81))","v":""},{"$f":"PROPER(IF('SD Teacher''s Data'!F81=\"\",\"\",'SD Teacher''s Data'!F81))","v":""},{"$f":"IF('SD Teacher''s Data'!E81=\"\",\"\",'SD Teacher''s Data'!E81)","v":""},{"$f":"IF('SD Teacher''s Data'!K81=\"\",\"\",'SD Teacher''s Data'!K81)","v":""},{"$f":"IF('SD Teacher''s Data'!B81=\"\",\"\",'SD Teacher''s Data'!B81)","v":""},{"$nulls":5},{"$f":"IF('SD Teacher''s Data'!J81=\"\",\"\",'SD Teacher''s Data'!J81)","v":""}]
[{"$f":"IF(Table1[[#This Row],[नाम]]=\"\",\"\",ROWS($A$1:A81))","v":""},{"$f":"PROPER(IF('SD Teacher''s Data'!A82=\"\",\"\",'SD Teacher''s Data'!A82))","v":""},{"$f":"PROPER(IF('SD Teacher''s Data'!F82=\"\",\"\",'SD Teacher''s Data'!F82))","v":""},{"$f":"IF('SD Teacher''s Data'!E82=\"\",\"\",'SD Teacher''s Data'!E82)","v":""},{"$f":"IF('SD Teacher''s Data'!K82=\"\",\"\",'SD Teacher''s Data'!K82)","v":""},{"$f":"IF('SD Teacher''s Data'!B82=\"\",\"\",'SD Teacher''s Data'!B82)","v":""},{"$nulls":5},{"$f":"IF('SD Teacher''s Data'!J82=\"\",\"\",'SD Teacher''s Data'!J82)","v":""}]
[{"$f":"IF(Table1[[#This Row],[नाम]]=\"\",\"\",ROWS($A$1:A82))","v":""},{"$f":"PROPER(IF('SD Teacher''s Data'!A83=\"\",\"\",'SD Teacher''s Data'!A83))","v":""},{"$f":"PROPER(IF('SD Teacher''s Data'!F83=\"\",\"\",'SD Teacher''s Data'!F83))","v":""},{"$f":"IF('SD Teacher''s Data'!E83=\"\",\"\",'SD Teacher''s Data'!E83)","v":""},{"$f":"IF('SD Teacher''s Data'!K83=\"\",\"\",'SD Teacher''s Data'!K83)","v":""},{"$f":"IF('SD Teacher''s Data'!B83=\"\",\"\",'SD Teacher''s Data'!B83)","v":""},{"$nulls":5},{"$f":"IF('SD Teacher''s Data'!J83=\"\",\"\",'SD Teacher''s Data'!J83)","v":""}]
[{"$f":"IF(Table1[[#This Row],[नाम]]=\"\",\"\",ROWS($A$1:A83))","v":""},{"$f":"PROPER(IF('SD Teacher''s Data'!A84=\"\",\"\",'SD Teacher''s Data'!A84))","v":""},{"$f":"PROPER(IF('SD Teacher''s Data'!F84=\"\",\"\",'SD Teacher''s Data'!F84))","v":""},{"$f":"IF('SD Teacher''s Data'!E84=\"\",\"\",'SD Teacher''s Data'!E84)","v":""},{"$f":"IF('SD Teacher''s Data'!K84=\"\",\"\",'SD Teacher''s Data'!K84)","v":""},{"$f":"IF('SD Teacher''s Data'!B84=\"\",\"\",'SD Teacher''s Data'!B84)","v":""},{"$nulls":5},{"$f":"IF('SD Teacher''s Data'!J84=\"\",\"\",'SD Teacher''s Data'!J84)","v":""}]
[{"$f":"IF(Table1[[#This Row],[नाम]]=\"\",\"\",ROWS($A$1:A84))","v":""},{"$f":"PROPER(IF('SD Teacher''s Data'!A85=\"\",\"\",'SD Teacher''s Data'!A85))","v":""},{"$f":"PROPER(IF('SD Teacher''s Data'!F85=\"\",\"\",'SD Teacher''s Data'!F85))","v":""},{"$f":"IF('SD Teacher''s Data'!E85=\"\",\"\",'SD Teacher''s Data'!E85)","v":""},{"$f":"IF('SD Teacher''s Data'!K85=\"\",\"\",'SD Teacher''s Data'!K85)","v":""},{"$f":"IF('SD Teacher''s Data'!B85=\"\",\"\",'SD Teacher''s Data'!B85)","v":""},{"$nulls":5},{"$f":"IF('SD Teacher''s Data'!J85=\"\",\"\",'SD Teacher''s Data'!J85)","v":""}]
[{"$f":"IF(Table1[[#This Row],[नाम]]=\"\",\"\",ROWS($A$1:A85))","v":""},{"$f":"PROPER(IF('SD Teacher''s Data'!A86=\"\",\"\",'SD Teacher''s Data'!A86))","v":""},{"$f":"PROPER(IF('SD Teacher''s Data'!F86=\"\",\"\",'SD Teacher''s Data'!F86))","v":""},{"$f":"IF('SD Teacher''s Data'!E86=\"\",\"\",'SD Teacher''s Data'!E86)","v":""},{"$f":"IF('SD Teacher''s Data'!K86=\"\",\"\",'SD Teacher''s Data'!K86)","v":""},{"$f":"IF('SD Teacher''s Data'!B86=\"\",\"\",'SD Teacher''s Data'!B86)","v":""},{"$nulls":5},{"$f":"IF('SD Teacher''s Data'!J86=\"\",\"\",'SD Teacher''s Data'!J86)","v":""}]
[{"$f":"IF(Table1[[#This Row],[नाम]]=\"\",\"\",ROWS($A$1:A86))","v":""},{"$f":"PROPER(IF('SD Teacher''s Data'!A87=\"\",\"\",'SD Teacher''s Data'!A87))","v":""},{"$f":"PROPER(IF('SD Teacher''s Data'!F87=\"\",\"\",'SD Teacher''s Data'!F87))","v":""},{"$f":"IF('SD Teacher''s Data'!E87=\"\",\"\",'SD Teacher''s Data'!E87)","v":""},{"$f":"IF('SD Teacher''s Data'!K87=\"\",\"\",'SD Teacher''s Data'!K87)","v":""},{"$f":"IF('SD Teacher''s Data'!B87=\"\",\"\",'SD Teacher''s Data'!B87)","v":""},{"$nulls":5},{"$f":"IF('SD Teacher''s Data'!J87=\"\",\"\",'SD Teacher''s Data'!J87)","v":""}]
[{"$f":"IF(Table1[[#This Row],[नाम]]=\"\",\"\",ROWS($A$1:A87))","v":""},{"$f":"PROPER(IF('SD Teacher''s Data'!A88=\"\",\"\",'SD Teacher''s Data'!A88))","v":""},{"$f":"PROPER(IF('SD Teacher''s Data'!F88=\"\",\"\",'SD Teacher''s Data'!F88))","v":""},{"$f":"IF('SD Teacher''s Data'!E88=\"\",\"\",'SD Teacher''s Data'!E88)","v":""},{"$f":"IF('SD Teacher''s Data'!K88=\"\",\"\",'SD Teacher''s Data'!K88)","v":""},{"$f":"IF('SD Teacher''s Data'!B88=\"\",\"\",'SD Teacher''s Data'!B88)","v":""},{"$nulls":5},{"$f":"IF('SD Teacher''s Data'!J88=\"\",\"\",'SD Teacher''s Data'!J88)","v":""}]
[{"$f":"IF(Table1[[#This Row],[नाम]]=\"\",\"\",ROWS($A$1:A88))","v":""},{"$f":"PROPER(IF('SD Teacher''s Data'!A89=\"\",\"\",'SD Teacher''s Data'!A89))","v":""},{"$f":"PROPER(IF('SD Teacher''s Data'!F89=\"\",\"\",'SD Teacher''s Data'!F89))","v":""},{"$f":"IF('SD Teacher''s Data'!E89=\"\",\"\",'SD Teacher''s Data'!E89)","v":""},{"$f":"IF('SD Teacher''s Data'!K89=\"\",\"\",'SD Teacher''s Data'!K89)","v":""},{"$f":"IF('SD Teacher''s Data'!B89=\"\",\"\",'SD Teacher''s Data'!B89)","v":""},{"$nulls":5},{"$f":"IF('SD Teacher''s Data'!J89=\"\",\"\",'SD Teacher''s Data'!J89)","v":""}]
[{"$f":"IF(Table1[[#This Row],[नाम]]=\"\",\"\",ROWS($A$1:A89))","v":""},{"$f":"PROPER(IF('SD Teacher''s Data'!A90=\"\",\"\",'SD Teacher''s Data'!A90))","v":""},{"$f":"PROPER(IF('SD Teacher''s Data'!F90=\"\",\"\",'SD Teacher''s Data'!F90))","v":""},{"$f":"IF('SD Teacher''s Data'!E90=\"\",\"\",'SD Teacher''s Data'!E90)","v":""},{"$f":"IF('SD Teacher''s Data'!K90=\"\",\"\",'SD Teacher''s Data'!K90)","v":""},{"$f":"IF('SD Teacher''s Data'!B90=\"\",\"\",'SD Teacher''s Data'!B90)","v":""},{"$nulls":5},{"$f":"IF('SD Teacher''s Data'!J90=\"\",\"\",'SD Teacher''s Data'!J90)","v":""}]
[{"$f":"IF(Table1[[#This Row],[नाम]]=\"\",\"\",ROWS($A$1:A90))","v":""},{"$f":"PROPER(IF('SD Teacher''s Data'!A91=\"\",\"\",'SD Teacher''s Data'!A91))","v":""},{"$f":"PROPER(IF('SD Teacher''s Data'!F91=\"\",\"\",'SD Teacher''s Data'!F91))","v":""},{"$f":"IF('SD Teacher''s Data'!E91=\"\",\"\",'SD Teacher''s Data'!E91)","v":""},{"$f":"IF('SD Teacher''s Data'!K91=\"\",\"\",'SD Teacher''s Data'!K91)","v":""},{"$f":"IF('SD Teacher''s Data'!B91=\"\",\"\",'SD Teacher''s Data'!B91)","v":""},{"$nulls":5},{"$f":"IF('SD Teacher''s Data'!J91=\"\",\"\",'SD Teacher''s Data'!J91)","v":""}]
[{"$f":"IF(Table1[[#This Row],[नाम]]=\"\",\"\",ROWS($A$1:A91))","v":""},{"$f":"PROPER(IF('SD Teacher''s Data'!A92=\"\",\"\",'SD Teacher''s Data'!A92))","v":""},{"$f":"PROPER(IF('SD Teacher''s Data'!F92=\"\",\"\",'SD Teacher''s Data'!F92))","v":""},{"$f":"IF('SD Teacher''s Data'!E92=\"\",\"\",'SD Teacher''s Data'!E92)","v":""},{"$f":"IF('SD Teacher''s Data'!K92=\"\",\"\",'SD Teacher''s Data'!K92)","v":""},{"$f":"IF('SD Teacher''s Data'!B92=\"\",\"\",'SD Teacher''s Data'!B92)","v":""},{"$nulls":5},{"$f":"IF('SD Teacher''s Data'!J92=\"\",\"\",'SD Teacher''s Data'!J92)","v":""}]
[{"$f":"IF(Table1[[#This Row],[नाम]]=\"\",\"\",ROWS($A$1:A92))","v":""},{"$f":"PROPER(IF('SD Teacher''s Data'!A93=\"\",\"\",'SD Teacher''s Data'!A93))","v":""},{"$f":"PROPER(IF('SD Teacher''s Data'!F93=\"\",\"\",'SD Teacher''s Data'!F93))","v":""},{"$f":"IF('SD Teacher''s Data'!E93=\"\",\"\",'SD Teacher''s Data'!E93)","v":""},{"$f":"IF('SD Teacher''s Data'!K93=\"\",\"\",'SD Teacher''s Data'!K93)","v":""},{"$f":"IF('SD Teacher''s Data'!B93=\"\",\"\",'SD Teacher''s Data'!B93)","v":""},{"$nulls":5},{"$f":"IF('SD Teacher''s Data'!J93=\"\",\"\",'SD Teacher''s Data'!J93)","v":""}]
[{"$f":"IF(Table1[[#This Row],[नाम]]=\"\",\"\",ROWS($A$1:A93))","v":""},{"$f":"PROPER(IF('SD Teacher''s Data'!A94=\"\",\"\",'SD Teacher''s Data'!A94))","v":""},{"$f":"PROPER(IF('SD Teacher''s Data'!F94=\"\",\"\",'SD Teacher''s Data'!F94))","v":""},{"$f":"IF('SD Teacher''s Data'!E94=\"\",\"\",'SD Teacher''s Data'!E94)","v":""},{"$f":"IF('SD Teacher''s Data'!K94=\"\",\"\",'SD Teacher''s Data'!K94)","v":""},{"$f":"IF('SD Teacher''s Data'!B94=\"\",\"\",'SD Teacher''s Data'!B94)","v":""},{"$nulls":5},{"$f":"IF('SD Teacher''s Data'!J94=\"\",\"\",'SD Teacher''s Data'!J94)","v":""}]
[{"$f":"IF(Table1[[#This Row],[नाम]]=\"\",\"\",ROWS($A$1:A94))","v":""},{"$f":"PROPER(IF('SD Teacher''s Data'!A95=\"\",\"\",'SD Teacher''s Data'!A95))","v":""},{"$f":"PROPER(IF('SD Teacher''s Data'!F95=\"\",\"\",'SD Teacher''s Data'!F95))","v":""},{"$f":"IF('SD Teacher''s Data'!E95=\"\",\"\",'SD Teacher''s Data'!E95)","v":""},{"$f":"IF('SD Teacher''s Data'!K95=\"\",\"\",'SD Teacher''s Data'!K95)","v":""},{"$f":"IF('SD Teacher''s Data'!B95=\"\",\"\",'SD Teacher''s Data'!B95)","v":""},{"$nulls":5},{"$f":"IF('SD Teacher''s Data'!J95=\"\",\"\",'SD Teacher''s Data'!J95)","v":""}]
[{"$f":"IF(Table1[[#This Row],[नाम]]=\"\",\"\",ROWS($A$1:A95))","v":""},{"$f":"PROPER(IF('SD Teacher''s Data'!A96=\"\",\"\",'SD Teacher''s Data'!A96))","v":""},{"$f":"PROPER(IF('SD Teacher''s Data'!F96=\"\",\"\",'SD Teacher''s Data'!F96))","v":""},{"$f":"IF('SD Teacher''s Data'!E96=\"\",\"\",'SD Teacher''s Data'!E96)","v":""},{"$f":"IF('SD Teacher''s Data'!K96=\"\",\"\",'SD Teacher''s Data'!K96)","v":""},{"$f":"IF('SD Teacher''s Data'!B96=\"\",\"\",'SD Teacher''s Data'!B96)","v":""},{"$nulls":5},{"$f":"IF('SD Teacher''s Data'!J96=\"\",\"\",'SD Teacher''s Data'!J96)","v":""}]
[{"$f":"IF(Table1[[#This Row],[नाम]]=\"\",\"\",ROWS($A$1:A96))","v":""},{"$f":"PROPER(IF('SD Teacher''s Data'!A97=\"\",\"\",'SD Teacher''s Data'!A97))","v":""},{"$f":"PROPER(IF('SD Teacher''s Data'!F97=\"\",\"\",'SD Teacher''s Data'!F97))","v":""},{"$f":"IF('SD Teacher''s Data'!E97=\"\",\"\",'SD Teacher''s Data'!E97)","v":""},{"$f":"IF('SD Teacher''s Data'!K97=\"\",\"\",'SD Teacher''s Data'!K97)","v":""},{"$f":"IF('SD Teacher''s Data'!B97=\"\",\"\",'SD Teacher''s Data'!B97)","v":""},{"$nulls":5},{"$f":"IF('SD Teacher''s Data'!J97=\"\",\"\",'SD Teacher''s Data'!J97)","v":""}]
[{"$f":"IF(Table1[[#This Row],[नाम]]=\"\",\"\",ROWS($A$1:A97))","v":""},{"$f":"PROPER(IF('SD Teacher''s Data'!A98=\"\",\"\",'SD Teacher''s Data'!A98))","v":""},{"$f":"PROPER(IF('SD Teacher''s Data'!F98=\"\",\"\",'SD Teacher''s Data'!F98))","v":""},{"$f":"IF('SD Teacher''s Data'!E98=\"\",\"\",'SD Teacher''s Data'!E98)","v":""},{"$f":"IF('SD Teacher''s Data'!K98=\"\",\"\",'SD Teacher''s Data'!K98)","v":""},{"$f":"IF('SD Teacher''s Data'!B98=\"\",\"\",'SD Teacher''s Data'!B98)","v":""},{"$nulls":5},{"$f":"IF('SD Teacher''s Data'!J98=\"\",\"\",'SD Teacher''s Data'!J98)","v":""}]
[{"$f":"IF(Table1[[#This Row],[नाम]]=\"\",\"\",ROWS($A$1:A98))","v":""},{"$f":"PROPER(IF('SD Teacher''s Data'!A99=\"\",\"\",'SD Teacher''s Data'!A99))","v":""},{"$f":"PROPER(IF('SD Teacher''s Data'!F99=\"\",\"\",'SD Teacher''s Data'!F99))","v":""},{"$f":"IF('SD Teacher''s Data'!E99=\"\",\"\",'SD Teacher''s Data'!E99)","v":""},{"$f":"IF('SD Teacher''s Data'!K99=\"\",\"\",'SD Teacher''s Data'!K99)","v":""},{"$f":"IF('SD Teacher''s Data'!B99=\"\",\"\",'SD Teacher''s Data'!B99)","v":""},{"$nulls":5},{"$f":"IF('SD Teacher''s Data'!J99=\"\",\"\",'SD Teacher''s Data'!J99)","v":""}]
[{"$f":"IF(Table1[[#This Row],[नाम]]=\"\",\"\",ROWS($A$1:A99))","v":""},{"$f":"PROPER(IF('SD Teacher''s Data'!A100=\"\",\"\",'SD Teacher''s Data'!A100))","v":""},{"$f":"PROPER(IF('SD Teacher''s Data'!F100=\"\",\"\",'SD Teacher''s Data'!F100))","v":""},{"$f":"IF('SD Teacher''s Data'!E100=\"\",\"\",'SD Teacher''s Data'!E100)","v":""},{"$f":"IF('SD Teacher''s Data'!K100=\"\",\"\",'SD Teacher''s Data'!K100)","v":""},{"$f":"IF('SD Teacher''s Data'!B100=\"\",\"\",'SD Teacher''s Data'!B100)","v":""},{"$nulls":5},{"$f":"IF('SD Teacher''s Data'!J100=\"\",\"\",'SD Teacher''s Data'!J100)","v":""}]
[{"$f":"IF(Table1[[#This Row],[नाम]]=\"\",\"\",ROWS($A$1:A100))","v":""},{"$f":"PROPER(IF('SD Teacher''s Data'!A101=\"\",\"\",'SD Teacher''s Data'!A101))","v":""},{"$f":"PROPER(IF('SD Teacher''s Data'!F101=\"\",\"\",'SD Teacher''s Data'!F101))","v":""},{"$f":"IF('SD Teacher''s Data'!E101=\"\",\"\",'SD Teacher''s Data'!E101)","v":""},{"$f":"IF('SD Teacher''s Data'!K101=\"\",\"\",'SD Teacher''s Data'!K101)","v":""},{"$f":"IF('SD Teacher''s Data'!B101=\"\",\"\",'SD Teacher''s Data'!B101)","v":""},{"$nulls":5},{"$f":"IF('SD Teacher''s Data'!J101=\"\",\"\",'SD Teacher''s Data'!J101)","v":""}]
[{"$f":"IF(Table1[[#This Row],[नाम]]=\"\",\"\",ROWS($A$1:A101))","v":""},{"$f":"PROPER(IF('SD Teacher''s Data'!A102=\"\",\"\",'SD Teacher''s Data'!A102))","v":""},{"$f":"PROPER(IF('SD Teacher''s Data'!F102=\"\",\"\",'SD Teacher''s Data'!F102))","v":""},{"$f":"IF('SD Teacher''s Data'!E102=\"\",\"\",'SD Teacher''s Data'!E102)","v":""},{"$f":"IF('SD Teacher''s Data'!K102=\"\",\"\",'SD Teacher''s Data'!K102)","v":""},{"$f":"IF('SD Teacher''s Data'!B102=\"\",\"\",'SD Teacher''s Data'!B102)","v":""},{"$nulls":5},{"$f":"IF('SD Teacher''s Data'!J102=\"\",\"\",'SD Teacher''s Data'!J102)","v":""}]
[{"$f":"IF(Table1[[#This Row],[नाम]]=\"\",\"\",ROWS($A$1:A102))","v":""},{"$f":"PROPER(IF('SD Teacher''s Data'!A103=\"\",\"\",'SD Teacher''s Data'!A103))","v":""},{"$f":"PROPER(IF('SD Teacher''s Data'!F103=\"\",\"\",'SD Teacher''s Data'!F103))","v":""},{"$f":"IF('SD Teacher''s Data'!E103=\"\",\"\",'SD Teacher''s Data'!E103)","v":""},{"$f":"IF('SD Teacher''s Data'!K103=\"\",\"\",'SD Teacher''s Data'!K103)","v":""},{"$f":"IF('SD Teacher''s Data'!B103=\"\",\"\",'SD Teacher''s Data'!B103)","v":""},{"$nulls":5},{"$f":"IF('SD Teacher''s Data'!J103=\"\",\"\",'SD Teacher''s Data'!J103)","v":""}]
[{"$f":"IF(Table1[[#This Row],[नाम]]=\"\",\"\",ROWS($A$1:A103))","v":""},{"$f":"PROPER(IF('SD Teacher''s Data'!A104=\"\",\"\",'SD Teacher''s Data'!A104))","v":""},{"$f":"PROPER(IF('SD Teacher''s Data'!F104=\"\",\"\",'SD Teacher''s Data'!F104))","v":""},{"$f":"IF('SD Teacher''s Data'!E104=\"\",\"\",'SD Teacher''s Data'!E104)","v":""},{"$f":"IF('SD Teacher''s Data'!K104=\"\",\"\",'SD Teacher''s Data'!K104)","v":""},{"$f":"IF('SD Teacher''s Data'!B104=\"\",\"\",'SD Teacher''s Data'!B104)","v":""},{"$nulls":5},{"$f":"IF('SD Teacher''s Data'!J104=\"\",\"\",'SD Teacher''s Data'!J104)","v":""}]
[{"$f":"IF(Table1[[#This Row],[नाम]]=\"\",\"\",ROWS($A$1:A104))","v":""},{"$f":"PROPER(IF('SD Teacher''s Data'!A105=\"\",\"\",'SD Teacher''s Data'!A105))","v":""},{"$f":"PROPER(IF('SD Teacher''s Data'!F105=\"\",\"\",'SD Teacher''s Data'!F105))","v":""},{"$f":"IF('SD Teacher''s Data'!E105=\"\",\"\",'SD Teacher''s Data'!E105)","v":""},{"$f":"IF('SD Teacher''s Data'!K105=\"\",\"\",'SD Teacher''s Data'!K105)","v":""},{"$f":"IF('SD Teacher''s Data'!B105=\"\",\"\",'SD Teacher''s Data'!B105)","v":""},{"$nulls":5},{"$f":"IF('SD Teacher''s Data'!J105=\"\",\"\",'SD Teacher''s Data'!J105)","v":""}]
[{"$f":"IF(Table1[[#This Row],[नाम]]=\"\",\"\",ROWS($A$1:A105))","v":""},{"$f":"PROPER(IF('SD Teacher''s Data'!A106=\"\",\"\",'SD Teacher''s Data'!A106))","v":""},{"$f":"PROPER(IF('SD Teacher''s Data'!F106=\"\",\"\",'SD Teacher''s Data'!F106))","v":""},{"$f":"IF('SD Teacher''s Data'!E106=\"\",\"\",'SD Teacher''s Data'!E106)","v":""},{"$f":"IF('SD Teacher''s Data'!K106=\"\",\"\",'SD Teacher''s Data'!K106)","v":""},{"$f":"IF('SD Teacher''s Data'!B106=\"\",\"\",'SD Teacher''s Data'!B106)","v":""},{"$nulls":5},{"$f":"IF('SD Teacher''s Data'!J106=\"\",\"\",'SD Teacher''s Data'!J106)","v":""}]
[{"$f":"IF(Table1[[#This Row],[नाम]]=\"\",\"\",ROWS($A$1:A106))","v":""},{"$f":"PROPER(IF('SD Teacher''s Data'!A107=\"\",\"\",'SD Teacher''s Data'!A107))","v":""},{"$f":"PROPER(IF('SD Teacher''s Data'!F107=\"\",\"\",'SD Teacher''s Data'!F107))","v":""},{"$f":"IF('SD Teacher''s Data'!E107=\"\",\"\",'SD Teacher''s Data'!E107)","v":""},{"$f":"IF('SD Teacher''s Data'!K107=\"\",\"\",'SD Teacher''s Data'!K107)","v":""},{"$f":"IF('SD Teacher''s Data'!B107=\"\",\"\",'SD Teacher''s Data'!B107)","v":""},{"$nulls":5},{"$f":"IF('SD Teacher''s Data'!J107=\"\",\"\",'SD Teacher''s Data'!J107)","v":""}]
[{"$f":"IF(Table1[[#This Row],[नाम]]=\"\",\"\",ROWS($A$1:A107))","v":""},{"$f":"PROPER(IF('SD Teacher''s Data'!A108=\"\",\"\",'SD Teacher''s Data'!A108))","v":""},{"$f":"PROPER(IF('SD Teacher''s Data'!F108=\"\",\"\",'SD Teacher''s Data'!F108))","v":""},{"$f":"IF('SD Teacher''s Data'!E108=\"\",\"\",'SD Teacher''s Data'!E108)","v":""},{"$f":"IF('SD Teacher''s Data'!K108=\"\",\"\",'SD Teacher''s Data'!K108)","v":""},{"$f":"IF('SD Teacher''s Data'!B108=\"\",\"\",'SD Teacher''s Data'!B108)","v":""},{"$nulls":5},{"$f":"IF('SD Teacher''s Data'!J108=\"\",\"\",'SD Teacher''s Data'!J108)","v":""}]
[{"$f":"IF(Table1[[#This Row],[नाम]]=\"\",\"\",ROWS($A$1:A108))","v":""},{"$f":"PROPER(IF('SD Teacher''s Data'!A109=\"\",\"\",'SD Teacher''s Data'!A109))","v":""},{"$f":"PROPER(IF('SD Teacher''s Data'!F109=\"\",\"\",'SD Teacher''s Data'!F109))","v":""},{"$f":"IF('SD Teacher''s Data'!E109=\"\",\"\",'SD Teacher''s Data'!E109)","v":""},{"$f":"IF('SD Teacher''s Data'!K109=\"\",\"\",'SD Teacher''s Data'!K109)","v":""},{"$f":"IF('SD Teacher''s Data'!B109=\"\",\"\",'SD Teacher''s Data'!B109)","v":""},{"$nulls":5},{"$f":"IF('SD Teacher''s Data'!J109=\"\",\"\",'SD Teacher''s Data'!J109)","v":""}]
[{"$f":"IF(Table1[[#This Row],[नाम]]=\"\",\"\",ROWS($A$1:A109))","v":""},{"$f":"PROPER(IF('SD Teacher''s Data'!A110=\"\",\"\",'SD Teacher''s Data'!A110))","v":""},{"$f":"PROPER(IF('SD Teacher''s Data'!F110=\"\",\"\",'SD Teacher''s Data'!F110))","v":""},{"$f":"IF('SD Teacher''s Data'!E110=\"\",\"\",'SD Teacher''s Data'!E110)","v":""},{"$f":"IF('SD Teacher''s Data'!K110=\"\",\"\",'SD Teacher''s Data'!K110)","v":""},{"$f":"IF('SD Teacher''s Data'!B110=\"\",\"\",'SD Teacher''s Data'!B110)","v":""},{"$nulls":5},{"$f":"IF('SD Teacher''s Data'!J110=\"\",\"\",'SD Teacher''s Data'!J110)","v":""}]
[{"$f":"IF(Table1[[#This Row],[नाम]]=\"\",\"\",ROWS($A$1:A110))","v":""},{"$f":"PROPER(IF('SD Teacher''s Data'!A111=\"\",\"\",'SD Teacher''s Data'!A111))","v":""},{"$f":"PROPER(IF('SD Teacher''s Data'!F111=\"\",\"\",'SD Teacher''s Data'!F111))","v":""},{"$f":"IF('SD Teacher''s Data'!E111=\"\",\"\",'SD Teacher''s Data'!E111)","v":""},{"$f":"IF('SD Teacher''s Data'!K111=\"\",\"\",'SD Teacher''s Data'!K111)","v":""},{"$f":"IF('SD Teacher''s Data'!B111=\"\",\"\",'SD Teacher''s Data'!B111)","v":""},{"$nulls":5},{"$f":"IF('SD Teacher''s Data'!J111=\"\",\"\",'SD Teacher''s Data'!J111)","v":""}]
[{"$f":"IF(Table1[[#This Row],[नाम]]=\"\",\"\",ROWS($A$1:A111))","v":""},{"$f":"PROPER(IF('SD Teacher''s Data'!A112=\"\",\"\",'SD Teacher''s Data'!A112))","v":""},{"$f":"PROPER(IF('SD Teacher''s Data'!F112=\"\",\"\",'SD Teacher''s Data'!F112))","v":""},{"$f":"IF('SD Teacher''s Data'!E112=\"\",\"\",'SD Teacher''s Data'!E112)","v":""},{"$f":"IF('SD Teacher''s Data'!K112=\"\",\"\",'SD Teacher''s Data'!K112)","v":""},{"$f":"IF('SD Teacher''s Data'!B112=\"\",\"\",'SD Teacher''s Data'!B112)","v":""},{"$nulls":5},{"$f":"IF('SD Teacher''s Data'!J112=\"\",\"\",'SD Teacher''s Data'!J112)","v":""}]
[{"$f":"IF(Table1[[#This Row],[नाम]]=\"\",\"\",ROWS($A$1:A112))","v":""},{"$f":"PROPER(IF('SD Teacher''s Data'!A113=\"\",\"\",'SD Teacher''s Data'!A113))","v":""},{"$f":"PROPER(IF('SD Teacher''s Data'!F113=\"\",\"\",'SD Teacher''s Data'!F113))","v":""},{"$f":"IF('SD Teacher''s Data'!E113=\"\",\"\",'SD Teacher''s Data'!E113)","v":""},{"$f":"IF('SD Teacher''s Data'!K113=\"\",\"\",'SD Teacher''s Data'!K113)","v":""},{"$f":"IF('SD Teacher''s Data'!B113=\"\",\"\",'SD Teacher''s Data'!B113)","v":""},{"$nulls":5},{"$f":"IF('SD Teacher''s Data'!J113=\"\",\"\",'SD Teacher''s Data'!J113)","v":""}]
[{"$f":"IF(Table1[[#This Row],[नाम]]=\"\",\"\",ROWS($A$1:A113))","v":""},{"$f":"PROPER(IF('SD Teacher''s Data'!A114=\"\",\"\",'SD Teacher''s Data'!A114))","v":""},{"$f":"PROPER(IF('SD Teacher''s Data'!F114=\"\",\"\",'SD Teacher''s Data'!F114))","v":""},{"$f":"IF('SD Teacher''s Data'!E114=\"\",\"\",'SD Teacher''s Data'!E114)","v":""},{"$f":"IF('SD Teacher''s Data'!K114=\"\",\"\",'SD Teacher''s Data'!K114)","v":""},{"$f":"IF('SD Teacher''s Data'!B114=\"\",\"\",'SD Teacher''s Data'!B114)","v":""},{"$nulls":5},{"$f":"IF('SD Teacher''s Data'!J114=\"\",\"\",'SD Teacher''s Data'!J114)","v":""}]
[{"$f":"IF(Table1[[#This Row],[नाम]]=\"\",\"\",ROWS($A$1:A114))","v":""},{"$f":"PROPER(IF('SD Teacher''s Data'!A115=\"\",\"\",'SD Teacher''s Data'!A115))","v":""},{"$f":"PROPER(IF('SD Teacher''s Data'!F115=\"\",\"\",'SD Teacher''s Data'!F115))","v":""},{"$f":"IF('SD Teacher''s Data'!E115=\"\",\"\",'SD Teacher''s Data'!E115)","v":""},{"$f":"IF('SD Teacher''s Data'!K115=\"\",\"\",'SD Teacher''s Data'!K115)","v":""},{"$f":"IF('SD Teacher''s Data'!B115=\"\",\"\",'SD Teacher''s Data'!B115)","v":""},{"$nulls":5},{"$f":"IF('SD Teacher''s Data'!J115=\"\",\"\",'SD Teacher''s Data'!J115)","v":""}]
[{"$f":"IF(Table1[[#This Row],[नाम]]=\"\",\"\",ROWS($A$1:A115))","v":""},{"$f":"PROPER(IF('SD Teacher''s Data'!A116=\"\",\"\",'SD Teacher''s Data'!A116))","v":""},{"$f":"PROPER(IF('SD Teacher''s Data'!F116=\"\",\"\",'SD Teacher''s Data'!F116))","v":""},{"$f":"IF('SD Teacher''s Data'!E116=\"\",\"\",'SD Teacher''s Data'!E116)","v":""},{"$f":"IF('SD Teacher''s Data'!K116=\"\",\"\",'SD Teacher''s Data'!K116)","v":""},{"$f":"IF('SD Teacher''s Data'!B116=\"\",\"\",'SD Teacher''s Data'!B116)","v":""},{"$nulls":5},{"$f":"IF('SD Teacher''s Data'!J116=\"\",\"\",'SD Teacher''s Data'!J116)","v":""}]
[{"$f":"IF(Table1[[#This Row],[नाम]]=\"\",\"\",ROWS($A$1:A116))","v":""},{"$f":"PROPER(IF('SD Teacher''s Data'!A117=\"\",\"\",'SD Teacher''s Data'!A117))","v":""},{"$f":"PROPER(IF('SD Teacher''s Data'!F117=\"\",\"\",'SD Teacher''s Data'!F117))","v":""},{"$f":"IF('SD Teacher''s Data'!E117=\"\",\"\",'SD Teacher''s Data'!E117)","v":""},{"$f":"IF('SD Teacher''s Data'!K117=\"\",\"\",'SD Teacher''s Data'!K117)","v":""},{"$f":"IF('SD Teacher''s Data'!B117=\"\",\"\",'SD Teacher''s Data'!B117)","v":""},{"$nulls":5},{"$f":"IF('SD Teacher''s Data'!J117=\"\",\"\",'SD Teacher''s Data'!J117)","v":""}]
[{"$f":"IF(Table1[[#This Row],[नाम]]=\"\",\"\",ROWS($A$1:A117))","v":""},{"$f":"PROPER(IF('SD Teacher''s Data'!A118=\"\",\"\",'SD Teacher''s Data'!A118))","v":""},{"$f":"PROPER(IF('SD Teacher''s Data'!F118=\"\",\"\",'SD Teacher''s Data'!F118))","v":""},{"$f":"IF('SD Teacher''s Data'!E118=\"\",\"\",'SD Teacher''s Data'!E118)","v":""},{"$f":"IF('SD Teacher''s Data'!K118=\"\",\"\",'SD Teacher''s Data'!K118)","v":""},{"$f":"IF('SD Teacher''s Data'!B118=\"\",\"\",'SD Teacher''s Data'!B118)","v":""},{"$nulls":5},{"$f":"IF('SD Teacher''s Data'!J118=\"\",\"\",'SD Teacher''s Data'!J118)","v":""}]
[{"$f":"IF(Table1[[#This Row],[नाम]]=\"\",\"\",ROWS($A$1:A118))","v":""},{"$f":"PROPER(IF('SD Teacher''s Data'!A119=\"\",\"\",'SD Teacher''s Data'!A119))","v":""},{"$f":"PROPER(IF('SD Teacher''s Data'!F119=\"\",\"\",'SD Teacher''s Data'!F119))","v":""},{"$f":"IF('SD Teacher''s Data'!E119=\"\",\"\",'SD Teacher''s Data'!E119)","v":""},{"$f":"IF('SD Teacher''s Data'!K119=\"\",\"\",'SD Teacher''s Data'!K119)","v":""},{"$f":"IF('SD Teacher''s Data'!B119=\"\",\"\",'SD Teacher''s Data'!B119)","v":""},{"$nulls":5},{"$f":"IF('SD Teacher''s Data'!J119=\"\",\"\",'SD Teacher''s Data'!J119)","v":""}]
[{"$f":"IF(Table1[[#This Row],[नाम]]=\"\",\"\",ROWS($A$1:A119))","v":""},{"$f":"PROPER(IF('SD Teacher''s Data'!A120=\"\",\"\",'SD Teacher''s Data'!A120))","v":""},{"$f":"PROPER(IF('SD Teacher''s Data'!F120=\"\",\"\",'SD Teacher''s Data'!F120))","v":""},{"$f":"IF('SD Teacher''s Data'!E120=\"\",\"\",'SD Teacher''s Data'!E120)","v":""},{"$f":"IF('SD Teacher''s Data'!K120=\"\",\"\",'SD Teacher''s Data'!K120)","v":""},{"$f":"IF('SD Teacher''s Data'!B120=\"\",\"\",'SD Teacher''s Data'!B120)","v":""},{"$nulls":5},{"$f":"IF('SD Teacher''s Data'!J120=\"\",\"\",'SD Teacher''s Data'!J120)","v":""}]
[{"$f":"IF(Table1[[#This Row],[नाम]]=\"\",\"\",ROWS($A$1:A120))","v":""},{"$f":"PROPER(IF('SD Teacher''s Data'!A121=\"\",\"\",'SD Teacher''s Data'!A121))","v":""},{"$f":"PROPER(IF('SD Teacher''s Data'!F121=\"\",\"\",'SD Teacher''s Data'!F121))","v":""},{"$f":"IF('SD Teacher''s Data'!E121=\"\",\"\",'SD Teacher''s Data'!E121)","v":""},{"$f":"IF('SD Teacher''s Data'!K121=\"\",\"\",'SD Teacher''s Data'!K121)","v":""},{"$f":"IF('SD Teacher''s Data'!B121=\"\",\"\",'SD Teacher''s Data'!B121)","v":""},{"$nulls":5},{"$f":"IF('SD Teacher''s Data'!J121=\"\",\"\",'SD Teacher''s Data'!J121)","v":""}]
[{"$f":"IF(Table1[[#This Row],[नाम]]=\"\",\"\",ROWS($A$1:A121))","v":""},{"$f":"PROPER(IF('SD Teacher''s Data'!A122=\"\",\"\",'SD Teacher''s Data'!A122))","v":""},{"$f":"PROPER(IF('SD Teacher''s Data'!F122=\"\",\"\",'SD Teacher''s Data'!F122))","v":""},{"$f":"IF('SD Teacher''s Data'!E122=\"\",\"\",'SD Teacher''s Data'!E122)","v":""},{"$f":"IF('SD Teacher''s Data'!K122=\"\",\"\",'SD Teacher''s Data'!K122)","v":""},{"$f":"IF('SD Teacher''s Data'!B122=\"\",\"\",'SD Teacher''s Data'!B122)","v":""},{"$nulls":5},{"$f":"IF('SD Teacher''s Data'!J122=\"\",\"\",'SD Teacher''s Data'!J122)","v":""}]
[{"$f":"IF(Table1[[#This Row],[नाम]]=\"\",\"\",ROWS($A$1:A122))","v":""},{"$f":"PROPER(IF('SD Teacher''s Data'!A123=\"\",\"\",'SD Teacher''s Data'!A123))","v":""},{"$f":"PROPER(IF('SD Teacher''s Data'!F123=\"\",\"\",'SD Teacher''s Data'!F123))","v":""},{"$f":"IF('SD Teacher''s Data'!E123=\"\",\"\",'SD Teacher''s Data'!E123)","v":""},{"$f":"IF('SD Teacher''s Data'!K123=\"\",\"\",'SD Teacher''s Data'!K123)","v":""},{"$f":"IF('SD Teacher''s Data'!B123=\"\",\"\",'SD Teacher''s Data'!B123)","v":""},{"$nulls":5},{"$f":"IF('SD Teacher''s Data'!J123=\"\",\"\",'SD Teacher''s Data'!J123)","v":""}]
[{"$f":"IF(Table1[[#This Row],[नाम]]=\"\",\"\",ROWS($A$1:A123))","v":""},{"$f":"PROPER(IF('SD Teacher''s Data'!A124=\"\",\"\",'SD Teacher''s Data'!A124))","v":""},{"$f":"PROPER(IF('SD Teacher''s Data'!F124=\"\",\"\",'SD Teacher''s Data'!F124))","v":""},{"$f":"IF('SD Teacher''s Data'!E124=\"\",\"\",'SD Teacher''s Data'!E124)","v":""},{"$f":"IF('SD Teacher''s Data'!K124=\"\",\"\",'SD Teacher''s Data'!K124)","v":""},{"$f":"IF('SD Teacher''s Data'!B124=\"\",\"\",'SD Teacher''s Data'!B124)","v":""},{"$nulls":5},{"$f":"IF('SD Teacher''s Data'!J124=\"\",\"\",'SD Teacher''s Data'!J124)","v":""}]
[{"$f":"IF(Table1[[#This Row],[नाम]]=\"\",\"\",ROWS($A$1:A124))","v":""},{"$f":"PROPER(IF('SD Teacher''s Data'!A125=\"\",\"\",'SD Teacher''s Data'!A125))","v":""},{"$f":"PROPER(IF('SD Teacher''s Data'!F125=\"\",\"\",'SD Teacher''s Data'!F125))","v":""},{"$f":"IF('SD Teacher''s Data'!E125=\"\",\"\",'SD Teacher''s Data'!E125)","v":""},{"$f":"IF('SD Teacher''s Data'!K125=\"\",\"\",'SD Teacher''s Data'!K125)","v":""},{"$f":"IF('SD Teacher''s Data'!B125=\"\",\"\",'SD Teacher''s Data'!B125)","v":""},{"$nulls":5},{"$f":"IF('SD Teacher''s Data'!J125=\"\",\"\",'SD Teacher''s Data'!J125)","v":""}]
[{"$f":"IF(Table1[[#This Row],[नाम]]=\"\",\"\",ROWS($A$1:A125))","v":""},{"$f":"PROPER(IF('SD Teacher''s Data'!A126=\"\",\"\",'SD Teacher''s Data'!A126))","v":""},{"$f":"PROPER(IF('SD Teacher''s Data'!F126=\"\",\"\",'SD Teacher''s Data'!F126))","v":""},{"$f":"IF('SD Teacher''s Data'!E126=\"\",\"\",'SD Teacher''s Data'!E126)","v":""},{"$f":"IF('SD Teacher''s Data'!K126=\"\",\"\",'SD Teacher''s Data'!K126)","v":""},{"$f":"IF('SD Teacher''s Data'!B126=\"\",\"\",'SD Teacher''s Data'!B126)","v":""},{"$nulls":5},{"$f":"IF('SD Teacher''s Data'!J126=\"\",\"\",'SD Teacher''s Data'!J126)","v":""}]
[{"$f":"IF(Table1[[#This Row],[नाम]]=\"\",\"\",ROWS($A$1:A126))","v":""},{"$f":"PROPER(IF('SD Teacher''s Data'!A127=\"\",\"\",'SD Teacher''s Data'!A127))","v":""},{"$f":"PROPER(IF('SD Teacher''s Data'!F127=\"\",\"\",'SD Teacher''s Data'!F127))","v":""},{"$f":"IF('SD Teacher''s Data'!E127=\"\",\"\",'SD Teacher''s Data'!E127)","v":""},{"$f":"IF('SD Teacher''s Data'!K127=\"\",\"\",'SD Teacher''s Data'!K127)","v":""},{"$f":"IF('SD Teacher''s Data'!B127=\"\",\"\",'SD Teacher''s Data'!B127)","v":""},{"$nulls":5},{"$f":"IF('SD Teacher''s Data'!J127=\"\",\"\",'SD Teacher''s Data'!J127)","v":""}]
[{"$f":"IF(Table1[[#This Row],[नाम]]=\"\",\"\",ROWS($A$1:A127))","v":""},{"$f":"PROPER(IF('SD Teacher''s Data'!A128=\"\",\"\",'SD Teacher''s Data'!A128))","v":""},{"$f":"PROPER(IF('SD Teacher''s Data'!F128=\"\",\"\",'SD Teacher''s Data'!F128))","v":""},{"$f":"IF('SD Teacher''s Data'!E128=\"\",\"\",'SD Teacher''s Data'!E128)","v":""},{"$f":"IF('SD Teacher''s Data'!K128=\"\",\"\",'SD Teacher''s Data'!K128)","v":""},{"$f":"IF('SD Teacher''s Data'!B128=\"\",\"\",'SD Teacher''s Data'!B128)","v":""},{"$nulls":5},{"$f":"IF('SD Teacher''s Data'!J128=\"\",\"\",'SD Teacher''s Data'!J128)","v":""}]
[{"$f":"IF(Table1[[#This Row],[नाम]]=\"\",\"\",ROWS($A$1:A128))","v":""},{"$f":"PROPER(IF('SD Teacher''s Data'!A129=\"\",\"\",'SD Teacher''s Data'!A129))","v":""},{"$f":"PROPER(IF('SD Teacher''s Data'!F129=\"\",\"\",'SD Teacher''s Data'!F129))","v":""},{"$f":"IF('SD Teacher''s Data'!E129=\"\",\"\",'SD Teacher''s Data'!E129)","v":""},{"$f":"IF('SD Teacher''s Data'!K129=\"\",\"\",'SD Teacher''s Data'!K129)","v":""},{"$f":"IF('SD Teacher''s Data'!B129=\"\",\"\",'SD Teacher''s Data'!B129)","v":""},{"$nulls":5},{"$f":"IF('SD Teacher''s Data'!J129=\"\",\"\",'SD Teacher''s Data'!J129)","v":""}]
[{"$f":"IF(Table1[[#This Row],[नाम]]=\"\",\"\",ROWS($A$1:A129))","v":""},{"$f":"PROPER(IF('SD Teacher''s Data'!A130=\"\",\"\",'SD Teacher''s Data'!A130))","v":""},{"$f":"PROPER(IF('SD Teacher''s Data'!F130=\"\",\"\",'SD Teacher''s Data'!F130))","v":""},{"$f":"IF('SD Teacher''s Data'!E130=\"\",\"\",'SD Teacher''s Data'!E130)","v":""},{"$f":"IF('SD Teacher''s Data'!K130=\"\",\"\",'SD Teacher''s Data'!K130)","v":""},{"$f":"IF('SD Teacher''s Data'!B130=\"\",\"\",'SD Teacher''s Data'!B130)","v":""},{"$nulls":5},{"$f":"IF('SD Teacher''s Data'!J130=\"\",\"\",'SD Teacher''s Data'!J130)","v":""}]
[{"$f":"IF(Table1[[#This Row],[नाम]]=\"\",\"\",ROWS($A$1:A130))","v":""},{"$f":"PROPER(IF('SD Teacher''s Data'!A131=\"\",\"\",'SD Teacher''s Data'!A131))","v":""},{"$f":"PROPER(IF('SD Teacher''s Data'!F131=\"\",\"\",'SD Teacher''s Data'!F131))","v":""},{"$f":"IF('SD Teacher''s Data'!E131=\"\",\"\",'SD Teacher''s Data'!E131)","v":""},{"$f":"IF('SD Teacher''s Data'!K131=\"\",\"\",'SD Teacher''s Data'!K131)","v":""},{"$f":"IF('SD Teacher''s Data'!B131=\"\",\"\",'SD Teacher''s Data'!B131)","v":""},{"$nulls":5},{"$f":"IF('SD Teacher''s Data'!J131=\"\",\"\",'SD Teacher''s Data'!J131)","v":""}]
[{"$f":"IF(Table1[[#This Row],[नाम]]=\"\",\"\",ROWS($A$1:A131))","v":""},{"$f":"PROPER(IF('SD Teacher''s Data'!A132=\"\",\"\",'SD Teacher''s Data'!A132))","v":""},{"$f":"PROPER(IF('SD Teacher''s Data'!F132=\"\",\"\",'SD Teacher''s Data'!F132))","v":""},{"$f":"IF('SD Teacher''s Data'!E132=\"\",\"\",'SD Teacher''s Data'!E132)","v":""},{"$f":"IF('SD Teacher''s Data'!K132=\"\",\"\",'SD Teacher''s Data'!K132)","v":""},{"$f":"IF('SD Teacher''s Data'!B132=\"\",\"\",'SD Teacher''s Data'!B132)","v":""},{"$nulls":5},{"$f":"IF('SD Teacher''s Data'!J132=\"\",\"\",'SD Teacher''s Data'!J132)","v":""}]
[{"$f":"IF(Table1[[#This Row],[नाम]]=\"\",\"\",ROWS($A$1:A132))","v":""},{"$f":"PROPER(IF('SD Teacher''s Data'!A133=\"\",\"\",'SD Teacher''s Data'!A133))","v":""},{"$f":"PROPER(IF('SD Teacher''s Data'!F133=\"\",\"\",'SD Teacher''s Data'!F133))","v":""},{"$f":"IF('SD Teacher''s Data'!E133=\"\",\"\",'SD Teacher''s Data'!E133)","v":""},{"$f":"IF('SD Teacher''s Data'!K133=\"\",\"\",'SD Teacher''s Data'!K133)","v":""},{"$f":"IF('SD Teacher''s Data'!B133=\"\",\"\",'SD Teacher''s Data'!B133)","v":""},{"$nulls":5},{"$f":"IF('SD Teacher''s Data'!J133=\"\",\"\",'SD Teacher''s Data'!J133)","v":""}]
[{"$f":"IF(Table1[[#This Row],[नाम]]=\"\",\"\",ROWS($A$1:A133))","v":""},{"$f":"PROPER(IF('SD Teacher''s Data'!A134=\"\",\"\",'SD Teacher''s Data'!A134))","v":""},{"$f":"PROPER(IF('SD Teacher''s Data'!F134=\"\",\"\",'SD Teacher''s Data'!F134))","v":""},{"$f":"IF('SD Teacher''s Data'!E134=\"\",\"\",'SD Teacher''s Data'!E134)","v":""},{"$f":"IF('SD Teacher''s Data'!K134=\"\",\"\",'SD Teacher''s Data'!K134)","v":""},{"$f":"IF('SD Teacher''s Data'!B134=\"\",\"\",'SD Teacher''s Data'!B134)","v":""},{"$nulls":5},{"$f":"IF('SD Teacher''s Data'!J134=\"\",\"\",'SD Teacher''s Data'!J134)","v":""}]
[{"$f":"IF(Table1[[#This Row],[नाम]]=\"\",\"\",ROWS($A$1:A134))","v":""},{"$f":"PROPER(IF('SD Teacher''s Data'!A135=\"\",\"\",'SD Teacher''s Data'!A135))","v":""},{"$f":"PROPER(IF('SD Teacher''s Data'!F135=\"\",\"\",'SD Teacher''s Data'!F135))","v":""},{"$f":"IF('SD Teacher''s Data'!E135=\"\",\"\",'SD Teacher''s Data'!E135)","v":""},{"$f":"IF('SD Teacher''s Data'!K135=\"\",\"\",'SD Teacher''s Data'!K135)","v":""},{"$f":"IF('SD Teacher''s Data'!B135=\"\",\"\",'SD Teacher''s Data'!B135)","v":""},{"$nulls":5},{"$f":"IF('SD Teacher''s Data'!J135=\"\",\"\",'SD Teacher''s Data'!J135)","v":""}]
[{"$f":"IF(Table1[[#This Row],[नाम]]=\"\",\"\",ROWS($A$1:A135))","v":""},{"$f":"PROPER(IF('SD Teacher''s Data'!A136=\"\",\"\",'SD Teacher''s Data'!A136))","v":""},{"$f":"PROPER(IF('SD Teacher''s Data'!F136=\"\",\"\",'SD Teacher''s Data'!F136))","v":""},{"$f":"IF('SD Teacher''s Data'!E136=\"\",\"\",'SD Teacher''s Data'!E136)","v":""},{"$f":"IF('SD Teacher''s Data'!K136=\"\",\"\",'SD Teacher''s Data'!K136)","v":""},{"$f":"IF('SD Teacher''s Data'!B136=\"\",\"\",'SD Teacher''s Data'!B136)","v":""},{"$nulls":5},{"$f":"IF('SD Teacher''s Data'!J136=\"\",\"\",'SD Teacher''s Data'!J136)","v":""}]
[{"$f":"IF(Table1[[#This Row],[नाम]]=\"\",\"\",ROWS($A$1:A136))","v":""},{"$f":"PROPER(IF('SD Teacher''s Data'!A137=\"\",\"\",'SD Teacher''s Data'!A137))","v":""},{"$f":"PROPER(IF('SD Teacher''s Data'!F137=\"\",\"\",'SD Teacher''s Data'!F137))","v":""},{"$f":"IF('SD Teacher''s Data'!E137=\"\",\"\",'SD Teacher''s Data'!E137)","v":""},{"$f":"IF('SD Teacher''s Data'!K137=\"\",\"\",'SD Teacher''s Data'!K137)","v":""},{"$f":"IF('SD Teacher''s Data'!B137=\"\",\"\",'SD Teacher''s Data'!B137)","v":""},{"$nulls":5},{"$f":"IF('SD Teacher''s Data'!J137=\"\",\"\",'SD Teacher''s Data'!J137)","v":""}]
[{"$f":"IF(Table1[[#This Row],[नाम]]=\"\",\"\",ROWS($A$1:A137))","v":""},{"$f":"PROPER(IF('SD Teacher''s Data'!A138=\"\",\"\",'SD Teacher''s Data'!A138))","v":""},{"$f":"PROPER(IF('SD Teacher''s Data'!F138=\"\",\"\",'SD Teacher''s Data'!F138))","v":""},{"$f":"IF('SD Teacher''s Data'!E138=\"\",\"\",'SD Teacher''s Data'!E138)","v":""},{"$f":"IF('SD Teacher''s Data'!K138=\"\",\"\",'SD Teacher''s Data'!K138)","v":""},{"$f":"IF('SD Teacher''s Data'!B138=\"\",\"\",'SD Teacher''s Data'!B138)","v":""},{"$nulls":5},{"$f":"IF('SD Teacher''s Data'!J138=\"\",\"\",'SD Teacher''s Data'!J138)","v":""}]
[{"$f":"IF(Table1[[#This Row],[नाम]]=\"\",\"\",ROWS($A$1:A138))","v":""},{"$f":"PROPER(IF('SD Teacher''s Data'!A139=\"\",\"\",'SD Teacher''s Data'!A139))","v":""},{"$f":"PROPER(IF('SD Teacher''s Data'!F139=\"\",\"\",'SD Teacher''s Data'!F139))","v":""},{"$f":"IF('SD Teacher''s Data'!E139=\"\",\"\",'SD Teacher''s Data'!E139)","v":""},{"$f":"IF('SD Teacher''s Data'!K139=\"\",\"\",'SD Teacher''s Data'!K139)","v":""},{"$f":"IF('SD Teacher''s Data'!B139=\"\",\"\",'SD Teacher''s Data'!B139)","v":""},{"$nulls":5},{"$f":"IF('SD Teacher''s Data'!J139=\"\",\"\",'SD Teacher''s Data'!J139)","v":""}]
[{"$f":"IF(Table1[[#This Row],[नाम]]=\"\",\"\",ROWS($A$1:A139))","v":""},{"$f":"PROPER(IF('SD Teacher''s Data'!A140=\"\",\"\",'SD Teacher''s Data'!A140))","v":""},{"$f":"PROPER(IF('SD Teacher''s Data'!F140=\"\",\"\",'SD Teacher''s Data'!F140))","v":""},{"$f":"IF('SD Teacher''s Data'!E140=\"\",\"\",'SD Teacher''s Data'!E140)","v":""},{"$f":"IF('SD Teacher''s Data'!K140=\"\",\"\",'SD Teacher''s Data'!K140)","v":""},{"$f":"IF('SD Teacher''s Data'!B140=\"\",\"\",'SD Teacher''s Data'!B140)","v":""},{"$nulls":5},{"$f":"IF('SD Teacher''s Data'!J140=\"\",\"\",'SD Teacher''s Data'!J140)","v":""}]
[{"$f":"IF(Table1[[#This Row],[नाम]]=\"\",\"\",ROWS($A$1:A140))","v":""},{"$f":"PROPER(IF('SD Teacher''s Data'!A141=\"\",\"\",'SD Teacher''s Data'!A141))","v":""},{"$f":"PROPER(IF('SD Teacher''s Data'!F141=\"\",\"\",'SD Teacher''s Data'!F141))","v":""},{"$f":"IF('SD Teacher''s Data'!E141=\"\",\"\",'SD Teacher''s Data'!E141)","v":""},{"$f":"IF('SD Teacher''s Data'!K141=\"\",\"\",'SD Teacher''s Data'!K141)","v":""},{"$f":"IF('SD Teacher''s Data'!B141=\"\",\"\",'SD Teacher''s Data'!B141)","v":""},{"$nulls":5},{"$f":"IF('SD Teacher''s Data'!J141=\"\",\"\",'SD Teacher''s Data'!J141)","v":""}]
[{"$f":"IF(Table1[[#This Row],[नाम]]=\"\",\"\",ROWS($A$1:A141))","v":""},{"$f":"PROPER(IF('SD Teacher''s Data'!A142=\"\",\"\",'SD Teacher''s Data'!A142))","v":""},{"$f":"PROPER(IF('SD Teacher''s Data'!F142=\"\",\"\",'SD Teacher''s Data'!F142))","v":""},{"$f":"IF('SD Teacher''s Data'!E142=\"\",\"\",'SD Teacher''s Data'!E142)","v":""},{"$f":"IF('SD Teacher''s Data'!K142=\"\",\"\",'SD Teacher''s Data'!K142)","v":""},{"$f":"IF('SD Teacher''s Data'!B142=\"\",\"\",'SD Teacher''s Data'!B142)","v":""},{"$nulls":5},{"$f":"IF('SD Teacher''s Data'!J142=\"\",\"\",'SD Teacher''s Data'!J142)","v":""}]
[{"$f":"IF(Table1[[#This Row],[नाम]]=\"\",\"\",ROWS($A$1:A142))","v":""},{"$f":"PROPER(IF('SD Teacher''s Data'!A143=\"\",\"\",'SD Teacher''s Data'!A143))","v":""},{"$f":"PROPER(IF('SD Teacher''s Data'!F143=\"\",\"\",'SD Teacher''s Data'!F143))","v":""},{"$f":"IF('SD Teacher''s Data'!E143=\"\",\"\",'SD Teacher''s Data'!E143)","v":""},{"$f":"IF('SD Teacher''s Data'!K143=\"\",\"\",'SD Teacher''s Data'!K143)","v":""},{"$f":"IF('SD Teacher''s Data'!B143=\"\",\"\",'SD Teacher''s Data'!B143)","v":""},{"$nulls":5},{"$f":"IF('SD Teacher''s Data'!J143=\"\",\"\",'SD Teacher''s Data'!J143)","v":""}]
[{"$f":"IF(Table1[[#This Row],[नाम]]=\"\",\"\",ROWS($A$1:A143))","v":""},{"$f":"PROPER(IF('SD Teacher''s Data'!A144=\"\",\"\",'SD Teacher''s Data'!A144))","v":""},{"$f":"PROPER(IF('SD Teacher''s Data'!F144=\"\",\"\",'SD Teacher''s Data'!F144))","v":""},{"$f":"IF('SD Teacher''s Data'!E144=\"\",\"\",'SD Teacher''s Data'!E144)","v":""},{"$f":"IF('SD Teacher''s Data'!K144=\"\",\"\",'SD Teacher''s Data'!K144)","v":""},{"$f":"IF('SD Teacher''s Data'!B144=\"\",\"\",'SD Teacher''s Data'!B144)","v":""},{"$nulls":5},{"$f":"IF('SD Teacher''s Data'!J144=\"\",\"\",'SD Teacher''s Data'!J144)","v":""}]
[{"$f":"IF(Table1[[#This Row],[नाम]]=\"\",\"\",ROWS($A$1:A144))","v":""},{"$f":"PROPER(IF('SD Teacher''s Data'!A145=\"\",\"\",'SD Teacher''s Data'!A145))","v":""},{"$f":"PROPER(IF('SD Teacher''s Data'!F145=\"\",\"\",'SD Teacher''s Data'!F145))","v":""},{"$f":"IF('SD Teacher''s Data'!E145=\"\",\"\",'SD Teacher''s Data'!E145)","v":""},{"$f":"IF('SD Teacher''s Data'!K145=\"\",\"\",'SD Teacher''s Data'!K145)","v":""},{"$f":"IF('SD Teacher''s Data'!B145=\"\",\"\",'SD Teacher''s Data'!B145)","v":""},{"$nulls":5},{"$f":"IF('SD Teacher''s Data'!J145=\"\",\"\",'SD Teacher''s Data'!J145)","v":""}]
[{"$f":"IF(Table1[[#This Row],[नाम]]=\"\",\"\",ROWS($A$1:A145))","v":""},{"$f":"PROPER(IF('SD Teacher''s Data'!A146=\"\",\"\",'SD Teacher''s Data'!A146))","v":""},{"$f":"PROPER(IF('SD Teacher''s Data'!F146=\"\",\"\",'SD Teacher''s Data'!F146))","v":""},{"$f":"IF('SD Teacher''s Data'!E146=\"\",\"\",'SD Teacher''s Data'!E146)","v":""},{"$f":"IF('SD Teacher''s Data'!K146=\"\",\"\",'SD Teacher''s Data'!K146)","v":""},{"$f":"IF('SD Teacher''s Data'!B146=\"\",\"\",'SD Teacher''s Data'!B146)","v":""},{"$nulls":5},{"$f":"IF('SD Teacher''s Data'!J146=\"\",\"\",'SD Teacher''s Data'!J146)","v":""}]
[{"$f":"IF(Table1[[#This Row],[नाम]]=\"\",\"\",ROWS($A$1:A146))","v":""},{"$f":"PROPER(IF('SD Teacher''s Data'!A147=\"\",\"\",'SD Teacher''s Data'!A147))","v":""},{"$f":"PROPER(IF('SD Teacher''s Data'!F147=\"\",\"\",'SD Teacher''s Data'!F147))","v":""},{"$f":"IF('SD Teacher''s Data'!E147=\"\",\"\",'SD Teacher''s Data'!E147)","v":""},{"$f":"IF('SD Teacher''s Data'!K147=\"\",\"\",'SD Teacher''s Data'!K147)","v":""},{"$f":"IF('SD Teacher''s Data'!B147=\"\",\"\",'SD Teacher''s Data'!B147)","v":""},{"$nulls":5},{"$f":"IF('SD Teacher''s Data'!J147=\"\",\"\",'SD Teacher''s Data'!J147)","v":""}]
[{"$f":"IF(Table1[[#This Row],[नाम]]=\"\",\"\",ROWS($A$1:A147))","v":""},{"$f":"PROPER(IF('SD Teacher''s Data'!A148=\"\",\"\",'SD Teacher''s Data'!A148))","v":""},{"$f":"PROPER(IF('SD Teacher''s Data'!F148=\"\",\"\",'SD Teacher''s Data'!F148))","v":""},{"$f":"IF('SD Teacher''s Data'!E148=\"\",\"\",'SD Teacher''s Data'!E148)","v":""},{"$f":"IF('SD Teacher''s Data'!K148=\"\",\"\",'SD Teacher''s Data'!K148)","v":""},{"$f":"IF('SD Teacher''s Data'!B148=\"\",\"\",'SD Teacher''s Data'!B148)","v":""},{"$nulls":5},{"$f":"IF('SD Teacher''s Data'!J148=\"\",\"\",'SD Teacher''s Data'!J148)","v":""}]
[{"$f":"IF(Table1[[#This Row],[नाम]]=\"\",\"\",ROWS($A$1:A148))","v":""},{"$f":"PROPER(IF('SD Teacher''s Data'!A149=\"\",\"\",'SD Teacher''s Data'!A149))","v":""},{"$f":"PROPER(IF('SD Teacher''s Data'!F149=\"\",\"\",'SD Teacher''s Data'!F149))","v":""},{"$f":"IF('SD Teacher''s Data'!E149=\"\",\"\",'SD Teacher''s Data'!E149)","v":""},{"$f":"IF('SD Teacher''s Data'!K149=\"\",\"\",'SD Teacher''s Data'!K149)","v":""},{"$f":"IF('SD Teacher''s Data'!B149=\"\",\"\",'SD Teacher''s Data'!B149)","v":""},{"$nulls":5},{"$f":"IF('SD Teacher''s Data'!J149=\"\",\"\",'SD Teacher''s Data'!J149)","v":""}]
[{"$f":"IF(Table1[[#This Row],[नाम]]=\"\",\"\",ROWS($A$1:A149))","v":""},{"$f":"PROPER(IF('SD Teacher''s Data'!A150=\"\",\"\",'SD Teacher''s Data'!A150))","v":""},{"$f":"PROPER(IF('SD Teacher''s Data'!F150=\"\",\"\",'SD Teacher''s Data'!F150))","v":""},{"$f":"IF('SD Teacher''s Data'!E150=\"\",\"\",'SD Teacher''s Data'!E150)","v":""},{"$f":"IF('SD Teacher''s Data'!K150=\"\",\"\",'SD Teacher''s Data'!K150)","v":""},{"$f":"IF('SD Teacher''s Data'!B150=\"\",\"\",'SD Teacher''s Data'!B150)","v":""},{"$nulls":5},{"$f":"IF('SD Teacher''s Data'!J150=\"\",\"\",'SD Teacher''s Data'!J150)","v":""}]
[{"$f":"IF(Table1[[#This Row],[नाम]]=\"\",\"\",ROWS($A$1:A150))","v":""},{"$f":"PROPER(IF('SD Teacher''s Data'!A151=\"\",\"\",'SD Teacher''s Data'!A151))","v":""},{"$f":"PROPER(IF('SD Teacher''s Data'!F151=\"\",\"\",'SD Teacher''s Data'!F151))","v":""},{"$f":"IF('SD Teacher''s Data'!E151=\"\",\"\",'SD Teacher''s Data'!E151)","v":""},{"$f":"IF('SD Teacher''s Data'!K151=\"\",\"\",'SD Teacher''s Data'!K151)","v":""},{"$f":"IF('SD Teacher''s Data'!B151=\"\",\"\",'SD Teacher''s Data'!B151)","v":""},{"$nulls":5},{"$f":"IF('SD Teacher''s Data'!J151=\"\",\"\",'SD Teacher''s Data'!J151)","v":""}]
[{"$f":"IF(Table1[[#This Row],[नाम]]=\"\",\"\",ROWS($A$1:A151))","v":""},{"$f":"PROPER(IF('SD Teacher''s Data'!A152=\"\",\"\",'SD Teacher''s Data'!A152))","v":""},{"$f":"PROPER(IF('SD Teacher''s Data'!F152=\"\",\"\",'SD Teacher''s Data'!F152))","v":""},{"$f":"IF('SD Teacher''s Data'!E152=\"\",\"\",'SD Teacher''s Data'!E152)","v":""},{"$f":"IF('SD Teacher''s Data'!K152=\"\",\"\",'SD Teacher''s Data'!K152)","v":""},{"$f":"IF('SD Teacher''s Data'!B152=\"\",\"\",'SD Teacher''s Data'!B152)","v":""},{"$nulls":5},{"$f":"IF('SD Teacher''s Data'!J152=\"\",\"\",'SD Teacher''s Data'!J152)","v":""}]
[{"$f":"IF(Table1[[#This Row],[नाम]]=\"\",\"\",ROWS($A$1:A152))","v":""},{"$f":"PROPER(IF('SD Teacher''s Data'!A153=\"\",\"\",'SD Teacher''s Data'!A153))","v":""},{"$f":"PROPER(IF('SD Teacher''s Data'!F153=\"\",\"\",'SD Teacher''s Data'!F153))","v":""},{"$f":"IF('SD Teacher''s Data'!E153=\"\",\"\",'SD Teacher''s Data'!E153)","v":""},{"$f":"IF('SD Teacher''s Data'!K153=\"\",\"\",'SD Teacher''s Data'!K153)","v":""},{"$f":"IF('SD Teacher''s Data'!B153=\"\",\"\",'SD Teacher''s Data'!B153)","v":""},{"$nulls":5},{"$f":"IF('SD Teacher''s Data'!J153=\"\",\"\",'SD Teacher''s Data'!J153)","v":""}]
[{"$f":"IF(Table1[[#This Row],[नाम]]=\"\",\"\",ROWS($A$1:A153))","v":""},{"$f":"PROPER(IF('SD Teacher''s Data'!A154=\"\",\"\",'SD Teacher''s Data'!A154))","v":""},{"$f":"PROPER(IF('SD Teacher''s Data'!F154=\"\",\"\",'SD Teacher''s Data'!F154))","v":""},{"$f":"IF('SD Teacher''s Data'!E154=\"\",\"\",'SD Teacher''s Data'!E154)","v":""},{"$f":"IF('SD Teacher''s Data'!K154=\"\",\"\",'SD Teacher''s Data'!K154)","v":""},{"$f":"IF('SD Teacher''s Data'!B154=\"\",\"\",'SD Teacher''s Data'!B154)","v":""},{"$nulls":5},{"$f":"IF('SD Teacher''s Data'!J154=\"\",\"\",'SD Teacher''s Data'!J154)","v":""}]
[{"$f":"IF(Table1[[#This Row],[नाम]]=\"\",\"\",ROWS($A$1:A154))","v":""},{"$f":"PROPER(IF('SD Teacher''s Data'!A155=\"\",\"\",'SD Teacher''s Data'!A155))","v":""},{"$f":"PROPER(IF('SD Teacher''s Data'!F155=\"\",\"\",'SD Teacher''s Data'!F155))","v":""},{"$f":"IF('SD Teacher''s Data'!E155=\"\",\"\",'SD Teacher''s Data'!E155)","v":""},{"$f":"IF('SD Teacher''s Data'!K155=\"\",\"\",'SD Teacher''s Data'!K155)","v":""},{"$f":"IF('SD Teacher''s Data'!B155=\"\",\"\",'SD Teacher''s Data'!B155)","v":""},{"$nulls":5},{"$f":"IF('SD Teacher''s Data'!J155=\"\",\"\",'SD Teacher''s Data'!J155)","v":""}]
[{"$f":"IF(Table1[[#This Row],[नाम]]=\"\",\"\",ROWS($A$1:A155))","v":""},{"$f":"PROPER(IF('SD Teacher''s Data'!A156=\"\",\"\",'SD Teacher''s Data'!A156))","v":""},{"$f":"PROPER(IF('SD Teacher''s Data'!F156=\"\",\"\",'SD Teacher''s Data'!F156))","v":""},{"$f":"IF('SD Teacher''s Data'!E156=\"\",\"\",'SD Teacher''s Data'!E156)","v":""},{"$f":"IF('SD Teacher''s Data'!K156=\"\",\"\",'SD Teacher''s Data'!K156)","v":""},{"$f":"IF('SD Teacher''s Data'!B156=\"\",\"\",'SD Teacher''s Data'!B156)","v":""},{"$nulls":5},{"$f":"IF('SD Teacher''s Data'!J156=\"\",\"\",'SD Teacher''s Data'!J156)","v":""}]
[{"$f":"IF(Table1[[#This Row],[नाम]]=\"\",\"\",ROWS($A$1:A156))","v":""},{"$f":"PROPER(IF('SD Teacher''s Data'!A157=\"\",\"\",'SD Teacher''s Data'!A157))","v":""},{"$f":"PROPER(IF('SD Teacher''s Data'!F157=\"\",\"\",'SD Teacher''s Data'!F157))","v":""},{"$f":"IF('SD Teacher''s Data'!E157=\"\",\"\",'SD Teacher''s Data'!E157)","v":""},{"$f":"IF('SD Teacher''s Data'!K157=\"\",\"\",'SD Teacher''s Data'!K157)","v":""},{"$f":"IF('SD Teacher''s Data'!B157=\"\",\"\",'SD Teacher''s Data'!B157)","v":""},{"$nulls":5},{"$f":"IF('SD Teacher''s Data'!J157=\"\",\"\",'SD Teacher''s Data'!J157)","v":""}]
[{"$f":"IF(Table1[[#This Row],[नाम]]=\"\",\"\",ROWS($A$1:A157))","v":""},{"$f":"PROPER(IF('SD Teacher''s Data'!A158=\"\",\"\",'SD Teacher''s Data'!A158))","v":""},{"$f":"PROPER(IF('SD Teacher''s Data'!F158=\"\",\"\",'SD Teacher''s Data'!F158))","v":""},{"$f":"IF('SD Teacher''s Data'!E158=\"\",\"\",'SD Teacher''s Data'!E158)","v":""},{"$f":"IF('SD Teacher''s Data'!K158=\"\",\"\",'SD Teacher''s Data'!K158)","v":""},{"$f":"IF('SD Teacher''s Data'!B158=\"\",\"\",'SD Teacher''s Data'!B158)","v":""},{"$nulls":5},{"$f":"IF('SD Teacher''s Data'!J158=\"\",\"\",'SD Teacher''s Data'!J158)","v":""}]
[{"$f":"IF(Table1[[#This Row],[नाम]]=\"\",\"\",ROWS($A$1:A158))","v":""},{"$f":"PROPER(IF('SD Teacher''s Data'!A159=\"\",\"\",'SD Teacher''s Data'!A159))","v":""},{"$f":"PROPER(IF('SD Teacher''s Data'!F159=\"\",\"\",'SD Teacher''s Data'!F159))","v":""},{"$f":"IF('SD Teacher''s Data'!E159=\"\",\"\",'SD Teacher''s Data'!E159)","v":""},{"$f":"IF('SD Teacher''s Data'!K159=\"\",\"\",'SD Teacher''s Data'!K159)","v":""},{"$f":"IF('SD Teacher''s Data'!B159=\"\",\"\",'SD Teacher''s Data'!B159)","v":""},{"$nulls":5},{"$f":"IF('SD Teacher''s Data'!J159=\"\",\"\",'SD Teacher''s Data'!J159)","v":""}]
[{"$f":"IF(Table1[[#This Row],[नाम]]=\"\",\"\",ROWS($A$1:A159))","v":""},{"$f":"PROPER(IF('SD Teacher''s Data'!A160=\"\",\"\",'SD Teacher''s Data'!A160))","v":""},{"$f":"PROPER(IF('SD Teacher''s Data'!F160=\"\",\"\",'SD Teacher''s Data'!F160))","v":""},{"$f":"IF('SD Teacher''s Data'!E160=\"\",\"\",'SD Teacher''s Data'!E160)","v":""},{"$f":"IF('SD Teacher''s Data'!K160=\"\",\"\",'SD Teacher''s Data'!K160)","v":""},{"$f":"IF('SD Teacher''s Data'!B160=\"\",\"\",'SD Teacher''s Data'!B160)","v":""},{"$nulls":5},{"$f":"IF('SD Teacher''s Data'!J160=\"\",\"\",'SD Teacher''s Data'!J160)","v":""}]
[{"$f":"IF(Table1[[#This Row],[नाम]]=\"\",\"\",ROWS($A$1:A160))","v":""},{"$f":"PROPER(IF('SD Teacher''s Data'!A161=\"\",\"\",'SD Teacher''s Data'!A161))","v":""},{"$f":"PROPER(IF('SD Teacher''s Data'!F161=\"\",\"\",'SD Teacher''s Data'!F161))","v":""},{"$f":"IF('SD Teacher''s Data'!E161=\"\",\"\",'SD Teacher''s Data'!E161)","v":""},{"$f":"IF('SD Teacher''s Data'!K161=\"\",\"\",'SD Teacher''s Data'!K161)","v":""},{"$f":"IF('SD Teacher''s Data'!B161=\"\",\"\",'SD Teacher''s Data'!B161)","v":""},{"$nulls":5},{"$f":"IF('SD Teacher''s Data'!J161=\"\",\"\",'SD Teacher''s Data'!J161)","v":""}]
[{"$f":"IF(Table1[[#This Row],[नाम]]=\"\",\"\",ROWS($A$1:A161))","v":""},{"$f":"PROPER(IF('SD Teacher''s Data'!A162=\"\",\"\",'SD Teacher''s Data'!A162))","v":""},{"$f":"PROPER(IF('SD Teacher''s Data'!F162=\"\",\"\",'SD Teacher''s Data'!F162))","v":""},{"$f":"IF('SD Teacher''s Data'!E162=\"\",\"\",'SD Teacher''s Data'!E162)","v":""},{"$f":"IF('SD Teacher''s Data'!K162=\"\",\"\",'SD Teacher''s Data'!K162)","v":""},{"$f":"IF('SD Teacher''s Data'!B162=\"\",\"\",'SD Teacher''s Data'!B162)","v":""},{"$nulls":5},{"$f":"IF('SD Teacher''s Data'!J162=\"\",\"\",'SD Teacher''s Data'!J162)","v":""}]
[{"$f":"IF(Table1[[#This Row],[नाम]]=\"\",\"\",ROWS($A$1:A162))","v":""},{"$f":"PROPER(IF('SD Teacher''s Data'!A163=\"\",\"\",'SD Teacher''s Data'!A163))","v":""},{"$f":"PROPER(IF('SD Teacher''s Data'!F163=\"\",\"\",'SD Teacher''s Data'!F163))","v":""},{"$f":"IF('SD Teacher''s Data'!E163=\"\",\"\",'SD Teacher''s Data'!E163)","v":""},{"$f":"IF('SD Teacher''s Data'!K163=\"\",\"\",'SD Teacher''s Data'!K163)","v":""},{"$f":"IF('SD Teacher''s Data'!B163=\"\",\"\",'SD Teacher''s Data'!B163)","v":""},{"$nulls":5},{"$f":"IF('SD Teacher''s Data'!J163=\"\",\"\",'SD Teacher''s Data'!J163)","v":""}]
[{"$f":"IF(Table1[[#This Row],[नाम]]=\"\",\"\",ROWS($A$1:A163))","v":""},{"$f":"PROPER(IF('SD Teacher''s Data'!A164=\"\",\"\",'SD Teacher''s Data'!A164))","v":""},{"$f":"PROPER(IF('SD Teacher''s Data'!F164=\"\",\"\",'SD Teacher''s Data'!F164))","v":""},{"$f":"IF('SD Teacher''s Data'!E164=\"\",\"\",'SD Teacher''s Data'!E164)","v":""},{"$f":"IF('SD Teacher''s Data'!K164=\"\",\"\",'SD Teacher''s Data'!K164)","v":""},{"$f":"IF('SD Teacher''s Data'!B164=\"\",\"\",'SD Teacher''s Data'!B164)","v":""},{"$nulls":5},{"$f":"IF('SD Teacher''s Data'!J164=\"\",\"\",'SD Teacher''s Data'!J164)","v":""}]
[{"$f":"IF(Table1[[#This Row],[नाम]]=\"\",\"\",ROWS($A$1:A164))","v":""},{"$f":"PROPER(IF('SD Teacher''s Data'!A165=\"\",\"\",'SD Teacher''s Data'!A165))","v":""},{"$f":"PROPER(IF('SD Teacher''s Data'!F165=\"\",\"\",'SD Teacher''s Data'!F165))","v":""},{"$f":"IF('SD Teacher''s Data'!E165=\"\",\"\",'SD Teacher''s Data'!E165)","v":""},{"$f":"IF('SD Teacher''s Data'!K165=\"\",\"\",'SD Teacher''s Data'!K165)","v":""},{"$f":"IF('SD Teacher''s Data'!B165=\"\",\"\",'SD Teacher''s Data'!B165)","v":""},{"$nulls":5},{"$f":"IF('SD Teacher''s Data'!J165=\"\",\"\",'SD Teacher''s Data'!J165)","v":""}]
[{"$f":"IF(Table1[[#This Row],[नाम]]=\"\",\"\",ROWS($A$1:A165))","v":""},{"$f":"PROPER(IF('SD Teacher''s Data'!A166=\"\",\"\",'SD Teacher''s Data'!A166))","v":""},{"$f":"PROPER(IF('SD Teacher''s Data'!F166=\"\",\"\",'SD Teacher''s Data'!F166))","v":""},{"$f":"IF('SD Teacher''s Data'!E166=\"\",\"\",'SD Teacher''s Data'!E166)","v":""},{"$f":"IF('SD Teacher''s Data'!K166=\"\",\"\",'SD Teacher''s Data'!K166)","v":""},{"$f":"IF('SD Teacher''s Data'!B166=\"\",\"\",'SD Teacher''s Data'!B166)","v":""},{"$nulls":5},{"$f":"IF('SD Teacher''s Data'!J166=\"\",\"\",'SD Teacher''s Data'!J166)","v":""}]
[{"$f":"IF(Table1[[#This Row],[नाम]]=\"\",\"\",ROWS($A$1:A166))","v":""},{"$f":"PROPER(IF('SD Teacher''s Data'!A167=\"\",\"\",'SD Teacher''s Data'!A167))","v":""},{"$f":"PROPER(IF('SD Teacher''s Data'!F167=\"\",\"\",'SD Teacher''s Data'!F167))","v":""},{"$f":"IF('SD Teacher''s Data'!E167=\"\",\"\",'SD Teacher''s Data'!E167)","v":""},{"$f":"IF('SD Teacher''s Data'!K167=\"\",\"\",'SD Teacher''s Data'!K167)","v":""},{"$f":"IF('SD Teacher''s Data'!B167=\"\",\"\",'SD Teacher''s Data'!B167)","v":""},{"$nulls":5},{"$f":"IF('SD Teacher''s Data'!J167=\"\",\"\",'SD Teacher''s Data'!J167)","v":""}]
[{"$f":"IF(Table1[[#This Row],[नाम]]=\"\",\"\",ROWS($A$1:A167))","v":""},{"$f":"PROPER(IF('SD Teacher''s Data'!A168=\"\",\"\",'SD Teacher''s Data'!A168))","v":""},{"$f":"PROPER(IF('SD Teacher''s Data'!F168=\"\",\"\",'SD Teacher''s Data'!F168))","v":""},{"$f":"IF('SD Teacher''s Data'!E168=\"\",\"\",'SD Teacher''s Data'!E168)","v":""},{"$f":"IF('SD Teacher''s Data'!K168=\"\",\"\",'SD Teacher''s Data'!K168)","v":""},{"$f":"IF('SD Teacher''s Data'!B168=\"\",\"\",'SD Teacher''s Data'!B168)","v":""},{"$nulls":5},{"$f":"IF('SD Teacher''s Data'!J168=\"\",\"\",'SD Teacher''s Data'!J168)","v":""}]
[{"$f":"IF(Table1[[#This Row],[नाम]]=\"\",\"\",ROWS($A$1:A168))","v":""},{"$f":"PROPER(IF('SD Teacher''s Data'!A169=\"\",\"\",'SD Teacher''s Data'!A169))","v":""},{"$f":"PROPER(IF('SD Teacher''s Data'!F169=\"\",\"\",'SD Teacher''s Data'!F169))","v":""},{"$f":"IF('SD Teacher''s Data'!E169=\"\",\"\",'SD Teacher''s Data'!E169)","v":""},{"$f":"IF('SD Teacher''s Data'!K169=\"\",\"\",'SD Teacher''s Data'!K169)","v":""},{"$f":"IF('SD Teacher''s Data'!B169=\"\",\"\",'SD Teacher''s Data'!B169)","v":""},{"$nulls":5},{"$f":"IF('SD Teacher''s Data'!J169=\"\",\"\",'SD Teacher''s Data'!J169)","v":""}]
[{"$f":"IF(Table1[[#This Row],[नाम]]=\"\",\"\",ROWS($A$1:A169))","v":""},{"$f":"PROPER(IF('SD Teacher''s Data'!A170=\"\",\"\",'SD Teacher''s Data'!A170))","v":""},{"$f":"PROPER(IF('SD Teacher''s Data'!F170=\"\",\"\",'SD Teacher''s Data'!F170))","v":""},{"$f":"IF('SD Teacher''s Data'!E170=\"\",\"\",'SD Teacher''s Data'!E170)","v":""},{"$f":"IF('SD Teacher''s Data'!K170=\"\",\"\",'SD Teacher''s Data'!K170)","v":""},{"$f":"IF('SD Teacher''s Data'!B170=\"\",\"\",'SD Teacher''s Data'!B170)","v":""},{"$nulls":5},{"$f":"IF('SD Teacher''s Data'!J170=\"\",\"\",'SD Teacher''s Data'!J170)","v":""}]
[{"$f":"IF(Table1[[#This Row],[नाम]]=\"\",\"\",ROWS($A$1:A170))","v":""},{"$f":"PROPER(IF('SD Teacher''s Data'!A171=\"\",\"\",'SD Teacher''s Data'!A171))","v":""},{"$f":"PROPER(IF('SD Teacher''s Data'!F171=\"\",\"\",'SD Teacher''s Data'!F171))","v":""},{"$f":"IF('SD Teacher''s Data'!E171=\"\",\"\",'SD Teacher''s Data'!E171)","v":""},{"$f":"IF('SD Teacher''s Data'!K171=\"\",\"\",'SD Teacher''s Data'!K171)","v":""},{"$f":"IF('SD Teacher''s Data'!B171=\"\",\"\",'SD Teacher''s Data'!B171)","v":""},{"$nulls":5},{"$f":"IF('SD Teacher''s Data'!J171=\"\",\"\",'SD Teacher''s Data'!J171)","v":""}]
[{"$f":"IF(Table1[[#This Row],[नाम]]=\"\",\"\",ROWS($A$1:A171))","v":""},{"$f":"PROPER(IF('SD Teacher''s Data'!A172=\"\",\"\",'SD Teacher''s Data'!A172))","v":""},{"$f":"PROPER(IF('SD Teacher''s Data'!F172=\"\",\"\",'SD Teacher''s Data'!F172))","v":""},{"$f":"IF('SD Teacher''s Data'!E172=\"\",\"\",'SD Teacher''s Data'!E172)","v":""},{"$f":"IF('SD Teacher''s Data'!K172=\"\",\"\",'SD Teacher''s Data'!K172)","v":""},{"$f":"IF('SD Teacher''s Data'!B172=\"\",\"\",'SD Teacher''s Data'!B172)","v":""},{"$nulls":5},{"$f":"IF('SD Teacher''s Data'!J172=\"\",\"\",'SD Teacher''s Data'!J172)","v":""}]
[{"$f":"IF(Table1[[#This Row],[नाम]]=\"\",\"\",ROWS($A$1:A172))","v":""},{"$f":"PROPER(IF('SD Teacher''s Data'!A173=\"\",\"\",'SD Teacher''s Data'!A173))","v":""},{"$f":"PROPER(IF('SD Teacher''s Data'!F173=\"\",\"\",'SD Teacher''s Data'!F173))","v":""},{"$f":"IF('SD Teacher''s Data'!E173=\"\",\"\",'SD Teacher''s Data'!E173)","v":""},{"$f":"IF('SD Teacher''s Data'!K173=\"\",\"\",'SD Teacher''s Data'!K173)","v":""},{"$f":"IF('SD Teacher''s Data'!B173=\"\",\"\",'SD Teacher''s Data'!B173)","v":""},{"$nulls":5},{"$f":"IF('SD Teacher''s Data'!J173=\"\",\"\",'SD Teacher''s Data'!J173)","v":""}]
[{"$f":"IF(Table1[[#This Row],[नाम]]=\"\",\"\",ROWS($A$1:A173))","v":""},{"$f":"PROPER(IF('SD Teacher''s Data'!A174=\"\",\"\",'SD Teacher''s Data'!A174))","v":""},{"$f":"PROPER(IF('SD Teacher''s Data'!F174=\"\",\"\",'SD Teacher''s Data'!F174))","v":""},{"$f":"IF('SD Teacher''s Data'!E174=\"\",\"\",'SD Teacher''s Data'!E174)","v":""},{"$f":"IF('SD Teacher''s Data'!K174=\"\",\"\",'SD Teacher''s Data'!K174)","v":""},{"$f":"IF('SD Teacher''s Data'!B174=\"\",\"\",'SD Teacher''s Data'!B174)","v":""},{"$nulls":5},{"$f":"IF('SD Teacher''s Data'!J174=\"\",\"\",'SD Teacher''s Data'!J174)","v":""}]
[{"$f":"IF(Table1[[#This Row],[नाम]]=\"\",\"\",ROWS($A$1:A174))","v":""},{"$f":"PROPER(IF('SD Teacher''s Data'!A175=\"\",\"\",'SD Teacher''s Data'!A175))","v":""},{"$f":"PROPER(IF('SD Teacher''s Data'!F175=\"\",\"\",'SD Teacher''s Data'!F175))","v":""},{"$f":"IF('SD Teacher''s Data'!E175=\"\",\"\",'SD Teacher''s Data'!E175)","v":""},{"$f":"IF('SD Teacher''s Data'!K175=\"\",\"\",'SD Teacher''s Data'!K175)","v":""},{"$f":"IF('SD Teacher''s Data'!B175=\"\",\"\",'SD Teacher''s Data'!B175)","v":""},{"$nulls":5},{"$f":"IF('SD Teacher''s Data'!J175=\"\",\"\",'SD Teacher''s Data'!J175)","v":""}]
[{"$f":"IF(Table1[[#This Row],[नाम]]=\"\",\"\",ROWS($A$1:A175))","v":""},{"$f":"PROPER(IF('SD Teacher''s Data'!A176=\"\",\"\",'SD Teacher''s Data'!A176))","v":""},{"$f":"PROPER(IF('SD Teacher''s Data'!F176=\"\",\"\",'SD Teacher''s Data'!F176))","v":""},{"$f":"IF('SD Teacher''s Data'!E176=\"\",\"\",'SD Teacher''s Data'!E176)","v":""},{"$f":"IF('SD Teacher''s Data'!K176=\"\",\"\",'SD Teacher''s Data'!K176)","v":""},{"$f":"IF('SD Teacher''s Data'!B176=\"\",\"\",'SD Teacher''s Data'!B176)","v":""},{"$nulls":5},{"$f":"IF('SD Teacher''s Data'!J176=\"\",\"\",'SD Teacher''s Data'!J176)","v":""}]
[{"$f":"IF(Table1[[#This Row],[नाम]]=\"\",\"\",ROWS($A$1:A176))","v":""},{"$f":"PROPER(IF('SD Teacher''s Data'!A177=\"\",\"\",'SD Teacher''s Data'!A177))","v":""},{"$f":"PROPER(IF('SD Teacher''s Data'!F177=\"\",\"\",'SD Teacher''s Data'!F177))","v":""},{"$f":"IF('SD Teacher''s Data'!E177=\"\",\"\",'SD Teacher''s Data'!E177)","v":""},{"$f":"IF('SD Teacher''s Data'!K177=\"\",\"\",'SD Teacher''s Data'!K177)","v":""},{"$f":"IF('SD Teacher''s Data'!B177=\"\",\"\",'SD Teacher''s Data'!B177)","v":""},{"$nulls":5},{"$f":"IF('SD Teacher''s Data'!J177=\"\",\"\",'SD Teacher''s Data'!J177)","v":""}]
[{"$f":"IF(Table1[[#This Row],[नाम]]=\"\",\"\",ROWS($A$1:A177))","v":""},{"$f":"PROPER(IF('SD Teacher''s Data'!A178=\"\",\"\",'SD Teacher''s Data'!A178))","v":""},{"$f":"PROPER(IF('SD Teacher''s Data'!F178=\"\",\"\",'SD Teacher''s Data'!F178))","v":""},{"$f":"IF('SD Teacher''s Data'!E178=\"\",\"\",'SD Teacher''s Data'!E178)","v":""},{"$f":"IF('SD Teacher''s Data'!K178=\"\",\"\",'SD Teacher''s Data'!K178)","v":""},{"$f":"IF('SD Teacher''s Data'!B178=\"\",\"\",'SD Teacher''s Data'!B178)","v":""},{"$nulls":5},{"$f":"IF('SD Teacher''s Data'!J178=\"\",\"\",'SD Teacher''s Data'!J178)","v":""}]
[{"$f":"IF(Table1[[#This Row],[नाम]]=\"\",\"\",ROWS($A$1:A178))","v":""},{"$f":"PROPER(IF('SD Teacher''s Data'!A179=\"\",\"\",'SD Teacher''s Data'!A179))","v":""},{"$f":"PROPER(IF('SD Teacher''s Data'!F179=\"\",\"\",'SD Teacher''s Data'!F179))","v":""},{"$f":"IF('SD Teacher''s Data'!E179=\"\",\"\",'SD Teacher''s Data'!E179)","v":""},{"$f":"IF('SD Teacher''s Data'!K179=\"\",\"\",'SD Teacher''s Data'!K179)","v":""},{"$f":"IF('SD Teacher''s Data'!B179=\"\",\"\",'SD Teacher''s Data'!B179)","v":""},{"$nulls":5},{"$f":"IF('SD Teacher''s Data'!J179=\"\",\"\",'SD Teacher''s Data'!J179)","v":""}]
[{"$f":"IF(Table1[[#This Row],[नाम]]=\"\",\"\",ROWS($A$1:A179))","v":""},{"$f":"PROPER(IF('SD Teacher''s Data'!A180=\"\",\"\",'SD Teacher''s Data'!A180))","v":""},{"$f":"PROPER(IF('SD Teacher''s Data'!F180=\"\",\"\",'SD Teacher''s Data'!F180))","v":""},{"$f":"IF('SD Teacher''s Data'!E180=\"\",\"\",'SD Teacher''s Data'!E180)","v":""},{"$f":"IF('SD Teacher''s Data'!K180=\"\",\"\",'SD Teacher''s Data'!K180)","v":""},{"$f":"IF('SD Teacher''s Data'!B180=\"\",\"\",'SD Teacher''s Data'!B180)","v":""},{"$nulls":5},{"$f":"IF('SD Teacher''s Data'!J180=\"\",\"\",'SD Teacher''s Data'!J180)","v":""}]
[{"$f":"IF(Table1[[#This Row],[नाम]]=\"\",\"\",ROWS($A$1:A180))","v":""},{"$f":"PROPER(IF('SD Teacher''s Data'!A181=\"\",\"\",'SD Teacher''s Data'!A181))","v":""},{"$f":"PROPER(IF('SD Teacher''s Data'!F181=\"\",\"\",'SD Teacher''s Data'!F181))","v":""},{"$f":"IF('SD Teacher''s Data'!E181=\"\",\"\",'SD Teacher''s Data'!E181)","v":""},{"$f":"IF('SD Teacher''s Data'!K181=\"\",\"\",'SD Teacher''s Data'!K181)","v":""},{"$f":"IF('SD Teacher''s Data'!B181=\"\",\"\",'SD Teacher''s Data'!B181)","v":""},{"$nulls":5},{"$f":"IF('SD Teacher''s Data'!J181=\"\",\"\",'SD Teacher''s Data'!J181)","v":""}]
[{"$f":"IF(Table1[[#This Row],[नाम]]=\"\",\"\",ROWS($A$1:A181))","v":""},{"$f":"PROPER(IF('SD Teacher''s Data'!A182=\"\",\"\",'SD Teacher''s Data'!A182))","v":""},{"$f":"PROPER(IF('SD Teacher''s Data'!F182=\"\",\"\",'SD Teacher''s Data'!F182))","v":""},{"$f":"IF('SD Teacher''s Data'!E182=\"\",\"\",'SD Teacher''s Data'!E182)","v":""},{"$f":"IF('SD Teacher''s Data'!K182=\"\",\"\",'SD Teacher''s Data'!K182)","v":""},{"$f":"IF('SD Teacher''s Data'!B182=\"\",\"\",'SD Teacher''s Data'!B182)","v":""},{"$nulls":5},{"$f":"IF('SD Teacher''s Data'!J182=\"\",\"\",'SD Teacher''s Data'!J182)","v":""}]
[{"$f":"IF(Table1[[#This Row],[नाम]]=\"\",\"\",ROWS($A$1:A182))","v":""},{"$f":"PROPER(IF('SD Teacher''s Data'!A183=\"\",\"\",'SD Teacher''s Data'!A183))","v":""},{"$f":"PROPER(IF('SD Teacher''s Data'!F183=\"\",\"\",'SD Teacher''s Data'!F183))","v":""},{"$f":"IF('SD Teacher''s Data'!E183=\"\",\"\",'SD Teacher''s Data'!E183)","v":""},{"$f":"IF('SD Teacher''s Data'!K183=\"\",\"\",'SD Teacher''s Data'!K183)","v":""},{"$f":"IF('SD Teacher''s Data'!B183=\"\",\"\",'SD Teacher''s Data'!B183)","v":""},{"$nulls":5},{"$f":"IF('SD Teacher''s Data'!J183=\"\",\"\",'SD Teacher''s Data'!J183)","v":""}]
[{"$f":"IF(Table1[[#This Row],[नाम]]=\"\",\"\",ROWS($A$1:A183))","v":""},{"$f":"PROPER(IF('SD Teacher''s Data'!A184=\"\",\"\",'SD Teacher''s Data'!A184))","v":""},{"$f":"PROPER(IF('SD Teacher''s Data'!F184=\"\",\"\",'SD Teacher''s Data'!F184))","v":""},{"$f":"IF('SD Teacher''s Data'!E184=\"\",\"\",'SD Teacher''s Data'!E184)","v":""},{"$f":"IF('SD Teacher''s Data'!K184=\"\",\"\",'SD Teacher''s Data'!K184)","v":""},{"$f":"IF('SD Teacher''s Data'!B184=\"\",\"\",'SD Teacher''s Data'!B184)","v":""},{"$nulls":5},{"$f":"IF('SD Teacher''s Data'!J184=\"\",\"\",'SD Teacher''s Data'!J184)","v":""}]
[{"$f":"IF(Table1[[#This Row],[नाम]]=\"\",\"\",ROWS($A$1:A184))","v":""},{"$f":"PROPER(IF('SD Teacher''s Data'!A185=\"\",\"\",'SD Teacher''s Data'!A185))","v":""},{"$f":"PROPER(IF('SD Teacher''s Data'!F185=\"\",\"\",'SD Teacher''s Data'!F185))","v":""},{"$f":"IF('SD Teacher''s Data'!E185=\"\",\"\",'SD Teacher''s Data'!E185)","v":""},{"$f":"IF('SD Teacher''s Data'!K185=\"\",\"\",'SD Teacher''s Data'!K185)","v":""},{"$f":"IF('SD Teacher''s Data'!B185=\"\",\"\",'SD Teacher''s Data'!B185)","v":""},{"$nulls":5},{"$f":"IF('SD Teacher''s Data'!J185=\"\",\"\",'SD Teacher''s Data'!J185)","v":""}]
[{"$f":"IF(Table1[[#This Row],[नाम]]=\"\",\"\",ROWS($A$1:A185))","v":""},{"$f":"PROPER(IF('SD Teacher''s Data'!A186=\"\",\"\",'SD Teacher''s Data'!A186))","v":""},{"$f":"PROPER(IF('SD Teacher''s Data'!F186=\"\",\"\",'SD Teacher''s Data'!F186))","v":""},{"$f":"IF('SD Teacher''s Data'!E186=\"\",\"\",'SD Teacher''s Data'!E186)","v":""},{"$f":"IF('SD Teacher''s Data'!K186=\"\",\"\",'SD Teacher''s Data'!K186)","v":""},{"$f":"IF('SD Teacher''s Data'!B186=\"\",\"\",'SD Teacher''s Data'!B186)","v":""},{"$nulls":5},{"$f":"IF('SD Teacher''s Data'!J186=\"\",\"\",'SD Teacher''s Data'!J186)","v":""}]
[{"$f":"IF(Table1[[#This Row],[नाम]]=\"\",\"\",ROWS($A$1:A186))","v":""},{"$f":"PROPER(IF('SD Teacher''s Data'!A187=\"\",\"\",'SD Teacher''s Data'!A187))","v":""},{"$f":"PROPER(IF('SD Teacher''s Data'!F187=\"\",\"\",'SD Teacher''s Data'!F187))","v":""},{"$f":"IF('SD Teacher''s Data'!E187=\"\",\"\",'SD Teacher''s Data'!E187)","v":""},{"$f":"IF('SD Teacher''s Data'!K187=\"\",\"\",'SD Teacher''s Data'!K187)","v":""},{"$f":"IF('SD Teacher''s Data'!B187=\"\",\"\",'SD Teacher''s Data'!B187)","v":""},{"$nulls":5},{"$f":"IF('SD Teacher''s Data'!J187=\"\",\"\",'SD Teacher''s Data'!J187)","v":""}]
[{"$f":"IF(Table1[[#This Row],[नाम]]=\"\",\"\",ROWS($A$1:A187))","v":""},{"$f":"PROPER(IF('SD Teacher''s Data'!A188=\"\",\"\",'SD Teacher''s Data'!A188))","v":""},{"$f":"PROPER(IF('SD Teacher''s Data'!F188=\"\",\"\",'SD Teacher''s Data'!F188))","v":""},{"$f":"IF('SD Teacher''s Data'!E188=\"\",\"\",'SD Teacher''s Data'!E188)","v":""},{"$f":"IF('SD Teacher''s Data'!K188=\"\",\"\",'SD Teacher''s Data'!K188)","v":""},{"$f":"IF('SD Teacher''s Data'!B188=\"\",\"\",'SD Teacher''s Data'!B188)","v":""},{"$nulls":5},{"$f":"IF('SD Teacher''s Data'!J188=\"\",\"\",'SD Teacher''s Data'!J188)","v":""}]
[{"$f":"IF(Table1[[#This Row],[नाम]]=\"\",\"\",ROWS($A$1:A188))","v":""},{"$f":"PROPER(IF('SD Teacher''s Data'!A189=\"\",\"\",'SD Teacher''s Data'!A189))","v":""},{"$f":"PROPER(IF('SD Teacher''s Data'!F189=\"\",\"\",'SD Teacher''s Data'!F189))","v":""},{"$f":"IF('SD Teacher''s Data'!E189=\"\",\"\",'SD Teacher''s Data'!E189)","v":""},{"$f":"IF('SD Teacher''s Data'!K189=\"\",\"\",'SD Teacher''s Data'!K189)","v":""},{"$f":"IF('SD Teacher''s Data'!B189=\"\",\"\",'SD Teacher''s Data'!B189)","v":""},{"$nulls":5},{"$f":"IF('SD Teacher''s Data'!J189=\"\",\"\",'SD Teacher''s Data'!J189)","v":""}]
[{"$f":"IF(Table1[[#This Row],[नाम]]=\"\",\"\",ROWS($A$1:A189))","v":""},{"$f":"PROPER(IF('SD Teacher''s Data'!A190=\"\",\"\",'SD Teacher''s Data'!A190))","v":""},{"$f":"PROPER(IF('SD Teacher''s Data'!F190=\"\",\"\",'SD Teacher''s Data'!F190))","v":""},{"$f":"IF('SD Teacher''s Data'!E190=\"\",\"\",'SD Teacher''s Data'!E190)","v":""},{"$f":"IF('SD Teacher''s Data'!K190=\"\",\"\",'SD Teacher''s Data'!K190)","v":""},{"$f":"IF('SD Teacher''s Data'!B190=\"\",\"\",'SD Teacher''s Data'!B190)","v":""},{"$nulls":5},{"$f":"IF('SD Teacher''s Data'!J190=\"\",\"\",'SD Teacher''s Data'!J190)","v":""}]
[{"$f":"IF(Table1[[#This Row],[नाम]]=\"\",\"\",ROWS($A$1:A190))","v":""},{"$f":"PROPER(IF('SD Teacher''s Data'!A191=\"\",\"\",'SD Teacher''s Data'!A191))","v":""},{"$f":"PROPER(IF('SD Teacher''s Data'!F191=\"\",\"\",'SD Teacher''s Data'!F191))","v":""},{"$f":"IF('SD Teacher''s Data'!E191=\"\",\"\",'SD Teacher''s Data'!E191)","v":""},{"$f":"IF('SD Teacher''s Data'!K191=\"\",\"\",'SD Teacher''s Data'!K191)","v":""},{"$f":"IF('SD Teacher''s Data'!B191=\"\",\"\",'SD Teacher''s Data'!B191)","v":""},{"$nulls":5},{"$f":"IF('SD Teacher''s Data'!J191=\"\",\"\",'SD Teacher''s Data'!J191)","v":""}]
[{"$f":"IF(Table1[[#This Row],[नाम]]=\"\",\"\",ROWS($A$1:A191))","v":""},{"$f":"PROPER(IF('SD Teacher''s Data'!A192=\"\",\"\",'SD Teacher''s Data'!A192))","v":""},{"$f":"PROPER(IF('SD Teacher''s Data'!F192=\"\",\"\",'SD Teacher''s Data'!F192))","v":""},{"$f":"IF('SD Teacher''s Data'!E192=\"\",\"\",'SD Teacher''s Data'!E192)","v":""},{"$f":"IF('SD Teacher''s Data'!K192=\"\",\"\",'SD Teacher''s Data'!K192)","v":""},{"$f":"IF('SD Teacher''s Data'!B192=\"\",\"\",'SD Teacher''s Data'!B192)","v":""},{"$nulls":5},{"$f":"IF('SD Teacher''s Data'!J192=\"\",\"\",'SD Teacher''s Data'!J192)","v":""}]
[{"$f":"IF(Table1[[#This Row],[नाम]]=\"\",\"\",ROWS($A$1:A192))","v":""},{"$f":"PROPER(IF('SD Teacher''s Data'!A193=\"\",\"\",'SD Teacher''s Data'!A193))","v":""},{"$f":"PROPER(IF('SD Teacher''s Data'!F193=\"\",\"\",'SD Teacher''s Data'!F193))","v":""},{"$f":"IF('SD Teacher''s Data'!E193=\"\",\"\",'SD Teacher''s Data'!E193)","v":""},{"$f":"IF('SD Teacher''s Data'!K193=\"\",\"\",'SD Teacher''s Data'!K193)","v":""},{"$f":"IF('SD Teacher''s Data'!B193=\"\",\"\",'SD Teacher''s Data'!B193)","v":""},{"$nulls":5},{"$f":"IF('SD Teacher''s Data'!J193=\"\",\"\",'SD Teacher''s Data'!J193)","v":""}]
[{"$f":"IF(Table1[[#This Row],[नाम]]=\"\",\"\",ROWS($A$1:A193))","v":""},{"$f":"PROPER(IF('SD Teacher''s Data'!A194=\"\",\"\",'SD Teacher''s Data'!A194))","v":""},{"$f":"PROPER(IF('SD Teacher''s Data'!F194=\"\",\"\",'SD Teacher''s Data'!F194))","v":""},{"$f":"IF('SD Teacher''s Data'!E194=\"\",\"\",'SD Teacher''s Data'!E194)","v":""},{"$f":"IF('SD Teacher''s Data'!K194=\"\",\"\",'SD Teacher''s Data'!K194)","v":""},{"$f":"IF('SD Teacher''s Data'!B194=\"\",\"\",'SD Teacher''s Data'!B194)","v":""},{"$nulls":5},{"$f":"IF('SD Teacher''s Data'!J194=\"\",\"\",'SD Teacher''s Data'!J194)","v":""}]
[{"$f":"IF(Table1[[#This Row],[नाम]]=\"\",\"\",ROWS($A$1:A194))","v":""},{"$f":"PROPER(IF('SD Teacher''s Data'!A195=\"\",\"\",'SD Teacher''s Data'!A195))","v":""},{"$f":"PROPER(IF('SD Teacher''s Data'!F195=\"\",\"\",'SD Teacher''s Data'!F195))","v":""},{"$f":"IF('SD Teacher''s Data'!E195=\"\",\"\",'SD Teacher''s Data'!E195)","v":""},{"$f":"IF('SD Teacher''s Data'!K195=\"\",\"\",'SD Teacher''s Data'!K195)","v":""},{"$f":"IF('SD Teacher''s Data'!B195=\"\",\"\",'SD Teacher''s Data'!B195)","v":""},{"$nulls":5},{"$f":"IF('SD Teacher''s Data'!J195=\"\",\"\",'SD Teacher''s Data'!J195)","v":""}]
[{"$f":"IF(Table1[[#This Row],[नाम]]=\"\",\"\",ROWS($A$1:A195))","v":""},{"$f":"PROPER(IF('SD Teacher''s Data'!A196=\"\",\"\",'SD Teacher''s Data'!A196))","v":""},{"$f":"PROPER(IF('SD Teacher''s Data'!F196=\"\",\"\",'SD Teacher''s Data'!F196))","v":""},{"$f":"IF('SD Teacher''s Data'!E196=\"\",\"\",'SD Teacher''s Data'!E196)","v":""},{"$f":"IF('SD Teacher''s Data'!K196=\"\",\"\",'SD Teacher''s Data'!K196)","v":""},{"$f":"IF('SD Teacher''s Data'!B196=\"\",\"\",'SD Teacher''s Data'!B196)","v":""},{"$nulls":5},{"$f":"IF('SD Teacher''s Data'!J196=\"\",\"\",'SD Teacher''s Data'!J196)","v":""}]
[{"$f":"IF(Table1[[#This Row],[नाम]]=\"\",\"\",ROWS($A$1:A196))","v":""},{"$f":"PROPER(IF('SD Teacher''s Data'!A197=\"\",\"\",'SD Teacher''s Data'!A197))","v":""},{"$f":"PROPER(IF('SD Teacher''s Data'!F197=\"\",\"\",'SD Teacher''s Data'!F197))","v":""},{"$f":"IF('SD Teacher''s Data'!E197=\"\",\"\",'SD Teacher''s Data'!E197)","v":""},{"$f":"IF('SD Teacher''s Data'!K197=\"\",\"\",'SD Teacher''s Data'!K197)","v":""},{"$f":"IF('SD Teacher''s Data'!B197=\"\",\"\",'SD Teacher''s Data'!B197)","v":""},{"$nulls":5},{"$f":"IF('SD Teacher''s Data'!J197=\"\",\"\",'SD Teacher''s Data'!J197)","v":""}]
[{"$f":"IF(Table1[[#This Row],[नाम]]=\"\",\"\",ROWS($A$1:A197))","v":""},{"$f":"PROPER(IF('SD Teacher''s Data'!A198=\"\",\"\",'SD Teacher''s Data'!A198))","v":""},{"$f":"PROPER(IF('SD Teacher''s Data'!F198=\"\",\"\",'SD Teacher''s Data'!F198))","v":""},{"$f":"IF('SD Teacher''s Data'!E198=\"\",\"\",'SD Teacher''s Data'!E198)","v":""},{"$f":"IF('SD Teacher''s Data'!K198=\"\",\"\",'SD Teacher''s Data'!K198)","v":""},{"$f":"IF('SD Teacher''s Data'!B198=\"\",\"\",'SD Teacher''s Data'!B198)","v":""},{"$nulls":5},{"$f":"IF('SD Teacher''s Data'!J198=\"\",\"\",'SD Teacher''s Data'!J198)","v":""}]
[{"$f":"IF(Table1[[#This Row],[नाम]]=\"\",\"\",ROWS($A$1:A198))","v":""},{"$f":"PROPER(IF('SD Teacher''s Data'!A199=\"\",\"\",'SD Teacher''s Data'!A199))","v":""},{"$f":"PROPER(IF('SD Teacher''s Data'!F199=\"\",\"\",'SD Teacher''s Data'!F199))","v":""},{"$f":"IF('SD Teacher''s Data'!E199=\"\",\"\",'SD Teacher''s Data'!E199)","v":""},{"$f":"IF('SD Teacher''s Data'!K199=\"\",\"\",'SD Teacher''s Data'!K199)","v":""},{"$f":"IF('SD Teacher''s Data'!B199=\"\",\"\",'SD Teacher''s Data'!B199)","v":""},{"$nulls":5},{"$f":"IF('SD Teacher''s Data'!J199=\"\",\"\",'SD Teacher''s Data'!J199)","v":""}]
[{"$f":"IF(Table1[[#This Row],[नाम]]=\"\",\"\",ROWS($A$1:A199))","v":""},{"$f":"PROPER(IF('SD Teacher''s Data'!A200=\"\",\"\",'SD Teacher''s Data'!A200))","v":""},{"$f":"PROPER(IF('SD Teacher''s Data'!F200=\"\",\"\",'SD Teacher''s Data'!F200))","v":""},{"$f":"IF('SD Teacher''s Data'!E200=\"\",\"\",'SD Teacher''s Data'!E200)","v":""},{"$f":"IF('SD Teacher''s Data'!K200=\"\",\"\",'SD Teacher''s Data'!K200)","v":""},{"$f":"IF('SD Teacher''s Data'!B200=\"\",\"\",'SD Teacher''s Data'!B200)","v":""},{"$nulls":5},{"$f":"IF('SD Teacher''s Data'!J200=\"\",\"\",'SD Teacher''s Data'!J200)","v":""}]
[{"$f":"IF(Table1[[#This Row],[नाम]]=\"\",\"\",ROWS($A$1:A200))","v":""},{"$f":"PROPER(IF('SD Teacher''s Data'!A201=\"\",\"\",'SD Teacher''s Data'!A201))","v":""},{"$f":"PROPER(IF('SD Teacher''s Data'!F201=\"\",\"\",'SD Teacher''s Data'!F201))","v":""},{"$f":"IF('SD Teacher''s Data'!E201=\"\",\"\",'SD Teacher''s Data'!E201)","v":""},{"$f":"IF('SD Teacher''s Data'!K201=\"\",\"\",'SD Teacher''s Data'!K201)","v":""},{"$f":"IF('SD Teacher''s Data'!B201=\"\",\"\",'SD Teacher''s Data'!B201)","v":""},{"$nulls":5},{"$f":"IF('SD Teacher''s Data'!J201=\"\",\"\",'SD Teacher''s Data'!J201)","v":""}]
[{"$f":"IF(Table1[[#This Row],[नाम]]=\"\",\"\",ROWS($A$1:A201))","v":""},{"$f":"PROPER(IF('SD Teacher''s Data'!A202=\"\",\"\",'SD Teacher''s Data'!A202))","v":""},{"$f":"PROPER(IF('SD Teacher''s Data'!F202=\"\",\"\",'SD Teacher''s Data'!F202))","v":""},{"$f":"IF('SD Teacher''s Data'!E202=\"\",\"\",'SD Teacher''s Data'!E202)","v":""},{"$f":"IF('SD Teacher''s Data'!K202=\"\",\"\",'SD Teacher''s Data'!K202)","v":""},{"$f":"IF('SD Teacher''s Data'!B202=\"\",\"\",'SD Teacher''s Data'!B202)","v":""},{"$nulls":5},{"$f":"IF('SD Teacher''s Data'!J202=\"\",\"\",'SD Teacher''s Data'!J202)","v":""}]
[{"$f":"IF(Table1[[#This Row],[नाम]]=\"\",\"\",ROWS($A$1:A202))","v":""},{"$f":"PROPER(IF('SD Teacher''s Data'!A203=\"\",\"\",'SD Teacher''s Data'!A203))","v":""},{"$f":"PROPER(IF('SD Teacher''s Data'!F203=\"\",\"\",'SD Teacher''s Data'!F203))","v":""},{"$f":"IF('SD Teacher''s Data'!E203=\"\",\"\",'SD Teacher''s Data'!E203)","v":""},{"$f":"IF('SD Teacher''s Data'!K203=\"\",\"\",'SD Teacher''s Data'!K203)","v":""},{"$f":"IF('SD Teacher''s Data'!B203=\"\",\"\",'SD Teacher''s Data'!B203)","v":""},{"$nulls":5},{"$f":"IF('SD Teacher''s Data'!J203=\"\",\"\",'SD Teacher''s Data'!J203)","v":""}]
[{"$f":"IF(Table1[[#This Row],[नाम]]=\"\",\"\",ROWS($A$1:A203))","v":""},{"$f":"PROPER(IF('SD Teacher''s Data'!A204=\"\",\"\",'SD Teacher''s Data'!A204))","v":""},{"$f":"PROPER(IF('SD Teacher''s Data'!F204=\"\",\"\",'SD Teacher''s Data'!F204))","v":""},{"$f":"IF('SD Teacher''s Data'!E204=\"\",\"\",'SD Teacher''s Data'!E204)","v":""},{"$f":"IF('SD Teacher''s Data'!K204=\"\",\"\",'SD Teacher''s Data'!K204)","v":""},{"$f":"IF('SD Teacher''s Data'!B204=\"\",\"\",'SD Teacher''s Data'!B204)","v":""},{"$nulls":5},{"$f":"IF('SD Teacher''s Data'!J204=\"\",\"\",'SD Teacher''s Data'!J204)","v":""}]
[{"$f":"IF(Table1[[#This Row],[नाम]]=\"\",\"\",ROWS($A$1:A204))","v":""},{"$f":"PROPER(IF('SD Teacher''s Data'!A205=\"\",\"\",'SD Teacher''s Data'!A205))","v":""},{"$f":"PROPER(IF('SD Teacher''s Data'!F205=\"\",\"\",'SD Teacher''s Data'!F205))","v":""},{"$f":"IF('SD Teacher''s Data'!E205=\"\",\"\",'SD Teacher''s Data'!E205)","v":""},{"$f":"IF('SD Teacher''s Data'!K205=\"\",\"\",'SD Teacher''s Data'!K205)","v":""},{"$f":"IF('SD Teacher''s Data'!B205=\"\",\"\",'SD Teacher''s Data'!B205)","v":""},{"$nulls":5},{"$f":"IF('SD Teacher''s Data'!J205=\"\",\"\",'SD Teacher''s Data'!J205)","v":""}]
[{"$f":"IF(Table1[[#This Row],[नाम]]=\"\",\"\",ROWS($A$1:A205))","v":""},{"$f":"PROPER(IF('SD Teacher''s Data'!A206=\"\",\"\",'SD Teacher''s Data'!A206))","v":""},{"$f":"PROPER(IF('SD Teacher''s Data'!F206=\"\",\"\",'SD Teacher''s Data'!F206))","v":""},{"$f":"IF('SD Teacher''s Data'!E206=\"\",\"\",'SD Teacher''s Data'!E206)","v":""},{"$f":"IF('SD Teacher''s Data'!K206=\"\",\"\",'SD Teacher''s Data'!K206)","v":""},{"$f":"IF('SD Teacher''s Data'!B206=\"\",\"\",'SD Teacher''s Data'!B206)","v":""},{"$nulls":5},{"$f":"IF('SD Teacher''s Data'!J206=\"\",\"\",'SD Teacher''s Data'!J206)","v":""}]
[{"$f":"IF(Table1[[#This Row],[नाम]]=\"\",\"\",ROWS($A$1:A206))","v":""},{"$f":"PROPER(IF('SD Teacher''s Data'!A207=\"\",\"\",'SD Teacher''s Data'!A207))","v":""},{"$f":"PROPER(IF('SD Teacher''s Data'!F207=\"\",\"\",'SD Teacher''s Data'!F207))","v":""},{"$f":"IF('SD Teacher''s Data'!E207=\"\",\"\",'SD Teacher''s Data'!E207)","v":""},{"$f":"IF('SD Teacher''s Data'!K207=\"\",\"\",'SD Teacher''s Data'!K207)","v":""},{"$f":"IF('SD Teacher''s Data'!B207=\"\",\"\",'SD Teacher''s Data'!B207)","v":""},{"$nulls":5},{"$f":"IF('SD Teacher''s Data'!J207=\"\",\"\",'SD Teacher''s Data'!J207)","v":""}]
[{"$f":"IF(Table1[[#This Row],[नाम]]=\"\",\"\",ROWS($A$1:A207))","v":""},{"$f":"PROPER(IF('SD Teacher''s Data'!A208=\"\",\"\",'SD Teacher''s Data'!A208))","v":""},{"$f":"PROPER(IF('SD Teacher''s Data'!F208=\"\",\"\",'SD Teacher''s Data'!F208))","v":""},{"$f":"IF('SD Teacher''s Data'!E208=\"\",\"\",'SD Teacher''s Data'!E208)","v":""},{"$f":"IF('SD Teacher''s Data'!K208=\"\",\"\",'SD Teacher''s Data'!K208)","v":""},{"$f":"IF('SD Teacher''s Data'!B208=\"\",\"\",'SD Teacher''s Data'!B208)","v":""},{"$nulls":5},{"$f":"IF('SD Teacher''s Data'!J208=\"\",\"\",'SD Teacher''s Data'!J208)","v":""}]
[{"$f":"IF(Table1[[#This Row],[नाम]]=\"\",\"\",ROWS($A$1:A208))","v":""},{"$f":"PROPER(IF('SD Teacher''s Data'!A209=\"\",\"\",'SD Teacher''s Data'!A209))","v":""},{"$f":"PROPER(IF('SD Teacher''s Data'!F209=\"\",\"\",'SD Teacher''s Data'!F209))","v":""},{"$f":"IF('SD Teacher''s Data'!E209=\"\",\"\",'SD Teacher''s Data'!E209)","v":""},{"$f":"IF('SD Teacher''s Data'!K209=\"\",\"\",'SD Teacher''s Data'!K209)","v":""},{"$f":"IF('SD Teacher''s Data'!B209=\"\",\"\",'SD Teacher''s Data'!B209)","v":""},{"$nulls":5},{"$f":"IF('SD Teacher''s Data'!J209=\"\",\"\",'SD Teacher''s Data'!J209)","v":""}]
[{"$f":"IF(Table1[[#This Row],[नाम]]=\"\",\"\",ROWS($A$1:A209))","v":""},{"$f":"PROPER(IF('SD Teacher''s Data'!A210=\"\",\"\",'SD Teacher''s Data'!A210))","v":""},{"$f":"PROPER(IF('SD Teacher''s Data'!F210=\"\",\"\",'SD Teacher''s Data'!F210))","v":""},{"$f":"IF('SD Teacher''s Data'!E210=\"\",\"\",'SD Teacher''s Data'!E210)","v":""},{"$f":"IF('SD Teacher''s Data'!K210=\"\",\"\",'SD Teacher''s Data'!K210)","v":""},{"$f":"IF('SD Teacher''s Data'!B210=\"\",\"\",'SD Teacher''s Data'!B210)","v":""},{"$nulls":5},{"$f":"IF('SD Teacher''s Data'!J210=\"\",\"\",'SD Teacher''s Data'!J210)","v":""}]
[{"$f":"IF(Table1[[#This Row],[नाम]]=\"\",\"\",ROWS($A$1:A210))","v":""},{"$f":"PROPER(IF('SD Teacher''s Data'!A211=\"\",\"\",'SD Teacher''s Data'!A211))","v":""},{"$f":"PROPER(IF('SD Teacher''s Data'!F211=\"\",\"\",'SD Teacher''s Data'!F211))","v":""},{"$f":"IF('SD Teacher''s Data'!E211=\"\",\"\",'SD Teacher''s Data'!E211)","v":""},{"$f":"IF('SD Teacher''s Data'!K211=\"\",\"\",'SD Teacher''s Data'!K211)","v":""},{"$f":"IF('SD Teacher''s Data'!B211=\"\",\"\",'SD Teacher''s Data'!B211)","v":""},{"$nulls":5},{"$f":"IF('SD Teacher''s Data'!J211=\"\",\"\",'SD Teacher''s Data'!J211)","v":""}]
[{"$f":"IF(Table1[[#This Row],[नाम]]=\"\",\"\",ROWS($A$1:A211))","v":""},{"$f":"PROPER(IF('SD Teacher''s Data'!A212=\"\",\"\",'SD Teacher''s Data'!A212))","v":""},{"$f":"PROPER(IF('SD Teacher''s Data'!F212=\"\",\"\",'SD Teacher''s Data'!F212))","v":""},{"$f":"IF('SD Teacher''s Data'!E212=\"\",\"\",'SD Teacher''s Data'!E212)","v":""},{"$f":"IF('SD Teacher''s Data'!K212=\"\",\"\",'SD Teacher''s Data'!K212)","v":""},{"$f":"IF('SD Teacher''s Data'!B212=\"\",\"\",'SD Teacher''s Data'!B212)","v":""},{"$nulls":5},{"$f":"IF('SD Teacher''s Data'!J212=\"\",\"\",'SD Teacher''s Data'!J212)","v":""}]
[{"$f":"IF(Table1[[#This Row],[नाम]]=\"\",\"\",ROWS($A$1:A212))","v":""},{"$f":"PROPER(IF('SD Teacher''s Data'!A213=\"\",\"\",'SD Teacher''s Data'!A213))","v":""},{"$f":"PROPER(IF('SD Teacher''s Data'!F213=\"\",\"\",'SD Teacher''s Data'!F213))","v":""},{"$f":"IF('SD Teacher''s Data'!E213=\"\",\"\",'SD Teacher''s Data'!E213)","v":""},{"$f":"IF('SD Teacher''s Data'!K213=\"\",\"\",'SD Teacher''s Data'!K213)","v":""},{"$f":"IF('SD Teacher''s Data'!B213=\"\",\"\",'SD Teacher''s Data'!B213)","v":""},{"$nulls":5},{"$f":"IF('SD Teacher''s Data'!J213=\"\",\"\",'SD Teacher''s Data'!J213)","v":""}]
[{"$f":"IF(Table1[[#This Row],[नाम]]=\"\",\"\",ROWS($A$1:A213))","v":""},{"$f":"PROPER(IF('SD Teacher''s Data'!A214=\"\",\"\",'SD Teacher''s Data'!A214))","v":""},{"$f":"PROPER(IF('SD Teacher''s Data'!F214=\"\",\"\",'SD Teacher''s Data'!F214))","v":""},{"$f":"IF('SD Teacher''s Data'!E214=\"\",\"\",'SD Teacher''s Data'!E214)","v":""},{"$f":"IF('SD Teacher''s Data'!K214=\"\",\"\",'SD Teacher''s Data'!K214)","v":""},{"$f":"IF('SD Teacher''s Data'!B214=\"\",\"\",'SD Teacher''s Data'!B214)","v":""},{"$nulls":5},{"$f":"IF('SD Teacher''s Data'!J214=\"\",\"\",'SD Teacher''s Data'!J214)","v":""}]
[{"$f":"IF(Table1[[#This Row],[नाम]]=\"\",\"\",ROWS($A$1:A214))","v":""},{"$f":"PROPER(IF('SD Teacher''s Data'!A215=\"\",\"\",'SD Teacher''s Data'!A215))","v":""},{"$f":"PROPER(IF('SD Teacher''s Data'!F215=\"\",\"\",'SD Teacher''s Data'!F215))","v":""},{"$f":"IF('SD Teacher''s Data'!E215=\"\",\"\",'SD Teacher''s Data'!E215)","v":""},{"$f":"IF('SD Teacher''s Data'!K215=\"\",\"\",'SD Teacher''s Data'!K215)","v":""},{"$f":"IF('SD Teacher''s Data'!B215=\"\",\"\",'SD Teacher''s Data'!B215)","v":""},{"$nulls":5},{"$f":"IF('SD Teacher''s Data'!J215=\"\",\"\",'SD Teacher''s Data'!J215)","v":""}]
[{"$f":"IF(Table1[[#This Row],[नाम]]=\"\",\"\",ROWS($A$1:A215))","v":""},{"$f":"PROPER(IF('SD Teacher''s Data'!A216=\"\",\"\",'SD Teacher''s Data'!A216))","v":""},{"$f":"PROPER(IF('SD Teacher''s Data'!F216=\"\",\"\",'SD Teacher''s Data'!F216))","v":""},{"$f":"IF('SD Teacher''s Data'!E216=\"\",\"\",'SD Teacher''s Data'!E216)","v":""},{"$f":"IF('SD Teacher''s Data'!K216=\"\",\"\",'SD Teacher''s Data'!K216)","v":""},{"$f":"IF('SD Teacher''s Data'!B216=\"\",\"\",'SD Teacher''s Data'!B216)","v":""},{"$nulls":5},{"$f":"IF('SD Teacher''s Data'!J216=\"\",\"\",'SD Teacher''s Data'!J216)","v":""}]
[{"$f":"IF(Table1[[#This Row],[नाम]]=\"\",\"\",ROWS($A$1:A216))","v":""},{"$f":"PROPER(IF('SD Teacher''s Data'!A217=\"\",\"\",'SD Teacher''s Data'!A217))","v":""},{"$f":"PROPER(IF('SD Teacher''s Data'!F217=\"\",\"\",'SD Teacher''s Data'!F217))","v":""},{"$f":"IF('SD Teacher''s Data'!E217=\"\",\"\",'SD Teacher''s Data'!E217)","v":""},{"$f":"IF('SD Teacher''s Data'!K217=\"\",\"\",'SD Teacher''s Data'!K217)","v":""},{"$f":"IF('SD Teacher''s Data'!B217=\"\",\"\",'SD Teacher''s Data'!B217)","v":""},{"$nulls":5},{"$f":"IF('SD Teacher''s Data'!J217=\"\",\"\",'SD Teacher''s Data'!J217)","v":""}]
[{"$f":"IF(Table1[[#This Row],[नाम]]=\"\",\"\",ROWS($A$1:A217))","v":""},{"$f":"PROPER(IF('SD Teacher''s Data'!A218=\"\",\"\",'SD Teacher''s Data'!A218))","v":""},{"$f":"PROPER(IF('SD Teacher''s Data'!F218=\"\",\"\",'SD Teacher''s Data'!F218))","v":""},{"$f":"IF('SD Teacher''s Data'!E218=\"\",\"\",'SD Teacher''s Data'!E218)","v":""},{"$f":"IF('SD Teacher''s Data'!K218=\"\",\"\",'SD Teacher''s Data'!K218)","v":""},{"$f":"IF('SD Teacher''s Data'!B218=\"\",\"\",'SD Teacher''s Data'!B218)","v":""},{"$nulls":5},{"$f":"IF('SD Teacher''s Data'!J218=\"\",\"\",'SD Teacher''s Data'!J218)","v":""}]
[{"$f":"IF(Table1[[#This Row],[नाम]]=\"\",\"\",ROWS($A$1:A218))","v":""},{"$f":"PROPER(IF('SD Teacher''s Data'!A219=\"\",\"\",'SD Teacher''s Data'!A219))","v":""},{"$f":"PROPER(IF('SD Teacher''s Data'!F219=\"\",\"\",'SD Teacher''s Data'!F219))","v":""},{"$f":"IF('SD Teacher''s Data'!E219=\"\",\"\",'SD Teacher''s Data'!E219)","v":""},{"$f":"IF('SD Teacher''s Data'!K219=\"\",\"\",'SD Teacher''s Data'!K219)","v":""},{"$f":"IF('SD Teacher''s Data'!B219=\"\",\"\",'SD Teacher''s Data'!B219)","v":""},{"$nulls":5},{"$f":"IF('SD Teacher''s Data'!J219=\"\",\"\",'SD Teacher''s Data'!J219)","v":""}]
[{"$f":"IF(Table1[[#This Row],[नाम]]=\"\",\"\",ROWS($A$1:A219))","v":""},{"$f":"PROPER(IF('SD Teacher''s Data'!A220=\"\",\"\",'SD Teacher''s Data'!A220))","v":""},{"$f":"PROPER(IF('SD Teacher''s Data'!F220=\"\",\"\",'SD Teacher''s Data'!F220))","v":""},{"$f":"IF('SD Teacher''s Data'!E220=\"\",\"\",'SD Teacher''s Data'!E220)","v":""},{"$f":"IF('SD Teacher''s Data'!K220=\"\",\"\",'SD Teacher''s Data'!K220)","v":""},{"$f":"IF('SD Teacher''s Data'!B220=\"\",\"\",'SD Teacher''s Data'!B220)","v":""},{"$nulls":5},{"$f":"IF('SD Teacher''s Data'!J220=\"\",\"\",'SD Teacher''s Data'!J220)","v":""}]
[{"$f":"IF(Table1[[#This Row],[नाम]]=\"\",\"\",ROWS($A$1:A220))","v":""},{"$f":"PROPER(IF('SD Teacher''s Data'!A221=\"\",\"\",'SD Teacher''s Data'!A221))","v":""},{"$f":"PROPER(IF('SD Teacher''s Data'!F221=\"\",\"\",'SD Teacher''s Data'!F221))","v":""},{"$f":"IF('SD Teacher''s Data'!E221=\"\",\"\",'SD Teacher''s Data'!E221)","v":""},{"$f":"IF('SD Teacher''s Data'!K221=\"\",\"\",'SD Teacher''s Data'!K221)","v":""},{"$f":"IF('SD Teacher''s Data'!B221=\"\",\"\",'SD Teacher''s Data'!B221)","v":""},{"$nulls":5},{"$f":"IF('SD Teacher''s Data'!J221=\"\",\"\",'SD Teacher''s Data'!J221)","v":""}]
[{"$f":"IF(Table1[[#This Row],[नाम]]=\"\",\"\",ROWS($A$1:A221))","v":""},{"$f":"PROPER(IF('SD Teacher''s Data'!A222=\"\",\"\",'SD Teacher''s Data'!A222))","v":""},{"$f":"PROPER(IF('SD Teacher''s Data'!F222=\"\",\"\",'SD Teacher''s Data'!F222))","v":""},{"$f":"IF('SD Teacher''s Data'!E222=\"\",\"\",'SD Teacher''s Data'!E222)","v":""},{"$f":"IF('SD Teacher''s Data'!K222=\"\",\"\",'SD Teacher''s Data'!K222)","v":""},{"$f":"IF('SD Teacher''s Data'!B222=\"\",\"\",'SD Teacher''s Data'!B222)","v":""},{"$nulls":5},{"$f":"IF('SD Teacher''s Data'!J222=\"\",\"\",'SD Teacher''s Data'!J222)","v":""}]
[{"$f":"IF(Table1[[#This Row],[नाम]]=\"\",\"\",ROWS($A$1:A222))","v":""},{"$f":"PROPER(IF('SD Teacher''s Data'!A223=\"\",\"\",'SD Teacher''s Data'!A223))","v":""},{"$f":"PROPER(IF('SD Teacher''s Data'!F223=\"\",\"\",'SD Teacher''s Data'!F223))","v":""},{"$f":"IF('SD Teacher''s Data'!E223=\"\",\"\",'SD Teacher''s Data'!E223)","v":""},{"$f":"IF('SD Teacher''s Data'!K223=\"\",\"\",'SD Teacher''s Data'!K223)","v":""},{"$f":"IF('SD Teacher''s Data'!B223=\"\",\"\",'SD Teacher''s Data'!B223)","v":""},{"$nulls":5},{"$f":"IF('SD Teacher''s Data'!J223=\"\",\"\",'SD Teacher''s Data'!J223)","v":""}]
[{"$f":"IF(Table1[[#This Row],[नाम]]=\"\",\"\",ROWS($A$1:A223))","v":""},{"$f":"PROPER(IF('SD Teacher''s Data'!A224=\"\",\"\",'SD Teacher''s Data'!A224))","v":""},{"$f":"PROPER(IF('SD Teacher''s Data'!F224=\"\",\"\",'SD Teacher''s Data'!F224))","v":""},{"$f":"IF('SD Teacher''s Data'!E224=\"\",\"\",'SD Teacher''s Data'!E224)","v":""},{"$f":"IF('SD Teacher''s Data'!K224=\"\",\"\",'SD Teacher''s Data'!K224)","v":""},{"$f":"IF('SD Teacher''s Data'!B224=\"\",\"\",'SD Teacher''s Data'!B224)","v":""},{"$nulls":5},{"$f":"IF('SD Teacher''s Data'!J224=\"\",\"\",'SD Teacher''s Data'!J224)","v":""}]
[{"$f":"IF(Table1[[#This Row],[नाम]]=\"\",\"\",ROWS($A$1:A224))","v":""},{"$f":"PROPER(IF('SD Teacher''s Data'!A225=\"\",\"\",'SD Teacher''s Data'!A225))","v":""},{"$f":"PROPER(IF('SD Teacher''s Data'!F225=\"\",\"\",'SD Teacher''s Data'!F225))","v":""},{"$f":"IF('SD Teacher''s Data'!E225=\"\",\"\",'SD Teacher''s Data'!E225)","v":""},{"$f":"IF('SD Teacher''s Data'!K225=\"\",\"\",'SD Teacher''s Data'!K225)","v":""},{"$f":"IF('SD Teacher''s Data'!B225=\"\",\"\",'SD Teacher''s Data'!B225)","v":""},{"$nulls":5},{"$f":"IF('SD Teacher''s Data'!J225=\"\",\"\",'SD Teacher''s Data'!J225)","v":""}]
[{"$f":"IF(Table1[[#This Row],[नाम]]=\"\",\"\",ROWS($A$1:A225))","v":""},{"$f":"PROPER(IF('SD Teacher''s Data'!A226=\"\",\"\",'SD Teacher''s Data'!A226))","v":""},{"$f":"PROPER(IF('SD Teacher''s Data'!F226=\"\",\"\",'SD Teacher''s Data'!F226))","v":""},{"$f":"IF('SD Teacher''s Data'!E226=\"\",\"\",'SD Teacher''s Data'!E226)","v":""},{"$f":"IF('SD Teacher''s Data'!K226=\"\",\"\",'SD Teacher''s Data'!K226)","v":""},{"$f":"IF('SD Teacher''s Data'!B226=\"\",\"\",'SD Teacher''s Data'!B226)","v":""},{"$nulls":5},{"$f":"IF('SD Teacher''s Data'!J226=\"\",\"\",'SD Teacher''s Data'!J226)","v":""}]
[{"$f":"IF(Table1[[#This Row],[नाम]]=\"\",\"\",ROWS($A$1:A226))","v":""},{"$f":"PROPER(IF('SD Teacher''s Data'!A227=\"\",\"\",'SD Teacher''s Data'!A227))","v":""},{"$f":"PROPER(IF('SD Teacher''s Data'!F227=\"\",\"\",'SD Teacher''s Data'!F227))","v":""},{"$f":"IF('SD Teacher''s Data'!E227=\"\",\"\",'SD Teacher''s Data'!E227)","v":""},{"$f":"IF('SD Teacher''s Data'!K227=\"\",\"\",'SD Teacher''s Data'!K227)","v":""},{"$f":"IF('SD Teacher''s Data'!B227=\"\",\"\",'SD Teacher''s Data'!B227)","v":""},{"$nulls":5},{"$f":"IF('SD Teacher''s Data'!J227=\"\",\"\",'SD Teacher''s Data'!J227)","v":""}]
[{"$f":"IF(Table1[[#This Row],[नाम]]=\"\",\"\",ROWS($A$1:A227))","v":""},{"$f":"PROPER(IF('SD Teacher''s Data'!A228=\"\",\"\",'SD Teacher''s Data'!A228))","v":""},{"$f":"PROPER(IF('SD Teacher''s Data'!F228=\"\",\"\",'SD Teacher''s Data'!F228))","v":""},{"$f":"IF('SD Teacher''s Data'!E228=\"\",\"\",'SD Teacher''s Data'!E228)","v":""},{"$f":"IF('SD Teacher''s Data'!K228=\"\",\"\",'SD Teacher''s Data'!K228)","v":""},{"$f":"IF('SD Teacher''s Data'!B228=\"\",\"\",'SD Teacher''s Data'!B228)","v":""},{"$nulls":5},{"$f":"IF('SD Teacher''s Data'!J228=\"\",\"\",'SD Teacher''s Data'!J228)","v":""}]
[{"$f":"IF(Table1[[#This Row],[नाम]]=\"\",\"\",ROWS($A$1:A228))","v":""},{"$f":"PROPER(IF('SD Teacher''s Data'!A229=\"\",\"\",'SD Teacher''s Data'!A229))","v":""},{"$f":"PROPER(IF('SD Teacher''s Data'!F229=\"\",\"\",'SD Teacher''s Data'!F229))","v":""},{"$f":"IF('SD Teacher''s Data'!E229=\"\",\"\",'SD Teacher''s Data'!E229)","v":""},{"$f":"IF('SD Teacher''s Data'!K229=\"\",\"\",'SD Teacher''s Data'!K229)","v":""},{"$f":"IF('SD Teacher''s Data'!B229=\"\",\"\",'SD Teacher''s Data'!B229)","v":""},{"$nulls":5},{"$f":"IF('SD Teacher''s Data'!J229=\"\",\"\",'SD Teacher''s Data'!J229)","v":""}]
[{"$f":"IF(Table1[[#This Row],[नाम]]=\"\",\"\",ROWS($A$1:A229))","v":""},{"$f":"PROPER(IF('SD Teacher''s Data'!A230=\"\",\"\",'SD Teacher''s Data'!A230))","v":""},{"$f":"PROPER(IF('SD Teacher''s Data'!F230=\"\",\"\",'SD Teacher''s Data'!F230))","v":""},{"$f":"IF('SD Teacher''s Data'!E230=\"\",\"\",'SD Teacher''s Data'!E230)","v":""},{"$f":"IF('SD Teacher''s Data'!K230=\"\",\"\",'SD Teacher''s Data'!K230)","v":""},{"$f":"IF('SD Teacher''s Data'!B230=\"\",\"\",'SD Teacher''s Data'!B230)","v":""},{"$nulls":5},{"$f":"IF('SD Teacher''s Data'!J230=\"\",\"\",'SD Teacher''s Data'!J230)","v":""}]
[{"$f":"IF(Table1[[#This Row],[नाम]]=\"\",\"\",ROWS($A$1:A230))","v":""},{"$f":"PROPER(IF('SD Teacher''s Data'!A231=\"\",\"\",'SD Teacher''s Data'!A231))","v":""},{"$f":"PROPER(IF('SD Teacher''s Data'!F231=\"\",\"\",'SD Teacher''s Data'!F231))","v":""},{"$f":"IF('SD Teacher''s Data'!E231=\"\",\"\",'SD Teacher''s Data'!E231)","v":""},{"$f":"IF('SD Teacher''s Data'!K231=\"\",\"\",'SD Teacher''s Data'!K231)","v":""},{"$f":"IF('SD Teacher''s Data'!B231=\"\",\"\",'SD Teacher''s Data'!B231)","v":""},{"$nulls":5},{"$f":"IF('SD Teacher''s Data'!J231=\"\",\"\",'SD Teacher''s Data'!J231)","v":""}]
[{"$f":"IF(Table1[[#This Row],[नाम]]=\"\",\"\",ROWS($A$1:A231))","v":""},{"$f":"PROPER(IF('SD Teacher''s Data'!A232=\"\",\"\",'SD Teacher''s Data'!A232))","v":""},{"$f":"PROPER(IF('SD Teacher''s Data'!F232=\"\",\"\",'SD Teacher''s Data'!F232))","v":""},{"$f":"IF('SD Teacher''s Data'!E232=\"\",\"\",'SD Teacher''s Data'!E232)","v":""},{"$f":"IF('SD Teacher''s Data'!K232=\"\",\"\",'SD Teacher''s Data'!K232)","v":""},{"$f":"IF('SD Teacher''s Data'!B232=\"\",\"\",'SD Teacher''s Data'!B232)","v":""},{"$nulls":5},{"$f":"IF('SD Teacher''s Data'!J232=\"\",\"\",'SD Teacher''s Data'!J232)","v":""}]
[{"$f":"IF(Table1[[#This Row],[नाम]]=\"\",\"\",ROWS($A$1:A232))","v":""},{"$f":"PROPER(IF('SD Teacher''s Data'!A233=\"\",\"\",'SD Teacher''s Data'!A233))","v":""},{"$f":"PROPER(IF('SD Teacher''s Data'!F233=\"\",\"\",'SD Teacher''s Data'!F233))","v":""},{"$f":"IF('SD Teacher''s Data'!E233=\"\",\"\",'SD Teacher''s Data'!E233)","v":""},{"$f":"IF('SD Teacher''s Data'!K233=\"\",\"\",'SD Teacher''s Data'!K233)","v":""},{"$f":"IF('SD Teacher''s Data'!B233=\"\",\"\",'SD Teacher''s Data'!B233)","v":""},{"$nulls":5},{"$f":"IF('SD Teacher''s Data'!J233=\"\",\"\",'SD Teacher''s Data'!J233)","v":""}]
[{"$f":"IF(Table1[[#This Row],[नाम]]=\"\",\"\",ROWS($A$1:A233))","v":""},{"$f":"PROPER(IF('SD Teacher''s Data'!A234=\"\",\"\",'SD Teacher''s Data'!A234))","v":""},{"$f":"PROPER(IF('SD Teacher''s Data'!F234=\"\",\"\",'SD Teacher''s Data'!F234))","v":""},{"$f":"IF('SD Teacher''s Data'!E234=\"\",\"\",'SD Teacher''s Data'!E234)","v":""},{"$f":"IF('SD Teacher''s Data'!K234=\"\",\"\",'SD Teacher''s Data'!K234)","v":""},{"$f":"IF('SD Teacher''s Data'!B234=\"\",\"\",'SD Teacher''s Data'!B234)","v":""},{"$nulls":5},{"$f":"IF('SD Teacher''s Data'!J234=\"\",\"\",'SD Teacher''s Data'!J234)","v":""}]
[{"$f":"IF(Table1[[#This Row],[नाम]]=\"\",\"\",ROWS($A$1:A234))","v":""},{"$f":"PROPER(IF('SD Teacher''s Data'!A235=\"\",\"\",'SD Teacher''s Data'!A235))","v":""},{"$f":"PROPER(IF('SD Teacher''s Data'!F235=\"\",\"\",'SD Teacher''s Data'!F235))","v":""},{"$f":"IF('SD Teacher''s Data'!E235=\"\",\"\",'SD Teacher''s Data'!E235)","v":""},{"$f":"IF('SD Teacher''s Data'!K235=\"\",\"\",'SD Teacher''s Data'!K235)","v":""},{"$f":"IF('SD Teacher''s Data'!B235=\"\",\"\",'SD Teacher''s Data'!B235)","v":""},{"$nulls":5},{"$f":"IF('SD Teacher''s Data'!J235=\"\",\"\",'SD Teacher''s Data'!J235)","v":""}]
[{"$f":"IF(Table1[[#This Row],[नाम]]=\"\",\"\",ROWS($A$1:A235))","v":""},{"$f":"PROPER(IF('SD Teacher''s Data'!A236=\"\",\"\",'SD Teacher''s Data'!A236))","v":""},{"$f":"PROPER(IF('SD Teacher''s Data'!F236=\"\",\"\",'SD Teacher''s Data'!F236))","v":""},{"$f":"IF('SD Teacher''s Data'!E236=\"\",\"\",'SD Teacher''s Data'!E236)","v":""},{"$f":"IF('SD Teacher''s Data'!K236=\"\",\"\",'SD Teacher''s Data'!K236)","v":""},{"$f":"IF('SD Teacher''s Data'!B236=\"\",\"\",'SD Teacher''s Data'!B236)","v":""},{"$nulls":5},{"$f":"IF('SD Teacher''s Data'!J236=\"\",\"\",'SD Teacher''s Data'!J236)","v":""}]
[{"$f":"IF(Table1[[#This Row],[नाम]]=\"\",\"\",ROWS($A$1:A236))","v":""},{"$f":"PROPER(IF('SD Teacher''s Data'!A237=\"\",\"\",'SD Teacher''s Data'!A237))","v":""},{"$f":"PROPER(IF('SD Teacher''s Data'!F237=\"\",\"\",'SD Teacher''s Data'!F237))","v":""},{"$f":"IF('SD Teacher''s Data'!E237=\"\",\"\",'SD Teacher''s Data'!E237)","v":""},{"$f":"IF('SD Teacher''s Data'!K237=\"\",\"\",'SD Teacher''s Data'!K237)","v":""},{"$f":"IF('SD Teacher''s Data'!B237=\"\",\"\",'SD Teacher''s Data'!B237)","v":""},{"$nulls":5},{"$f":"IF('SD Teacher''s Data'!J237=\"\",\"\",'SD Teacher''s Data'!J237)","v":""}]
[{"$f":"IF(Table1[[#This Row],[नाम]]=\"\",\"\",ROWS($A$1:A237))","v":""},{"$f":"PROPER(IF('SD Teacher''s Data'!A238=\"\",\"\",'SD Teacher''s Data'!A238))","v":""},{"$f":"PROPER(IF('SD Teacher''s Data'!F238=\"\",\"\",'SD Teacher''s Data'!F238))","v":""},{"$f":"IF('SD Teacher''s Data'!E238=\"\",\"\",'SD Teacher''s Data'!E238)","v":""},{"$f":"IF('SD Teacher''s Data'!K238=\"\",\"\",'SD Teacher''s Data'!K238)","v":""},{"$f":"IF('SD Teacher''s Data'!B238=\"\",\"\",'SD Teacher''s Data'!B238)","v":""},{"$nulls":5},{"$f":"IF('SD Teacher''s Data'!J238=\"\",\"\",'SD Teacher''s Data'!J238)","v":""}]
[{"$f":"IF(Table1[[#This Row],[नाम]]=\"\",\"\",ROWS($A$1:A238))","v":""},{"$f":"PROPER(IF('SD Teacher''s Data'!A239=\"\",\"\",'SD Teacher''s Data'!A239))","v":""},{"$f":"PROPER(IF('SD Teacher''s Data'!F239=\"\",\"\",'SD Teacher''s Data'!F239))","v":""},{"$f":"IF('SD Teacher''s Data'!E239=\"\",\"\",'SD Teacher''s Data'!E239)","v":""},{"$f":"IF('SD Teacher''s Data'!K239=\"\",\"\",'SD Teacher''s Data'!K239)","v":""},{"$f":"IF('SD Teacher''s Data'!B239=\"\",\"\",'SD Teacher''s Data'!B239)","v":""},{"$nulls":5},{"$f":"IF('SD Teacher''s Data'!J239=\"\",\"\",'SD Teacher''s Data'!J239)","v":""}]
[{"$f":"IF(Table1[[#This Row],[नाम]]=\"\",\"\",ROWS($A$1:A239))","v":""},{"$f":"PROPER(IF('SD Teacher''s Data'!A240=\"\",\"\",'SD Teacher''s Data'!A240))","v":""},{"$f":"PROPER(IF('SD Teacher''s Data'!F240=\"\",\"\",'SD Teacher''s Data'!F240))","v":""},{"$f":"IF('SD Teacher''s Data'!E240=\"\",\"\",'SD Teacher''s Data'!E240)","v":""},{"$f":"IF('SD Teacher''s Data'!K240=\"\",\"\",'SD Teacher''s Data'!K240)","v":""},{"$f":"IF('SD Teacher''s Data'!B240=\"\",\"\",'SD Teacher''s Data'!B240)","v":""},{"$nulls":5},{"$f":"IF('SD Teacher''s Data'!J240=\"\",\"\",'SD Teacher''s Data'!J240)","v":""}]
[{"$f":"IF(Table1[[#This Row],[नाम]]=\"\",\"\",ROWS($A$1:A240))","v":""},{"$f":"PROPER(IF('SD Teacher''s Data'!A241=\"\",\"\",'SD Teacher''s Data'!A241))","v":""},{"$f":"PROPER(IF('SD Teacher''s Data'!F241=\"\",\"\",'SD Teacher''s Data'!F241))","v":""},{"$f":"IF('SD Teacher''s Data'!E241=\"\",\"\",'SD Teacher''s Data'!E241)","v":""},{"$f":"IF('SD Teacher''s Data'!K241=\"\",\"\",'SD Teacher''s Data'!K241)","v":""},{"$f":"IF('SD Teacher''s Data'!B241=\"\",\"\",'SD Teacher''s Data'!B241)","v":""},{"$nulls":5},{"$f":"IF('SD Teacher''s Data'!J241=\"\",\"\",'SD Teacher''s Data'!J241)","v":""}]
[{"$f":"IF(Table1[[#This Row],[नाम]]=\"\",\"\",ROWS($A$1:A241))","v":""},{"$f":"PROPER(IF('SD Teacher''s Data'!A242=\"\",\"\",'SD Teacher''s Data'!A242))","v":""},{"$f":"PROPER(IF('SD Teacher''s Data'!F242=\"\",\"\",'SD Teacher''s Data'!F242))","v":""},{"$f":"IF('SD Teacher''s Data'!E242=\"\",\"\",'SD Teacher''s Data'!E242)","v":""},{"$f":"IF('SD Teacher''s Data'!K242=\"\",\"\",'SD Teacher''s Data'!K242)","v":""},{"$f":"IF('SD Teacher''s Data'!B242=\"\",\"\",'SD Teacher''s Data'!B242)","v":""},{"$nulls":5},{"$f":"IF('SD Teacher''s Data'!J242=\"\",\"\",'SD Teacher''s Data'!J242)","v":""}]
[{"$f":"IF(Table1[[#This Row],[नाम]]=\"\",\"\",ROWS($A$1:A242))","v":""},{"$f":"PROPER(IF('SD Teacher''s Data'!A243=\"\",\"\",'SD Teacher''s Data'!A243))","v":""},{"$f":"PROPER(IF('SD Teacher''s Data'!F243=\"\",\"\",'SD Teacher''s Data'!F243))","v":""},{"$f":"IF('SD Teacher''s Data'!E243=\"\",\"\",'SD Teacher''s Data'!E243)","v":""},{"$f":"IF('SD Teacher''s Data'!K243=\"\",\"\",'SD Teacher''s Data'!K243)","v":""},{"$f":"IF('SD Teacher''s Data'!B243=\"\",\"\",'SD Teacher''s Data'!B243)","v":""},{"$nulls":5},{"$f":"IF('SD Teacher''s Data'!J243=\"\",\"\",'SD Teacher''s Data'!J243)","v":""}]
[{"$f":"IF(Table1[[#This Row],[नाम]]=\"\",\"\",ROWS($A$1:A243))","v":""},{"$f":"PROPER(IF('SD Teacher''s Data'!A244=\"\",\"\",'SD Teacher''s Data'!A244))","v":""},{"$f":"PROPER(IF('SD Teacher''s Data'!F244=\"\",\"\",'SD Teacher''s Data'!F244))","v":""},{"$f":"IF('SD Teacher''s Data'!E244=\"\",\"\",'SD Teacher''s Data'!E244)","v":""},{"$f":"IF('SD Teacher''s Data'!K244=\"\",\"\",'SD Teacher''s Data'!K244)","v":""},{"$f":"IF('SD Teacher''s Data'!B244=\"\",\"\",'SD Teacher''s Data'!B244)","v":""},{"$nulls":5},{"$f":"IF('SD Teacher''s Data'!J244=\"\",\"\",'SD Teacher''s Data'!J244)","v":""}]
[{"$f":"IF(Table1[[#This Row],[नाम]]=\"\",\"\",ROWS($A$1:A244))","v":""},{"$f":"PROPER(IF('SD Teacher''s Data'!A245=\"\",\"\",'SD Teacher''s Data'!A245))","v":""},{"$f":"PROPER(IF('SD Teacher''s Data'!F245=\"\",\"\",'SD Teacher''s Data'!F245))","v":""},{"$f":"IF('SD Teacher''s Data'!E245=\"\",\"\",'SD Teacher''s Data'!E245)","v":""},{"$f":"IF('SD Teacher''s Data'!K245=\"\",\"\",'SD Teacher''s Data'!K245)","v":""},{"$f":"IF('SD Teacher''s Data'!B245=\"\",\"\",'SD Teacher''s Data'!B245)","v":""},{"$nulls":5},{"$f":"IF('SD Teacher''s Data'!J245=\"\",\"\",'SD Teacher''s Data'!J245)","v":""}]
[{"$f":"IF(Table1[[#This Row],[नाम]]=\"\",\"\",ROWS($A$1:A245))","v":""},{"$f":"PROPER(IF('SD Teacher''s Data'!A246=\"\",\"\",'SD Teacher''s Data'!A246))","v":""},{"$f":"PROPER(IF('SD Teacher''s Data'!F246=\"\",\"\",'SD Teacher''s Data'!F246))","v":""},{"$f":"IF('SD Teacher''s Data'!E246=\"\",\"\",'SD Teacher''s Data'!E246)","v":""},{"$f":"IF('SD Teacher''s Data'!K246=\"\",\"\",'SD Teacher''s Data'!K246)","v":""},{"$f":"IF('SD Teacher''s Data'!B246=\"\",\"\",'SD Teacher''s Data'!B246)","v":""},{"$nulls":5},{"$f":"IF('SD Teacher''s Data'!J246=\"\",\"\",'SD Teacher''s Data'!J246)","v":""}]
[{"$f":"IF(Table1[[#This Row],[नाम]]=\"\",\"\",ROWS($A$1:A246))","v":""},{"$f":"PROPER(IF('SD Teacher''s Data'!A247=\"\",\"\",'SD Teacher''s Data'!A247))","v":""},{"$f":"PROPER(IF('SD Teacher''s Data'!F247=\"\",\"\",'SD Teacher''s Data'!F247))","v":""},{"$f":"IF('SD Teacher''s Data'!E247=\"\",\"\",'SD Teacher''s Data'!E247)","v":""},{"$f":"IF('SD Teacher''s Data'!K247=\"\",\"\",'SD Teacher''s Data'!K247)","v":""},{"$f":"IF('SD Teacher''s Data'!B247=\"\",\"\",'SD Teacher''s Data'!B247)","v":""},{"$nulls":5},{"$f":"IF('SD Teacher''s Data'!J247=\"\",\"\",'SD Teacher''s Data'!J247)","v":""}]
[{"$f":"IF(Table1[[#This Row],[नाम]]=\"\",\"\",ROWS($A$1:A247))","v":""},{"$f":"PROPER(IF('SD Teacher''s Data'!A248=\"\",\"\",'SD Teacher''s Data'!A248))","v":""},{"$f":"PROPER(IF('SD Teacher''s Data'!F248=\"\",\"\",'SD Teacher''s Data'!F248))","v":""},{"$f":"IF('SD Teacher''s Data'!E248=\"\",\"\",'SD Teacher''s Data'!E248)","v":""},{"$f":"IF('SD Teacher''s Data'!K248=\"\",\"\",'SD Teacher''s Data'!K248)","v":""},{"$f":"IF('SD Teacher''s Data'!B248=\"\",\"\",'SD Teacher''s Data'!B248)","v":""},{"$nulls":5},{"$f":"IF('SD Teacher''s Data'!J248=\"\",\"\",'SD Teacher''s Data'!J248)","v":""}]
[{"$f":"IF(Table1[[#This Row],[नाम]]=\"\",\"\",ROWS($A$1:A248))","v":""},{"$f":"PROPER(IF('SD Teacher''s Data'!A249=\"\",\"\",'SD Teacher''s Data'!A249))","v":""},{"$f":"PROPER(IF('SD Teacher''s Data'!F249=\"\",\"\",'SD Teacher''s Data'!F249))","v":""},{"$f":"IF('SD Teacher''s Data'!E249=\"\",\"\",'SD Teacher''s Data'!E249)","v":""},{"$f":"IF('SD Teacher''s Data'!K249=\"\",\"\",'SD Teacher''s Data'!K249)","v":""},{"$f":"IF('SD Teacher''s Data'!B249=\"\",\"\",'SD Teacher''s Data'!B249)","v":""},{"$nulls":5},{"$f":"IF('SD Teacher''s Data'!J249=\"\",\"\",'SD Teacher''s Data'!J249)","v":""}]
[{"$f":"IF(Table1[[#This Row],[नाम]]=\"\",\"\",ROWS($A$1:A249))","v":""},{"$f":"PROPER(IF('SD Teacher''s Data'!A250=\"\",\"\",'SD Teacher''s Data'!A250))","v":""},{"$f":"PROPER(IF('SD Teacher''s Data'!F250=\"\",\"\",'SD Teacher''s Data'!F250))","v":""},{"$f":"IF('SD Teacher''s Data'!E250=\"\",\"\",'SD Teacher''s Data'!E250)","v":""},{"$f":"IF('SD Teacher''s Data'!K250=\"\",\"\",'SD Teacher''s Data'!K250)","v":""},{"$f":"IF('SD Teacher''s Data'!B250=\"\",\"\",'SD Teacher''s Data'!B250)","v":""},{"$nulls":5},{"$f":"IF('SD Teacher''s Data'!J250=\"\",\"\",'SD Teacher''s Data'!J250)","v":""}]
[{"$f":"IF(Table1[[#This Row],[नाम]]=\"\",\"\",ROWS($A$1:A250))","v":""},{"$f":"PROPER(IF('SD Teacher''s Data'!A251=\"\",\"\",'SD Teacher''s Data'!A251))","v":""},{"$f":"PROPER(IF('SD Teacher''s Data'!F251=\"\",\"\",'SD Teacher''s Data'!F251))","v":""},{"$f":"IF('SD Teacher''s Data'!E251=\"\",\"\",'SD Teacher''s Data'!E251)","v":""},{"$f":"IF('SD Teacher''s Data'!K251=\"\",\"\",'SD Teacher''s Data'!K251)","v":""},{"$f":"IF('SD Teacher''s Data'!B251=\"\",\"\",'SD Teacher''s Data'!B251)","v":""},{"$nulls":5},{"$f":"IF('SD Teacher''s Data'!J251=\"\",\"\",'SD Teacher''s Data'!J251)","v":""}]
[{"$f":"IF(Table1[[#This Row],[नाम]]=\"\",\"\",ROWS($A$1:A251))","v":""},{"$f":"PROPER(IF('SD Teacher''s Data'!A252=\"\",\"\",'SD Teacher''s Data'!A252))","v":""},{"$f":"PROPER(IF('SD Teacher''s Data'!F252=\"\",\"\",'SD Teacher''s Data'!F252))","v":""},{"$f":"IF('SD Teacher''s Data'!E252=\"\",\"\",'SD Teacher''s Data'!E252)","v":""},{"$f":"IF('SD Teacher''s Data'!K252=\"\",\"\",'SD Teacher''s Data'!K252)","v":""},{"$f":"IF('SD Teacher''s Data'!B252=\"\",\"\",'SD Teacher''s Data'!B252)","v":""},{"$nulls":5},{"$f":"IF('SD Teacher''s Data'!J252=\"\",\"\",'SD Teacher''s Data'!J252)","v":""}]
[{"$f":"IF(Table1[[#This Row],[नाम]]=\"\",\"\",ROWS($A$1:A252))","v":""},{"$f":"PROPER(IF('SD Teacher''s Data'!A253=\"\",\"\",'SD Teacher''s Data'!A253))","v":""},{"$f":"PROPER(IF('SD Teacher''s Data'!F253=\"\",\"\",'SD Teacher''s Data'!F253))","v":""},{"$f":"IF('SD Teacher''s Data'!E253=\"\",\"\",'SD Teacher''s Data'!E253)","v":""},{"$f":"IF('SD Teacher''s Data'!K253=\"\",\"\",'SD Teacher''s Data'!K253)","v":""},{"$f":"IF('SD Teacher''s Data'!B253=\"\",\"\",'SD Teacher''s Data'!B253)","v":""},{"$nulls":5},{"$f":"IF('SD Teacher''s Data'!J253=\"\",\"\",'SD Teacher''s Data'!J253)","v":""}]
[{"$f":"IF(Table1[[#This Row],[नाम]]=\"\",\"\",ROWS($A$1:A253))","v":""},{"$f":"PROPER(IF('SD Teacher''s Data'!A254=\"\",\"\",'SD Teacher''s Data'!A254))","v":""},{"$f":"PROPER(IF('SD Teacher''s Data'!F254=\"\",\"\",'SD Teacher''s Data'!F254))","v":""},{"$f":"IF('SD Teacher''s Data'!E254=\"\",\"\",'SD Teacher''s Data'!E254)","v":""},{"$f":"IF('SD Teacher''s Data'!K254=\"\",\"\",'SD Teacher''s Data'!K254)","v":""},{"$f":"IF('SD Teacher''s Data'!B254=\"\",\"\",'SD Teacher''s Data'!B254)","v":""},{"$nulls":5},{"$f":"IF('SD Teacher''s Data'!J254=\"\",\"\",'SD Teacher''s Data'!J254)","v":""}]
[{"$f":"IF(Table1[[#This Row],[नाम]]=\"\",\"\",ROWS($A$1:A254))","v":""},{"$f":"PROPER(IF('SD Teacher''s Data'!A255=\"\",\"\",'SD Teacher''s Data'!A255))","v":""},{"$f":"PROPER(IF('SD Teacher''s Data'!F255=\"\",\"\",'SD Teacher''s Data'!F255))","v":""},{"$f":"IF('SD Teacher''s Data'!E255=\"\",\"\",'SD Teacher''s Data'!E255)","v":""},{"$f":"IF('SD Teacher''s Data'!K255=\"\",\"\",'SD Teacher''s Data'!K255)","v":""},{"$f":"IF('SD Teacher''s Data'!B255=\"\",\"\",'SD Teacher''s Data'!B255)","v":""},{"$nulls":5},{"$f":"IF('SD Teacher''s Data'!J255=\"\",\"\",'SD Teacher''s Data'!J255)","v":""}]
[{"$f":"IF(Table1[[#This Row],[नाम]]=\"\",\"\",ROWS($A$1:A255))","v":""},{"$f":"PROPER(IF('SD Teacher''s Data'!A256=\"\",\"\",'SD Teacher''s Data'!A256))","v":""},{"$f":"PROPER(IF('SD Teacher''s Data'!F256=\"\",\"\",'SD Teacher''s Data'!F256))","v":""},{"$f":"IF('SD Teacher''s Data'!E256=\"\",\"\",'SD Teacher''s Data'!E256)","v":""},{"$f":"IF('SD Teacher''s Data'!K256=\"\",\"\",'SD Teacher''s Data'!K256)","v":""},{"$f":"IF('SD Teacher''s Data'!B256=\"\",\"\",'SD Teacher''s Data'!B256)","v":""},{"$nulls":5},{"$f":"IF('SD Teacher''s Data'!J256=\"\",\"\",'SD Teacher''s Data'!J256)","v":""}]
[{"$f":"IF(Table1[[#This Row],[नाम]]=\"\",\"\",ROWS($A$1:A256))","v":""},{"$f":"PROPER(IF('SD Teacher''s Data'!A257=\"\",\"\",'SD Teacher''s Data'!A257))","v":""},{"$f":"PROPER(IF('SD Teacher''s Data'!F257=\"\",\"\",'SD Teacher''s Data'!F257))","v":""},{"$f":"IF('SD Teacher''s Data'!E257=\"\",\"\",'SD Teacher''s Data'!E257)","v":""},{"$f":"IF('SD Teacher''s Data'!K257=\"\",\"\",'SD Teacher''s Data'!K257)","v":""},{"$f":"IF('SD Teacher''s Data'!B257=\"\",\"\",'SD Teacher''s Data'!B257)","v":""},{"$nulls":5},{"$f":"IF('SD Teacher''s Data'!J257=\"\",\"\",'SD Teacher''s Data'!J257)","v":""}]
[{"$f":"IF(Table1[[#This Row],[नाम]]=\"\",\"\",ROWS($A$1:A257))","v":""},{"$f":"PROPER(IF('SD Teacher''s Data'!A258=\"\",\"\",'SD Teacher''s Data'!A258))","v":""},{"$f":"PROPER(IF('SD Teacher''s Data'!F258=\"\",\"\",'SD Teacher''s Data'!F258))","v":""},{"$f":"IF('SD Teacher''s Data'!E258=\"\",\"\",'SD Teacher''s Data'!E258)","v":""},{"$f":"IF('SD Teacher''s Data'!K258=\"\",\"\",'SD Teacher''s Data'!K258)","v":""},{"$f":"IF('SD Teacher''s Data'!B258=\"\",\"\",'SD Teacher''s Data'!B258)","v":""},{"$nulls":5},{"$f":"IF('SD Teacher''s Data'!J258=\"\",\"\",'SD Teacher''s Data'!J258)","v":""}]
[{"$f":"IF(Table1[[#This Row],[नाम]]=\"\",\"\",ROWS($A$1:A258))","v":""},{"$f":"PROPER(IF('SD Teacher''s Data'!A259=\"\",\"\",'SD Teacher''s Data'!A259))","v":""},{"$f":"PROPER(IF('SD Teacher''s Data'!F259=\"\",\"\",'SD Teacher''s Data'!F259))","v":""},{"$f":"IF('SD Teacher''s Data'!E259=\"\",\"\",'SD Teacher''s Data'!E259)","v":""},{"$f":"IF('SD Teacher''s Data'!K259=\"\",\"\",'SD Teacher''s Data'!K259)","v":""},{"$f":"IF('SD Teacher''s Data'!B259=\"\",\"\",'SD Teacher''s Data'!B259)","v":""},{"$nulls":5},{"$f":"IF('SD Teacher''s Data'!J259=\"\",\"\",'SD Teacher''s Data'!J259)","v":""}]
[{"$f":"IF(Table1[[#This Row],[नाम]]=\"\",\"\",ROWS($A$1:A259))","v":""},{"$f":"PROPER(IF('SD Teacher''s Data'!A260=\"\",\"\",'SD Teacher''s Data'!A260))","v":""},{"$f":"PROPER(IF('SD Teacher''s Data'!F260=\"\",\"\",'SD Teacher''s Data'!F260))","v":""},{"$f":"IF('SD Teacher''s Data'!E260=\"\",\"\",'SD Teacher''s Data'!E260)","v":""},{"$f":"IF('SD Teacher''s Data'!K260=\"\",\"\",'SD Teacher''s Data'!K260)","v":""},{"$f":"IF('SD Teacher''s Data'!B260=\"\",\"\",'SD Teacher''s Data'!B260)","v":""},{"$nulls":5},{"$f":"IF('SD Teacher''s Data'!J260=\"\",\"\",'SD Teacher''s Data'!J260)","v":""}]
[{"$f":"IF(Table1[[#This Row],[नाम]]=\"\",\"\",ROWS($A$1:A260))","v":""},{"$f":"PROPER(IF('SD Teacher''s Data'!A261=\"\",\"\",'SD Teacher''s Data'!A261))","v":""},{"$f":"PROPER(IF('SD Teacher''s Data'!F261=\"\",\"\",'SD Teacher''s Data'!F261))","v":""},{"$f":"IF('SD Teacher''s Data'!E261=\"\",\"\",'SD Teacher''s Data'!E261)","v":""},{"$f":"IF('SD Teacher''s Data'!K261=\"\",\"\",'SD Teacher''s Data'!K261)","v":""},{"$f":"IF('SD Teacher''s Data'!B261=\"\",\"\",'SD Teacher''s Data'!B261)","v":""},{"$nulls":5},{"$f":"IF('SD Teacher''s Data'!J261=\"\",\"\",'SD Teacher''s Data'!J261)","v":""}]
[{"$f":"IF(Table1[[#This Row],[नाम]]=\"\",\"\",ROWS($A$1:A261))","v":""},{"$f":"PROPER(IF('SD Teacher''s Data'!A262=\"\",\"\",'SD Teacher''s Data'!A262))","v":""},{"$f":"PROPER(IF('SD Teacher''s Data'!F262=\"\",\"\",'SD Teacher''s Data'!F262))","v":""},{"$f":"IF('SD Teacher''s Data'!E262=\"\",\"\",'SD Teacher''s Data'!E262)","v":""},{"$f":"IF('SD Teacher''s Data'!K262=\"\",\"\",'SD Teacher''s Data'!K262)","v":""},{"$f":"IF('SD Teacher''s Data'!B262=\"\",\"\",'SD Teacher''s Data'!B262)","v":""},{"$nulls":5},{"$f":"IF('SD Teacher''s Data'!J262=\"\",\"\",'SD Teacher''s Data'!J262)","v":""}]
[{"$f":"IF(Table1[[#This Row],[नाम]]=\"\",\"\",ROWS($A$1:A262))","v":""},{"$f":"PROPER(IF('SD Teacher''s Data'!A263=\"\",\"\",'SD Teacher''s Data'!A263))","v":""},{"$f":"PROPER(IF('SD Teacher''s Data'!F263=\"\",\"\",'SD Teacher''s Data'!F263))","v":""},{"$f":"IF('SD Teacher''s Data'!E263=\"\",\"\",'SD Teacher''s Data'!E263)","v":""},{"$f":"IF('SD Teacher''s Data'!K263=\"\",\"\",'SD Teacher''s Data'!K263)","v":""},{"$f":"IF('SD Teacher''s Data'!B263=\"\",\"\",'SD Teacher''s Data'!B263)","v":""},{"$nulls":5},{"$f":"IF('SD Teacher''s Data'!J263=\"\",\"\",'SD Teacher''s Data'!J263)","v":""}]
[{"$f":"IF(Table1[[#This Row],[नाम]]=\"\",\"\",ROWS($A$1:A263))","v":""},{"$f":"PROPER(IF('SD Teacher''s Data'!A264=\"\",\"\",'SD Teacher''s Data'!A264))","v":""},{"$f":"PROPER(IF('SD Teacher''s Data'!F264=\"\",\"\",'SD Teacher''s Data'!F264))","v":""},{"$f":"IF('SD Teacher''s Data'!E264=\"\",\"\",'SD Teacher''s Data'!E264)","v":""},{"$f":"IF('SD Teacher''s Data'!K264=\"\",\"\",'SD Teacher''s Data'!K264)","v":""},{"$f":"IF('SD Teacher''s Data'!B264=\"\",\"\",'SD Teacher''s Data'!B264)","v":""},{"$nulls":5},{"$f":"IF('SD Teacher''s Data'!J264=\"\",\"\",'SD Teacher''s Data'!J264)","v":""}]
[{"$f":"IF(Table1[[#This Row],[नाम]]=\"\",\"\",ROWS($A$1:A264))","v":""},{"$f":"PROPER(IF('SD Teacher''s Data'!A265=\"\",\"\",'SD Teacher''s Data'!A265))","v":""},{"$f":"PROPER(IF('SD Teacher''s Data'!F265=\"\",\"\",'SD Teacher''s Data'!F265))","v":""},{"$f":"IF('SD Teacher''s Data'!E265=\"\",\"\",'SD Teacher''s Data'!E265)","v":""},{"$f":"IF('SD Teacher''s Data'!K265=\"\",\"\",'SD Teacher''s Data'!K265)","v":""},{"$f":"IF('SD Teacher''s Data'!B265=\"\",\"\",'SD Teacher''s Data'!B265)","v":""},{"$nulls":5},{"$f":"IF('SD Teacher''s Data'!J265=\"\",\"\",'SD Teacher''s Data'!J265)","v":""}]
[{"$f":"IF(Table1[[#This Row],[नाम]]=\"\",\"\",ROWS($A$1:A265))","v":""},{"$f":"PROPER(IF('SD Teacher''s Data'!A266=\"\",\"\",'SD Teacher''s Data'!A266))","v":""},{"$f":"PROPER(IF('SD Teacher''s Data'!F266=\"\",\"\",'SD Teacher''s Data'!F266))","v":""},{"$f":"IF('SD Teacher''s Data'!E266=\"\",\"\",'SD Teacher''s Data'!E266)","v":""},{"$f":"IF('SD Teacher''s Data'!K266=\"\",\"\",'SD Teacher''s Data'!K266)","v":""},{"$f":"IF('SD Teacher''s Data'!B266=\"\",\"\",'SD Teacher''s Data'!B266)","v":""},{"$nulls":5},{"$f":"IF('SD Teacher''s Data'!J266=\"\",\"\",'SD Teacher''s Data'!J266)","v":""}]
[{"$f":"IF(Table1[[#This Row],[नाम]]=\"\",\"\",ROWS($A$1:A266))","v":""},{"$f":"PROPER(IF('SD Teacher''s Data'!A267=\"\",\"\",'SD Teacher''s Data'!A267))","v":""},{"$f":"PROPER(IF('SD Teacher''s Data'!F267=\"\",\"\",'SD Teacher''s Data'!F267))","v":""},{"$f":"IF('SD Teacher''s Data'!E267=\"\",\"\",'SD Teacher''s Data'!E267)","v":""},{"$f":"IF('SD Teacher''s Data'!K267=\"\",\"\",'SD Teacher''s Data'!K267)","v":""},{"$f":"IF('SD Teacher''s Data'!B267=\"\",\"\",'SD Teacher''s Data'!B267)","v":""},{"$nulls":5},{"$f":"IF('SD Teacher''s Data'!J267=\"\",\"\",'SD Teacher''s Data'!J267)","v":""}]
[{"$f":"IF(Table1[[#This Row],[नाम]]=\"\",\"\",ROWS($A$1:A267))","v":""},{"$f":"PROPER(IF('SD Teacher''s Data'!A268=\"\",\"\",'SD Teacher''s Data'!A268))","v":""},{"$f":"PROPER(IF('SD Teacher''s Data'!F268=\"\",\"\",'SD Teacher''s Data'!F268))","v":""},{"$f":"IF('SD Teacher''s Data'!E268=\"\",\"\",'SD Teacher''s Data'!E268)","v":""},{"$f":"IF('SD Teacher''s Data'!K268=\"\",\"\",'SD Teacher''s Data'!K268)","v":""},{"$f":"IF('SD Teacher''s Data'!B268=\"\",\"\",'SD Teacher''s Data'!B268)","v":""},{"$nulls":5},{"$f":"IF('SD Teacher''s Data'!J268=\"\",\"\",'SD Teacher''s Data'!J268)","v":""}]
[{"$f":"IF(Table1[[#This Row],[नाम]]=\"\",\"\",ROWS($A$1:A268))","v":""},{"$f":"PROPER(IF('SD Teacher''s Data'!A269=\"\",\"\",'SD Teacher''s Data'!A269))","v":""},{"$f":"PROPER(IF('SD Teacher''s Data'!F269=\"\",\"\",'SD Teacher''s Data'!F269))","v":""},{"$f":"IF('SD Teacher''s Data'!E269=\"\",\"\",'SD Teacher''s Data'!E269)","v":""},{"$f":"IF('SD Teacher''s Data'!K269=\"\",\"\",'SD Teacher''s Data'!K269)","v":""},{"$f":"IF('SD Teacher''s Data'!B269=\"\",\"\",'SD Teacher''s Data'!B269)","v":""},{"$nulls":5},{"$f":"IF('SD Teacher''s Data'!J269=\"\",\"\",'SD Teacher''s Data'!J269)","v":""}]
[{"$f":"IF(Table1[[#This Row],[नाम]]=\"\",\"\",ROWS($A$1:A269))","v":""},{"$f":"PROPER(IF('SD Teacher''s Data'!A270=\"\",\"\",'SD Teacher''s Data'!A270))","v":""},{"$f":"PROPER(IF('SD Teacher''s Data'!F270=\"\",\"\",'SD Teacher''s Data'!F270))","v":""},{"$f":"IF('SD Teacher''s Data'!E270=\"\",\"\",'SD Teacher''s Data'!E270)","v":""},{"$f":"IF('SD Teacher''s Data'!K270=\"\",\"\",'SD Teacher''s Data'!K270)","v":""},{"$f":"IF('SD Teacher''s Data'!B270=\"\",\"\",'SD Teacher''s Data'!B270)","v":""},{"$nulls":5},{"$f":"IF('SD Teacher''s Data'!J270=\"\",\"\",'SD Teacher''s Data'!J270)","v":""}]
[{"$f":"IF(Table1[[#This Row],[नाम]]=\"\",\"\",ROWS($A$1:A270))","v":""},{"$f":"PROPER(IF('SD Teacher''s Data'!A271=\"\",\"\",'SD Teacher''s Data'!A271))","v":""},{"$f":"PROPER(IF('SD Teacher''s Data'!F271=\"\",\"\",'SD Teacher''s Data'!F271))","v":""},{"$f":"IF('SD Teacher''s Data'!E271=\"\",\"\",'SD Teacher''s Data'!E271)","v":""},{"$f":"IF('SD Teacher''s Data'!K271=\"\",\"\",'SD Teacher''s Data'!K271)","v":""},{"$f":"IF('SD Teacher''s Data'!B271=\"\",\"\",'SD Teacher''s Data'!B271)","v":""},{"$nulls":5},{"$f":"IF('SD Teacher''s Data'!J271=\"\",\"\",'SD Teacher''s Data'!J271)","v":""}]
[{"$f":"IF(Table1[[#This Row],[नाम]]=\"\",\"\",ROWS($A$1:A271))","v":""},{"$f":"PROPER(IF('SD Teacher''s Data'!A272=\"\",\"\",'SD Teacher''s Data'!A272))","v":""},{"$f":"PROPER(IF('SD Teacher''s Data'!F272=\"\",\"\",'SD Teacher''s Data'!F272))","v":""},{"$f":"IF('SD Teacher''s Data'!E272=\"\",\"\",'SD Teacher''s Data'!E272)","v":""},{"$f":"IF('SD Teacher''s Data'!K272=\"\",\"\",'SD Teacher''s Data'!K272)","v":""},{"$f":"IF('SD Teacher''s Data'!B272=\"\",\"\",'SD Teacher''s Data'!B272)","v":""},{"$nulls":5},{"$f":"IF('SD Teacher''s Data'!J272=\"\",\"\",'SD Teacher''s Data'!J272)","v":""}]
[{"$f":"IF(Table1[[#This Row],[नाम]]=\"\",\"\",ROWS($A$1:A272))","v":""},{"$f":"PROPER(IF('SD Teacher''s Data'!A273=\"\",\"\",'SD Teacher''s Data'!A273))","v":""},{"$f":"PROPER(IF('SD Teacher''s Data'!F273=\"\",\"\",'SD Teacher''s Data'!F273))","v":""},{"$f":"IF('SD Teacher''s Data'!E273=\"\",\"\",'SD Teacher''s Data'!E273)","v":""},{"$f":"IF('SD Teacher''s Data'!K273=\"\",\"\",'SD Teacher''s Data'!K273)","v":""},{"$f":"IF('SD Teacher''s Data'!B273=\"\",\"\",'SD Teacher''s Data'!B273)","v":""},{"$nulls":5},{"$f":"IF('SD Teacher''s Data'!J273=\"\",\"\",'SD Teacher''s Data'!J273)","v":""}]
[{"$f":"IF(Table1[[#This Row],[नाम]]=\"\",\"\",ROWS($A$1:A273))","v":""},{"$f":"PROPER(IF('SD Teacher''s Data'!A274=\"\",\"\",'SD Teacher''s Data'!A274))","v":""},{"$f":"PROPER(IF('SD Teacher''s Data'!F274=\"\",\"\",'SD Teacher''s Data'!F274))","v":""},{"$f":"IF('SD Teacher''s Data'!E274=\"\",\"\",'SD Teacher''s Data'!E274)","v":""},{"$f":"IF('SD Teacher''s Data'!K274=\"\",\"\",'SD Teacher''s Data'!K274)","v":""},{"$f":"IF('SD Teacher''s Data'!B274=\"\",\"\",'SD Teacher''s Data'!B274)","v":""},{"$nulls":5},{"$f":"IF('SD Teacher''s Data'!J274=\"\",\"\",'SD Teacher''s Data'!J274)","v":""}]
[{"$f":"IF(Table1[[#This Row],[नाम]]=\"\",\"\",ROWS($A$1:A274))","v":""},{"$f":"PROPER(IF('SD Teacher''s Data'!A275=\"\",\"\",'SD Teacher''s Data'!A275))","v":""},{"$f":"PROPER(IF('SD Teacher''s Data'!F275=\"\",\"\",'SD Teacher''s Data'!F275))","v":""},{"$f":"IF('SD Teacher''s Data'!E275=\"\",\"\",'SD Teacher''s Data'!E275)","v":""},{"$f":"IF('SD Teacher''s Data'!K275=\"\",\"\",'SD Teacher''s Data'!K275)","v":""},{"$f":"IF('SD Teacher''s Data'!B275=\"\",\"\",'SD Teacher''s Data'!B275)","v":""},{"$nulls":5},{"$f":"IF('SD Teacher''s Data'!J275=\"\",\"\",'SD Teacher''s Data'!J275)","v":""}]
[{"$f":"IF(Table1[[#This Row],[नाम]]=\"\",\"\",ROWS($A$1:A275))","v":""},{"$f":"PROPER(IF('SD Teacher''s Data'!A276=\"\",\"\",'SD Teacher''s Data'!A276))","v":""},{"$f":"PROPER(IF('SD Teacher''s Data'!F276=\"\",\"\",'SD Teacher''s Data'!F276))","v":""},{"$f":"IF('SD Teacher''s Data'!E276=\"\",\"\",'SD Teacher''s Data'!E276)","v":""},{"$f":"IF('SD Teacher''s Data'!K276=\"\",\"\",'SD Teacher''s Data'!K276)","v":""},{"$f":"IF('SD Teacher''s Data'!B276=\"\",\"\",'SD Teacher''s Data'!B276)","v":""},{"$nulls":5},{"$f":"IF('SD Teacher''s Data'!J276=\"\",\"\",'SD Teacher''s Data'!J276)","v":""}]
[{"$f":"IF(Table1[[#This Row],[नाम]]=\"\",\"\",ROWS($A$1:A276))","v":""},{"$f":"PROPER(IF('SD Teacher''s Data'!A277=\"\",\"\",'SD Teacher''s Data'!A277))","v":""},{"$f":"PROPER(IF('SD Teacher''s Data'!F277=\"\",\"\",'SD Teacher''s Data'!F277))","v":""},{"$f":"IF('SD Teacher''s Data'!E277=\"\",\"\",'SD Teacher''s Data'!E277)","v":""},{"$f":"IF('SD Teacher''s Data'!K277=\"\",\"\",'SD Teacher''s Data'!K277)","v":""},{"$f":"IF('SD Teacher''s Data'!B277=\"\",\"\",'SD Teacher''s Data'!B277)","v":""},{"$nulls":5},{"$f":"IF('SD Teacher''s Data'!J277=\"\",\"\",'SD Teacher''s Data'!J277)","v":""}]
[{"$f":"IF(Table1[[#This Row],[नाम]]=\"\",\"\",ROWS($A$1:A277))","v":""},{"$f":"PROPER(IF('SD Teacher''s Data'!A278=\"\",\"\",'SD Teacher''s Data'!A278))","v":""},{"$f":"PROPER(IF('SD Teacher''s Data'!F278=\"\",\"\",'SD Teacher''s Data'!F278))","v":""},{"$f":"IF('SD Teacher''s Data'!E278=\"\",\"\",'SD Teacher''s Data'!E278)","v":""},{"$f":"IF('SD Teacher''s Data'!K278=\"\",\"\",'SD Teacher''s Data'!K278)","v":""},{"$f":"IF('SD Teacher''s Data'!B278=\"\",\"\",'SD Teacher''s Data'!B278)","v":""},{"$nulls":5},{"$f":"IF('SD Teacher''s Data'!J278=\"\",\"\",'SD Teacher''s Data'!J278)","v":""}]
[{"$f":"IF(Table1[[#This Row],[नाम]]=\"\",\"\",ROWS($A$1:A278))","v":""},{"$f":"PROPER(IF('SD Teacher''s Data'!A279=\"\",\"\",'SD Teacher''s Data'!A279))","v":""},{"$f":"PROPER(IF('SD Teacher''s Data'!F279=\"\",\"\",'SD Teacher''s Data'!F279))","v":""},{"$f":"IF('SD Teacher''s Data'!E279=\"\",\"\",'SD Teacher''s Data'!E279)","v":""},{"$f":"IF('SD Teacher''s Data'!K279=\"\",\"\",'SD Teacher''s Data'!K279)","v":""},{"$f":"IF('SD Teacher''s Data'!B279=\"\",\"\",'SD Teacher''s Data'!B279)","v":""},{"$nulls":5},{"$f":"IF('SD Teacher''s Data'!J279=\"\",\"\",'SD Teacher''s Data'!J279)","v":""}]
[{"$f":"IF(Table1[[#This Row],[नाम]]=\"\",\"\",ROWS($A$1:A279))","v":""},{"$f":"PROPER(IF('SD Teacher''s Data'!A280=\"\",\"\",'SD Teacher''s Data'!A280))","v":""},{"$f":"PROPER(IF('SD Teacher''s Data'!F280=\"\",\"\",'SD Teacher''s Data'!F280))","v":""},{"$f":"IF('SD Teacher''s Data'!E280=\"\",\"\",'SD Teacher''s Data'!E280)","v":""},{"$f":"IF('SD Teacher''s Data'!K280=\"\",\"\",'SD Teacher''s Data'!K280)","v":""},{"$f":"IF('SD Teacher''s Data'!B280=\"\",\"\",'SD Teacher''s Data'!B280)","v":""},{"$nulls":5},{"$f":"IF('SD Teacher''s Data'!J280=\"\",\"\",'SD Teacher''s Data'!J280)","v":""}]
[{"$f":"IF(Table1[[#This Row],[नाम]]=\"\",\"\",ROWS($A$1:A280))","v":""},{"$f":"PROPER(IF('SD Teacher''s Data'!A281=\"\",\"\",'SD Teacher''s Data'!A281))","v":""},{"$f":"PROPER(IF('SD Teacher''s Data'!F281=\"\",\"\",'SD Teacher''s Data'!F281))","v":""},{"$f":"IF('SD Teacher''s Data'!E281=\"\",\"\",'SD Teacher''s Data'!E281)","v":""},{"$f":"IF('SD Teacher''s Data'!K281=\"\",\"\",'SD Teacher''s Data'!K281)","v":""},{"$f":"IF('SD Teacher''s Data'!B281=\"\",\"\",'SD Teacher''s Data'!B281)","v":""},{"$nulls":5},{"$f":"IF('SD Teacher''s Data'!J281=\"\",\"\",'SD Teacher''s Data'!J281)","v":""}]
[{"$f":"IF(Table1[[#This Row],[नाम]]=\"\",\"\",ROWS($A$1:A281))","v":""},{"$f":"PROPER(IF('SD Teacher''s Data'!A282=\"\",\"\",'SD Teacher''s Data'!A282))","v":""},{"$f":"PROPER(IF('SD Teacher''s Data'!F282=\"\",\"\",'SD Teacher''s Data'!F282))","v":""},{"$f":"IF('SD Teacher''s Data'!E282=\"\",\"\",'SD Teacher''s Data'!E282)","v":""},{"$f":"IF('SD Teacher''s Data'!K282=\"\",\"\",'SD Teacher''s Data'!K282)","v":""},{"$f":"IF('SD Teacher''s Data'!B282=\"\",\"\",'SD Teacher''s Data'!B282)","v":""},{"$nulls":5},{"$f":"IF('SD Teacher''s Data'!J282=\"\",\"\",'SD Teacher''s Data'!J282)","v":""}]
[{"$f":"IF(Table1[[#This Row],[नाम]]=\"\",\"\",ROWS($A$1:A282))","v":""},{"$f":"PROPER(IF('SD Teacher''s Data'!A283=\"\",\"\",'SD Teacher''s Data'!A283))","v":""},{"$f":"PROPER(IF('SD Teacher''s Data'!F283=\"\",\"\",'SD Teacher''s Data'!F283))","v":""},{"$f":"IF('SD Teacher''s Data'!E283=\"\",\"\",'SD Teacher''s Data'!E283)","v":""},{"$f":"IF('SD Teacher''s Data'!K283=\"\",\"\",'SD Teacher''s Data'!K283)","v":""},{"$f":"IF('SD Teacher''s Data'!B283=\"\",\"\",'SD Teacher''s Data'!B283)","v":""},{"$nulls":5},{"$f":"IF('SD Teacher''s Data'!J283=\"\",\"\",'SD Teacher''s Data'!J283)","v":""}]
[{"$f":"IF(Table1[[#This Row],[नाम]]=\"\",\"\",ROWS($A$1:A283))","v":""},{"$f":"PROPER(IF('SD Teacher''s Data'!A284=\"\",\"\",'SD Teacher''s Data'!A284))","v":""},{"$f":"PROPER(IF('SD Teacher''s Data'!F284=\"\",\"\",'SD Teacher''s Data'!F284))","v":""},{"$f":"IF('SD Teacher''s Data'!E284=\"\",\"\",'SD Teacher''s Data'!E284)","v":""},{"$f":"IF('SD Teacher''s Data'!K284=\"\",\"\",'SD Teacher''s Data'!K284)","v":""},{"$f":"IF('SD Teacher''s Data'!B284=\"\",\"\",'SD Teacher''s Data'!B284)","v":""},{"$nulls":5},{"$f":"IF('SD Teacher''s Data'!J284=\"\",\"\",'SD Teacher''s Data'!J284)","v":""}]
[{"$f":"IF(Table1[[#This Row],[नाम]]=\"\",\"\",ROWS($A$1:A284))","v":""},{"$f":"PROPER(IF('SD Teacher''s Data'!A285=\"\",\"\",'SD Teacher''s Data'!A285))","v":""},{"$f":"PROPER(IF('SD Teacher''s Data'!F285=\"\",\"\",'SD Teacher''s Data'!F285))","v":""},{"$f":"IF('SD Teacher''s Data'!E285=\"\",\"\",'SD Teacher''s Data'!E285)","v":""},{"$f":"IF('SD Teacher''s Data'!K285=\"\",\"\",'SD Teacher''s Data'!K285)","v":""},{"$f":"IF('SD Teacher''s Data'!B285=\"\",\"\",'SD Teacher''s Data'!B285)","v":""},{"$nulls":5},{"$f":"IF('SD Teacher''s Data'!J285=\"\",\"\",'SD Teacher''s Data'!J285)","v":""}]
[{"$f":"IF(Table1[[#This Row],[नाम]]=\"\",\"\",ROWS($A$1:A285))","v":""},{"$f":"PROPER(IF('SD Teacher''s Data'!A286=\"\",\"\",'SD Teacher''s Data'!A286))","v":""},{"$f":"PROPER(IF('SD Teacher''s Data'!F286=\"\",\"\",'SD Teacher''s Data'!F286))","v":""},{"$f":"IF('SD Teacher''s Data'!E286=\"\",\"\",'SD Teacher''s Data'!E286)","v":""},{"$f":"IF('SD Teacher''s Data'!K286=\"\",\"\",'SD Teacher''s Data'!K286)","v":""},{"$f":"IF('SD Teacher''s Data'!B286=\"\",\"\",'SD Teacher''s Data'!B286)","v":""},{"$nulls":5},{"$f":"IF('SD Teacher''s Data'!J286=\"\",\"\",'SD Teacher''s Data'!J286)","v":""}]
[{"$f":"IF(Table1[[#This Row],[नाम]]=\"\",\"\",ROWS($A$1:A286))","v":""},{"$f":"PROPER(IF('SD Teacher''s Data'!A287=\"\",\"\",'SD Teacher''s Data'!A287))","v":""},{"$f":"PROPER(IF('SD Teacher''s Data'!F287=\"\",\"\",'SD Teacher''s Data'!F287))","v":""},{"$f":"IF('SD Teacher''s Data'!E287=\"\",\"\",'SD Teacher''s Data'!E287)","v":""},{"$f":"IF('SD Teacher''s Data'!K287=\"\",\"\",'SD Teacher''s Data'!K287)","v":""},{"$f":"IF('SD Teacher''s Data'!B287=\"\",\"\",'SD Teacher''s Data'!B287)","v":""},{"$nulls":5},{"$f":"IF('SD Teacher''s Data'!J287=\"\",\"\",'SD Teacher''s Data'!J287)","v":""}]
[{"$f":"IF(Table1[[#This Row],[नाम]]=\"\",\"\",ROWS($A$1:A287))","v":""},{"$f":"PROPER(IF('SD Teacher''s Data'!A288=\"\",\"\",'SD Teacher''s Data'!A288))","v":""},{"$f":"PROPER(IF('SD Teacher''s Data'!F288=\"\",\"\",'SD Teacher''s Data'!F288))","v":""},{"$f":"IF('SD Teacher''s Data'!E288=\"\",\"\",'SD Teacher''s Data'!E288)","v":""},{"$f":"IF('SD Teacher''s Data'!K288=\"\",\"\",'SD Teacher''s Data'!K288)","v":""},{"$f":"IF('SD Teacher''s Data'!B288=\"\",\"\",'SD Teacher''s Data'!B288)","v":""},{"$nulls":5},{"$f":"IF('SD Teacher''s Data'!J288=\"\",\"\",'SD Teacher''s Data'!J288)","v":""}]
[{"$f":"IF(Table1[[#This Row],[नाम]]=\"\",\"\",ROWS($A$1:A288))","v":""},{"$f":"PROPER(IF('SD Teacher''s Data'!A289=\"\",\"\",'SD Teacher''s Data'!A289))","v":""},{"$f":"PROPER(IF('SD Teacher''s Data'!F289=\"\",\"\",'SD Teacher''s Data'!F289))","v":""},{"$f":"IF('SD Teacher''s Data'!E289=\"\",\"\",'SD Teacher''s Data'!E289)","v":""},{"$f":"IF('SD Teacher''s Data'!K289=\"\",\"\",'SD Teacher''s Data'!K289)","v":""},{"$f":"IF('SD Teacher''s Data'!B289=\"\",\"\",'SD Teacher''s Data'!B289)","v":""},{"$nulls":5},{"$f":"IF('SD Teacher''s Data'!J289=\"\",\"\",'SD Teacher''s Data'!J289)","v":""}]
[{"$f":"IF(Table1[[#This Row],[नाम]]=\"\",\"\",ROWS($A$1:A289))","v":""},{"$f":"PROPER(IF('SD Teacher''s Data'!A290=\"\",\"\",'SD Teacher''s Data'!A290))","v":""},{"$f":"PROPER(IF('SD Teacher''s Data'!F290=\"\",\"\",'SD Teacher''s Data'!F290))","v":""},{"$f":"IF('SD Teacher''s Data'!E290=\"\",\"\",'SD Teacher''s Data'!E290)","v":""},{"$f":"IF('SD Teacher''s Data'!K290=\"\",\"\",'SD Teacher''s Data'!K290)","v":""},{"$f":"IF('SD Teacher''s Data'!B290=\"\",\"\",'SD Teacher''s Data'!B290)","v":""},{"$nulls":5},{"$f":"IF('SD Teacher''s Data'!J290=\"\",\"\",'SD Teacher''s Data'!J290)","v":""}]
[{"$f":"IF(Table1[[#This Row],[नाम]]=\"\",\"\",ROWS($A$1:A290))","v":""},{"$f":"PROPER(IF('SD Teacher''s Data'!A291=\"\",\"\",'SD Teacher''s Data'!A291))","v":""},{"$f":"PROPER(IF('SD Teacher''s Data'!F291=\"\",\"\",'SD Teacher''s Data'!F291))","v":""},{"$f":"IF('SD Teacher''s Data'!E291=\"\",\"\",'SD Teacher''s Data'!E291)","v":""},{"$f":"IF('SD Teacher''s Data'!K291=\"\",\"\",'SD Teacher''s Data'!K291)","v":""},{"$f":"IF('SD Teacher''s Data'!B291=\"\",\"\",'SD Teacher''s Data'!B291)","v":""},{"$nulls":5},{"$f":"IF('SD Teacher''s Data'!J291=\"\",\"\",'SD Teacher''s Data'!J291)","v":""}]
[{"$f":"IF(Table1[[#This Row],[नाम]]=\"\",\"\",ROWS($A$1:A291))","v":""},{"$f":"PROPER(IF('SD Teacher''s Data'!A292=\"\",\"\",'SD Teacher''s Data'!A292))","v":""},{"$f":"PROPER(IF('SD Teacher''s Data'!F292=\"\",\"\",'SD Teacher''s Data'!F292))","v":""},{"$f":"IF('SD Teacher''s Data'!E292=\"\",\"\",'SD Teacher''s Data'!E292)","v":""},{"$f":"IF('SD Teacher''s Data'!K292=\"\",\"\",'SD Teacher''s Data'!K292)","v":""},{"$f":"IF('SD Teacher''s Data'!B292=\"\",\"\",'SD Teacher''s Data'!B292)","v":""},{"$nulls":5},{"$f":"IF('SD Teacher''s Data'!J292=\"\",\"\",'SD Teacher''s Data'!J292)","v":""}]
[{"$f":"IF(Table1[[#This Row],[नाम]]=\"\",\"\",ROWS($A$1:A292))","v":""},{"$f":"PROPER(IF('SD Teacher''s Data'!A293=\"\",\"\",'SD Teacher''s Data'!A293))","v":""},{"$f":"PROPER(IF('SD Teacher''s Data'!F293=\"\",\"\",'SD Teacher''s Data'!F293))","v":""},{"$f":"IF('SD Teacher''s Data'!E293=\"\",\"\",'SD Teacher''s Data'!E293)","v":""},{"$f":"IF('SD Teacher''s Data'!K293=\"\",\"\",'SD Teacher''s Data'!K293)","v":""},{"$f":"IF('SD Teacher''s Data'!B293=\"\",\"\",'SD Teacher''s Data'!B293)","v":""},{"$nulls":5},{"$f":"IF('SD Teacher''s Data'!J293=\"\",\"\",'SD Teacher''s Data'!J293)","v":""}]
[{"$f":"IF(Table1[[#This Row],[नाम]]=\"\",\"\",ROWS($A$1:A293))","v":""},{"$f":"PROPER(IF('SD Teacher''s Data'!A294=\"\",\"\",'SD Teacher''s Data'!A294))","v":""},{"$f":"PROPER(IF('SD Teacher''s Data'!F294=\"\",\"\",'SD Teacher''s Data'!F294))","v":""},{"$f":"IF('SD Teacher''s Data'!E294=\"\",\"\",'SD Teacher''s Data'!E294)","v":""},{"$f":"IF('SD Teacher''s Data'!K294=\"\",\"\",'SD Teacher''s Data'!K294)","v":""},{"$f":"IF('SD Teacher''s Data'!B294=\"\",\"\",'SD Teacher''s Data'!B294)","v":""},{"$nulls":5},{"$f":"IF('SD Teacher''s Data'!J294=\"\",\"\",'SD Teacher''s Data'!J294)","v":""}]
[{"$f":"IF(Table1[[#This Row],[नाम]]=\"\",\"\",ROWS($A$1:A294))","v":""},{"$f":"PROPER(IF('SD Teacher''s Data'!A295=\"\",\"\",'SD Teacher''s Data'!A295))","v":""},{"$f":"PROPER(IF('SD Teacher''s Data'!F295=\"\",\"\",'SD Teacher''s Data'!F295))","v":""},{"$f":"IF('SD Teacher''s Data'!E295=\"\",\"\",'SD Teacher''s Data'!E295)","v":""},{"$f":"IF('SD Teacher''s Data'!K295=\"\",\"\",'SD Teacher''s Data'!K295)","v":""},{"$f":"IF('SD Teacher''s Data'!B295=\"\",\"\",'SD Teacher''s Data'!B295)","v":""},{"$nulls":5},{"$f":"IF('SD Teacher''s Data'!J295=\"\",\"\",'SD Teacher''s Data'!J295)","v":""}]
[{"$f":"IF(Table1[[#This Row],[नाम]]=\"\",\"\",ROWS($A$1:A295))","v":""},{"$f":"PROPER(IF('SD Teacher''s Data'!A296=\"\",\"\",'SD Teacher''s Data'!A296))","v":""},{"$f":"PROPER(IF('SD Teacher''s Data'!F296=\"\",\"\",'SD Teacher''s Data'!F296))","v":""},{"$f":"IF('SD Teacher''s Data'!E296=\"\",\"\",'SD Teacher''s Data'!E296)","v":""},{"$f":"IF('SD Teacher''s Data'!K296=\"\",\"\",'SD Teacher''s Data'!K296)","v":""},{"$f":"IF('SD Teacher''s Data'!B296=\"\",\"\",'SD Teacher''s Data'!B296)","v":""},{"$nulls":5},{"$f":"IF('SD Teacher''s Data'!J296=\"\",\"\",'SD Teacher''s Data'!J296)","v":""}]
[{"$f":"IF(Table1[[#This Row],[नाम]]=\"\",\"\",ROWS($A$1:A296))","v":""},{"$f":"PROPER(IF('SD Teacher''s Data'!A297=\"\",\"\",'SD Teacher''s Data'!A297))","v":""},{"$f":"PROPER(IF('SD Teacher''s Data'!F297=\"\",\"\",'SD Teacher''s Data'!F297))","v":""},{"$f":"IF('SD Teacher''s Data'!E297=\"\",\"\",'SD Teacher''s Data'!E297)","v":""},{"$f":"IF('SD Teacher''s Data'!K297=\"\",\"\",'SD Teacher''s Data'!K297)","v":""},{"$f":"IF('SD Teacher''s Data'!B297=\"\",\"\",'SD Teacher''s Data'!B297)","v":""},{"$nulls":5},{"$f":"IF('SD Teacher''s Data'!J297=\"\",\"\",'SD Teacher''s Data'!J297)","v":""}]

{"sheet":"Bill and TV No.","index":2,"n_rows":15,"n_cols":6,"rows_kept":15,"merged":[[0,0,0,5],[1,0,1,5]]}
[{"$f":"'Emp. Data'!A1","v":"Government Senior Secondary School, Rooppura"}]
["Bill No. and TV No. Detail"]
["क्र.सं.","माह का नाम","बिल नं.","डेट","टी.वी. नं.","डेट"]
[1,"APR",1,"2021-03-21",6258,"2021-04-01"]
[2,"MAY",2,"2021-03-22",6259,"2021-04-02"]
[3,"JUN",3,"2021-03-23",6260,"2021-04-03"]
[4,"JUL",4,"2021-03-24",6261,"2021-04-04"]
[5,"AUG",5,"2021-03-25",6262,"2021-04-05"]
[6,"SEP",6,"2021-03-26",6263,"2021-04-06"]
[7,"OCT",7,"2021-03-27",6264,"2021-04-07"]
[8,"NOV",8,"2021-03-28",6265,"2021-04-08"]
[9,"DEC",9,"2021-03-29",6266,"2021-04-09"]
[10,"JAN",10,"2021-03-30",6267,"2021-04-10"]
[11,"FEB",11,"2021-03-31",6268,"2021-04-11"]
[12,"MAR",12,"2021-04-01",6269,"2021-04-12"]

{"sheet":"Allowances","index":3,"n_rows":299,"n_cols":11,"rows_kept":299,"merged":[[0,0,0,10],[1,0,1,10]]}
[{"$f":"'Emp. Data'!A1","v":"Government Senior Secondary School, Rooppura"}]
["Allowances Data"]
["क्र.सं.","नाम","मार्च मूल वेतन","अवकाश वेतन ","विशेष वेतन","विकलांग भत्ता","शहरी भत्ता ","अन्य 1","अन्य 2","अन्य 3","योग"]
[{"$f":"IF(Table2[[#This Row],[नाम]]=\"\",\"\",ROWS($A$1:A1))","v":1},{"$f":"PROPER(IF(Table1[[#This Row],[नाम]]=\"\",\"\",Table1[[#This Row],[नाम]]))","v":"Aditya Jakhad"},14600,{"$nulls":7},{"$f":"SUM(Table2[[#This Row],[मार्च मूल वेतन]:[अन्य 3]])","v":14600}]
[{"$f":"IF(Table2[[#This Row],[नाम]]=\"\",\"\",ROWS($A$1:A2))","v":2},{"$f":"PROPER(IF(Table1[[#This Row],[नाम]]=\"\",\"\",Table1[[#This Row],[नाम]]))","v":"Ashwini Kumar"},43800,{"$nulls":7},{"$f":"SUM(Table2[[#This Row],[मार्च मूल वेतन]:[अन्य 3]])","v":43800}]
[{"$f":"IF(Table2[[#This Row],[नाम]]=\"\",\"\",ROWS($A$1:A3))","v":3},{"$f":"PROPER(IF(Table1[[#This Row],[नाम]]=\"\",\"\",Table1[[#This Row],[नाम]]))","v":"Banwari"},{"$nulls":8},{"$f":"SUM(Table2[[#This Row],[मार्च मूल वेतन]:[अन्य 3]])","v":0}]
[{"$f":"IF(Table2[[#This Row],[नाम]]=\"\",\"\",ROWS($A$1:A4))","v":4},{"$f":"PROPER(IF(Table1[[#This Row],[नाम]]=\"\",\"\",Table1[[#This Row],[नाम]]))","v":"Chetan Ram Riyar"},{"$nulls":8},{"$f":"SUM(Table2[[#This Row],[मार्च मूल वेतन]:[अन्य 3]])","v":0}]
[{"$f":"IF(Table2[[#This Row],[नाम]]=\"\",\"\",ROWS($A$1:A5))","v":5},{"$f":"PROPER(IF(Table1[[#This Row],[नाम]]=\"\",\"\",Table1[[#This Row],[नाम]]))","v":"Chhotoo Singh"},{"$nulls":8},{"$f":"SUM(Table2[[#This Row],[मार्च मूल वेतन]:[अन्य 3]])","v":0}]
[{"$f":"IF(Table2[[#This Row],[नाम]]=\"\",\"\",ROWS($A$1:A6))","v":6},{"$f":"PROPER(IF(Table1[[#This Row],[नाम]]=\"\",\"\",Table1[[#This Row],[नाम]]))","v":"Hemlata Sharma"},{"$nulls":8},{"$f":"SUM(Table2[[#This Row],[मार्च मूल वेतन]:[अन्य 3]])","v":0}]
[{"$f":"IF(Table2[[#This Row],[नाम]]=\"\",\"\",ROWS($A$1:A7))","v":7},{"$f":"PROPER(IF(Table1[[#This Row],[नाम]]=\"\",\"\",Table1[[#This Row],[नाम]]))","v":"Kamla Barupal"},{"$nulls":8},{"$f":"SUM(Table2[[#This Row],[मार्च मूल वेतन]:[अन्य 3]])","v":0}]
[{"$f":"IF(Table2[[#This Row],[नाम]]=\"\",\"\",ROWS($A$1:A8))","v":8},{"$f":"PROPER(IF(Table1[[#This Row],[नाम]]=\"\",\"\",Table1[[#This Row],[नाम]]))","v":"Kamla Sesma"},{"$nulls":8},{"$f":"SUM(Table2[[#This Row],[मार्च मूल वेतन]:[अन्य 3]])","v":0}]
[{"$f":"IF(Table2[[#This Row],[नाम]]=\"\",\"\",ROWS($A$1:A9))","v":9},{"$f":"PROPER(IF(Table1[[#This Row],[नाम]]=\"\",\"\",Table1[[#This Row],[नाम]]))","v":"Pramod Kanwar"},{"$nulls":8},{"$f":"SUM(Table2[[#This Row],[मार्च मूल वेतन]:[अन्य 3]])","v":0}]
[{"$f":"IF(Table2[[#This Row],[नाम]]=\"\",\"\",ROWS($A$1:A10))","v":10},{"$f":"PROPER(IF(Table1[[#This Row],[नाम]]=\"\",\"\",Table1[[#This Row],[नाम]]))","v":"Rajkumari Jhhala"},{"$nulls":8},{"$f":"SUM(Table2[[#This Row],[मार्च मूल वेतन]:[अन्य 3]])","v":0}]
[{"$f":"IF(Table2[[#This Row],[नाम]]=\"\",\"\",ROWS($A$1:A11))","v":11},{"$f":"PROPER(IF(Table1[[#This Row],[नाम]]=\"\",\"\",Table1[[#This Row],[नाम]]))","v":"Rameshwar Lal"},{"$nulls":8},{"$f":"SUM(Table2[[#This Row],[मार्च मूल वेतन]:[अन्य 3]])","v":0}]
[{"$f":"IF(Table2[[#This Row],[नाम]]=\"\",\"\",ROWS($A$1:A12))","v":12},{"$f":"PROPER(IF(Table1[[#This Row],[नाम]]=\"\",\"\",Table1[[#This Row],[नाम]]))","v":"Randheer Singh Shekhawat"},{"$nulls":8},{"$f":"SUM(Table2[[#This Row],[मार्च मूल वेतन]:[अन्य 3]])","v":0}]
[{"$f":"IF(Table2[[#This Row],[नाम]]=\"\",\"\",ROWS($A$1:A13))","v":13},{"$f":"PROPER(IF(Table1[[#This Row],[नाम]]=\"\",\"\",Table1[[#This Row],[नाम]]))","v":"Santosh Mohanpuriya"},{"$nulls":8},{"$f":"SUM(Table2[[#This Row],[मार्च मूल वेतन]:[अन्य 3]])","v":0}]
[{"$f":"IF(Table2[[#This Row],[नाम]]=\"\",\"\",ROWS($A$1:A14))","v":14},{"$f":"PROPER(IF(Table1[[#This Row],[नाम]]=\"\",\"\",Table1[[#This Row],[नाम]]))","v":"Saroj Sunariwal"},{"$nulls":8},{"$f":"SUM(Table2[[#This Row],[मार्च मूल वेतन]:[अन्य 3]])","v":0}]
[{"$f":"IF(Table2[[#This Row],[नाम]]=\"\",\"\",ROWS($A$1:A15))","v":15},{"$f":"PROPER(IF(Table1[[#This Row],[नाम]]=\"\",\"\",Table1[[#This Row],[नाम]]))","v":"Sita Ram Balai"},{"$nulls":8},{"$f":"SUM(Table2[[#This Row],[मार्च मूल वेतन]:[अन्य 3]])","v":0}]
[{"$f":"IF(Table2[[#This Row],[नाम]]=\"\",\"\",ROWS($A$1:A16))","v":16},{"$f":"PROPER(IF(Table1[[#This Row],[नाम]]=\"\",\"\",Table1[[#This Row],[नाम]]))","v":"Sukha Ram Muhal"},{"$nulls":8},{"$f":"SUM(Table2[[#This Row],[मार्च मूल वेतन]:[अन्य 3]])","v":0}]
[{"$f":"IF(Table2[[#This Row],[नाम]]=\"\",\"\",ROWS($A$1:A17))","v":""},{"$f":"PROPER(IF(Table1[[#This Row],[नाम]]=\"\",\"\",Table1[[#This Row],[नाम]]))","v":""},{"$nulls":8},{"$f":"SUM(Table2[[#This Row],[मार्च मूल वेतन]:[अन्य 3]])","v":0}]
[{"$f":"IF(Table2[[#This Row],[नाम]]=\"\",\"\",ROWS($A$1:A18))","v":""},{"$f":"PROPER(IF(Table1[[#This Row],[नाम]]=\"\",\"\",Table1[[#This Row],[नाम]]))","v":""},{"$nulls":8},{"$f":"SUM(Table2[[#This Row],[मार्च मूल वेतन]:[अन्य 3]])","v":0}]
[{"$f":"IF(Table2[[#This Row],[नाम]]=\"\",\"\",ROWS($A$1:A19))","v":""},{"$f":"PROPER(IF(Table1[[#This Row],[नाम]]=\"\",\"\",Table1[[#This Row],[नाम]]))","v":""},{"$nulls":8},{"$f":"SUM(Table2[[#This Row],[मार्च मूल वेतन]:[अन्य 3]])","v":0}]
[{"$f":"IF(Table2[[#This Row],[नाम]]=\"\",\"\",ROWS($A$1:A20))","v":""},{"$f":"PROPER(IF(Table1[[#This Row],[नाम]]=\"\",\"\",Table1[[#This Row],[नाम]]))","v":""},{"$nulls":8},{"$f":"SUM(Table2[[#This Row],[मार्च मूल वेतन]:[अन्य 3]])","v":0}]
[{"$f":"IF(Table2[[#This Row],[नाम]]=\"\",\"\",ROWS($A$1:A21))","v":""},{"$f":"PROPER(IF(Table1[[#This Row],[नाम]]=\"\",\"\",Table1[[#This Row],[नाम]]))","v":""},{"$nulls":8},{"$f":"SUM(Table2[[#This Row],[मार्च मूल वेतन]:[अन्य 3]])","v":0}]
[{"$f":"IF(Table2[[#This Row],[नाम]]=\"\",\"\",ROWS($A$1:A22))","v":""},{"$f":"PROPER(IF(Table1[[#This Row],[नाम]]=\"\",\"\",Table1[[#This Row],[नाम]]))","v":""},{"$nulls":8},{"$f":"SUM(Table2[[#This Row],[मार्च मूल वेतन]:[अन्य 3]])","v":0}]
[{"$f":"IF(Table2[[#This Row],[नाम]]=\"\",\"\",ROWS($A$1:A23))","v":""},{"$f":"PROPER(IF(Table1[[#This Row],[नाम]]=\"\",\"\",Table1[[#This Row],[नाम]]))","v":""},{"$nulls":8},{"$f":"SUM(Table2[[#This Row],[मार्च मूल वेतन]:[अन्य 3]])","v":0}]
[{"$f":"IF(Table2[[#This Row],[नाम]]=\"\",\"\",ROWS($A$1:A24))","v":""},{"$f":"PROPER(IF(Table1[[#This Row],[नाम]]=\"\",\"\",Table1[[#This Row],[नाम]]))","v":""},{"$nulls":8},{"$f":"SUM(Table2[[#This Row],[मार्च मूल वेतन]:[अन्य 3]])","v":0}]
[{"$f":"IF(Table2[[#This Row],[नाम]]=\"\",\"\",ROWS($A$1:A25))","v":""},{"$f":"PROPER(IF(Table1[[#This Row],[नाम]]=\"\",\"\",Table1[[#This Row],[नाम]]))","v":""},{"$nulls":8},{"$f":"SUM(Table2[[#This Row],[मार्च मूल वेतन]:[अन्य 3]])","v":0}]
[{"$f":"IF(Table2[[#This Row],[नाम]]=\"\",\"\",ROWS($A$1:A26))","v":""},{"$f":"PROPER(IF(Table1[[#This Row],[नाम]]=\"\",\"\",Table1[[#This Row],[नाम]]))","v":""},{"$nulls":8},{"$f":"SUM(Table2[[#This Row],[मार्च मूल वेतन]:[अन्य 3]])","v":0}]
[{"$f":"IF(Table2[[#This Row],[नाम]]=\"\",\"\",ROWS($A$1:A27))","v":""},{"$f":"PROPER(IF(Table1[[#This Row],[नाम]]=\"\",\"\",Table1[[#This Row],[नाम]]))","v":""},{"$nulls":8},{"$f":"SUM(Table2[[#This Row],[मार्च मूल वेतन]:[अन्य 3]])","v":0}]
[{"$f":"IF(Table2[[#This Row],[नाम]]=\"\",\"\",ROWS($A$1:A28))","v":""},{"$f":"PROPER(IF(Table1[[#This Row],[नाम]]=\"\",\"\",Table1[[#This Row],[नाम]]))","v":""},{"$nulls":8},{"$f":"SUM(Table2[[#This Row],[मार्च मूल वेतन]:[अन्य 3]])","v":0}]
[{"$f":"IF(Table2[[#This Row],[नाम]]=\"\",\"\",ROWS($A$1:A29))","v":""},{"$f":"PROPER(IF(Table1[[#This Row],[नाम]]=\"\",\"\",Table1[[#This Row],[नाम]]))","v":""},{"$nulls":8},{"$f":"SUM(Table2[[#This Row],[मार्च मूल वेतन]:[अन्य 3]])","v":0}]
[{"$f":"IF(Table2[[#This Row],[नाम]]=\"\",\"\",ROWS($A$1:A30))","v":""},{"$f":"PROPER(IF(Table1[[#This Row],[नाम]]=\"\",\"\",Table1[[#This Row],[नाम]]))","v":""},{"$nulls":8},{"$f":"SUM(Table2[[#This Row],[मार्च मूल वेतन]:[अन्य 3]])","v":0}]
[{"$f":"IF(Table2[[#This Row],[नाम]]=\"\",\"\",ROWS($A$1:A31))","v":""},{"$f":"PROPER(IF(Table1[[#This Row],[नाम]]=\"\",\"\",Table1[[#This Row],[नाम]]))","v":""},{"$nulls":8},{"$f":"SUM(Table2[[#This Row],[मार्च मूल वेतन]:[अन्य 3]])","v":0}]
[{"$f":"IF(Table2[[#This Row],[नाम]]=\"\",\"\",ROWS($A$1:A32))","v":""},{"$f":"PROPER(IF(Table1[[#This Row],[नाम]]=\"\",\"\",Table1[[#This Row],[नाम]]))","v":""},{"$nulls":8},{"$f":"SUM(Table2[[#This Row],[मार्च मूल वेतन]:[अन्य 3]])","v":0}]
[{"$f":"IF(Table2[[#This Row],[नाम]]=\"\",\"\",ROWS($A$1:A33))","v":""},{"$f":"PROPER(IF(Table1[[#This Row],[नाम]]=\"\",\"\",Table1[[#This Row],[नाम]]))","v":""},{"$nulls":8},{"$f":"SUM(Table2[[#This Row],[मार्च मूल वेतन]:[अन्य 3]])","v":0}]
[{"$f":"IF(Table2[[#This Row],[नाम]]=\"\",\"\",ROWS($A$1:A34))","v":""},{"$f":"PROPER(IF(Table1[[#This Row],[नाम]]=\"\",\"\",Table1[[#This Row],[नाम]]))","v":""},{"$nulls":8},{"$f":"SUM(Table2[[#This Row],[मार्च मूल वेतन]:[अन्य 3]])","v":0}]
[{"$f":"IF(Table2[[#This Row],[नाम]]=\"\",\"\",ROWS($A$1:A35))","v":""},{"$f":"PROPER(IF(Table1[[#This Row],[नाम]]=\"\",\"\",Table1[[#This Row],[नाम]]))","v":""},{"$nulls":8},{"$f":"SUM(Table2[[#This Row],[मार्च मूल वेतन]:[अन्य 3]])","v":0}]
[{"$f":"IF(Table2[[#This Row],[नाम]]=\"\",\"\",ROWS($A$1:A36))","v":""},{"$f":"PROPER(IF(Table1[[#This Row],[नाम]]=\"\",\"\",Table1[[#This Row],[नाम]]))","v":""},{"$nulls":8},{"$f":"SUM(Table2[[#This Row],[मार्च मूल वेतन]:[अन्य 3]])","v":0}]
[{"$f":"IF(Table2[[#This Row],[नाम]]=\"\",\"\",ROWS($A$1:A37))","v":""},{"$f":"PROPER(IF(Table1[[#This Row],[नाम]]=\"\",\"\",Table1[[#This Row],[नाम]]))","v":""},{"$nulls":8},{"$f":"SUM(Table2[[#This Row],[मार्च मूल वेतन]:[अन्य 3]])","v":0}]
[{"$f":"IF(Table2[[#This Row],[नाम]]=\"\",\"\",ROWS($A$1:A38))","v":""},{"$f":"PROPER(IF(Table1[[#This Row],[नाम]]=\"\",\"\",Table1[[#This Row],[नाम]]))","v":""},{"$nulls":8},{"$f":"SUM(Table2[[#This Row],[मार्च मूल वेतन]:[अन्य 3]])","v":0}]
[{"$f":"IF(Table2[[#This Row],[नाम]]=\"\",\"\",ROWS($A$1:A39))","v":""},{"$f":"PROPER(IF(Table1[[#This Row],[नाम]]=\"\",\"\",Table1[[#This Row],[नाम]]))","v":""},{"$nulls":8},{"$f":"SUM(Table2[[#This Row],[मार्च मूल वेतन]:[अन्य 3]])","v":0}]
[{"$f":"IF(Table2[[#This Row],[नाम]]=\"\",\"\",ROWS($A$1:A40))","v":""},{"$f":"PROPER(IF(Table1[[#This Row],[नाम]]=\"\",\"\",Table1[[#This Row],[नाम]]))","v":""},{"$nulls":8},{"$f":"SUM(Table2[[#This Row],[मार्च मूल वेतन]:[अन्य 3]])","v":0}]
[{"$f":"IF(Table2[[#This Row],[नाम]]=\"\",\"\",ROWS($A$1:A41))","v":""},{"$f":"PROPER(IF(Table1[[#This Row],[नाम]]=\"\",\"\",Table1[[#This Row],[नाम]]))","v":""},{"$nulls":8},{"$f":"SUM(Table2[[#This Row],[मार्च मूल वेतन]:[अन्य 3]])","v":0}]
[{"$f":"IF(Table2[[#This Row],[नाम]]=\"\",\"\",ROWS($A$1:A42))","v":""},{"$f":"PROPER(IF(Table1[[#This Row],[नाम]]=\"\",\"\",Table1[[#This Row],[नाम]]))","v":""},{"$nulls":8},{"$f":"SUM(Table2[[#This Row],[मार्च मूल वेतन]:[अन्य 3]])","v":0}]
[{"$f":"IF(Table2[[#This Row],[नाम]]=\"\",\"\",ROWS($A$1:A43))","v":""},{"$f":"PROPER(IF(Table1[[#This Row],[नाम]]=\"\",\"\",Table1[[#This Row],[नाम]]))","v":""},{"$nulls":8},{"$f":"SUM(Table2[[#This Row],[मार्च मूल वेतन]:[अन्य 3]])","v":0}]
[{"$f":"IF(Table2[[#This Row],[नाम]]=\"\",\"\",ROWS($A$1:A44))","v":""},{"$f":"PROPER(IF(Table1[[#This Row],[नाम]]=\"\",\"\",Table1[[#This Row],[नाम]]))","v":""},{"$nulls":8},{"$f":"SUM(Table2[[#This Row],[मार्च मूल वेतन]:[अन्य 3]])","v":0}]
[{"$f":"IF(Table2[[#This Row],[नाम]]=\"\",\"\",ROWS($A$1:A45))","v":""},{"$f":"PROPER(IF(Table1[[#This Row],[नाम]]=\"\",\"\",Table1[[#This Row],[नाम]]))","v":""},{"$nulls":8},{"$f":"SUM(Table2[[#This Row],[मार्च मूल वेतन]:[अन्य 3]])","v":0}]
[{"$f":"IF(Table2[[#This Row],[नाम]]=\"\",\"\",ROWS($A$1:A46))","v":""},{"$f":"PROPER(IF(Table1[[#This Row],[नाम]]=\"\",\"\",Table1[[#This Row],[नाम]]))","v":""},{"$nulls":8},{"$f":"SUM(Table2[[#This Row],[मार्च मूल वेतन]:[अन्य 3]])","v":0}]
[{"$f":"IF(Table2[[#This Row],[नाम]]=\"\",\"\",ROWS($A$1:A47))","v":""},{"$f":"PROPER(IF(Table1[[#This Row],[नाम]]=\"\",\"\",Table1[[#This Row],[नाम]]))","v":""},{"$nulls":8},{"$f":"SUM(Table2[[#This Row],[मार्च मूल वेतन]:[अन्य 3]])","v":0}]
[{"$f":"IF(Table2[[#This Row],[नाम]]=\"\",\"\",ROWS($A$1:A48))","v":""},{"$f":"PROPER(IF(Table1[[#This Row],[नाम]]=\"\",\"\",Table1[[#This Row],[नाम]]))","v":""},{"$nulls":8},{"$f":"SUM(Table2[[#This Row],[मार्च मूल वेतन]:[अन्य 3]])","v":0}]
[{"$f":"IF(Table2[[#This Row],[नाम]]=\"\",\"\",ROWS($A$1:A49))","v":""},{"$f":"PROPER(IF(Table1[[#This Row],[नाम]]=\"\",\"\",Table1[[#This Row],[नाम]]))","v":""},{"$nulls":8},{"$f":"SUM(Table2[[#This Row],[मार्च मूल वेतन]:[अन्य 3]])","v":0}]
[{"$f":"IF(Table2[[#This Row],[नाम]]=\"\",\"\",ROWS($A$1:A50))","v":""},{"$f":"PROPER(IF(Table1[[#This Row],[नाम]]=\"\",\"\",Table1[[#This Row],[नाम]]))","v":""},{"$nulls":8},{"$f":"SUM(Table2[[#This Row],[मार्च मूल वेतन]:[अन्य 3]])","v":0}]
[{"$f":"IF(Table2[[#This Row],[नाम]]=\"\",\"\",ROWS($A$1:A51))","v":""},{"$f":"PROPER(IF(Table1[[#This Row],[नाम]]=\"\",\"\",Table1[[#This Row],[नाम]]))","v":""},{"$nulls":8},{"$f":"SUM(Table2[[#This Row],[मार्च मूल वेतन]:[अन्य 3]])","v":0}]
[{"$f":"IF(Table2[[#This Row],[नाम]]=\"\",\"\",ROWS($A$1:A52))","v":""},{"$f":"PROPER(IF(Table1[[#This Row],[नाम]]=\"\",\"\",Table1[[#This Row],[नाम]]))","v":""},{"$nulls":8},{"$f":"SUM(Table2[[#This Row],[मार्च मूल वेतन]:[अन्य 3]])","v":0}]
[{"$f":"IF(Table2[[#This Row],[नाम]]=\"\",\"\",ROWS($A$1:A53))","v":""},{"$f":"PROPER(IF(Table1[[#This Row],[नाम]]=\"\",\"\",Table1[[#This Row],[नाम]]))","v":""},{"$nulls":8},{"$f":"SUM(Table2[[#This Row],[मार्च मूल वेतन]:[अन्य 3]])","v":0}]
[{"$f":"IF(Table2[[#This Row],[नाम]]=\"\",\"\",ROWS($A$1:A54))","v":""},{"$f":"PROPER(IF(Table1[[#This Row],[नाम]]=\"\",\"\",Table1[[#This Row],[नाम]]))","v":""},{"$nulls":8},{"$f":"SUM(Table2[[#This Row],[मार्च मूल वेतन]:[अन्य 3]])","v":0}]
[{"$f":"IF(Table2[[#This Row],[नाम]]=\"\",\"\",ROWS($A$1:A55))","v":""},{"$f":"PROPER(IF(Table1[[#This Row],[नाम]]=\"\",\"\",Table1[[#This Row],[नाम]]))","v":""},{"$nulls":8},{"$f":"SUM(Table2[[#This Row],[मार्च मूल वेतन]:[अन्य 3]])","v":0}]
[{"$f":"IF(Table2[[#This Row],[नाम]]=\"\",\"\",ROWS($A$1:A56))","v":""},{"$f":"PROPER(IF(Table1[[#This Row],[नाम]]=\"\",\"\",Table1[[#This Row],[नाम]]))","v":""},{"$nulls":8},{"$f":"SUM(Table2[[#This Row],[मार्च मूल वेतन]:[अन्य 3]])","v":0}]
[{"$f":"IF(Table2[[#This Row],[नाम]]=\"\",\"\",ROWS($A$1:A57))","v":""},{"$f":"PROPER(IF(Table1[[#This Row],[नाम]]=\"\",\"\",Table1[[#This Row],[नाम]]))","v":""},{"$nulls":8},{"$f":"SUM(Table2[[#This Row],[मार्च मूल वेतन]:[अन्य 3]])","v":0}]
[{"$f":"IF(Table2[[#This Row],[नाम]]=\"\",\"\",ROWS($A$1:A58))","v":""},{"$f":"PROPER(IF(Table1[[#This Row],[नाम]]=\"\",\"\",Table1[[#This Row],[नाम]]))","v":""},{"$nulls":8},{"$f":"SUM(Table2[[#This Row],[मार्च मूल वेतन]:[अन्य 3]])","v":0}]
[{"$f":"IF(Table2[[#This Row],[नाम]]=\"\",\"\",ROWS($A$1:A59))","v":""},{"$f":"PROPER(IF(Table1[[#This Row],[नाम]]=\"\",\"\",Table1[[#This Row],[नाम]]))","v":""},{"$nulls":8},{"$f":"SUM(Table2[[#This Row],[मार्च मूल वेतन]:[अन्य 3]])","v":0}]
[{"$f":"IF(Table2[[#This Row],[नाम]]=\"\",\"\",ROWS($A$1:A60))","v":""},{"$f":"PROPER(IF(Table1[[#This Row],[नाम]]=\"\",\"\",Table1[[#This Row],[नाम]]))","v":""},{"$nulls":8},{"$f":"SUM(Table2[[#This Row],[मार्च मूल वेतन]:[अन्य 3]])","v":0}]
[{"$f":"IF(Table2[[#This Row],[नाम]]=\"\",\"\",ROWS($A$1:A61))","v":""},{"$f":"PROPER(IF(Table1[[#This Row],[नाम]]=\"\",\"\",Table1[[#This Row],[नाम]]))","v":""},{"$nulls":8},{"$f":"SUM(Table2[[#This Row],[मार्च मूल वेतन]:[अन्य 3]])","v":0}]
[{"$f":"IF(Table2[[#This Row],[नाम]]=\"\",\"\",ROWS($A$1:A62))","v":""},{"$f":"PROPER(IF(Table1[[#This Row],[नाम]]=\"\",\"\",Table1[[#This Row],[नाम]]))","v":""},{"$nulls":8},{"$f":"SUM(Table2[[#This Row],[मार्च मूल वेतन]:[अन्य 3]])","v":0}]
[{"$f":"IF(Table2[[#This Row],[नाम]]=\"\",\"\",ROWS($A$1:A63))","v":""},{"$f":"PROPER(IF(Table1[[#This Row],[नाम]]=\"\",\"\",Table1[[#This Row],[नाम]]))","v":""},{"$nulls":8},{"$f":"SUM(Table2[[#This Row],[मार्च मूल वेतन]:[अन्य 3]])","v":0}]
[{"$f":"IF(Table2[[#This Row],[नाम]]=\"\",\"\",ROWS($A$1:A64))","v":""},{"$f":"PROPER(IF(Table1[[#This Row],[नाम]]=\"\",\"\",Table1[[#This Row],[नाम]]))","v":""},{"$nulls":8},{"$f":"SUM(Table2[[#This Row],[मार्च मूल वेतन]:[अन्य 3]])","v":0}]
[{"$f":"IF(Table2[[#This Row],[नाम]]=\"\",\"\",ROWS($A$1:A65))","v":""},{"$f":"PROPER(IF(Table1[[#This Row],[नाम]]=\"\",\"\",Table1[[#This Row],[नाम]]))","v":""},{"$nulls":8},{"$f":"SUM(Table2[[#This Row],[मार्च मूल वेतन]:[अन्य 3]])","v":0}]
[{"$f":"IF(Table2[[#This Row],[नाम]]=\"\",\"\",ROWS($A$1:A66))","v":""},{"$f":"PROPER(IF(Table1[[#This Row],[नाम]]=\"\",\"\",Table1[[#This Row],[नाम]]))","v":""},{"$nulls":8},{"$f":"SUM(Table2[[#This Row],[मार्च मूल वेतन]:[अन्य 3]])","v":0}]
[{"$f":"IF(Table2[[#This Row],[नाम]]=\"\",\"\",ROWS($A$1:A67))","v":""},{"$f":"PROPER(IF(Table1[[#This Row],[नाम]]=\"\",\"\",Table1[[#This Row],[नाम]]))","v":""},{"$nulls":8},{"$f":"SUM(Table2[[#This Row],[मार्च मूल वेतन]:[अन्य 3]])","v":0}]
[{"$f":"IF(Table2[[#This Row],[नाम]]=\"\",\"\",ROWS($A$1:A68))","v":""},{"$f":"PROPER(IF(Table1[[#This Row],[नाम]]=\"\",\"\",Table1[[#This Row],[नाम]]))","v":""},{"$nulls":8},{"$f":"SUM(Table2[[#This Row],[मार्च मूल वेतन]:[अन्य 3]])","v":0}]
[{"$f":"IF(Table2[[#This Row],[नाम]]=\"\",\"\",ROWS($A$1:A69))","v":""},{"$f":"PROPER(IF(Table1[[#This Row],[नाम]]=\"\",\"\",Table1[[#This Row],[नाम]]))","v":""},{"$nulls":8},{"$f":"SUM(Table2[[#This Row],[मार्च मूल वेतन]:[अन्य 3]])","v":0}]
[{"$f":"IF(Table2[[#This Row],[नाम]]=\"\",\"\",ROWS($A$1:A70))","v":""},{"$f":"PROPER(IF(Table1[[#This Row],[नाम]]=\"\",\"\",Table1[[#This Row],[नाम]]))","v":""},{"$nulls":8},{"$f":"SUM(Table2[[#This Row],[मार्च मूल वेतन]:[अन्य 3]])","v":0}]
[{"$f":"IF(Table2[[#This Row],[नाम]]=\"\",\"\",ROWS($A$1:A71))","v":""},{"$f":"PROPER(IF(Table1[[#This Row],[नाम]]=\"\",\"\",Table1[[#This Row],[नाम]]))","v":""},{"$nulls":8},{"$f":"SUM(Table2[[#This Row],[मार्च मूल वेतन]:[अन्य 3]])","v":0}]
[{"$f":"IF(Table2[[#This Row],[नाम]]=\"\",\"\",ROWS($A$1:A72))","v":""},{"$f":"PROPER(IF(Table1[[#This Row],[नाम]]=\"\",\"\",Table1[[#This Row],[नाम]]))","v":""},{"$nulls":8},{"$f":"SUM(Table2[[#This Row],[मार्च मूल वेतन]:[अन्य 3]])","v":0}]
[{"$f":"IF(Table2[[#This Row],[नाम]]=\"\",\"\",ROWS($A$1:A73))","v":""},{"$f":"PROPER(IF(Table1[[#This Row],[नाम]]=\"\",\"\",Table1[[#This Row],[नाम]]))","v":""},{"$nulls":8},{"$f":"SUM(Table2[[#This Row],[मार्च मूल वेतन]:[अन्य 3]])","v":0}]
[{"$f":"IF(Table2[[#This Row],[नाम]]=\"\",\"\",ROWS($A$1:A74))","v":""},{"$f":"PROPER(IF(Table1[[#This Row],[नाम]]=\"\",\"\",Table1[[#This Row],[नाम]]))","v":""},{"$nulls":8},{"$f":"SUM(Table2[[#This Row],[मार्च मूल वेतन]:[अन्य 3]])","v":0}]
[{"$f":"IF(Table2[[#This Row],[नाम]]=\"\",\"\",ROWS($A$1:A75))","v":""},{"$f":"PROPER(IF(Table1[[#This Row],[नाम]]=\"\",\"\",Table1[[#This Row],[नाम]]))","v":""},{"$nulls":8},{"$f":"SUM(Table2[[#This Row],[मार्च मूल वेतन]:[अन्य 3]])","v":0}]
[{"$f":"IF(Table2[[#This Row],[नाम]]=\"\",\"\",ROWS($A$1:A76))","v":""},{"$f":"PROPER(IF(Table1[[#This Row],[नाम]]=\"\",\"\",Table1[[#This Row],[नाम]]))","v":""},{"$nulls":8},{"$f":"SUM(Table2[[#This Row],[मार्च मूल वेतन]:[अन्य 3]])","v":0}]
[{"$f":"IF(Table2[[#This Row],[नाम]]=\"\",\"\",ROWS($A$1:A77))","v":""},{"$f":"PROPER(IF(Table1[[#This Row],[नाम]]=\"\",\"\",Table1[[#This Row],[नाम]]))","v":""},{"$nulls":8},{"$f":"SUM(Table2[[#This Row],[मार्च मूल वेतन]:[अन्य 3]])","v":0}]
[{"$f":"IF(Table2[[#This Row],[नाम]]=\"\",\"\",ROWS($A$1:A78))","v":""},{"$f":"PROPER(IF(Table1[[#This Row],[नाम]]=\"\",\"\",Table1[[#This Row],[नाम]]))","v":""},{"$nulls":8},{"$f":"SUM(Table2[[#This Row],[मार्च मूल वेतन]:[अन्य 3]])","v":0}]
[{"$f":"IF(Table2[[#This Row],[नाम]]=\"\",\"\",ROWS($A$1:A79))","v":""},{"$f":"PROPER(IF(Table1[[#This Row],[नाम]]=\"\",\"\",Table1[[#This Row],[नाम]]))","v":""},{"$nulls":8},{"$f":"SUM(Table2[[#This Row],[मार्च मूल वेतन]:[अन्य 3]])","v":0}]
[{"$f":"IF(Table2[[#This Row],[नाम]]=\"\",\"\",ROWS($A$1:A80))","v":""},{"$f":"PROPER(IF(Table1[[#This Row],[नाम]]=\"\",\"\",Table1[[#This Row],[नाम]]))","v":""},{"$nulls":8},{"$f":"SUM(Table2[[#This Row],[मार्च मूल वेतन]:[अन्य 3]])","v":0}]
[{"$f":"IF(Table2[[#This Row],[नाम]]=\"\",\"\",ROWS($A$1:A81))","v":""},{"$f":"PROPER(IF(Table1[[#This Row],[नाम]]=\"\",\"\",Table1[[#This Row],[नाम]]))","v":""},{"$nulls":8},{"$f":"SUM(Table2[[#This Row],[मार्च मूल वेतन]:[अन्य 3]])","v":0}]
[{"$f":"IF(Table2[[#This Row],[नाम]]=\"\",\"\",ROWS($A$1:A82))","v":""},{"$f":"PROPER(IF(Table1[[#This Row],[नाम]]=\"\",\"\",Table1[[#This Row],[नाम]]))","v":""},{"$nulls":8},{"$f":"SUM(Table2[[#This Row],[मार्च मूल वेतन]:[अन्य 3]])","v":0}]
[{"$f":"IF(Table2[[#This Row],[नाम]]=\"\",\"\",ROWS($A$1:A83))","v":""},{"$f":"PROPER(IF(Table1[[#This Row],[नाम]]=\"\",\"\",Table1[[#This Row],[नाम]]))","v":""},{"$nulls":8},{"$f":"SUM(Table2[[#This Row],[मार्च मूल वेतन]:[अन्य 3]])","v":0}]
[{"$f":"IF(Table2[[#This Row],[नाम]]=\"\",\"\",ROWS($A$1:A84))","v":""},{"$f":"PROPER(IF(Table1[[#This Row],[नाम]]=\"\",\"\",Table1[[#This Row],[नाम]]))","v":""},{"$nulls":8},{"$f":"SUM(Table2[[#This Row],[मार्च मूल वेतन]:[अन्य 3]])","v":0}]
[{"$f":"IF(Table2[[#This Row],[नाम]]=\"\",\"\",ROWS($A$1:A85))","v":""},{"$f":"PROPER(IF(Table1[[#This Row],[नाम]]=\"\",\"\",Table1[[#This Row],[नाम]]))","v":""},{"$nulls":8},{"$f":"SUM(Table2[[#This Row],[मार्च मूल वेतन]:[अन्य 3]])","v":0}]
[{"$f":"IF(Table2[[#This Row],[नाम]]=\"\",\"\",ROWS($A$1:A86))","v":""},{"$f":"PROPER(IF(Table1[[#This Row],[नाम]]=\"\",\"\",Table1[[#This Row],[नाम]]))","v":""},{"$nulls":8},{"$f":"SUM(Table2[[#This Row],[मार्च मूल वेतन]:[अन्य 3]])","v":0}]
[{"$f":"IF(Table2[[#This Row],[नाम]]=\"\",\"\",ROWS($A$1:A87))","v":""},{"$f":"PROPER(IF(Table1[[#This Row],[नाम]]=\"\",\"\",Table1[[#This Row],[नाम]]))","v":""},{"$nulls":8},{"$f":"SUM(Table2[[#This Row],[मार्च मूल वेतन]:[अन्य 3]])","v":0}]
[{"$f":"IF(Table2[[#This Row],[नाम]]=\"\",\"\",ROWS($A$1:A88))","v":""},{"$f":"PROPER(IF(Table1[[#This Row],[नाम]]=\"\",\"\",Table1[[#This Row],[नाम]]))","v":""},{"$nulls":8},{"$f":"SUM(Table2[[#This Row],[मार्च मूल वेतन]:[अन्य 3]])","v":0}]
[{"$f":"IF(Table2[[#This Row],[नाम]]=\"\",\"\",ROWS($A$1:A89))","v":""},{"$f":"PROPER(IF(Table1[[#This Row],[नाम]]=\"\",\"\",Table1[[#This Row],[नाम]]))","v":""},{"$nulls":8},{"$f":"SUM(Table2[[#This Row],[मार्च मूल वेतन]:[अन्य 3]])","v":0}]
[{"$f":"IF(Table2[[#This Row],[नाम]]=\"\",\"\",ROWS($A$1:A90))","v":""},{"$f":"PROPER(IF(Table1[[#This Row],[नाम]]=\"\",\"\",Table1[[#This Row],[नाम]]))","v":""},{"$nulls":8},{"$f":"SUM(Table2[[#This Row],[मार्च मूल वेतन]:[अन्य 3]])","v":0}]
[{"$f":"IF(Table2[[#This Row],[नाम]]=\"\",\"\",ROWS($A$1:A91))","v":""},{"$f":"PROPER(IF(Table1[[#This Row],[नाम]]=\"\",\"\",Table1[[#This Row],[नाम]]))","v":""},{"$nulls":8},{"$f":"SUM(Table2[[#This Row],[मार्च मूल वेतन]:[अन्य 3]])","v":0}]
[{"$f":"IF(Table2[[#This Row],[नाम]]=\"\",\"\",ROWS($A$1:A92))","v":""},{"$f":"PROPER(IF(Table1[[#This Row],[नाम]]=\"\",\"\",Table1[[#This Row],[नाम]]))","v":""},{"$nulls":8},{"$f":"SUM(Table2[[#This Row],[मार्च मूल वेतन]:[अन्य 3]])","v":0}]
[{"$f":"IF(Table2[[#This Row],[नाम]]=\"\",\"\",ROWS($A$1:A93))","v":""},{"$f":"PROPER(IF(Table1[[#This Row],[नाम]]=\"\",\"\",Table1[[#This Row],[नाम]]))","v":""},{"$nulls":8},{"$f":"SUM(Table2[[#This Row],[मार्च मूल वेतन]:[अन्य 3]])","v":0}]
[{"$f":"IF(Table2[[#This Row],[नाम]]=\"\",\"\",ROWS($A$1:A94))","v":""},{"$f":"PROPER(IF(Table1[[#This Row],[नाम]]=\"\",\"\",Table1[[#This Row],[नाम]]))","v":""},{"$nulls":8},{"$f":"SUM(Table2[[#This Row],[मार्च मूल वेतन]:[अन्य 3]])","v":0}]
[{"$f":"IF(Table2[[#This Row],[नाम]]=\"\",\"\",ROWS($A$1:A95))","v":""},{"$f":"PROPER(IF(Table1[[#This Row],[नाम]]=\"\",\"\",Table1[[#This Row],[नाम]]))","v":""},{"$nulls":8},{"$f":"SUM(Table2[[#This Row],[मार्च मूल वेतन]:[अन्य 3]])","v":0}]
[{"$f":"IF(Table2[[#This Row],[नाम]]=\"\",\"\",ROWS($A$1:A96))","v":""},{"$f":"PROPER(IF(Table1[[#This Row],[नाम]]=\"\",\"\",Table1[[#This Row],[नाम]]))","v":""},{"$nulls":8},{"$f":"SUM(Table2[[#This Row],[मार्च मूल वेतन]:[अन्य 3]])","v":0}]
[{"$f":"IF(Table2[[#This Row],[नाम]]=\"\",\"\",ROWS($A$1:A97))","v":""},{"$f":"PROPER(IF(Table1[[#This Row],[नाम]]=\"\",\"\",Table1[[#This Row],[नाम]]))","v":""},{"$nulls":8},{"$f":"SUM(Table2[[#This Row],[मार्च मूल वेतन]:[अन्य 3]])","v":0}]
[{"$f":"IF(Table2[[#This Row],[नाम]]=\"\",\"\",ROWS($A$1:A98))","v":""},{"$f":"PROPER(IF(Table1[[#This Row],[नाम]]=\"\",\"\",Table1[[#This Row],[नाम]]))","v":""},{"$nulls":8},{"$f":"SUM(Table2[[#This Row],[मार्च मूल वेतन]:[अन्य 3]])","v":0}]
[{"$f":"IF(Table2[[#This Row],[नाम]]=\"\",\"\",ROWS($A$1:A99))","v":""},{"$f":"PROPER(IF(Table1[[#This Row],[नाम]]=\"\",\"\",Table1[[#This Row],[नाम]]))","v":""},{"$nulls":8},{"$f":"SUM(Table2[[#This Row],[मार्च मूल वेतन]:[अन्य 3]])","v":0}]
[{"$f":"IF(Table2[[#This Row],[नाम]]=\"\",\"\",ROWS($A$1:A100))","v":""},{"$f":"PROPER(IF(Table1[[#This Row],[नाम]]=\"\",\"\",Table1[[#This Row],[नाम]]))","v":""},{"$nulls":8},{"$f":"SUM(Table2[[#This Row],[मार्च मूल वेतन]:[अन्य 3]])","v":0}]
[{"$f":"IF(Table2[[#This Row],[नाम]]=\"\",\"\",ROWS($A$1:A101))","v":""},{"$f":"PROPER(IF(Table1[[#This Row],[नाम]]=\"\",\"\",Table1[[#This Row],[नाम]]))","v":""},{"$nulls":8},{"$f":"SUM(Table2[[#This Row],[मार्च मूल वेतन]:[अन्य 3]])","v":0}]
[{"$f":"IF(Table2[[#This Row],[नाम]]=\"\",\"\",ROWS($A$1:A102))","v":""},{"$f":"PROPER(IF(Table1[[#This Row],[नाम]]=\"\",\"\",Table1[[#This Row],[नाम]]))","v":""},{"$nulls":8},{"$f":"SUM(Table2[[#This Row],[मार्च मूल वेतन]:[अन्य 3]])","v":0}]
[{"$f":"IF(Table2[[#This Row],[नाम]]=\"\",\"\",ROWS($A$1:A103))","v":""},{"$f":"PROPER(IF(Table1[[#This Row],[नाम]]=\"\",\"\",Table1[[#This Row],[नाम]]))","v":""},{"$nulls":8},{"$f":"SUM(Table2[[#This Row],[मार्च मूल वेतन]:[अन्य 3]])","v":0}]
[{"$f":"IF(Table2[[#This Row],[नाम]]=\"\",\"\",ROWS($A$1:A104))","v":""},{"$f":"PROPER(IF(Table1[[#This Row],[नाम]]=\"\",\"\",Table1[[#This Row],[नाम]]))","v":""},{"$nulls":8},{"$f":"SUM(Table2[[#This Row],[मार्च मूल वेतन]:[अन्य 3]])","v":0}]
[{"$f":"IF(Table2[[#This Row],[नाम]]=\"\",\"\",ROWS($A$1:A105))","v":""},{"$f":"PROPER(IF(Table1[[#This Row],[नाम]]=\"\",\"\",Table1[[#This Row],[नाम]]))","v":""},{"$nulls":8},{"$f":"SUM(Table2[[#This Row],[मार्च मूल वेतन]:[अन्य 3]])","v":0}]
[{"$f":"IF(Table2[[#This Row],[नाम]]=\"\",\"\",ROWS($A$1:A106))","v":""},{"$f":"PROPER(IF(Table1[[#This Row],[नाम]]=\"\",\"\",Table1[[#This Row],[नाम]]))","v":""},{"$nulls":8},{"$f":"SUM(Table2[[#This Row],[मार्च मूल वेतन]:[अन्य 3]])","v":0}]
[{"$f":"IF(Table2[[#This Row],[नाम]]=\"\",\"\",ROWS($A$1:A107))","v":""},{"$f":"PROPER(IF(Table1[[#This Row],[नाम]]=\"\",\"\",Table1[[#This Row],[नाम]]))","v":""},{"$nulls":8},{"$f":"SUM(Table2[[#This Row],[मार्च मूल वेतन]:[अन्य 3]])","v":0}]
[{"$f":"IF(Table2[[#This Row],[नाम]]=\"\",\"\",ROWS($A$1:A108))","v":""},{"$f":"PROPER(IF(Table1[[#This Row],[नाम]]=\"\",\"\",Table1[[#This Row],[नाम]]))","v":""},{"$nulls":8},{"$f":"SUM(Table2[[#This Row],[मार्च मूल वेतन]:[अन्य 3]])","v":0}]
[{"$f":"IF(Table2[[#This Row],[नाम]]=\"\",\"\",ROWS($A$1:A109))","v":""},{"$f":"PROPER(IF(Table1[[#This Row],[नाम]]=\"\",\"\",Table1[[#This Row],[नाम]]))","v":""},{"$nulls":8},{"$f":"SUM(Table2[[#This Row],[मार्च मूल वेतन]:[अन्य 3]])","v":0}]
[{"$f":"IF(Table2[[#This Row],[नाम]]=\"\",\"\",ROWS($A$1:A110))","v":""},{"$f":"PROPER(IF(Table1[[#This Row],[नाम]]=\"\",\"\",Table1[[#This Row],[नाम]]))","v":""},{"$nulls":8},{"$f":"SUM(Table2[[#This Row],[मार्च मूल वेतन]:[अन्य 3]])","v":0}]
[{"$f":"IF(Table2[[#This Row],[नाम]]=\"\",\"\",ROWS($A$1:A111))","v":""},{"$f":"PROPER(IF(Table1[[#This Row],[नाम]]=\"\",\"\",Table1[[#This Row],[नाम]]))","v":""},{"$nulls":8},{"$f":"SUM(Table2[[#This Row],[मार्च मूल वेतन]:[अन्य 3]])","v":0}]
[{"$f":"IF(Table2[[#This Row],[नाम]]=\"\",\"\",ROWS($A$1:A112))","v":""},{"$f":"PROPER(IF(Table1[[#This Row],[नाम]]=\"\",\"\",Table1[[#This Row],[नाम]]))","v":""},{"$nulls":8},{"$f":"SUM(Table2[[#This Row],[मार्च मूल वेतन]:[अन्य 3]])","v":0}]
[{"$f":"IF(Table2[[#This Row],[नाम]]=\"\",\"\",ROWS($A$1:A113))","v":""},{"$f":"PROPER(IF(Table1[[#This Row],[नाम]]=\"\",\"\",Table1[[#This Row],[नाम]]))","v":""},{"$nulls":8},{"$f":"SUM(Table2[[#This Row],[मार्च मूल वेतन]:[अन्य 3]])","v":0}]
[{"$f":"IF(Table2[[#This Row],[नाम]]=\"\",\"\",ROWS($A$1:A114))","v":""},{"$f":"PROPER(IF(Table1[[#This Row],[नाम]]=\"\",\"\",Table1[[#This Row],[नाम]]))","v":""},{"$nulls":8},{"$f":"SUM(Table2[[#This Row],[मार्च मूल वेतन]:[अन्य 3]])","v":0}]
[{"$f":"IF(Table2[[#This Row],[नाम]]=\"\",\"\",ROWS($A$1:A115))","v":""},{"$f":"PROPER(IF(Table1[[#This Row],[नाम]]=\"\",\"\",Table1[[#This Row],[नाम]]))","v":""},{"$nulls":8},{"$f":"SUM(Table2[[#This Row],[मार्च मूल वेतन]:[अन्य 3]])","v":0}]
[{"$f":"IF(Table2[[#This Row],[नाम]]=\"\",\"\",ROWS($A$1:A116))","v":""},{"$f":"PROPER(IF(Table1[[#This Row],[नाम]]=\"\",\"\",Table1[[#This Row],[नाम]]))","v":""},{"$nulls":8},{"$f":"SUM(Table2[[#This Row],[मार्च मूल वेतन]:[अन्य 3]])","v":0}]
[{"$f":"IF(Table2[[#This Row],[नाम]]=\"\",\"\",ROWS($A$1:A117))","v":""},{"$f":"PROPER(IF(Table1[[#This Row],[नाम]]=\"\",\"\",Table1[[#This Row],[नाम]]))","v":""},{"$nulls":8},{"$f":"SUM(Table2[[#This Row],[मार्च मूल वेतन]:[अन्य 3]])","v":0}]
[{"$f":"IF(Table2[[#This Row],[नाम]]=\"\",\"\",ROWS($A$1:A118))","v":""},{"$f":"PROPER(IF(Table1[[#This Row],[नाम]]=\"\",\"\",Table1[[#This Row],[नाम]]))","v":""},{"$nulls":8},{"$f":"SUM(Table2[[#This Row],[मार्च मूल वेतन]:[अन्य 3]])","v":0}]
[{"$f":"IF(Table2[[#This Row],[नाम]]=\"\",\"\",ROWS($A$1:A119))","v":""},{"$f":"PROPER(IF(Table1[[#This Row],[नाम]]=\"\",\"\",Table1[[#This Row],[नाम]]))","v":""},{"$nulls":8},{"$f":"SUM(Table2[[#This Row],[मार्च मूल वेतन]:[अन्य 3]])","v":0}]
[{"$f":"IF(Table2[[#This Row],[नाम]]=\"\",\"\",ROWS($A$1:A120))","v":""},{"$f":"PROPER(IF(Table1[[#This Row],[नाम]]=\"\",\"\",Table1[[#This Row],[नाम]]))","v":""},{"$nulls":8},{"$f":"SUM(Table2[[#This Row],[मार्च मूल वेतन]:[अन्य 3]])","v":0}]
[{"$f":"IF(Table2[[#This Row],[नाम]]=\"\",\"\",ROWS($A$1:A121))","v":""},{"$f":"PROPER(IF(Table1[[#This Row],[नाम]]=\"\",\"\",Table1[[#This Row],[नाम]]))","v":""},{"$nulls":8},{"$f":"SUM(Table2[[#This Row],[मार्च मूल वेतन]:[अन्य 3]])","v":0}]
[{"$f":"IF(Table2[[#This Row],[नाम]]=\"\",\"\",ROWS($A$1:A122))","v":""},{"$f":"PROPER(IF(Table1[[#This Row],[नाम]]=\"\",\"\",Table1[[#This Row],[नाम]]))","v":""},{"$nulls":8},{"$f":"SUM(Table2[[#This Row],[मार्च मूल वेतन]:[अन्य 3]])","v":0}]
[{"$f":"IF(Table2[[#This Row],[नाम]]=\"\",\"\",ROWS($A$1:A123))","v":""},{"$f":"PROPER(IF(Table1[[#This Row],[नाम]]=\"\",\"\",Table1[[#This Row],[नाम]]))","v":""},{"$nulls":8},{"$f":"SUM(Table2[[#This Row],[मार्च मूल वेतन]:[अन्य 3]])","v":0}]
[{"$f":"IF(Table2[[#This Row],[नाम]]=\"\",\"\",ROWS($A$1:A124))","v":""},{"$f":"PROPER(IF(Table1[[#This Row],[नाम]]=\"\",\"\",Table1[[#This Row],[नाम]]))","v":""},{"$nulls":8},{"$f":"SUM(Table2[[#This Row],[मार्च मूल वेतन]:[अन्य 3]])","v":0}]
[{"$f":"IF(Table2[[#This Row],[नाम]]=\"\",\"\",ROWS($A$1:A125))","v":""},{"$f":"PROPER(IF(Table1[[#This Row],[नाम]]=\"\",\"\",Table1[[#This Row],[नाम]]))","v":""},{"$nulls":8},{"$f":"SUM(Table2[[#This Row],[मार्च मूल वेतन]:[अन्य 3]])","v":0}]
[{"$f":"IF(Table2[[#This Row],[नाम]]=\"\",\"\",ROWS($A$1:A126))","v":""},{"$f":"PROPER(IF(Table1[[#This Row],[नाम]]=\"\",\"\",Table1[[#This Row],[नाम]]))","v":""},{"$nulls":8},{"$f":"SUM(Table2[[#This Row],[मार्च मूल वेतन]:[अन्य 3]])","v":0}]
[{"$f":"IF(Table2[[#This Row],[नाम]]=\"\",\"\",ROWS($A$1:A127))","v":""},{"$f":"PROPER(IF(Table1[[#This Row],[नाम]]=\"\",\"\",Table1[[#This Row],[नाम]]))","v":""},{"$nulls":8},{"$f":"SUM(Table2[[#This Row],[मार्च मूल वेतन]:[अन्य 3]])","v":0}]
[{"$f":"IF(Table2[[#This Row],[नाम]]=\"\",\"\",ROWS($A$1:A128))","v":""},{"$f":"PROPER(IF(Table1[[#This Row],[नाम]]=\"\",\"\",Table1[[#This Row],[नाम]]))","v":""},{"$nulls":8},{"$f":"SUM(Table2[[#This Row],[मार्च मूल वेतन]:[अन्य 3]])","v":0}]
[{"$f":"IF(Table2[[#This Row],[नाम]]=\"\",\"\",ROWS($A$1:A129))","v":""},{"$f":"PROPER(IF(Table1[[#This Row],[नाम]]=\"\",\"\",Table1[[#This Row],[नाम]]))","v":""},{"$nulls":8},{"$f":"SUM(Table2[[#This Row],[मार्च मूल वेतन]:[अन्य 3]])","v":0}]
[{"$f":"IF(Table2[[#This Row],[नाम]]=\"\",\"\",ROWS($A$1:A130))","v":""},{"$f":"PROPER(IF(Table1[[#This Row],[नाम]]=\"\",\"\",Table1[[#This Row],[नाम]]))","v":""},{"$nulls":8},{"$f":"SUM(Table2[[#This Row],[मार्च मूल वेतन]:[अन्य 3]])","v":0}]
[{"$f":"IF(Table2[[#This Row],[नाम]]=\"\",\"\",ROWS($A$1:A131))","v":""},{"$f":"PROPER(IF(Table1[[#This Row],[नाम]]=\"\",\"\",Table1[[#This Row],[नाम]]))","v":""},{"$nulls":8},{"$f":"SUM(Table2[[#This Row],[मार्च मूल वेतन]:[अन्य 3]])","v":0}]
[{"$f":"IF(Table2[[#This Row],[नाम]]=\"\",\"\",ROWS($A$1:A132))","v":""},{"$f":"PROPER(IF(Table1[[#This Row],[नाम]]=\"\",\"\",Table1[[#This Row],[नाम]]))","v":""},{"$nulls":8},{"$f":"SUM(Table2[[#This Row],[मार्च मूल वेतन]:[अन्य 3]])","v":0}]
[{"$f":"IF(Table2[[#This Row],[नाम]]=\"\",\"\",ROWS($A$1:A133))","v":""},{"$f":"PROPER(IF(Table1[[#This Row],[नाम]]=\"\",\"\",Table1[[#This Row],[नाम]]))","v":""},{"$nulls":8},{"$f":"SUM(Table2[[#This Row],[मार्च मूल वेतन]:[अन्य 3]])","v":0}]
[{"$f":"IF(Table2[[#This Row],[नाम]]=\"\",\"\",ROWS($A$1:A134))","v":""},{"$f":"PROPER(IF(Table1[[#This Row],[नाम]]=\"\",\"\",Table1[[#This Row],[नाम]]))","v":""},{"$nulls":8},{"$f":"SUM(Table2[[#This Row],[मार्च मूल वेतन]:[अन्य 3]])","v":0}]
[{"$f":"IF(Table2[[#This Row],[नाम]]=\"\",\"\",ROWS($A$1:A135))","v":""},{"$f":"PROPER(IF(Table1[[#This Row],[नाम]]=\"\",\"\",Table1[[#This Row],[नाम]]))","v":""},{"$nulls":8},{"$f":"SUM(Table2[[#This Row],[मार्च मूल वेतन]:[अन्य 3]])","v":0}]
[{"$f":"IF(Table2[[#This Row],[नाम]]=\"\",\"\",ROWS($A$1:A136))","v":""},{"$f":"PROPER(IF(Table1[[#This Row],[नाम]]=\"\",\"\",Table1[[#This Row],[नाम]]))","v":""},{"$nulls":8},{"$f":"SUM(Table2[[#This Row],[मार्च मूल वेतन]:[अन्य 3]])","v":0}]
[{"$f":"IF(Table2[[#This Row],[नाम]]=\"\",\"\",ROWS($A$1:A137))","v":""},{"$f":"PROPER(IF(Table1[[#This Row],[नाम]]=\"\",\"\",Table1[[#This Row],[नाम]]))","v":""},{"$nulls":8},{"$f":"SUM(Table2[[#This Row],[मार्च मूल वेतन]:[अन्य 3]])","v":0}]
[{"$f":"IF(Table2[[#This Row],[नाम]]=\"\",\"\",ROWS($A$1:A138))","v":""},{"$f":"PROPER(IF(Table1[[#This Row],[नाम]]=\"\",\"\",Table1[[#This Row],[नाम]]))","v":""},{"$nulls":8},{"$f":"SUM(Table2[[#This Row],[मार्च मूल वेतन]:[अन्य 3]])","v":0}]
[{"$f":"IF(Table2[[#This Row],[नाम]]=\"\",\"\",ROWS($A$1:A139))","v":""},{"$f":"PROPER(IF(Table1[[#This Row],[नाम]]=\"\",\"\",Table1[[#This Row],[नाम]]))","v":""},{"$nulls":8},{"$f":"SUM(Table2[[#This Row],[मार्च मूल वेतन]:[अन्य 3]])","v":0}]
[{"$f":"IF(Table2[[#This Row],[नाम]]=\"\",\"\",ROWS($A$1:A140))","v":""},{"$f":"PROPER(IF(Table1[[#This Row],[नाम]]=\"\",\"\",Table1[[#This Row],[नाम]]))","v":""},{"$nulls":8},{"$f":"SUM(Table2[[#This Row],[मार्च मूल वेतन]:[अन्य 3]])","v":0}]
[{"$f":"IF(Table2[[#This Row],[नाम]]=\"\",\"\",ROWS($A$1:A141))","v":""},{"$f":"PROPER(IF(Table1[[#This Row],[नाम]]=\"\",\"\",Table1[[#This Row],[नाम]]))","v":""},{"$nulls":8},{"$f":"SUM(Table2[[#This Row],[मार्च मूल वेतन]:[अन्य 3]])","v":0}]
[{"$f":"IF(Table2[[#This Row],[नाम]]=\"\",\"\",ROWS($A$1:A142))","v":""},{"$f":"PROPER(IF(Table1[[#This Row],[नाम]]=\"\",\"\",Table1[[#This Row],[नाम]]))","v":""},{"$nulls":8},{"$f":"SUM(Table2[[#This Row],[मार्च मूल वेतन]:[अन्य 3]])","v":0}]
[{"$f":"IF(Table2[[#This Row],[नाम]]=\"\",\"\",ROWS($A$1:A143))","v":""},{"$f":"PROPER(IF(Table1[[#This Row],[नाम]]=\"\",\"\",Table1[[#This Row],[नाम]]))","v":""},{"$nulls":8},{"$f":"SUM(Table2[[#This Row],[मार्च मूल वेतन]:[अन्य 3]])","v":0}]
[{"$f":"IF(Table2[[#This Row],[नाम]]=\"\",\"\",ROWS($A$1:A144))","v":""},{"$f":"PROPER(IF(Table1[[#This Row],[नाम]]=\"\",\"\",Table1[[#This Row],[नाम]]))","v":""},{"$nulls":8},{"$f":"SUM(Table2[[#This Row],[मार्च मूल वेतन]:[अन्य 3]])","v":0}]
[{"$f":"IF(Table2[[#This Row],[नाम]]=\"\",\"\",ROWS($A$1:A145))","v":""},{"$f":"PROPER(IF(Table1[[#This Row],[नाम]]=\"\",\"\",Table1[[#This Row],[नाम]]))","v":""},{"$nulls":8},{"$f":"SUM(Table2[[#This Row],[मार्च मूल वेतन]:[अन्य 3]])","v":0}]
[{"$f":"IF(Table2[[#This Row],[नाम]]=\"\",\"\",ROWS($A$1:A146))","v":""},{"$f":"PROPER(IF(Table1[[#This Row],[नाम]]=\"\",\"\",Table1[[#This Row],[नाम]]))","v":""},{"$nulls":8},{"$f":"SUM(Table2[[#This Row],[मार्च मूल वेतन]:[अन्य 3]])","v":0}]
[{"$f":"IF(Table2[[#This Row],[नाम]]=\"\",\"\",ROWS($A$1:A147))","v":""},{"$f":"PROPER(IF(Table1[[#This Row],[नाम]]=\"\",\"\",Table1[[#This Row],[नाम]]))","v":""},{"$nulls":8},{"$f":"SUM(Table2[[#This Row],[मार्च मूल वेतन]:[अन्य 3]])","v":0}]
[{"$f":"IF(Table2[[#This Row],[नाम]]=\"\",\"\",ROWS($A$1:A148))","v":""},{"$f":"PROPER(IF(Table1[[#This Row],[नाम]]=\"\",\"\",Table1[[#This Row],[नाम]]))","v":""},{"$nulls":8},{"$f":"SUM(Table2[[#This Row],[मार्च मूल वेतन]:[अन्य 3]])","v":0}]
[{"$f":"IF(Table2[[#This Row],[नाम]]=\"\",\"\",ROWS($A$1:A149))","v":""},{"$f":"PROPER(IF(Table1[[#This Row],[नाम]]=\"\",\"\",Table1[[#This Row],[नाम]]))","v":""},{"$nulls":8},{"$f":"SUM(Table2[[#This Row],[मार्च मूल वेतन]:[अन्य 3]])","v":0}]
[{"$f":"IF(Table2[[#This Row],[नाम]]=\"\",\"\",ROWS($A$1:A150))","v":""},{"$f":"PROPER(IF(Table1[[#This Row],[नाम]]=\"\",\"\",Table1[[#This Row],[नाम]]))","v":""},{"$nulls":8},{"$f":"SUM(Table2[[#This Row],[मार्च मूल वेतन]:[अन्य 3]])","v":0}]
[{"$f":"IF(Table2[[#This Row],[नाम]]=\"\",\"\",ROWS($A$1:A151))","v":""},{"$f":"PROPER(IF(Table1[[#This Row],[नाम]]=\"\",\"\",Table1[[#This Row],[नाम]]))","v":""},{"$nulls":8},{"$f":"SUM(Table2[[#This Row],[मार्च मूल वेतन]:[अन्य 3]])","v":0}]
[{"$f":"IF(Table2[[#This Row],[नाम]]=\"\",\"\",ROWS($A$1:A152))","v":""},{"$f":"PROPER(IF(Table1[[#This Row],[नाम]]=\"\",\"\",Table1[[#This Row],[नाम]]))","v":""},{"$nulls":8},{"$f":"SUM(Table2[[#This Row],[मार्च मूल वेतन]:[अन्य 3]])","v":0}]
[{"$f":"IF(Table2[[#This Row],[नाम]]=\"\",\"\",ROWS($A$1:A153))","v":""},{"$f":"PROPER(IF(Table1[[#This Row],[नाम]]=\"\",\"\",Table1[[#This Row],[नाम]]))","v":""},{"$nulls":8},{"$f":"SUM(Table2[[#This Row],[मार्च मूल वेतन]:[अन्य 3]])","v":0}]
[{"$f":"IF(Table2[[#This Row],[नाम]]=\"\",\"\",ROWS($A$1:A154))","v":""},{"$f":"PROPER(IF(Table1[[#This Row],[नाम]]=\"\",\"\",Table1[[#This Row],[नाम]]))","v":""},{"$nulls":8},{"$f":"SUM(Table2[[#This Row],[मार्च मूल वेतन]:[अन्य 3]])","v":0}]
[{"$f":"IF(Table2[[#This Row],[नाम]]=\"\",\"\",ROWS($A$1:A155))","v":""},{"$f":"PROPER(IF(Table1[[#This Row],[नाम]]=\"\",\"\",Table1[[#This Row],[नाम]]))","v":""},{"$nulls":8},{"$f":"SUM(Table2[[#This Row],[मार्च मूल वेतन]:[अन्य 3]])","v":0}]
[{"$f":"IF(Table2[[#This Row],[नाम]]=\"\",\"\",ROWS($A$1:A156))","v":""},{"$f":"PROPER(IF(Table1[[#This Row],[नाम]]=\"\",\"\",Table1[[#This Row],[नाम]]))","v":""},{"$nulls":8},{"$f":"SUM(Table2[[#This Row],[मार्च मूल वेतन]:[अन्य 3]])","v":0}]
[{"$f":"IF(Table2[[#This Row],[नाम]]=\"\",\"\",ROWS($A$1:A157))","v":""},{"$f":"PROPER(IF(Table1[[#This Row],[नाम]]=\"\",\"\",Table1[[#This Row],[नाम]]))","v":""},{"$nulls":8},{"$f":"SUM(Table2[[#This Row],[मार्च मूल वेतन]:[अन्य 3]])","v":0}]
[{"$f":"IF(Table2[[#This Row],[नाम]]=\"\",\"\",ROWS($A$1:A158))","v":""},{"$f":"PROPER(IF(Table1[[#This Row],[नाम]]=\"\",\"\",Table1[[#This Row],[नाम]]))","v":""},{"$nulls":8},{"$f":"SUM(Table2[[#This Row],[मार्च मूल वेतन]:[अन्य 3]])","v":0}]
[{"$f":"IF(Table2[[#This Row],[नाम]]=\"\",\"\",ROWS($A$1:A159))","v":""},{"$f":"PROPER(IF(Table1[[#This Row],[नाम]]=\"\",\"\",Table1[[#This Row],[नाम]]))","v":""},{"$nulls":8},{"$f":"SUM(Table2[[#This Row],[मार्च मूल वेतन]:[अन्य 3]])","v":0}]
[{"$f":"IF(Table2[[#This Row],[नाम]]=\"\",\"\",ROWS($A$1:A160))","v":""},{"$f":"PROPER(IF(Table1[[#This Row],[नाम]]=\"\",\"\",Table1[[#This Row],[नाम]]))","v":""},{"$nulls":8},{"$f":"SUM(Table2[[#This Row],[मार्च मूल वेतन]:[अन्य 3]])","v":0}]
[{"$f":"IF(Table2[[#This Row],[नाम]]=\"\",\"\",ROWS($A$1:A161))","v":""},{"$f":"PROPER(IF(Table1[[#This Row],[नाम]]=\"\",\"\",Table1[[#This Row],[नाम]]))","v":""},{"$nulls":8},{"$f":"SUM(Table2[[#This Row],[मार्च मूल वेतन]:[अन्य 3]])","v":0}]
[{"$f":"IF(Table2[[#This Row],[नाम]]=\"\",\"\",ROWS($A$1:A162))","v":""},{"$f":"PROPER(IF(Table1[[#This Row],[नाम]]=\"\",\"\",Table1[[#This Row],[नाम]]))","v":""},{"$nulls":8},{"$f":"SUM(Table2[[#This Row],[मार्च मूल वेतन]:[अन्य 3]])","v":0}]
[{"$f":"IF(Table2[[#This Row],[नाम]]=\"\",\"\",ROWS($A$1:A163))","v":""},{"$f":"PROPER(IF(Table1[[#This Row],[नाम]]=\"\",\"\",Table1[[#This Row],[नाम]]))","v":""},{"$nulls":8},{"$f":"SUM(Table2[[#This Row],[मार्च मूल वेतन]:[अन्य 3]])","v":0}]
[{"$f":"IF(Table2[[#This Row],[नाम]]=\"\",\"\",ROWS($A$1:A164))","v":""},{"$f":"PROPER(IF(Table1[[#This Row],[नाम]]=\"\",\"\",Table1[[#This Row],[नाम]]))","v":""},{"$nulls":8},{"$f":"SUM(Table2[[#This Row],[मार्च मूल वेतन]:[अन्य 3]])","v":0}]
[{"$f":"IF(Table2[[#This Row],[नाम]]=\"\",\"\",ROWS($A$1:A165))","v":""},{"$f":"PROPER(IF(Table1[[#This Row],[नाम]]=\"\",\"\",Table1[[#This Row],[नाम]]))","v":""},{"$nulls":8},{"$f":"SUM(Table2[[#This Row],[मार्च मूल वेतन]:[अन्य 3]])","v":0}]
[{"$f":"IF(Table2[[#This Row],[नाम]]=\"\",\"\",ROWS($A$1:A166))","v":""},{"$f":"PROPER(IF(Table1[[#This Row],[नाम]]=\"\",\"\",Table1[[#This Row],[नाम]]))","v":""},{"$nulls":8},{"$f":"SUM(Table2[[#This Row],[मार्च मूल वेतन]:[अन्य 3]])","v":0}]
[{"$f":"IF(Table2[[#This Row],[नाम]]=\"\",\"\",ROWS($A$1:A167))","v":""},{"$f":"PROPER(IF(Table1[[#This Row],[नाम]]=\"\",\"\",Table1[[#This Row],[नाम]]))","v":""},{"$nulls":8},{"$f":"SUM(Table2[[#This Row],[मार्च मूल वेतन]:[अन्य 3]])","v":0}]
[{"$f":"IF(Table2[[#This Row],[नाम]]=\"\",\"\",ROWS($A$1:A168))","v":""},{"$f":"PROPER(IF(Table1[[#This Row],[नाम]]=\"\",\"\",Table1[[#This Row],[नाम]]))","v":""},{"$nulls":8},{"$f":"SUM(Table2[[#This Row],[मार्च मूल वेतन]:[अन्य 3]])","v":0}]
[{"$f":"IF(Table2[[#This Row],[नाम]]=\"\",\"\",ROWS($A$1:A169))","v":""},{"$f":"PROPER(IF(Table1[[#This Row],[नाम]]=\"\",\"\",Table1[[#This Row],[नाम]]))","v":""},{"$nulls":8},{"$f":"SUM(Table2[[#This Row],[मार्च मूल वेतन]:[अन्य 3]])","v":0}]
[{"$f":"IF(Table2[[#This Row],[नाम]]=\"\",\"\",ROWS($A$1:A170))","v":""},{"$f":"PROPER(IF(Table1[[#This Row],[नाम]]=\"\",\"\",Table1[[#This Row],[नाम]]))","v":""},{"$nulls":8},{"$f":"SUM(Table2[[#This Row],[मार्च मूल वेतन]:[अन्य 3]])","v":0}]
[{"$f":"IF(Table2[[#This Row],[नाम]]=\"\",\"\",ROWS($A$1:A171))","v":""},{"$f":"PROPER(IF(Table1[[#This Row],[नाम]]=\"\",\"\",Table1[[#This Row],[नाम]]))","v":""},{"$nulls":8},{"$f":"SUM(Table2[[#This Row],[मार्च मूल वेतन]:[अन्य 3]])","v":0}]
[{"$f":"IF(Table2[[#This Row],[नाम]]=\"\",\"\",ROWS($A$1:A172))","v":""},{"$f":"PROPER(IF(Table1[[#This Row],[नाम]]=\"\",\"\",Table1[[#This Row],[नाम]]))","v":""},{"$nulls":8},{"$f":"SUM(Table2[[#This Row],[मार्च मूल वेतन]:[अन्य 3]])","v":0}]
[{"$f":"IF(Table2[[#This Row],[नाम]]=\"\",\"\",ROWS($A$1:A173))","v":""},{"$f":"PROPER(IF(Table1[[#This Row],[नाम]]=\"\",\"\",Table1[[#This Row],[नाम]]))","v":""},{"$nulls":8},{"$f":"SUM(Table2[[#This Row],[मार्च मूल वेतन]:[अन्य 3]])","v":0}]
[{"$f":"IF(Table2[[#This Row],[नाम]]=\"\",\"\",ROWS($A$1:A174))","v":""},{"$f":"PROPER(IF(Table1[[#This Row],[नाम]]=\"\",\"\",Table1[[#This Row],[नाम]]))","v":""},{"$nulls":8},{"$f":"SUM(Table2[[#This Row],[मार्च मूल वेतन]:[अन्य 3]])","v":0}]
[{"$f":"IF(Table2[[#This Row],[नाम]]=\"\",\"\",ROWS($A$1:A175))","v":""},{"$f":"PROPER(IF(Table1[[#This Row],[नाम]]=\"\",\"\",Table1[[#This Row],[नाम]]))","v":""},{"$nulls":8},{"$f":"SUM(Table2[[#This Row],[मार्च मूल वेतन]:[अन्य 3]])","v":0}]
[{"$f":"IF(Table2[[#This Row],[नाम]]=\"\",\"\",ROWS($A$1:A176))","v":""},{"$f":"PROPER(IF(Table1[[#This Row],[नाम]]=\"\",\"\",Table1[[#This Row],[नाम]]))","v":""},{"$nulls":8},{"$f":"SUM(Table2[[#This Row],[मार्च मूल वेतन]:[अन्य 3]])","v":0}]
[{"$f":"IF(Table2[[#This Row],[नाम]]=\"\",\"\",ROWS($A$1:A177))","v":""},{"$f":"PROPER(IF(Table1[[#This Row],[नाम]]=\"\",\"\",Table1[[#This Row],[नाम]]))","v":""},{"$nulls":8},{"$f":"SUM(Table2[[#This Row],[मार्च मूल वेतन]:[अन्य 3]])","v":0}]
[{"$f":"IF(Table2[[#This Row],[नाम]]=\"\",\"\",ROWS($A$1:A178))","v":""},{"$f":"PROPER(IF(Table1[[#This Row],[नाम]]=\"\",\"\",Table1[[#This Row],[नाम]]))","v":""},{"$nulls":8},{"$f":"SUM(Table2[[#This Row],[मार्च मूल वेतन]:[अन्य 3]])","v":0}]
[{"$f":"IF(Table2[[#This Row],[नाम]]=\"\",\"\",ROWS($A$1:A179))","v":""},{"$f":"PROPER(IF(Table1[[#This Row],[नाम]]=\"\",\"\",Table1[[#This Row],[नाम]]))","v":""},{"$nulls":8},{"$f":"SUM(Table2[[#This Row],[मार्च मूल वेतन]:[अन्य 3]])","v":0}]
[{"$f":"IF(Table2[[#This Row],[नाम]]=\"\",\"\",ROWS($A$1:A180))","v":""},{"$f":"PROPER(IF(Table1[[#This Row],[नाम]]=\"\",\"\",Table1[[#This Row],[नाम]]))","v":""},{"$nulls":8},{"$f":"SUM(Table2[[#This Row],[मार्च मूल वेतन]:[अन्य 3]])","v":0}]
[{"$f":"IF(Table2[[#This Row],[नाम]]=\"\",\"\",ROWS($A$1:A181))","v":""},{"$f":"PROPER(IF(Table1[[#This Row],[नाम]]=\"\",\"\",Table1[[#This Row],[नाम]]))","v":""},{"$nulls":8},{"$f":"SUM(Table2[[#This Row],[मार्च मूल वेतन]:[अन्य 3]])","v":0}]
[{"$f":"IF(Table2[[#This Row],[नाम]]=\"\",\"\",ROWS($A$1:A182))","v":""},{"$f":"PROPER(IF(Table1[[#This Row],[नाम]]=\"\",\"\",Table1[[#This Row],[नाम]]))","v":""},{"$nulls":8},{"$f":"SUM(Table2[[#This Row],[मार्च मूल वेतन]:[अन्य 3]])","v":0}]
[{"$f":"IF(Table2[[#This Row],[नाम]]=\"\",\"\",ROWS($A$1:A183))","v":""},{"$f":"PROPER(IF(Table1[[#This Row],[नाम]]=\"\",\"\",Table1[[#This Row],[नाम]]))","v":""},{"$nulls":8},{"$f":"SUM(Table2[[#This Row],[मार्च मूल वेतन]:[अन्य 3]])","v":0}]
[{"$f":"IF(Table2[[#This Row],[नाम]]=\"\",\"\",ROWS($A$1:A184))","v":""},{"$f":"PROPER(IF(Table1[[#This Row],[नाम]]=\"\",\"\",Table1[[#This Row],[नाम]]))","v":""},{"$nulls":8},{"$f":"SUM(Table2[[#This Row],[मार्च मूल वेतन]:[अन्य 3]])","v":0}]
[{"$f":"IF(Table2[[#This Row],[नाम]]=\"\",\"\",ROWS($A$1:A185))","v":""},{"$f":"PROPER(IF(Table1[[#This Row],[नाम]]=\"\",\"\",Table1[[#This Row],[नाम]]))","v":""},{"$nulls":8},{"$f":"SUM(Table2[[#This Row],[मार्च मूल वेतन]:[अन्य 3]])","v":0}]
[{"$f":"IF(Table2[[#This Row],[नाम]]=\"\",\"\",ROWS($A$1:A186))","v":""},{"$f":"PROPER(IF(Table1[[#This Row],[नाम]]=\"\",\"\",Table1[[#This Row],[नाम]]))","v":""},{"$nulls":8},{"$f":"SUM(Table2[[#This Row],[मार्च मूल वेतन]:[अन्य 3]])","v":0}]
[{"$f":"IF(Table2[[#This Row],[नाम]]=\"\",\"\",ROWS($A$1:A187))","v":""},{"$f":"PROPER(IF(Table1[[#This Row],[नाम]]=\"\",\"\",Table1[[#This Row],[नाम]]))","v":""},{"$nulls":8},{"$f":"SUM(Table2[[#This Row],[मार्च मूल वेतन]:[अन्य 3]])","v":0}]
[{"$f":"IF(Table2[[#This Row],[नाम]]=\"\",\"\",ROWS($A$1:A188))","v":""},{"$f":"PROPER(IF(Table1[[#This Row],[नाम]]=\"\",\"\",Table1[[#This Row],[नाम]]))","v":""},{"$nulls":8},{"$f":"SUM(Table2[[#This Row],[मार्च मूल वेतन]:[अन्य 3]])","v":0}]
[{"$f":"IF(Table2[[#This Row],[नाम]]=\"\",\"\",ROWS($A$1:A189))","v":""},{"$f":"PROPER(IF(Table1[[#This Row],[नाम]]=\"\",\"\",Table1[[#This Row],[नाम]]))","v":""},{"$nulls":8},{"$f":"SUM(Table2[[#This Row],[मार्च मूल वेतन]:[अन्य 3]])","v":0}]
[{"$f":"IF(Table2[[#This Row],[नाम]]=\"\",\"\",ROWS($A$1:A190))","v":""},{"$f":"PROPER(IF(Table1[[#This Row],[नाम]]=\"\",\"\",Table1[[#This Row],[नाम]]))","v":""},{"$nulls":8},{"$f":"SUM(Table2[[#This Row],[मार्च मूल वेतन]:[अन्य 3]])","v":0}]
[{"$f":"IF(Table2[[#This Row],[नाम]]=\"\",\"\",ROWS($A$1:A191))","v":""},{"$f":"PROPER(IF(Table1[[#This Row],[नाम]]=\"\",\"\",Table1[[#This Row],[नाम]]))","v":""},{"$nulls":8},{"$f":"SUM(Table2[[#This Row],[मार्च मूल वेतन]:[अन्य 3]])","v":0}]
[{"$f":"IF(Table2[[#This Row],[नाम]]=\"\",\"\",ROWS($A$1:A192))","v":""},{"$f":"PROPER(IF(Table1[[#This Row],[नाम]]=\"\",\"\",Table1[[#This Row],[नाम]]))","v":""},{"$nulls":8},{"$f":"SUM(Table2[[#This Row],[मार्च मूल वेतन]:[अन्य 3]])","v":0}]
[{"$f":"IF(Table2[[#This Row],[नाम]]=\"\",\"\",ROWS($A$1:A193))","v":""},{"$f":"PROPER(IF(Table1[[#This Row],[नाम]]=\"\",\"\",Table1[[#This Row],[नाम]]))","v":""},{"$nulls":8},{"$f":"SUM(Table2[[#This Row],[मार्च मूल वेतन]:[अन्य 3]])","v":0}]
[{"$f":"IF(Table2[[#This Row],[नाम]]=\"\",\"\",ROWS($A$1:A194))","v":""},{"$f":"PROPER(IF(Table1[[#This Row],[नाम]]=\"\",\"\",Table1[[#This Row],[नाम]]))","v":""},{"$nulls":8},{"$f":"SUM(Table2[[#This Row],[मार्च मूल वेतन]:[अन्य 3]])","v":0}]
[{"$f":"IF(Table2[[#This Row],[नाम]]=\"\",\"\",ROWS($A$1:A195))","v":""},{"$f":"PROPER(IF(Table1[[#This Row],[नाम]]=\"\",\"\",Table1[[#This Row],[नाम]]))","v":""},{"$nulls":8},{"$f":"SUM(Table2[[#This Row],[मार्च मूल वेतन]:[अन्य 3]])","v":0}]
[{"$f":"IF(Table2[[#This Row],[नाम]]=\"\",\"\",ROWS($A$1:A196))","v":""},{"$f":"PROPER(IF(Table1[[#This Row],[नाम]]=\"\",\"\",Table1[[#This Row],[नाम]]))","v":""},{"$nulls":8},{"$f":"SUM(Table2[[#This Row],[मार्च मूल वेतन]:[अन्य 3]])","v":0}]
[{"$f":"IF(Table2[[#This Row],[नाम]]=\"\",\"\",ROWS($A$1:A197))","v":""},{"$f":"PROPER(IF(Table1[[#This Row],[नाम]]=\"\",\"\",Table1[[#This Row],[नाम]]))","v":""},{"$nulls":8},{"$f":"SUM(Table2[[#This Row],[मार्च मूल वेतन]:[अन्य 3]])","v":0}]
[{"$f":"IF(Table2[[#This Row],[नाम]]=\"\",\"\",ROWS($A$1:A198))","v":""},{"$f":"PROPER(IF(Table1[[#This Row],[नाम]]=\"\",\"\",Table1[[#This Row],[नाम]]))","v":""},{"$nulls":8},{"$f":"SUM(Table2[[#This Row],[मार्च मूल वेतन]:[अन्य 3]])","v":0}]
[{"$f":"IF(Table2[[#This Row],[नाम]]=\"\",\"\",ROWS($A$1:A199))","v":""},{"$f":"PROPER(IF(Table1[[#This Row],[नाम]]=\"\",\"\",Table1[[#This Row],[नाम]]))","v":""},{"$nulls":8},{"$f":"SUM(Table2[[#This Row],[मार्च मूल वेतन]:[अन्य 3]])","v":0}]
[{"$f":"IF(Table2[[#This Row],[नाम]]=\"\",\"\",ROWS($A$1:A200))","v":""},{"$f":"PROPER(IF(Table1[[#This Row],[नाम]]=\"\",\"\",Table1[[#This Row],[नाम]]))","v":""},{"$nulls":8},{"$f":"SUM(Table2[[#This Row],[मार्च मूल वेतन]:[अन्य 3]])","v":0}]
[{"$f":"IF(Table2[[#This Row],[नाम]]=\"\",\"\",ROWS($A$1:A201))","v":""},{"$f":"PROPER(IF(Table1[[#This Row],[नाम]]=\"\",\"\",Table1[[#This Row],[नाम]]))","v":""},{"$nulls":8},{"$f":"SUM(Table2[[#This Row],[मार्च मूल वेतन]:[अन्य 3]])","v":0}]
[{"$f":"IF(Table2[[#This Row],[नाम]]=\"\",\"\",ROWS($A$1:A202))","v":""},{"$f":"PROPER(IF(Table1[[#This Row],[नाम]]=\"\",\"\",Table1[[#This Row],[नाम]]))","v":""},{"$nulls":8},{"$f":"SUM(Table2[[#This Row],[मार्च मूल वेतन]:[अन्य 3]])","v":0}]
[{"$f":"IF(Table2[[#This Row],[नाम]]=\"\",\"\",ROWS($A$1:A203))","v":""},{"$f":"PROPER(IF(Table1[[#This Row],[नाम]]=\"\",\"\",Table1[[#This Row],[नाम]]))","v":""},{"$nulls":8},{"$f":"SUM(Table2[[#This Row],[मार्च मूल वेतन]:[अन्य 3]])","v":0}]
[{"$f":"IF(Table2[[#This Row],[नाम]]=\"\",\"\",ROWS($A$1:A204))","v":""},{"$f":"PROPER(IF(Table1[[#This Row],[नाम]]=\"\",\"\",Table1[[#This Row],[नाम]]))","v":""},{"$nulls":8},{"$f":"SUM(Table2[[#This Row],[मार्च मूल वेतन]:[अन्य 3]])","v":0}]
[{"$f":"IF(Table2[[#This Row],[नाम]]=\"\",\"\",ROWS($A$1:A205))","v":""},{"$f":"PROPER(IF(Table1[[#This Row],[नाम]]=\"\",\"\",Table1[[#This Row],[नाम]]))","v":""},{"$nulls":8},{"$f":"SUM(Table2[[#This Row],[मार्च मूल वेतन]:[अन्य 3]])","v":0}]
[{"$f":"IF(Table2[[#This Row],[नाम]]=\"\",\"\",ROWS($A$1:A206))","v":""},{"$f":"PROPER(IF(Table1[[#This Row],[नाम]]=\"\",\"\",Table1[[#This Row],[नाम]]))","v":""},{"$nulls":8},{"$f":"SUM(Table2[[#This Row],[मार्च मूल वेतन]:[अन्य 3]])","v":0}]
[{"$f":"IF(Table2[[#This Row],[नाम]]=\"\",\"\",ROWS($A$1:A207))","v":""},{"$f":"PROPER(IF(Table1[[#This Row],[नाम]]=\"\",\"\",Table1[[#This Row],[नाम]]))","v":""},{"$nulls":8},{"$f":"SUM(Table2[[#This Row],[मार्च मूल वेतन]:[अन्य 3]])","v":0}]
[{"$f":"IF(Table2[[#This Row],[नाम]]=\"\",\"\",ROWS($A$1:A208))","v":""},{"$f":"PROPER(IF(Table1[[#This Row],[नाम]]=\"\",\"\",Table1[[#This Row],[नाम]]))","v":""},{"$nulls":8},{"$f":"SUM(Table2[[#This Row],[मार्च मूल वेतन]:[अन्य 3]])","v":0}]
[{"$f":"IF(Table2[[#This Row],[नाम]]=\"\",\"\",ROWS($A$1:A209))","v":""},{"$f":"PROPER(IF(Table1[[#This Row],[नाम]]=\"\",\"\",Table1[[#This Row],[नाम]]))","v":""},{"$nulls":8},{"$f":"SUM(Table2[[#This Row],[मार्च मूल वेतन]:[अन्य 3]])","v":0}]
[{"$f":"IF(Table2[[#This Row],[नाम]]=\"\",\"\",ROWS($A$1:A210))","v":""},{"$f":"PROPER(IF(Table1[[#This Row],[नाम]]=\"\",\"\",Table1[[#This Row],[नाम]]))","v":""},{"$nulls":8},{"$f":"SUM(Table2[[#This Row],[मार्च मूल वेतन]:[अन्य 3]])","v":0}]
[{"$f":"IF(Table2[[#This Row],[नाम]]=\"\",\"\",ROWS($A$1:A211))","v":""},{"$f":"PROPER(IF(Table1[[#This Row],[नाम]]=\"\",\"\",Table1[[#This Row],[नाम]]))","v":""},{"$nulls":8},{"$f":"SUM(Table2[[#This Row],[मार्च मूल वेतन]:[अन्य 3]])","v":0}]
[{"$f":"IF(Table2[[#This Row],[नाम]]=\"\",\"\",ROWS($A$1:A212))","v":""},{"$f":"PROPER(IF(Table1[[#This Row],[नाम]]=\"\",\"\",Table1[[#This Row],[नाम]]))","v":""},{"$nulls":8},{"$f":"SUM(Table2[[#This Row],[मार्च मूल वेतन]:[अन्य 3]])","v":0}]
[{"$f":"IF(Table2[[#This Row],[नाम]]=\"\",\"\",ROWS($A$1:A213))","v":""},{"$f":"PROPER(IF(Table1[[#This Row],[नाम]]=\"\",\"\",Table1[[#This Row],[नाम]]))","v":""},{"$nulls":8},{"$f":"SUM(Table2[[#This Row],[मार्च मूल वेतन]:[अन्य 3]])","v":0}]
[{"$f":"IF(Table2[[#This Row],[नाम]]=\"\",\"\",ROWS($A$1:A214))","v":""},{"$f":"PROPER(IF(Table1[[#This Row],[नाम]]=\"\",\"\",Table1[[#This Row],[नाम]]))","v":""},{"$nulls":8},{"$f":"SUM(Table2[[#This Row],[मार्च मूल वेतन]:[अन्य 3]])","v":0}]
[{"$f":"IF(Table2[[#This Row],[नाम]]=\"\",\"\",ROWS($A$1:A215))","v":""},{"$f":"PROPER(IF(Table1[[#This Row],[नाम]]=\"\",\"\",Table1[[#This Row],[नाम]]))","v":""},{"$nulls":8},{"$f":"SUM(Table2[[#This Row],[मार्च मूल वेतन]:[अन्य 3]])","v":0}]
[{"$f":"IF(Table2[[#This Row],[नाम]]=\"\",\"\",ROWS($A$1:A216))","v":""},{"$f":"PROPER(IF(Table1[[#This Row],[नाम]]=\"\",\"\",Table1[[#This Row],[नाम]]))","v":""},{"$nulls":8},{"$f":"SUM(Table2[[#This Row],[मार्च मूल वेतन]:[अन्य 3]])","v":0}]
[{"$f":"IF(Table2[[#This Row],[नाम]]=\"\",\"\",ROWS($A$1:A217))","v":""},{"$f":"PROPER(IF(Table1[[#This Row],[नाम]]=\"\",\"\",Table1[[#This Row],[नाम]]))","v":""},{"$nulls":8},{"$f":"SUM(Table2[[#This Row],[मार्च मूल वेतन]:[अन्य 3]])","v":0}]
[{"$f":"IF(Table2[[#This Row],[नाम]]=\"\",\"\",ROWS($A$1:A218))","v":""},{"$f":"PROPER(IF(Table1[[#This Row],[नाम]]=\"\",\"\",Table1[[#This Row],[नाम]]))","v":""},{"$nulls":8},{"$f":"SUM(Table2[[#This Row],[मार्च मूल वेतन]:[अन्य 3]])","v":0}]
[{"$f":"IF(Table2[[#This Row],[नाम]]=\"\",\"\",ROWS($A$1:A219))","v":""},{"$f":"PROPER(IF(Table1[[#This Row],[नाम]]=\"\",\"\",Table1[[#This Row],[नाम]]))","v":""},{"$nulls":8},{"$f":"SUM(Table2[[#This Row],[मार्च मूल वेतन]:[अन्य 3]])","v":0}]
[{"$f":"IF(Table2[[#This Row],[नाम]]=\"\",\"\",ROWS($A$1:A220))","v":""},{"$f":"PROPER(IF(Table1[[#This Row],[नाम]]=\"\",\"\",Table1[[#This Row],[नाम]]))","v":""},{"$nulls":8},{"$f":"SUM(Table2[[#This Row],[मार्च मूल वेतन]:[अन्य 3]])","v":0}]
[{"$f":"IF(Table2[[#This Row],[नाम]]=\"\",\"\",ROWS($A$1:A221))","v":""},{"$f":"PROPER(IF(Table1[[#This Row],[नाम]]=\"\",\"\",Table1[[#This Row],[नाम]]))","v":""},{"$nulls":8},{"$f":"SUM(Table2[[#This Row],[मार्च मूल वेतन]:[अन्य 3]])","v":0}]
[{"$f":"IF(Table2[[#This Row],[नाम]]=\"\",\"\",ROWS($A$1:A222))","v":""},{"$f":"PROPER(IF(Table1[[#This Row],[नाम]]=\"\",\"\",Table1[[#This Row],[नाम]]))","v":""},{"$nulls":8},{"$f":"SUM(Table2[[#This Row],[मार्च मूल वेतन]:[अन्य 3]])","v":0}]
[{"$f":"IF(Table2[[#This Row],[नाम]]=\"\",\"\",ROWS($A$1:A223))","v":""},{"$f":"PROPER(IF(Table1[[#This Row],[नाम]]=\"\",\"\",Table1[[#This Row],[नाम]]))","v":""},{"$nulls":8},{"$f":"SUM(Table2[[#This Row],[मार्च मूल वेतन]:[अन्य 3]])","v":0}]
[{"$f":"IF(Table2[[#This Row],[नाम]]=\"\",\"\",ROWS($A$1:A224))","v":""},{"$f":"PROPER(IF(Table1[[#This Row],[नाम]]=\"\",\"\",Table1[[#This Row],[नाम]]))","v":""},{"$nulls":8},{"$f":"SUM(Table2[[#This Row],[मार्च मूल वेतन]:[अन्य 3]])","v":0}]
[{"$f":"IF(Table2[[#This Row],[नाम]]=\"\",\"\",ROWS($A$1:A225))","v":""},{"$f":"PROPER(IF(Table1[[#This Row],[नाम]]=\"\",\"\",Table1[[#This Row],[नाम]]))","v":""},{"$nulls":8},{"$f":"SUM(Table2[[#This Row],[मार्च मूल वेतन]:[अन्य 3]])","v":0}]
[{"$f":"IF(Table2[[#This Row],[नाम]]=\"\",\"\",ROWS($A$1:A226))","v":""},{"$f":"PROPER(IF(Table1[[#This Row],[नाम]]=\"\",\"\",Table1[[#This Row],[नाम]]))","v":""},{"$nulls":8},{"$f":"SUM(Table2[[#This Row],[मार्च मूल वेतन]:[अन्य 3]])","v":0}]
[{"$f":"IF(Table2[[#This Row],[नाम]]=\"\",\"\",ROWS($A$1:A227))","v":""},{"$f":"PROPER(IF(Table1[[#This Row],[नाम]]=\"\",\"\",Table1[[#This Row],[नाम]]))","v":""},{"$nulls":8},{"$f":"SUM(Table2[[#This Row],[मार्च मूल वेतन]:[अन्य 3]])","v":0}]
[{"$f":"IF(Table2[[#This Row],[नाम]]=\"\",\"\",ROWS($A$1:A228))","v":""},{"$f":"PROPER(IF(Table1[[#This Row],[नाम]]=\"\",\"\",Table1[[#This Row],[नाम]]))","v":""},{"$nulls":8},{"$f":"SUM(Table2[[#This Row],[मार्च मूल वेतन]:[अन्य 3]])","v":0}]
[{"$f":"IF(Table2[[#This Row],[नाम]]=\"\",\"\",ROWS($A$1:A229))","v":""},{"$f":"PROPER(IF(Table1[[#This Row],[नाम]]=\"\",\"\",Table1[[#This Row],[नाम]]))","v":""},{"$nulls":8},{"$f":"SUM(Table2[[#This Row],[मार्च मूल वेतन]:[अन्य 3]])","v":0}]
[{"$f":"IF(Table2[[#This Row],[नाम]]=\"\",\"\",ROWS($A$1:A230))","v":""},{"$f":"PROPER(IF(Table1[[#This Row],[नाम]]=\"\",\"\",Table1[[#This Row],[नाम]]))","v":""},{"$nulls":8},{"$f":"SUM(Table2[[#This Row],[मार्च मूल वेतन]:[अन्य 3]])","v":0}]
[{"$f":"IF(Table2[[#This Row],[नाम]]=\"\",\"\",ROWS($A$1:A231))","v":""},{"$f":"PROPER(IF(Table1[[#This Row],[नाम]]=\"\",\"\",Table1[[#This Row],[नाम]]))","v":""},{"$nulls":8},{"$f":"SUM(Table2[[#This Row],[मार्च मूल वेतन]:[अन्य 3]])","v":0}]
[{"$f":"IF(Table2[[#This Row],[नाम]]=\"\",\"\",ROWS($A$1:A232))","v":""},{"$f":"PROPER(IF(Table1[[#This Row],[नाम]]=\"\",\"\",Table1[[#This Row],[नाम]]))","v":""},{"$nulls":8},{"$f":"SUM(Table2[[#This Row],[मार्च मूल वेतन]:[अन्य 3]])","v":0}]
[{"$f":"IF(Table2[[#This Row],[नाम]]=\"\",\"\",ROWS($A$1:A233))","v":""},{"$f":"PROPER(IF(Table1[[#This Row],[नाम]]=\"\",\"\",Table1[[#This Row],[नाम]]))","v":""},{"$nulls":8},{"$f":"SUM(Table2[[#This Row],[मार्च मूल वेतन]:[अन्य 3]])","v":0}]
[{"$f":"IF(Table2[[#This Row],[नाम]]=\"\",\"\",ROWS($A$1:A234))","v":""},{"$f":"PROPER(IF(Table1[[#This Row],[नाम]]=\"\",\"\",Table1[[#This Row],[नाम]]))","v":""},{"$nulls":8},{"$f":"SUM(Table2[[#This Row],[मार्च मूल वेतन]:[अन्य 3]])","v":0}]
[{"$f":"IF(Table2[[#This Row],[नाम]]=\"\",\"\",ROWS($A$1:A235))","v":""},{"$f":"PROPER(IF(Table1[[#This Row],[नाम]]=\"\",\"\",Table1[[#This Row],[नाम]]))","v":""},{"$nulls":8},{"$f":"SUM(Table2[[#This Row],[मार्च मूल वेतन]:[अन्य 3]])","v":0}]
[{"$f":"IF(Table2[[#This Row],[नाम]]=\"\",\"\",ROWS($A$1:A236))","v":""},{"$f":"PROPER(IF(Table1[[#This Row],[नाम]]=\"\",\"\",Table1[[#This Row],[नाम]]))","v":""},{"$nulls":8},{"$f":"SUM(Table2[[#This Row],[मार्च मूल वेतन]:[अन्य 3]])","v":0}]
[{"$f":"IF(Table2[[#This Row],[नाम]]=\"\",\"\",ROWS($A$1:A237))","v":""},{"$f":"PROPER(IF(Table1[[#This Row],[नाम]]=\"\",\"\",Table1[[#This Row],[नाम]]))","v":""},{"$nulls":8},{"$f":"SUM(Table2[[#This Row],[मार्च मूल वेतन]:[अन्य 3]])","v":0}]
[{"$f":"IF(Table2[[#This Row],[नाम]]=\"\",\"\",ROWS($A$1:A238))","v":""},{"$f":"PROPER(IF(Table1[[#This Row],[नाम]]=\"\",\"\",Table1[[#This Row],[नाम]]))","v":""},{"$nulls":8},{"$f":"SUM(Table2[[#This Row],[मार्च मूल वेतन]:[अन्य 3]])","v":0}]
[{"$f":"IF(Table2[[#This Row],[नाम]]=\"\",\"\",ROWS($A$1:A239))","v":""},{"$f":"PROPER(IF(Table1[[#This Row],[नाम]]=\"\",\"\",Table1[[#This Row],[नाम]]))","v":""},{"$nulls":8},{"$f":"SUM(Table2[[#This Row],[मार्च मूल वेतन]:[अन्य 3]])","v":0}]
[{"$f":"IF(Table2[[#This Row],[नाम]]=\"\",\"\",ROWS($A$1:A240))","v":""},{"$f":"PROPER(IF(Table1[[#This Row],[नाम]]=\"\",\"\",Table1[[#This Row],[नाम]]))","v":""},{"$nulls":8},{"$f":"SUM(Table2[[#This Row],[मार्च मूल वेतन]:[अन्य 3]])","v":0}]
[{"$f":"IF(Table2[[#This Row],[नाम]]=\"\",\"\",ROWS($A$1:A241))","v":""},{"$f":"PROPER(IF(Table1[[#This Row],[नाम]]=\"\",\"\",Table1[[#This Row],[नाम]]))","v":""},{"$nulls":8},{"$f":"SUM(Table2[[#This Row],[मार्च मूल वेतन]:[अन्य 3]])","v":0}]
[{"$f":"IF(Table2[[#This Row],[नाम]]=\"\",\"\",ROWS($A$1:A242))","v":""},{"$f":"PROPER(IF(Table1[[#This Row],[नाम]]=\"\",\"\",Table1[[#This Row],[नाम]]))","v":""},{"$nulls":8},{"$f":"SUM(Table2[[#This Row],[मार्च मूल वेतन]:[अन्य 3]])","v":0}]
[{"$f":"IF(Table2[[#This Row],[नाम]]=\"\",\"\",ROWS($A$1:A243))","v":""},{"$f":"PROPER(IF(Table1[[#This Row],[नाम]]=\"\",\"\",Table1[[#This Row],[नाम]]))","v":""},{"$nulls":8},{"$f":"SUM(Table2[[#This Row],[मार्च मूल वेतन]:[अन्य 3]])","v":0}]
[{"$f":"IF(Table2[[#This Row],[नाम]]=\"\",\"\",ROWS($A$1:A244))","v":""},{"$f":"PROPER(IF(Table1[[#This Row],[नाम]]=\"\",\"\",Table1[[#This Row],[नाम]]))","v":""},{"$nulls":8},{"$f":"SUM(Table2[[#This Row],[मार्च मूल वेतन]:[अन्य 3]])","v":0}]
[{"$f":"IF(Table2[[#This Row],[नाम]]=\"\",\"\",ROWS($A$1:A245))","v":""},{"$f":"PROPER(IF(Table1[[#This Row],[नाम]]=\"\",\"\",Table1[[#This Row],[नाम]]))","v":""},{"$nulls":8},{"$f":"SUM(Table2[[#This Row],[मार्च मूल वेतन]:[अन्य 3]])","v":0}]
[{"$f":"IF(Table2[[#This Row],[नाम]]=\"\",\"\",ROWS($A$1:A246))","v":""},{"$f":"PROPER(IF(Table1[[#This Row],[नाम]]=\"\",\"\",Table1[[#This Row],[नाम]]))","v":""},{"$nulls":8},{"$f":"SUM(Table2[[#This Row],[मार्च मूल वेतन]:[अन्य 3]])","v":0}]
[{"$f":"IF(Table2[[#This Row],[नाम]]=\"\",\"\",ROWS($A$1:A247))","v":""},{"$f":"PROPER(IF(Table1[[#This Row],[नाम]]=\"\",\"\",Table1[[#This Row],[नाम]]))","v":""},{"$nulls":8},{"$f":"SUM(Table2[[#This Row],[मार्च मूल वेतन]:[अन्य 3]])","v":0}]
[{"$f":"IF(Table2[[#This Row],[नाम]]=\"\",\"\",ROWS($A$1:A248))","v":""},{"$f":"PROPER(IF(Table1[[#This Row],[नाम]]=\"\",\"\",Table1[[#This Row],[नाम]]))","v":""},{"$nulls":8},{"$f":"SUM(Table2[[#This Row],[मार्च मूल वेतन]:[अन्य 3]])","v":0}]
[{"$f":"IF(Table2[[#This Row],[नाम]]=\"\",\"\",ROWS($A$1:A249))","v":""},{"$f":"PROPER(IF(Table1[[#This Row],[नाम]]=\"\",\"\",Table1[[#This Row],[नाम]]))","v":""},{"$nulls":8},{"$f":"SUM(Table2[[#This Row],[मार्च मूल वेतन]:[अन्य 3]])","v":0}]
[{"$f":"IF(Table2[[#This Row],[नाम]]=\"\",\"\",ROWS($A$1:A250))","v":""},{"$f":"PROPER(IF(Table1[[#This Row],[नाम]]=\"\",\"\",Table1[[#This Row],[नाम]]))","v":""},{"$nulls":8},{"$f":"SUM(Table2[[#This Row],[मार्च मूल वेतन]:[अन्य 3]])","v":0}]
[{"$f":"IF(Table2[[#This Row],[नाम]]=\"\",\"\",ROWS($A$1:A251))","v":""},{"$f":"PROPER(IF(Table1[[#This Row],[नाम]]=\"\",\"\",Table1[[#This Row],[नाम]]))","v":""},{"$nulls":8},{"$f":"SUM(Table2[[#This Row],[मार्च मूल वेतन]:[अन्य 3]])","v":0}]
[{"$f":"IF(Table2[[#This Row],[नाम]]=\"\",\"\",ROWS($A$1:A252))","v":""},{"$f":"PROPER(IF(Table1[[#This Row],[नाम]]=\"\",\"\",Table1[[#This Row],[नाम]]))","v":""},{"$nulls":8},{"$f":"SUM(Table2[[#This Row],[मार्च मूल वेतन]:[अन्य 3]])","v":0}]
[{"$f":"IF(Table2[[#This Row],[नाम]]=\"\",\"\",ROWS($A$1:A253))","v":""},{"$f":"PROPER(IF(Table1[[#This Row],[नाम]]=\"\",\"\",Table1[[#This Row],[नाम]]))","v":""},{"$nulls":8},{"$f":"SUM(Table2[[#This Row],[मार्च मूल वेतन]:[अन्य 3]])","v":0}]
[{"$f":"IF(Table2[[#This Row],[नाम]]=\"\",\"\",ROWS($A$1:A254))","v":""},{"$f":"PROPER(IF(Table1[[#This Row],[नाम]]=\"\",\"\",Table1[[#This Row],[नाम]]))","v":""},{"$nulls":8},{"$f":"SUM(Table2[[#This Row],[मार्च मूल वेतन]:[अन्य 3]])","v":0}]
[{"$f":"IF(Table2[[#This Row],[नाम]]=\"\",\"\",ROWS($A$1:A255))","v":""},{"$f":"PROPER(IF(Table1[[#This Row],[नाम]]=\"\",\"\",Table1[[#This Row],[नाम]]))","v":""},{"$nulls":8},{"$f":"SUM(Table2[[#This Row],[मार्च मूल वेतन]:[अन्य 3]])","v":0}]
[{"$f":"IF(Table2[[#This Row],[नाम]]=\"\",\"\",ROWS($A$1:A256))","v":""},{"$f":"PROPER(IF(Table1[[#This Row],[नाम]]=\"\",\"\",Table1[[#This Row],[नाम]]))","v":""},{"$nulls":8},{"$f":"SUM(Table2[[#This Row],[मार्च मूल वेतन]:[अन्य 3]])","v":0}]
[{"$f":"IF(Table2[[#This Row],[नाम]]=\"\",\"\",ROWS($A$1:A257))","v":""},{"$f":"PROPER(IF(Table1[[#This Row],[नाम]]=\"\",\"\",Table1[[#This Row],[नाम]]))","v":""},{"$nulls":8},{"$f":"SUM(Table2[[#This Row],[मार्च मूल वेतन]:[अन्य 3]])","v":0}]
[{"$f":"IF(Table2[[#This Row],[नाम]]=\"\",\"\",ROWS($A$1:A258))","v":""},{"$f":"PROPER(IF(Table1[[#This Row],[नाम]]=\"\",\"\",Table1[[#This Row],[नाम]]))","v":""},{"$nulls":8},{"$f":"SUM(Table2[[#This Row],[मार्च मूल वेतन]:[अन्य 3]])","v":0}]
[{"$f":"IF(Table2[[#This Row],[नाम]]=\"\",\"\",ROWS($A$1:A259))","v":""},{"$f":"PROPER(IF(Table1[[#This Row],[नाम]]=\"\",\"\",Table1[[#This Row],[नाम]]))","v":""},{"$nulls":8},{"$f":"SUM(Table2[[#This Row],[मार्च मूल वेतन]:[अन्य 3]])","v":0}]
[{"$f":"IF(Table2[[#This Row],[नाम]]=\"\",\"\",ROWS($A$1:A260))","v":""},{"$f":"PROPER(IF(Table1[[#This Row],[नाम]]=\"\",\"\",Table1[[#This Row],[नाम]]))","v":""},{"$nulls":8},{"$f":"SUM(Table2[[#This Row],[मार्च मूल वेतन]:[अन्य 3]])","v":0}]
[{"$f":"IF(Table2[[#This Row],[नाम]]=\"\",\"\",ROWS($A$1:A261))","v":""},{"$f":"PROPER(IF(Table1[[#This Row],[नाम]]=\"\",\"\",Table1[[#This Row],[नाम]]))","v":""},{"$nulls":8},{"$f":"SUM(Table2[[#This Row],[मार्च मूल वेतन]:[अन्य 3]])","v":0}]
[{"$f":"IF(Table2[[#This Row],[नाम]]=\"\",\"\",ROWS($A$1:A262))","v":""},{"$f":"PROPER(IF(Table1[[#This Row],[नाम]]=\"\",\"\",Table1[[#This Row],[नाम]]))","v":""},{"$nulls":8},{"$f":"SUM(Table2[[#This Row],[मार्च मूल वेतन]:[अन्य 3]])","v":0}]
[{"$f":"IF(Table2[[#This Row],[नाम]]=\"\",\"\",ROWS($A$1:A263))","v":""},{"$f":"PROPER(IF(Table1[[#This Row],[नाम]]=\"\",\"\",Table1[[#This Row],[नाम]]))","v":""},{"$nulls":8},{"$f":"SUM(Table2[[#This Row],[मार्च मूल वेतन]:[अन्य 3]])","v":0}]
[{"$f":"IF(Table2[[#This Row],[नाम]]=\"\",\"\",ROWS($A$1:A264))","v":""},{"$f":"PROPER(IF(Table1[[#This Row],[नाम]]=\"\",\"\",Table1[[#This Row],[नाम]]))","v":""},{"$nulls":8},{"$f":"SUM(Table2[[#This Row],[मार्च मूल वेतन]:[अन्य 3]])","v":0}]
[{"$f":"IF(Table2[[#This Row],[नाम]]=\"\",\"\",ROWS($A$1:A265))","v":""},{"$f":"PROPER(IF(Table1[[#This Row],[नाम]]=\"\",\"\",Table1[[#This Row],[नाम]]))","v":""},{"$nulls":8},{"$f":"SUM(Table2[[#This Row],[मार्च मूल वेतन]:[अन्य 3]])","v":0}]
[{"$f":"IF(Table2[[#This Row],[नाम]]=\"\",\"\",ROWS($A$1:A266))","v":""},{"$f":"PROPER(IF(Table1[[#This Row],[नाम]]=\"\",\"\",Table1[[#This Row],[नाम]]))","v":""},{"$nulls":8},{"$f":"SUM(Table2[[#This Row],[मार्च मूल वेतन]:[अन्य 3]])","v":0}]
[{"$f":"IF(Table2[[#This Row],[नाम]]=\"\",\"\",ROWS($A$1:A267))","v":""},{"$f":"PROPER(IF(Table1[[#This Row],[नाम]]=\"\",\"\",Table1[[#This Row],[नाम]]))","v":""},{"$nulls":8},{"$f":"SUM(Table2[[#This Row],[मार्च मूल वेतन]:[अन्य 3]])","v":0}]
[{"$f":"IF(Table2[[#This Row],[नाम]]=\"\",\"\",ROWS($A$1:A268))","v":""},{"$f":"PROPER(IF(Table1[[#This Row],[नाम]]=\"\",\"\",Table1[[#This Row],[नाम]]))","v":""},{"$nulls":8},{"$f":"SUM(Table2[[#This Row],[मार्च मूल वेतन]:[अन्य 3]])","v":0}]
[{"$f":"IF(Table2[[#This Row],[नाम]]=\"\",\"\",ROWS($A$1:A269))","v":""},{"$f":"PROPER(IF(Table1[[#This Row],[नाम]]=\"\",\"\",Table1[[#This Row],[नाम]]))","v":""},{"$nulls":8},{"$f":"SUM(Table2[[#This Row],[मार्च मूल वेतन]:[अन्य 3]])","v":0}]
[{"$f":"IF(Table2[[#This Row],[नाम]]=\"\",\"\",ROWS($A$1:A270))","v":""},{"$f":"PROPER(IF(Table1[[#This Row],[नाम]]=\"\",\"\",Table1[[#This Row],[नाम]]))","v":""},{"$nulls":8},{"$f":"SUM(Table2[[#This Row],[मार्च मूल वेतन]:[अन्य 3]])","v":0}]
[{"$f":"IF(Table2[[#This Row],[नाम]]=\"\",\"\",ROWS($A$1:A271))","v":""},{"$f":"PROPER(IF(Table1[[#This Row],[नाम]]=\"\",\"\",Table1[[#This Row],[नाम]]))","v":""},{"$nulls":8},{"$f":"SUM(Table2[[#This Row],[मार्च मूल वेतन]:[अन्य 3]])","v":0}]
[{"$f":"IF(Table2[[#This Row],[नाम]]=\"\",\"\",ROWS($A$1:A272))","v":""},{"$f":"PROPER(IF(Table1[[#This Row],[नाम]]=\"\",\"\",Table1[[#This Row],[नाम]]))","v":""},{"$nulls":8},{"$f":"SUM(Table2[[#This Row],[मार्च मूल वेतन]:[अन्य 3]])","v":0}]
[{"$f":"IF(Table2[[#This Row],[नाम]]=\"\",\"\",ROWS($A$1:A273))","v":""},{"$f":"PROPER(IF(Table1[[#This Row],[नाम]]=\"\",\"\",Table1[[#This Row],[नाम]]))","v":""},{"$nulls":8},{"$f":"SUM(Table2[[#This Row],[मार्च मूल वेतन]:[अन्य 3]])","v":0}]
[{"$f":"IF(Table2[[#This Row],[नाम]]=\"\",\"\",ROWS($A$1:A274))","v":""},{"$f":"PROPER(IF(Table1[[#This Row],[नाम]]=\"\",\"\",Table1[[#This Row],[नाम]]))","v":""},{"$nulls":8},{"$f":"SUM(Table2[[#This Row],[मार्च मूल वेतन]:[अन्य 3]])","v":0}]
[{"$f":"IF(Table2[[#This Row],[नाम]]=\"\",\"\",ROWS($A$1:A275))","v":""},{"$f":"PROPER(IF(Table1[[#This Row],[नाम]]=\"\",\"\",Table1[[#This Row],[नाम]]))","v":""},{"$nulls":8},{"$f":"SUM(Table2[[#This Row],[मार्च मूल वेतन]:[अन्य 3]])","v":0}]
[{"$f":"IF(Table2[[#This Row],[नाम]]=\"\",\"\",ROWS($A$1:A276))","v":""},{"$f":"PROPER(IF(Table1[[#This Row],[नाम]]=\"\",\"\",Table1[[#This Row],[नाम]]))","v":""},{"$nulls":8},{"$f":"SUM(Table2[[#This Row],[मार्च मूल वेतन]:[अन्य 3]])","v":0}]
[{"$f":"IF(Table2[[#This Row],[नाम]]=\"\",\"\",ROWS($A$1:A277))","v":""},{"$f":"PROPER(IF(Table1[[#This Row],[नाम]]=\"\",\"\",Table1[[#This Row],[नाम]]))","v":""},{"$nulls":8},{"$f":"SUM(Table2[[#This Row],[मार्च मूल वेतन]:[अन्य 3]])","v":0}]
[{"$f":"IF(Table2[[#This Row],[नाम]]=\"\",\"\",ROWS($A$1:A278))","v":""},{"$f":"PROPER(IF(Table1[[#This Row],[नाम]]=\"\",\"\",Table1[[#This Row],[नाम]]))","v":""},{"$nulls":8},{"$f":"SUM(Table2[[#This Row],[मार्च मूल वेतन]:[अन्य 3]])","v":0}]
[{"$f":"IF(Table2[[#This Row],[नाम]]=\"\",\"\",ROWS($A$1:A279))","v":""},{"$f":"PROPER(IF(Table1[[#This Row],[नाम]]=\"\",\"\",Table1[[#This Row],[नाम]]))","v":""},{"$nulls":8},{"$f":"SUM(Table2[[#This Row],[मार्च मूल वेतन]:[अन्य 3]])","v":0}]
[{"$f":"IF(Table2[[#This Row],[नाम]]=\"\",\"\",ROWS($A$1:A280))","v":""},{"$f":"PROPER(IF(Table1[[#This Row],[नाम]]=\"\",\"\",Table1[[#This Row],[नाम]]))","v":""},{"$nulls":8},{"$f":"SUM(Table2[[#This Row],[मार्च मूल वेतन]:[अन्य 3]])","v":0}]
[{"$f":"IF(Table2[[#This Row],[नाम]]=\"\",\"\",ROWS($A$1:A281))","v":""},{"$f":"PROPER(IF(Table1[[#This Row],[नाम]]=\"\",\"\",Table1[[#This Row],[नाम]]))","v":""},{"$nulls":8},{"$f":"SUM(Table2[[#This Row],[मार्च मूल वेतन]:[अन्य 3]])","v":0}]
[{"$f":"IF(Table2[[#This Row],[नाम]]=\"\",\"\",ROWS($A$1:A282))","v":""},{"$f":"PROPER(IF(Table1[[#This Row],[नाम]]=\"\",\"\",Table1[[#This Row],[नाम]]))","v":""},{"$nulls":8},{"$f":"SUM(Table2[[#This Row],[मार्च मूल वेतन]:[अन्य 3]])","v":0}]
[{"$f":"IF(Table2[[#This Row],[नाम]]=\"\",\"\",ROWS($A$1:A283))","v":""},{"$f":"PROPER(IF(Table1[[#This Row],[नाम]]=\"\",\"\",Table1[[#This Row],[नाम]]))","v":""},{"$nulls":8},{"$f":"SUM(Table2[[#This Row],[मार्च मूल वेतन]:[अन्य 3]])","v":0}]
[{"$f":"IF(Table2[[#This Row],[नाम]]=\"\",\"\",ROWS($A$1:A284))","v":""},{"$f":"PROPER(IF(Table1[[#This Row],[नाम]]=\"\",\"\",Table1[[#This Row],[नाम]]))","v":""},{"$nulls":8},{"$f":"SUM(Table2[[#This Row],[मार्च मूल वेतन]:[अन्य 3]])","v":0}]
[{"$f":"IF(Table2[[#This Row],[नाम]]=\"\",\"\",ROWS($A$1:A285))","v":""},{"$f":"PROPER(IF(Table1[[#This Row],[नाम]]=\"\",\"\",Table1[[#This Row],[नाम]]))","v":""},{"$nulls":8},{"$f":"SUM(Table2[[#This Row],[मार्च मूल वेतन]:[अन्य 3]])","v":0}]
[{"$f":"IF(Table2[[#This Row],[नाम]]=\"\",\"\",ROWS($A$1:A286))","v":""},{"$f":"PROPER(IF(Table1[[#This Row],[नाम]]=\"\",\"\",Table1[[#This Row],[नाम]]))","v":""},{"$nulls":8},{"$f":"SUM(Table2[[#This Row],[मार्च मूल वेतन]:[अन्य 3]])","v":0}]
[{"$f":"IF(Table2[[#This Row],[नाम]]=\"\",\"\",ROWS($A$1:A287))","v":""},{"$f":"PROPER(IF(Table1[[#This Row],[नाम]]=\"\",\"\",Table1[[#This Row],[नाम]]))","v":""},{"$nulls":8},{"$f":"SUM(Table2[[#This Row],[मार्च मूल वेतन]:[अन्य 3]])","v":0}]
[{"$f":"IF(Table2[[#This Row],[नाम]]=\"\",\"\",ROWS($A$1:A288))","v":""},{"$f":"PROPER(IF(Table1[[#This Row],[नाम]]=\"\",\"\",Table1[[#This Row],[नाम]]))","v":""},{"$nulls":8},{"$f":"SUM(Table2[[#This Row],[मार्च मूल वेतन]:[अन्य 3]])","v":0}]
[{"$f":"IF(Table2[[#This Row],[नाम]]=\"\",\"\",ROWS($A$1:A289))","v":""},{"$f":"PROPER(IF(Table1[[#This Row],[नाम]]=\"\",\"\",Table1[[#This Row],[नाम]]))","v":""},{"$nulls":8},{"$f":"SUM(Table2[[#This Row],[मार्च मूल वेतन]:[अन्य 3]])","v":0}]
[{"$f":"IF(Table2[[#This Row],[नाम]]=\"\",\"\",ROWS($A$1:A290))","v":""},{"$f":"PROPER(IF(Table1[[#This Row],[नाम]]=\"\",\"\",Table1[[#This Row],[नाम]]))","v":""},{"$nulls":8},{"$f":"SUM(Table2[[#This Row],[मार्च मूल वेतन]:[अन्य 3]])","v":0}]
[{"$f":"IF(Table2[[#This Row],[नाम]]=\"\",\"\",ROWS($A$1:A291))","v":""},{"$f":"PROPER(IF(Table1[[#This Row],[नाम]]=\"\",\"\",Table1[[#This Row],[नाम]]))","v":""},{"$nulls":8},{"$f":"SUM(Table2[[#This Row],[मार्च मूल वेतन]:[अन्य 3]])","v":0}]
[{"$f":"IF(Table2[[#This Row],[नाम]]=\"\",\"\",ROWS($A$1:A292))","v":""},{"$f":"PROPER(IF(Table1[[#This Row],[नाम]]=\"\",\"\",Table1[[#This Row],[नाम]]))","v":""},{"$nulls":8},{"$f":"SUM(Table2[[#This Row],[मार्च मूल वेतन]:[अन्य 3]])","v":0}]
[{"$f":"IF(Table2[[#This Row],[नाम]]=\"\",\"\",ROWS($A$1:A293))","v":""},{"$f":"PROPER(IF(Table1[[#This Row],[नाम]]=\"\",\"\",Table1[[#This Row],[नाम]]))","v":""},{"$nulls":8},{"$f":"SUM(Table2[[#This Row],[मार्च मूल वेतन]:[अन्य 3]])","v":0}]
[{"$f":"IF(Table2[[#This Row],[नाम]]=\"\",\"\",ROWS($A$1:A294))","v":""},{"$f":"PROPER(IF(Table1[[#This Row],[नाम]]=\"\",\"\",Table1[[#This Row],[नाम]]))","v":""},{"$nulls":8},{"$f":"SUM(Table2[[#This Row],[मार्च मूल वेतन]:[अन्य 3]])","v":0}]
[{"$f":"IF(Table2[[#This Row],[नाम]]=\"\",\"\",ROWS($A$1:A295))","v":""},{"$f":"PROPER(IF(Table1[[#This Row],[नाम]]=\"\",\"\",Table1[[#This Row],[नाम]]))","v":""},{"$nulls":8},{"$f":"SUM(Table2[[#This Row],[मार्च मूल वेतन]:[अन्य 3]])","v":0}]
[{"$f":"IF(Table2[[#This Row],[नाम]]=\"\",\"\",ROWS($A$1:A296))","v":""},{"$f":"PROPER(IF(Table1[[#This Row],[नाम]]=\"\",\"\",Table1[[#This Row],[नाम]]))","v":""},{"$nulls":8},{"$f":"SUM(Table2[[#This Row],[मार्च मूल वेतन]:[अन्य 3]])","v":0}]

{"sheet":"Deductions","index":4,"n_rows":299,"n_cols":15,"rows_kept":299,"merged":[[0,0,0,14],[1,0,1,14]]}
[{"$f":"'Emp. Data'!$A$1","v":"Government Senior Secondary School, Rooppura"}]
["Deductions Detail"]
["क्र.सं.","नाम","GPF","GPF Loan","SI","SI Loan","ITAX","RPMF","LIC","CM CORONA","GIS","अन्य 1","अन्य 2","अन्य 3","योग (ब)"]
[{"$f":"IF(Table3[[#This Row],[नाम]]=\"\",\"\",ROWS($A$1:A1))","v":1},{"$f":"PROPER(IF(Table1[[#This Row],[नाम]]=\"\",\"\",Table1[[#This Row],[नाम]]))","v":"Aditya Jakhad"},0,0,3000,0,0,0,0,0,220,0,0,0,{"$f":"SUM(Table3[[#This Row],[GPF]:[अन्य 3]])","v":3220}]
[{"$f":"IF(Table3[[#This Row],[नाम]]=\"\",\"\",ROWS($A$1:A2))","v":2},{"$f":"PROPER(IF(Table1[[#This Row],[नाम]]=\"\",\"\",Table1[[#This Row],[नाम]]))","v":"Ashwini Kumar"},0,0,3000,0,0,0,0,0,220,0,0,0,{"$f":"SUM(Table3[[#This Row],[GPF]:[अन्य 3]])","v":3220}]
[{"$f":"IF(Table3[[#This Row],[नाम]]=\"\",\"\",ROWS($A$1:A3))","v":3},{"$f":"PROPER(IF(Table1[[#This Row],[नाम]]=\"\",\"\",Table1[[#This Row],[नाम]]))","v":"Banwari"},0,0,3000,0,0,0,0,0,220,0,0,0,{"$f":"SUM(Table3[[#This Row],[GPF]:[अन्य 3]])","v":3220}]
[{"$f":"IF(Table3[[#This Row],[नाम]]=\"\",\"\",ROWS($A$1:A4))","v":4},{"$f":"PROPER(IF(Table1[[#This Row],[नाम]]=\"\",\"\",Table1[[#This Row],[नाम]]))","v":"Chetan Ram Riyar"},{"$nulls":8},220,{"$nulls":3},{"$f":"SUM(Table3[[#This Row],[GPF]:[अन्य 3]])","v":220}]
[{"$f":"IF(Table3[[#This Row],[नाम]]=\"\",\"\",ROWS($A$1:A5))","v":5},{"$f":"PROPER(IF(Table1[[#This Row],[नाम]]=\"\",\"\",Table1[[#This Row],[नाम]]))","v":"Chhotoo Singh"},{"$nulls":8},220,{"$nulls":3},{"$f":"SUM(Table3[[#This Row],[GPF]:[अन्य 3]])","v":220}]
[{"$f":"IF(Table3[[#This Row],[नाम]]=\"\",\"\",ROWS($A$1:A6))","v":6},{"$f":"PROPER(IF(Table1[[#This Row],[नाम]]=\"\",\"\",Table1[[#This Row],[नाम]]))","v":"Hemlata Sharma"},{"$nulls":8},220,{"$nulls":3},{"$f":"SUM(Table3[[#This Row],[GPF]:[अन्य 3]])","v":220}]
[{"$f":"IF(Table3[[#This Row],[नाम]]=\"\",\"\",ROWS($A$1:A7))","v":7},{"$f":"PROPER(IF(Table1[[#This Row],[नाम]]=\"\",\"\",Table1[[#This Row],[नाम]]))","v":"Kamla Barupal"},{"$nulls":8},220,{"$nulls":3},{"$f":"SUM(Table3[[#This Row],[GPF]:[अन्य 3]])","v":220}]
[{"$f":"IF(Table3[[#This Row],[नाम]]=\"\",\"\",ROWS($A$1:A8))","v":8},{"$f":"PROPER(IF(Table1[[#This Row],[नाम]]=\"\",\"\",Table1[[#This Row],[नाम]]))","v":"Kamla Sesma"},{"$nulls":8},220,{"$nulls":3},{"$f":"SUM(Table3[[#This Row],[GPF]:[अन्य 3]])","v":220}]
[{"$f":"IF(Table3[[#This Row],[नाम]]=\"\",\"\",ROWS($A$1:A9))","v":9},{"$f":"PROPER(IF(Table1[[#This Row],[नाम]]=\"\",\"\",Table1[[#This Row],[नाम]]))","v":"Pramod Kanwar"},{"$nulls":8},220,{"$nulls":3},{"$f":"SUM(Table3[[#This Row],[GPF]:[अन्य 3]])","v":220}]
[{"$f":"IF(Table3[[#This Row],[नाम]]=\"\",\"\",ROWS($A$1:A10))","v":10},{"$f":"PROPER(IF(Table1[[#This Row],[नाम]]=\"\",\"\",Table1[[#This Row],[नाम]]))","v":"Rajkumari Jhhala"},{"$nulls":8},220,{"$nulls":3},{"$f":"SUM(Table3[[#This Row],[GPF]:[अन्य 3]])","v":220}]
[{"$f":"IF(Table3[[#This Row],[नाम]]=\"\",\"\",ROWS($A$1:A11))","v":11},{"$f":"PROPER(IF(Table1[[#This Row],[नाम]]=\"\",\"\",Table1[[#This Row],[नाम]]))","v":"Rameshwar Lal"},{"$nulls":8},220,{"$nulls":3},{"$f":"SUM(Table3[[#This Row],[GPF]:[अन्य 3]])","v":220}]
[{"$f":"IF(Table3[[#This Row],[नाम]]=\"\",\"\",ROWS($A$1:A12))","v":12},{"$f":"PROPER(IF(Table1[[#This Row],[नाम]]=\"\",\"\",Table1[[#This Row],[नाम]]))","v":"Randheer Singh Shekhawat"},{"$nulls":8},220,{"$nulls":3},{"$f":"SUM(Table3[[#This Row],[GPF]:[अन्य 3]])","v":220}]
[{"$f":"IF(Table3[[#This Row],[नाम]]=\"\",\"\",ROWS($A$1:A13))","v":13},{"$f":"PROPER(IF(Table1[[#This Row],[नाम]]=\"\",\"\",Table1[[#This Row],[नाम]]))","v":"Santosh Mohanpuriya"},{"$nulls":8},220,{"$nulls":3},{"$f":"SUM(Table3[[#This Row],[GPF]:[अन्य 3]])","v":220}]
[{"$f":"IF(Table3[[#This Row],[नाम]]=\"\",\"\",ROWS($A$1:A14))","v":14},{"$f":"PROPER(IF(Table1[[#This Row],[नाम]]=\"\",\"\",Table1[[#This Row],[नाम]]))","v":"Saroj Sunariwal"},{"$nulls":8},220,{"$nulls":3},{"$f":"SUM(Table3[[#This Row],[GPF]:[अन्य 3]])","v":220}]
[{"$f":"IF(Table3[[#This Row],[नाम]]=\"\",\"\",ROWS($A$1:A15))","v":15},{"$f":"PROPER(IF(Table1[[#This Row],[नाम]]=\"\",\"\",Table1[[#This Row],[नाम]]))","v":"Sita Ram Balai"},{"$nulls":8},220,{"$nulls":3},{"$f":"SUM(Table3[[#This Row],[GPF]:[अन्य 3]])","v":220}]
[{"$f":"IF(Table3[[#This Row],[नाम]]=\"\",\"\",ROWS($A$1:A16))","v":16},{"$f":"PROPER(IF(Table1[[#This Row],[नाम]]=\"\",\"\",Table1[[#This Row],[नाम]]))","v":"Sukha Ram Muhal"},{"$nulls":8},220,{"$nulls":3},{"$f":"SUM(Table3[[#This Row],[GPF]:[अन्य 3]])","v":220}]
[{"$f":"IF(Table3[[#This Row],[नाम]]=\"\",\"\",ROWS($A$1:A17))","v":""},{"$f":"PROPER(IF(Table1[[#This Row],[नाम]]=\"\",\"\",Table1[[#This Row],[नाम]]))","v":""},{"$nulls":8},220,{"$nulls":3},{"$f":"SUM(Table3[[#This Row],[GPF]:[अन्य 3]])","v":220}]
[{"$f":"IF(Table3[[#This Row],[नाम]]=\"\",\"\",ROWS($A$1:A18))","v":""},{"$f":"PROPER(IF(Table1[[#This Row],[नाम]]=\"\",\"\",Table1[[#This Row],[नाम]]))","v":""},{"$nulls":8},220,{"$nulls":3},{"$f":"SUM(Table3[[#This Row],[GPF]:[अन्य 3]])","v":220}]
[{"$f":"IF(Table3[[#This Row],[नाम]]=\"\",\"\",ROWS($A$1:A19))","v":""},{"$f":"PROPER(IF(Table1[[#This Row],[नाम]]=\"\",\"\",Table1[[#This Row],[नाम]]))","v":""},{"$nulls":8},220,{"$nulls":3},{"$f":"SUM(Table3[[#This Row],[GPF]:[अन्य 3]])","v":220}]
[{"$f":"IF(Table3[[#This Row],[नाम]]=\"\",\"\",ROWS($A$1:A20))","v":""},{"$f":"PROPER(IF(Table1[[#This Row],[नाम]]=\"\",\"\",Table1[[#This Row],[नाम]]))","v":""},{"$nulls":8},220,{"$nulls":3},{"$f":"SUM(Table3[[#This Row],[GPF]:[अन्य 3]])","v":220}]
[{"$f":"IF(Table3[[#This Row],[नाम]]=\"\",\"\",ROWS($A$1:A21))","v":""},{"$f":"PROPER(IF(Table1[[#This Row],[नाम]]=\"\",\"\",Table1[[#This Row],[नाम]]))","v":""},{"$nulls":8},220,{"$nulls":3},{"$f":"SUM(Table3[[#This Row],[GPF]:[अन्य 3]])","v":220}]
[{"$f":"IF(Table3[[#This Row],[नाम]]=\"\",\"\",ROWS($A$1:A22))","v":""},{"$f":"PROPER(IF(Table1[[#This Row],[नाम]]=\"\",\"\",Table1[[#This Row],[नाम]]))","v":""},{"$nulls":8},220,{"$nulls":3},{"$f":"SUM(Table3[[#This Row],[GPF]:[अन्य 3]])","v":220}]
[{"$f":"IF(Table3[[#This Row],[नाम]]=\"\",\"\",ROWS($A$1:A23))","v":""},{"$f":"PROPER(IF(Table1[[#This Row],[नाम]]=\"\",\"\",Table1[[#This Row],[नाम]]))","v":""},{"$nulls":8},220,{"$nulls":3},{"$f":"SUM(Table3[[#This Row],[GPF]:[अन्य 3]])","v":220}]
[{"$f":"IF(Table3[[#This Row],[नाम]]=\"\",\"\",ROWS($A$1:A24))","v":""},{"$f":"PROPER(IF(Table1[[#This Row],[नाम]]=\"\",\"\",Table1[[#This Row],[नाम]]))","v":""},{"$nulls":8},220,{"$nulls":3},{"$f":"SUM(Table3[[#This Row],[GPF]:[अन्य 3]])","v":220}]
[{"$f":"IF(Table3[[#This Row],[नाम]]=\"\",\"\",ROWS($A$1:A25))","v":""},{"$f":"PROPER(IF(Table1[[#This Row],[नाम]]=\"\",\"\",Table1[[#This Row],[नाम]]))","v":""},{"$nulls":8},220,{"$nulls":3},{"$f":"SUM(Table3[[#This Row],[GPF]:[अन्य 3]])","v":220}]
[{"$f":"IF(Table3[[#This Row],[नाम]]=\"\",\"\",ROWS($A$1:A26))","v":""},{"$f":"PROPER(IF(Table1[[#This Row],[नाम]]=\"\",\"\",Table1[[#This Row],[नाम]]))","v":""},{"$nulls":8},220,{"$nulls":3},{"$f":"SUM(Table3[[#This Row],[GPF]:[अन्य 3]])","v":220}]
[{"$f":"IF(Table3[[#This Row],[नाम]]=\"\",\"\",ROWS($A$1:A27))","v":""},{"$f":"PROPER(IF(Table1[[#This Row],[नाम]]=\"\",\"\",Table1[[#This Row],[नाम]]))","v":""},{"$nulls":8},220,{"$nulls":3},{"$f":"SUM(Table3[[#This Row],[GPF]:[अन्य 3]])","v":220}]
[{"$f":"IF(Table3[[#This Row],[नाम]]=\"\",\"\",ROWS($A$1:A28))","v":""},{"$f":"PROPER(IF(Table1[[#This Row],[नाम]]=\"\",\"\",Table1[[#This Row],[नाम]]))","v":""},{"$nulls":8},220,{"$nulls":3},{"$f":"SUM(Table3[[#This Row],[GPF]:[अन्य 3]])","v":220}]
[{"$f":"IF(Table3[[#This Row],[नाम]]=\"\",\"\",ROWS($A$1:A29))","v":""},{"$f":"PROPER(IF(Table1[[#This Row],[नाम]]=\"\",\"\",Table1[[#This Row],[नाम]]))","v":""},{"$nulls":8},220,{"$nulls":3},{"$f":"SUM(Table3[[#This Row],[GPF]:[अन्य 3]])","v":220}]
[{"$f":"IF(Table3[[#This Row],[नाम]]=\"\",\"\",ROWS($A$1:A30))","v":""},{"$f":"PROPER(IF(Table1[[#This Row],[नाम]]=\"\",\"\",Table1[[#This Row],[नाम]]))","v":""},{"$nulls":8},220,{"$nulls":3},{"$f":"SUM(Table3[[#This Row],[GPF]:[अन्य 3]])","v":220}]
[{"$f":"IF(Table3[[#This Row],[नाम]]=\"\",\"\",ROWS($A$1:A31))","v":""},{"$f":"PROPER(IF(Table1[[#This Row],[नाम]]=\"\",\"\",Table1[[#This Row],[नाम]]))","v":""},{"$nulls":8},220,{"$nulls":3},{"$f":"SUM(Table3[[#This Row],[GPF]:[अन्य 3]])","v":220}]
[{"$f":"IF(Table3[[#This Row],[नाम]]=\"\",\"\",ROWS($A$1:A32))","v":""},{"$f":"PROPER(IF(Table1[[#This Row],[नाम]]=\"\",\"\",Table1[[#This Row],[नाम]]))","v":""},{"$nulls":8},220,{"$nulls":3},{"$f":"SUM(Table3[[#This Row],[GPF]:[अन्य 3]])","v":220}]
[{"$f":"IF(Table3[[#This Row],[नाम]]=\"\",\"\",ROWS($A$1:A33))","v":""},{"$f":"PROPER(IF(Table1[[#This Row],[नाम]]=\"\",\"\",Table1[[#This Row],[नाम]]))","v":""},{"$nulls":8},220,{"$nulls":3},{"$f":"SUM(Table3[[#This Row],[GPF]:[अन्य 3]])","v":220}]
[{"$f":"IF(Table3[[#This Row],[नाम]]=\"\",\"\",ROWS($A$1:A34))","v":""},{"$f":"PROPER(IF(Table1[[#This Row],[नाम]]=\"\",\"\",Table1[[#This Row],[नाम]]))","v":""},{"$nulls":8},220,{"$nulls":3},{"$f":"SUM(Table3[[#This Row],[GPF]:[अन्य 3]])","v":220}]
[{"$f":"IF(Table3[[#This Row],[नाम]]=\"\",\"\",ROWS($A$1:A35))","v":""},{"$f":"PROPER(IF(Table1[[#This Row],[नाम]]=\"\",\"\",Table1[[#This Row],[नाम]]))","v":""},{"$nulls":8},220,{"$nulls":3},{"$f":"SUM(Table3[[#This Row],[GPF]:[अन्य 3]])","v":220}]
[{"$f":"IF(Table3[[#This Row],[नाम]]=\"\",\"\",ROWS($A$1:A36))","v":""},{"$f":"PROPER(IF(Table1[[#This Row],[नाम]]=\"\",\"\",Table1[[#This Row],[नाम]]))","v":""},{"$nulls":8},220,{"$nulls":3},{"$f":"SUM(Table3[[#This Row],[GPF]:[अन्य 3]])","v":220}]
[{"$f":"IF(Table3[[#This Row],[नाम]]=\"\",\"\",ROWS($A$1:A37))","v":""},{"$f":"PROPER(IF(Table1[[#This Row],[नाम]]=\"\",\"\",Table1[[#This Row],[नाम]]))","v":""},{"$nulls":8},220,{"$nulls":3},{"$f":"SUM(Table3[[#This Row],[GPF]:[अन्य 3]])","v":220}]
[{"$f":"IF(Table3[[#This Row],[नाम]]=\"\",\"\",ROWS($A$1:A38))","v":""},{"$f":"PROPER(IF(Table1[[#This Row],[नाम]]=\"\",\"\",Table1[[#This Row],[नाम]]))","v":""},{"$nulls":8},220,{"$nulls":3},{"$f":"SUM(Table3[[#This Row],[GPF]:[अन्य 3]])","v":220}]
[{"$f":"IF(Table3[[#This Row],[नाम]]=\"\",\"\",ROWS($A$1:A39))","v":""},{"$f":"PROPER(IF(Table1[[#This Row],[नाम]]=\"\",\"\",Table1[[#This Row],[नाम]]))","v":""},{"$nulls":8},220,{"$nulls":3},{"$f":"SUM(Table3[[#This Row],[GPF]:[अन्य 3]])","v":220}]
[{"$f":"IF(Table3[[#This Row],[नाम]]=\"\",\"\",ROWS($A$1:A40))","v":""},{"$f":"PROPER(IF(Table1[[#This Row],[नाम]]=\"\",\"\",Table1[[#This Row],[नाम]]))","v":""},{"$nulls":8},220,{"$nulls":3},{"$f":"SUM(Table3[[#This Row],[GPF]:[अन्य 3]])","v":220}]
[{"$f":"IF(Table3[[#This Row],[नाम]]=\"\",\"\",ROWS($A$1:A41))","v":""},{"$f":"PROPER(IF(Table1[[#This Row],[नाम]]=\"\",\"\",Table1[[#This Row],[नाम]]))","v":""},{"$nulls":8},220,{"$nulls":3},{"$f":"SUM(Table3[[#This Row],[GPF]:[अन्य 3]])","v":220}]
[{"$f":"IF(Table3[[#This Row],[नाम]]=\"\",\"\",ROWS($A$1:A42))","v":""},{"$f":"PROPER(IF(Table1[[#This Row],[नाम]]=\"\",\"\",Table1[[#This Row],[नाम]]))","v":""},{"$nulls":8},220,{"$nulls":3},{"$f":"SUM(Table3[[#This Row],[GPF]:[अन्य 3]])","v":220}]
[{"$f":"IF(Table3[[#This Row],[नाम]]=\"\",\"\",ROWS($A$1:A43))","v":""},{"$f":"PROPER(IF(Table1[[#This Row],[नाम]]=\"\",\"\",Table1[[#This Row],[नाम]]))","v":""},{"$nulls":8},220,{"$nulls":3},{"$f":"SUM(Table3[[#This Row],[GPF]:[अन्य 3]])","v":220}]
[{"$f":"IF(Table3[[#This Row],[नाम]]=\"\",\"\",ROWS($A$1:A44))","v":""},{"$f":"PROPER(IF(Table1[[#This Row],[नाम]]=\"\",\"\",Table1[[#This Row],[नाम]]))","v":""},{"$nulls":8},220,{"$nulls":3},{"$f":"SUM(Table3[[#This Row],[GPF]:[अन्य 3]])","v":220}]
[{"$f":"IF(Table3[[#This Row],[नाम]]=\"\",\"\",ROWS($A$1:A45))","v":""},{"$f":"PROPER(IF(Table1[[#This Row],[नाम]]=\"\",\"\",Table1[[#This Row],[नाम]]))","v":""},{"$nulls":8},220,{"$nulls":3},{"$f":"SUM(Table3[[#This Row],[GPF]:[अन्य 3]])","v":220}]
[{"$f":"IF(Table3[[#This Row],[नाम]]=\"\",\"\",ROWS($A$1:A46))","v":""},{"$f":"PROPER(IF(Table1[[#This Row],[नाम]]=\"\",\"\",Table1[[#This Row],[नाम]]))","v":""},{"$nulls":8},220,{"$nulls":3},{"$f":"SUM(Table3[[#This Row],[GPF]:[अन्य 3]])","v":220}]
[{"$f":"IF(Table3[[#This Row],[नाम]]=\"\",\"\",ROWS($A$1:A47))","v":""},{"$f":"PROPER(IF(Table1[[#This Row],[नाम]]=\"\",\"\",Table1[[#This Row],[नाम]]))","v":""},{"$nulls":8},220,{"$nulls":3},{"$f":"SUM(Table3[[#This Row],[GPF]:[अन्य 3]])","v":220}]
[{"$f":"IF(Table3[[#This Row],[नाम]]=\"\",\"\",ROWS($A$1:A48))","v":""},{"$f":"PROPER(IF(Table1[[#This Row],[नाम]]=\"\",\"\",Table1[[#This Row],[नाम]]))","v":""},{"$nulls":8},220,{"$nulls":3},{"$f":"SUM(Table3[[#This Row],[GPF]:[अन्य 3]])","v":220}]
[{"$f":"IF(Table3[[#This Row],[नाम]]=\"\",\"\",ROWS($A$1:A49))","v":""},{"$f":"PROPER(IF(Table1[[#This Row],[नाम]]=\"\",\"\",Table1[[#This Row],[नाम]]))","v":""},{"$nulls":8},220,{"$nulls":3},{"$f":"SUM(Table3[[#This Row],[GPF]:[अन्य 3]])","v":220}]
[{"$f":"IF(Table3[[#This Row],[नाम]]=\"\",\"\",ROWS($A$1:A50))","v":""},{"$f":"PROPER(IF(Table1[[#This Row],[नाम]]=\"\",\"\",Table1[[#This Row],[नाम]]))","v":""},{"$nulls":8},220,{"$nulls":3},{"$f":"SUM(Table3[[#This Row],[GPF]:[अन्य 3]])","v":220}]
[{"$f":"IF(Table3[[#This Row],[नाम]]=\"\",\"\",ROWS($A$1:A51))","v":""},{"$f":"PROPER(IF(Table1[[#This Row],[नाम]]=\"\",\"\",Table1[[#This Row],[नाम]]))","v":""},{"$nulls":8},220,{"$nulls":3},{"$f":"SUM(Table3[[#This Row],[GPF]:[अन्य 3]])","v":220}]
[{"$f":"IF(Table3[[#This Row],[नाम]]=\"\",\"\",ROWS($A$1:A52))","v":""},{"$f":"PROPER(IF(Table1[[#This Row],[नाम]]=\"\",\"\",Table1[[#This Row],[नाम]]))","v":""},{"$nulls":8},220,{"$nulls":3},{"$f":"SUM(Table3[[#This Row],[GPF]:[अन्य 3]])","v":220}]
[{"$f":"IF(Table3[[#This Row],[नाम]]=\"\",\"\",ROWS($A$1:A53))","v":""},{"$f":"PROPER(IF(Table1[[#This Row],[नाम]]=\"\",\"\",Table1[[#This Row],[नाम]]))","v":""},{"$nulls":8},220,{"$nulls":3},{"$f":"SUM(Table3[[#This Row],[GPF]:[अन्य 3]])","v":220}]
[{"$f":"IF(Table3[[#This Row],[नाम]]=\"\",\"\",ROWS($A$1:A54))","v":""},{"$f":"PROPER(IF(Table1[[#This Row],[नाम]]=\"\",\"\",Table1[[#This Row],[नाम]]))","v":""},{"$nulls":8},220,{"$nulls":3},{"$f":"SUM(Table3[[#This Row],[GPF]:[अन्य 3]])","v":220}]
[{"$f":"IF(Table3[[#This Row],[नाम]]=\"\",\"\",ROWS($A$1:A55))","v":""},{"$f":"PROPER(IF(Table1[[#This Row],[नाम]]=\"\",\"\",Table1[[#This Row],[नाम]]))","v":""},{"$nulls":8},220,{"$nulls":3},{"$f":"SUM(Table3[[#This Row],[GPF]:[अन्य 3]])","v":220}]
[{"$f":"IF(Table3[[#This Row],[नाम]]=\"\",\"\",ROWS($A$1:A56))","v":""},{"$f":"PROPER(IF(Table1[[#This Row],[नाम]]=\"\",\"\",Table1[[#This Row],[नाम]]))","v":""},{"$nulls":8},220,{"$nulls":3},{"$f":"SUM(Table3[[#This Row],[GPF]:[अन्य 3]])","v":220}]
[{"$f":"IF(Table3[[#This Row],[नाम]]=\"\",\"\",ROWS($A$1:A57))","v":""},{"$f":"PROPER(IF(Table1[[#This Row],[नाम]]=\"\",\"\",Table1[[#This Row],[नाम]]))","v":""},{"$nulls":8},220,{"$nulls":3},{"$f":"SUM(Table3[[#This Row],[GPF]:[अन्य 3]])","v":220}]
[{"$f":"IF(Table3[[#This Row],[नाम]]=\"\",\"\",ROWS($A$1:A58))","v":""},{"$f":"PROPER(IF(Table1[[#This Row],[नाम]]=\"\",\"\",Table1[[#This Row],[नाम]]))","v":""},{"$nulls":8},220,{"$nulls":3},{"$f":"SUM(Table3[[#This Row],[GPF]:[अन्य 3]])","v":220}]
[{"$f":"IF(Table3[[#This Row],[नाम]]=\"\",\"\",ROWS($A$1:A59))","v":""},{"$f":"PROPER(IF(Table1[[#This Row],[नाम]]=\"\",\"\",Table1[[#This Row],[नाम]]))","v":""},{"$nulls":8},220,{"$nulls":3},{"$f":"SUM(Table3[[#This Row],[GPF]:[अन्य 3]])","v":220}]
[{"$f":"IF(Table3[[#This Row],[नाम]]=\"\",\"\",ROWS($A$1:A60))","v":""},{"$f":"PROPER(IF(Table1[[#This Row],[नाम]]=\"\",\"\",Table1[[#This Row],[नाम]]))","v":""},{"$nulls":8},220,{"$nulls":3},{"$f":"SUM(Table3[[#This Row],[GPF]:[अन्य 3]])","v":220}]
[{"$f":"IF(Table3[[#This Row],[नाम]]=\"\",\"\",ROWS($A$1:A61))","v":""},{"$f":"PROPER(IF(Table1[[#This Row],[नाम]]=\"\",\"\",Table1[[#This Row],[नाम]]))","v":""},{"$nulls":8},220,{"$nulls":3},{"$f":"SUM(Table3[[#This Row],[GPF]:[अन्य 3]])","v":220}]
[{"$f":"IF(Table3[[#This Row],[नाम]]=\"\",\"\",ROWS($A$1:A62))","v":""},{"$f":"PROPER(IF(Table1[[#This Row],[नाम]]=\"\",\"\",Table1[[#This Row],[नाम]]))","v":""},{"$nulls":8},220,{"$nulls":3},{"$f":"SUM(Table3[[#This Row],[GPF]:[अन्य 3]])","v":220}]
[{"$f":"IF(Table3[[#This Row],[नाम]]=\"\",\"\",ROWS($A$1:A63))","v":""},{"$f":"PROPER(IF(Table1[[#This Row],[नाम]]=\"\",\"\",Table1[[#This Row],[नाम]]))","v":""},{"$nulls":8},220,{"$nulls":3},{"$f":"SUM(Table3[[#This Row],[GPF]:[अन्य 3]])","v":220}]
[{"$f":"IF(Table3[[#This Row],[नाम]]=\"\",\"\",ROWS($A$1:A64))","v":""},{"$f":"PROPER(IF(Table1[[#This Row],[नाम]]=\"\",\"\",Table1[[#This Row],[नाम]]))","v":""},{"$nulls":8},220,{"$nulls":3},{"$f":"SUM(Table3[[#This Row],[GPF]:[अन्य 3]])","v":220}]
[{"$f":"IF(Table3[[#This Row],[नाम]]=\"\",\"\",ROWS($A$1:A65))","v":""},{"$f":"PROPER(IF(Table1[[#This Row],[नाम]]=\"\",\"\",Table1[[#This Row],[नाम]]))","v":""},{"$nulls":8},220,{"$nulls":3},{"$f":"SUM(Table3[[#This Row],[GPF]:[अन्य 3]])","v":220}]
[{"$f":"IF(Table3[[#This Row],[नाम]]=\"\",\"\",ROWS($A$1:A66))","v":""},{"$f":"PROPER(IF(Table1[[#This Row],[नाम]]=\"\",\"\",Table1[[#This Row],[नाम]]))","v":""},{"$nulls":8},220,{"$nulls":3},{"$f":"SUM(Table3[[#This Row],[GPF]:[अन्य 3]])","v":220}]
[{"$f":"IF(Table3[[#This Row],[नाम]]=\"\",\"\",ROWS($A$1:A67))","v":""},{"$f":"PROPER(IF(Table1[[#This Row],[नाम]]=\"\",\"\",Table1[[#This Row],[नाम]]))","v":""},{"$nulls":8},220,{"$nulls":3},{"$f":"SUM(Table3[[#This Row],[GPF]:[अन्य 3]])","v":220}]
[{"$f":"IF(Table3[[#This Row],[नाम]]=\"\",\"\",ROWS($A$1:A68))","v":""},{"$f":"PROPER(IF(Table1[[#This Row],[नाम]]=\"\",\"\",Table1[[#This Row],[नाम]]))","v":""},{"$nulls":8},220,{"$nulls":3},{"$f":"SUM(Table3[[#This Row],[GPF]:[अन्य 3]])","v":220}]
[{"$f":"IF(Table3[[#This Row],[नाम]]=\"\",\"\",ROWS($A$1:A69))","v":""},{"$f":"PROPER(IF(Table1[[#This Row],[नाम]]=\"\",\"\",Table1[[#This Row],[नाम]]))","v":""},{"$nulls":8},220,{"$nulls":3},{"$f":"SUM(Table3[[#This Row],[GPF]:[अन्य 3]])","v":220}]
[{"$f":"IF(Table3[[#This Row],[नाम]]=\"\",\"\",ROWS($A$1:A70))","v":""},{"$f":"PROPER(IF(Table1[[#This Row],[नाम]]=\"\",\"\",Table1[[#This Row],[नाम]]))","v":""},{"$nulls":8},220,{"$nulls":3},{"$f":"SUM(Table3[[#This Row],[GPF]:[अन्य 3]])","v":220}]
[{"$f":"IF(Table3[[#This Row],[नाम]]=\"\",\"\",ROWS($A$1:A71))","v":""},{"$f":"PROPER(IF(Table1[[#This Row],[नाम]]=\"\",\"\",Table1[[#This Row],[नाम]]))","v":""},{"$nulls":8},220,{"$nulls":3},{"$f":"SUM(Table3[[#This Row],[GPF]:[अन्य 3]])","v":220}]
[{"$f":"IF(Table3[[#This Row],[नाम]]=\"\",\"\",ROWS($A$1:A72))","v":""},{"$f":"PROPER(IF(Table1[[#This Row],[नाम]]=\"\",\"\",Table1[[#This Row],[नाम]]))","v":""},{"$nulls":8},220,{"$nulls":3},{"$f":"SUM(Table3[[#This Row],[GPF]:[अन्य 3]])","v":220}]
[{"$f":"IF(Table3[[#This Row],[नाम]]=\"\",\"\",ROWS($A$1:A73))","v":""},{"$f":"PROPER(IF(Table1[[#This Row],[नाम]]=\"\",\"\",Table1[[#This Row],[नाम]]))","v":""},{"$nulls":8},220,{"$nulls":3},{"$f":"SUM(Table3[[#This Row],[GPF]:[अन्य 3]])","v":220}]
[{"$f":"IF(Table3[[#This Row],[नाम]]=\"\",\"\",ROWS($A$1:A74))","v":""},{"$f":"PROPER(IF(Table1[[#This Row],[नाम]]=\"\",\"\",Table1[[#This Row],[नाम]]))","v":""},{"$nulls":8},220,{"$nulls":3},{"$f":"SUM(Table3[[#This Row],[GPF]:[अन्य 3]])","v":220}]
[{"$f":"IF(Table3[[#This Row],[नाम]]=\"\",\"\",ROWS($A$1:A75))","v":""},{"$f":"PROPER(IF(Table1[[#This Row],[नाम]]=\"\",\"\",Table1[[#This Row],[नाम]]))","v":""},{"$nulls":8},220,{"$nulls":3},{"$f":"SUM(Table3[[#This Row],[GPF]:[अन्य 3]])","v":220}]
[{"$f":"IF(Table3[[#This Row],[नाम]]=\"\",\"\",ROWS($A$1:A76))","v":""},{"$f":"PROPER(IF(Table1[[#This Row],[नाम]]=\"\",\"\",Table1[[#This Row],[नाम]]))","v":""},{"$nulls":8},220,{"$nulls":3},{"$f":"SUM(Table3[[#This Row],[GPF]:[अन्य 3]])","v":220}]
[{"$f":"IF(Table3[[#This Row],[नाम]]=\"\",\"\",ROWS($A$1:A77))","v":""},{"$f":"PROPER(IF(Table1[[#This Row],[नाम]]=\"\",\"\",Table1[[#This Row],[नाम]]))","v":""},{"$nulls":8},220,{"$nulls":3},{"$f":"SUM(Table3[[#This Row],[GPF]:[अन्य 3]])","v":220}]
[{"$f":"IF(Table3[[#This Row],[नाम]]=\"\",\"\",ROWS($A$1:A78))","v":""},{"$f":"PROPER(IF(Table1[[#This Row],[नाम]]=\"\",\"\",Table1[[#This Row],[नाम]]))","v":""},{"$nulls":8},220,{"$nulls":3},{"$f":"SUM(Table3[[#This Row],[GPF]:[अन्य 3]])","v":220}]
[{"$f":"IF(Table3[[#This Row],[नाम]]=\"\",\"\",ROWS($A$1:A79))","v":""},{"$f":"PROPER(IF(Table1[[#This Row],[नाम]]=\"\",\"\",Table1[[#This Row],[नाम]]))","v":""},{"$nulls":8},220,{"$nulls":3},{"$f":"SUM(Table3[[#This Row],[GPF]:[अन्य 3]])","v":220}]
[{"$f":"IF(Table3[[#This Row],[नाम]]=\"\",\"\",ROWS($A$1:A80))","v":""},{"$f":"PROPER(IF(Table1[[#This Row],[नाम]]=\"\",\"\",Table1[[#This Row],[नाम]]))","v":""},{"$nulls":8},220,{"$nulls":3},{"$f":"SUM(Table3[[#This Row],[GPF]:[अन्य 3]])","v":220}]
[{"$f":"IF(Table3[[#This Row],[नाम]]=\"\",\"\",ROWS($A$1:A81))","v":""},{"$f":"PROPER(IF(Table1[[#This Row],[नाम]]=\"\",\"\",Table1[[#This Row],[नाम]]))","v":""},{"$nulls":8},220,{"$nulls":3},{"$f":"SUM(Table3[[#This Row],[GPF]:[अन्य 3]])","v":220}]
[{"$f":"IF(Table3[[#This Row],[नाम]]=\"\",\"\",ROWS($A$1:A82))","v":""},{"$f":"PROPER(IF(Table1[[#This Row],[नाम]]=\"\",\"\",Table1[[#This Row],[नाम]]))","v":""},{"$nulls":8},220,{"$nulls":3},{"$f":"SUM(Table3[[#This Row],[GPF]:[अन्य 3]])","v":220}]
[{"$f":"IF(Table3[[#This Row],[नाम]]=\"\",\"\",ROWS($A$1:A83))","v":""},{"$f":"PROPER(IF(Table1[[#This Row],[नाम]]=\"\",\"\",Table1[[#This Row],[नाम]]))","v":""},{"$nulls":8},220,{"$nulls":3},{"$f":"SUM(Table3[[#This Row],[GPF]:[अन्य 3]])","v":220}]
[{"$f":"IF(Table3[[#This Row],[नाम]]=\"\",\"\",ROWS($A$1:A84))","v":""},{"$f":"PROPER(IF(Table1[[#This Row],[नाम]]=\"\",\"\",Table1[[#This Row],[नाम]]))","v":""},{"$nulls":8},220,{"$nulls":3},{"$f":"SUM(Table3[[#This Row],[GPF]:[अन्य 3]])","v":220}]
[{"$f":"IF(Table3[[#This Row],[नाम]]=\"\",\"\",ROWS($A$1:A85))","v":""},{"$f":"PROPER(IF(Table1[[#This Row],[नाम]]=\"\",\"\",Table1[[#This Row],[नाम]]))","v":""},{"$nulls":8},220,{"$nulls":3},{"$f":"SUM(Table3[[#This Row],[GPF]:[अन्य 3]])","v":220}]
[{"$f":"IF(Table3[[#This Row],[नाम]]=\"\",\"\",ROWS($A$1:A86))","v":""},{"$f":"PROPER(IF(Table1[[#This Row],[नाम]]=\"\",\"\",Table1[[#This Row],[नाम]]))","v":""},{"$nulls":8},220,{"$nulls":3},{"$f":"SUM(Table3[[#This Row],[GPF]:[अन्य 3]])","v":220}]
[{"$f":"IF(Table3[[#This Row],[नाम]]=\"\",\"\",ROWS($A$1:A87))","v":""},{"$f":"PROPER(IF(Table1[[#This Row],[नाम]]=\"\",\"\",Table1[[#This Row],[नाम]]))","v":""},{"$nulls":8},220,{"$nulls":3},{"$f":"SUM(Table3[[#This Row],[GPF]:[अन्य 3]])","v":220}]
[{"$f":"IF(Table3[[#This Row],[नाम]]=\"\",\"\",ROWS($A$1:A88))","v":""},{"$f":"PROPER(IF(Table1[[#This Row],[नाम]]=\"\",\"\",Table1[[#This Row],[नाम]]))","v":""},{"$nulls":8},220,{"$nulls":3},{"$f":"SUM(Table3[[#This Row],[GPF]:[अन्य 3]])","v":220}]
[{"$f":"IF(Table3[[#This Row],[नाम]]=\"\",\"\",ROWS($A$1:A89))","v":""},{"$f":"PROPER(IF(Table1[[#This Row],[नाम]]=\"\",\"\",Table1[[#This Row],[नाम]]))","v":""},{"$nulls":8},220,{"$nulls":3},{"$f":"SUM(Table3[[#This Row],[GPF]:[अन्य 3]])","v":220}]
[{"$f":"IF(Table3[[#This Row],[नाम]]=\"\",\"\",ROWS($A$1:A90))","v":""},{"$f":"PROPER(IF(Table1[[#This Row],[नाम]]=\"\",\"\",Table1[[#This Row],[नाम]]))","v":""},{"$nulls":8},220,{"$nulls":3},{"$f":"SUM(Table3[[#This Row],[GPF]:[अन्य 3]])","v":220}]
[{"$f":"IF(Table3[[#This Row],[नाम]]=\"\",\"\",ROWS($A$1:A91))","v":""},{"$f":"PROPER(IF(Table1[[#This Row],[नाम]]=\"\",\"\",Table1[[#This Row],[नाम]]))","v":""},{"$nulls":8},220,{"$nulls":3},{"$f":"SUM(Table3[[#This Row],[GPF]:[अन्य 3]])","v":220}]
[{"$f":"IF(Table3[[#This Row],[नाम]]=\"\",\"\",ROWS($A$1:A92))","v":""},{"$f":"PROPER(IF(Table1[[#This Row],[नाम]]=\"\",\"\",Table1[[#This Row],[नाम]]))","v":""},{"$nulls":8},220,{"$nulls":3},{"$f":"SUM(Table3[[#This Row],[GPF]:[अन्य 3]])","v":220}]
[{"$f":"IF(Table3[[#This Row],[नाम]]=\"\",\"\",ROWS($A$1:A93))","v":""},{"$f":"PROPER(IF(Table1[[#This Row],[नाम]]=\"\",\"\",Table1[[#This Row],[नाम]]))","v":""},{"$nulls":8},220,{"$nulls":3},{"$f":"SUM(Table3[[#This Row],[GPF]:[अन्य 3]])","v":220}]
[{"$f":"IF(Table3[[#This Row],[नाम]]=\"\",\"\",ROWS($A$1:A94))","v":""},{"$f":"PROPER(IF(Table1[[#This Row],[नाम]]=\"\",\"\",Table1[[#This Row],[नाम]]))","v":""},{"$nulls":8},220,{"$nulls":3},{"$f":"SUM(Table3[[#This Row],[GPF]:[अन्य 3]])","v":220}]
[{"$f":"IF(Table3[[#This Row],[नाम]]=\"\",\"\",ROWS($A$1:A95))","v":""},{"$f":"PROPER(IF(Table1[[#This Row],[नाम]]=\"\",\"\",Table1[[#This Row],[नाम]]))","v":""},{"$nulls":8},220,{"$nulls":3},{"$f":"SUM(Table3[[#This Row],[GPF]:[अन्य 3]])","v":220}]
[{"$f":"IF(Table3[[#This Row],[नाम]]=\"\",\"\",ROWS($A$1:A96))","v":""},{"$f":"PROPER(IF(Table1[[#This Row],[नाम]]=\"\",\"\",Table1[[#This Row],[नाम]]))","v":""},{"$nulls":8},220,{"$nulls":3},{"$f":"SUM(Table3[[#This Row],[GPF]:[अन्य 3]])","v":220}]
[{"$f":"IF(Table3[[#This Row],[नाम]]=\"\",\"\",ROWS($A$1:A97))","v":""},{"$f":"PROPER(IF(Table1[[#This Row],[नाम]]=\"\",\"\",Table1[[#This Row],[नाम]]))","v":""},{"$nulls":8},220,{"$nulls":3},{"$f":"SUM(Table3[[#This Row],[GPF]:[अन्य 3]])","v":220}]
[{"$f":"IF(Table3[[#This Row],[नाम]]=\"\",\"\",ROWS($A$1:A98))","v":""},{"$f":"PROPER(IF(Table1[[#This Row],[नाम]]=\"\",\"\",Table1[[#This Row],[नाम]]))","v":""},{"$nulls":8},220,{"$nulls":3},{"$f":"SUM(Table3[[#This Row],[GPF]:[अन्य 3]])","v":220}]
[{"$f":"IF(Table3[[#This Row],[नाम]]=\"\",\"\",ROWS($A$1:A99))","v":""},{"$f":"PROPER(IF(Table1[[#This Row],[नाम]]=\"\",\"\",Table1[[#This Row],[नाम]]))","v":""},{"$nulls":8},220,{"$nulls":3},{"$f":"SUM(Table3[[#This Row],[GPF]:[अन्य 3]])","v":220}]
[{"$f":"IF(Table3[[#This Row],[नाम]]=\"\",\"\",ROWS($A$1:A100))","v":""},{"$f":"PROPER(IF(Table1[[#This Row],[नाम]]=\"\",\"\",Table1[[#This Row],[नाम]]))","v":""},{"$nulls":8},220,{"$nulls":3},{"$f":"SUM(Table3[[#This Row],[GPF]:[अन्य 3]])","v":220}]
[{"$f":"IF(Table3[[#This Row],[नाम]]=\"\",\"\",ROWS($A$1:A101))","v":""},{"$f":"PROPER(IF(Table1[[#This Row],[नाम]]=\"\",\"\",Table1[[#This Row],[नाम]]))","v":""},{"$nulls":8},220,{"$nulls":3},{"$f":"SUM(Table3[[#This Row],[GPF]:[अन्य 3]])","v":220}]
[{"$f":"IF(Table3[[#This Row],[नाम]]=\"\",\"\",ROWS($A$1:A102))","v":""},{"$f":"PROPER(IF(Table1[[#This Row],[नाम]]=\"\",\"\",Table1[[#This Row],[नाम]]))","v":""},{"$nulls":8},220,{"$nulls":3},{"$f":"SUM(Table3[[#This Row],[GPF]:[अन्य 3]])","v":220}]
[{"$f":"IF(Table3[[#This Row],[नाम]]=\"\",\"\",ROWS($A$1:A103))","v":""},{"$f":"PROPER(IF(Table1[[#This Row],[नाम]]=\"\",\"\",Table1[[#This Row],[नाम]]))","v":""},{"$nulls":8},220,{"$nulls":3},{"$f":"SUM(Table3[[#This Row],[GPF]:[अन्य 3]])","v":220}]
[{"$f":"IF(Table3[[#This Row],[नाम]]=\"\",\"\",ROWS($A$1:A104))","v":""},{"$f":"PROPER(IF(Table1[[#This Row],[नाम]]=\"\",\"\",Table1[[#This Row],[नाम]]))","v":""},{"$nulls":8},220,{"$nulls":3},{"$f":"SUM(Table3[[#This Row],[GPF]:[अन्य 3]])","v":220}]
[{"$f":"IF(Table3[[#This Row],[नाम]]=\"\",\"\",ROWS($A$1:A105))","v":""},{"$f":"PROPER(IF(Table1[[#This Row],[नाम]]=\"\",\"\",Table1[[#This Row],[नाम]]))","v":""},{"$nulls":8},220,{"$nulls":3},{"$f":"SUM(Table3[[#This Row],[GPF]:[अन्य 3]])","v":220}]
[{"$f":"IF(Table3[[#This Row],[नाम]]=\"\",\"\",ROWS($A$1:A106))","v":""},{"$f":"PROPER(IF(Table1[[#This Row],[नाम]]=\"\",\"\",Table1[[#This Row],[नाम]]))","v":""},{"$nulls":8},220,{"$nulls":3},{"$f":"SUM(Table3[[#This Row],[GPF]:[अन्य 3]])","v":220}]
[{"$f":"IF(Table3[[#This Row],[नाम]]=\"\",\"\",ROWS($A$1:A107))","v":""},{"$f":"PROPER(IF(Table1[[#This Row],[नाम]]=\"\",\"\",Table1[[#This Row],[नाम]]))","v":""},{"$nulls":8},220,{"$nulls":3},{"$f":"SUM(Table3[[#This Row],[GPF]:[अन्य 3]])","v":220}]
[{"$f":"IF(Table3[[#This Row],[नाम]]=\"\",\"\",ROWS($A$1:A108))","v":""},{"$f":"PROPER(IF(Table1[[#This Row],[नाम]]=\"\",\"\",Table1[[#This Row],[नाम]]))","v":""},{"$nulls":8},220,{"$nulls":3},{"$f":"SUM(Table3[[#This Row],[GPF]:[अन्य 3]])","v":220}]
[{"$f":"IF(Table3[[#This Row],[नाम]]=\"\",\"\",ROWS($A$1:A109))","v":""},{"$f":"PROPER(IF(Table1[[#This Row],[नाम]]=\"\",\"\",Table1[[#This Row],[नाम]]))","v":""},{"$nulls":8},220,{"$nulls":3},{"$f":"SUM(Table3[[#This Row],[GPF]:[अन्य 3]])","v":220}]
[{"$f":"IF(Table3[[#This Row],[नाम]]=\"\",\"\",ROWS($A$1:A110))","v":""},{"$f":"PROPER(IF(Table1[[#This Row],[नाम]]=\"\",\"\",Table1[[#This Row],[नाम]]))","v":""},{"$nulls":8},220,{"$nulls":3},{"$f":"SUM(Table3[[#This Row],[GPF]:[अन्य 3]])","v":220}]
[{"$f":"IF(Table3[[#This Row],[नाम]]=\"\",\"\",ROWS($A$1:A111))","v":""},{"$f":"PROPER(IF(Table1[[#This Row],[नाम]]=\"\",\"\",Table1[[#This Row],[नाम]]))","v":""},{"$nulls":8},220,{"$nulls":3},{"$f":"SUM(Table3[[#This Row],[GPF]:[अन्य 3]])","v":220}]
[{"$f":"IF(Table3[[#This Row],[नाम]]=\"\",\"\",ROWS($A$1:A112))","v":""},{"$f":"PROPER(IF(Table1[[#This Row],[नाम]]=\"\",\"\",Table1[[#This Row],[नाम]]))","v":""},{"$nulls":8},220,{"$nulls":3},{"$f":"SUM(Table3[[#This Row],[GPF]:[अन्य 3]])","v":220}]
[{"$f":"IF(Table3[[#This Row],[नाम]]=\"\",\"\",ROWS($A$1:A113))","v":""},{"$f":"PROPER(IF(Table1[[#This Row],[नाम]]=\"\",\"\",Table1[[#This Row],[नाम]]))","v":""},{"$nulls":8},220,{"$nulls":3},{"$f":"SUM(Table3[[#This Row],[GPF]:[अन्य 3]])","v":220}]
[{"$f":"IF(Table3[[#This Row],[नाम]]=\"\",\"\",ROWS($A$1:A114))","v":""},{"$f":"PROPER(IF(Table1[[#This Row],[नाम]]=\"\",\"\",Table1[[#This Row],[नाम]]))","v":""},{"$nulls":8},220,{"$nulls":3},{"$f":"SUM(Table3[[#This Row],[GPF]:[अन्य 3]])","v":220}]
[{"$f":"IF(Table3[[#This Row],[नाम]]=\"\",\"\",ROWS($A$1:A115))","v":""},{"$f":"PROPER(IF(Table1[[#This Row],[नाम]]=\"\",\"\",Table1[[#This Row],[नाम]]))","v":""},{"$nulls":8},220,{"$nulls":3},{"$f":"SUM(Table3[[#This Row],[GPF]:[अन्य 3]])","v":220}]
[{"$f":"IF(Table3[[#This Row],[नाम]]=\"\",\"\",ROWS($A$1:A116))","v":""},{"$f":"PROPER(IF(Table1[[#This Row],[नाम]]=\"\",\"\",Table1[[#This Row],[नाम]]))","v":""},{"$nulls":8},220,{"$nulls":3},{"$f":"SUM(Table3[[#This Row],[GPF]:[अन्य 3]])","v":220}]
[{"$f":"IF(Table3[[#This Row],[नाम]]=\"\",\"\",ROWS($A$1:A117))","v":""},{"$f":"PROPER(IF(Table1[[#This Row],[नाम]]=\"\",\"\",Table1[[#This Row],[नाम]]))","v":""},{"$nulls":8},220,{"$nulls":3},{"$f":"SUM(Table3[[#This Row],[GPF]:[अन्य 3]])","v":220}]
[{"$f":"IF(Table3[[#This Row],[नाम]]=\"\",\"\",ROWS($A$1:A118))","v":""},{"$f":"PROPER(IF(Table1[[#This Row],[नाम]]=\"\",\"\",Table1[[#This Row],[नाम]]))","v":""},{"$nulls":8},220,{"$nulls":3},{"$f":"SUM(Table3[[#This Row],[GPF]:[अन्य 3]])","v":220}]
[{"$f":"IF(Table3[[#This Row],[नाम]]=\"\",\"\",ROWS($A$1:A119))","v":""},{"$f":"PROPER(IF(Table1[[#This Row],[नाम]]=\"\",\"\",Table1[[#This Row],[नाम]]))","v":""},{"$nulls":8},220,{"$nulls":3},{"$f":"SUM(Table3[[#This Row],[GPF]:[अन्य 3]])","v":220}]
[{"$f":"IF(Table3[[#This Row],[नाम]]=\"\",\"\",ROWS($A$1:A120))","v":""},{"$f":"PROPER(IF(Table1[[#This Row],[नाम]]=\"\",\"\",Table1[[#This Row],[नाम]]))","v":""},{"$nulls":8},220,{"$nulls":3},{"$f":"SUM(Table3[[#This Row],[GPF]:[अन्य 3]])","v":220}]
[{"$f":"IF(Table3[[#This Row],[नाम]]=\"\",\"\",ROWS($A$1:A121))","v":""},{"$f":"PROPER(IF(Table1[[#This Row],[नाम]]=\"\",\"\",Table1[[#This Row],[नाम]]))","v":""},{"$nulls":8},220,{"$nulls":3},{"$f":"SUM(Table3[[#This Row],[GPF]:[अन्य 3]])","v":220}]
[{"$f":"IF(Table3[[#This Row],[नाम]]=\"\",\"\",ROWS($A$1:A122))","v":""},{"$f":"PROPER(IF(Table1[[#This Row],[नाम]]=\"\",\"\",Table1[[#This Row],[नाम]]))","v":""},{"$nulls":8},220,{"$nulls":3},{"$f":"SUM(Table3[[#This Row],[GPF]:[अन्य 3]])","v":220}]
[{"$f":"IF(Table3[[#This Row],[नाम]]=\"\",\"\",ROWS($A$1:A123))","v":""},{"$f":"PROPER(IF(Table1[[#This Row],[नाम]]=\"\",\"\",Table1[[#This Row],[नाम]]))","v":""},{"$nulls":8},220,{"$nulls":3},{"$f":"SUM(Table3[[#This Row],[GPF]:[अन्य 3]])","v":220}]
[{"$f":"IF(Table3[[#This Row],[नाम]]=\"\",\"\",ROWS($A$1:A124))","v":""},{"$f":"PROPER(IF(Table1[[#This Row],[नाम]]=\"\",\"\",Table1[[#This Row],[नाम]]))","v":""},{"$nulls":8},220,{"$nulls":3},{"$f":"SUM(Table3[[#This Row],[GPF]:[अन्य 3]])","v":220}]
[{"$f":"IF(Table3[[#This Row],[नाम]]=\"\",\"\",ROWS($A$1:A125))","v":""},{"$f":"PROPER(IF(Table1[[#This Row],[नाम]]=\"\",\"\",Table1[[#This Row],[नाम]]))","v":""},{"$nulls":8},220,{"$nulls":3},{"$f":"SUM(Table3[[#This Row],[GPF]:[अन्य 3]])","v":220}]
[{"$f":"IF(Table3[[#This Row],[नाम]]=\"\",\"\",ROWS($A$1:A126))","v":""},{"$f":"PROPER(IF(Table1[[#This Row],[नाम]]=\"\",\"\",Table1[[#This Row],[नाम]]))","v":""},{"$nulls":8},220,{"$nulls":3},{"$f":"SUM(Table3[[#This Row],[GPF]:[अन्य 3]])","v":220}]
[{"$f":"IF(Table3[[#This Row],[नाम]]=\"\",\"\",ROWS($A$1:A127))","v":""},{"$f":"PROPER(IF(Table1[[#This Row],[नाम]]=\"\",\"\",Table1[[#This Row],[नाम]]))","v":""},{"$nulls":8},220,{"$nulls":3},{"$f":"SUM(Table3[[#This Row],[GPF]:[अन्य 3]])","v":220}]
[{"$f":"IF(Table3[[#This Row],[नाम]]=\"\",\"\",ROWS($A$1:A128))","v":""},{"$f":"PROPER(IF(Table1[[#This Row],[नाम]]=\"\",\"\",Table1[[#This Row],[नाम]]))","v":""},{"$nulls":8},220,{"$nulls":3},{"$f":"SUM(Table3[[#This Row],[GPF]:[अन्य 3]])","v":220}]
[{"$f":"IF(Table3[[#This Row],[नाम]]=\"\",\"\",ROWS($A$1:A129))","v":""},{"$f":"PROPER(IF(Table1[[#This Row],[नाम]]=\"\",\"\",Table1[[#This Row],[नाम]]))","v":""},{"$nulls":8},220,{"$nulls":3},{"$f":"SUM(Table3[[#This Row],[GPF]:[अन्य 3]])","v":220}]
[{"$f":"IF(Table3[[#This Row],[नाम]]=\"\",\"\",ROWS($A$1:A130))","v":""},{"$f":"PROPER(IF(Table1[[#This Row],[नाम]]=\"\",\"\",Table1[[#This Row],[नाम]]))","v":""},{"$nulls":8},220,{"$nulls":3},{"$f":"SUM(Table3[[#This Row],[GPF]:[अन्य 3]])","v":220}]
[{"$f":"IF(Table3[[#This Row],[नाम]]=\"\",\"\",ROWS($A$1:A131))","v":""},{"$f":"PROPER(IF(Table1[[#This Row],[नाम]]=\"\",\"\",Table1[[#This Row],[नाम]]))","v":""},{"$nulls":8},220,{"$nulls":3},{"$f":"SUM(Table3[[#This Row],[GPF]:[अन्य 3]])","v":220}]
[{"$f":"IF(Table3[[#This Row],[नाम]]=\"\",\"\",ROWS($A$1:A132))","v":""},{"$f":"PROPER(IF(Table1[[#This Row],[नाम]]=\"\",\"\",Table1[[#This Row],[नाम]]))","v":""},{"$nulls":8},220,{"$nulls":3},{"$f":"SUM(Table3[[#This Row],[GPF]:[अन्य 3]])","v":220}]
[{"$f":"IF(Table3[[#This Row],[नाम]]=\"\",\"\",ROWS($A$1:A133))","v":""},{"$f":"PROPER(IF(Table1[[#This Row],[नाम]]=\"\",\"\",Table1[[#This Row],[नाम]]))","v":""},{"$nulls":8},220,{"$nulls":3},{"$f":"SUM(Table3[[#This Row],[GPF]:[अन्य 3]])","v":220}]
[{"$f":"IF(Table3[[#This Row],[नाम]]=\"\",\"\",ROWS($A$1:A134))","v":""},{"$f":"PROPER(IF(Table1[[#This Row],[नाम]]=\"\",\"\",Table1[[#This Row],[नाम]]))","v":""},{"$nulls":8},220,{"$nulls":3},{"$f":"SUM(Table3[[#This Row],[GPF]:[अन्य 3]])","v":220}]
[{"$f":"IF(Table3[[#This Row],[नाम]]=\"\",\"\",ROWS($A$1:A135))","v":""},{"$f":"PROPER(IF(Table1[[#This Row],[नाम]]=\"\",\"\",Table1[[#This Row],[नाम]]))","v":""},{"$nulls":8},220,{"$nulls":3},{"$f":"SUM(Table3[[#This Row],[GPF]:[अन्य 3]])","v":220}]
[{"$f":"IF(Table3[[#This Row],[नाम]]=\"\",\"\",ROWS($A$1:A136))","v":""},{"$f":"PROPER(IF(Table1[[#This Row],[नाम]]=\"\",\"\",Table1[[#This Row],[नाम]]))","v":""},{"$nulls":8},220,{"$nulls":3},{"$f":"SUM(Table3[[#This Row],[GPF]:[अन्य 3]])","v":220}]
[{"$f":"IF(Table3[[#This Row],[नाम]]=\"\",\"\",ROWS($A$1:A137))","v":""},{"$f":"PROPER(IF(Table1[[#This Row],[नाम]]=\"\",\"\",Table1[[#This Row],[नाम]]))","v":""},{"$nulls":8},220,{"$nulls":3},{"$f":"SUM(Table3[[#This Row],[GPF]:[अन्य 3]])","v":220}]
[{"$f":"IF(Table3[[#This Row],[नाम]]=\"\",\"\",ROWS($A$1:A138))","v":""},{"$f":"PROPER(IF(Table1[[#This Row],[नाम]]=\"\",\"\",Table1[[#This Row],[नाम]]))","v":""},{"$nulls":8},220,{"$nulls":3},{"$f":"SUM(Table3[[#This Row],[GPF]:[अन्य 3]])","v":220}]
[{"$f":"IF(Table3[[#This Row],[नाम]]=\"\",\"\",ROWS($A$1:A139))","v":""},{"$f":"PROPER(IF(Table1[[#This Row],[नाम]]=\"\",\"\",Table1[[#This Row],[नाम]]))","v":""},{"$nulls":8},220,{"$nulls":3},{"$f":"SUM(Table3[[#This Row],[GPF]:[अन्य 3]])","v":220}]
[{"$f":"IF(Table3[[#This Row],[नाम]]=\"\",\"\",ROWS($A$1:A140))","v":""},{"$f":"PROPER(IF(Table1[[#This Row],[नाम]]=\"\",\"\",Table1[[#This Row],[नाम]]))","v":""},{"$nulls":8},220,{"$nulls":3},{"$f":"SUM(Table3[[#This Row],[GPF]:[अन्य 3]])","v":220}]
[{"$f":"IF(Table3[[#This Row],[नाम]]=\"\",\"\",ROWS($A$1:A141))","v":""},{"$f":"PROPER(IF(Table1[[#This Row],[नाम]]=\"\",\"\",Table1[[#This Row],[नाम]]))","v":""},{"$nulls":8},220,{"$nulls":3},{"$f":"SUM(Table3[[#This Row],[GPF]:[अन्य 3]])","v":220}]
[{"$f":"IF(Table3[[#This Row],[नाम]]=\"\",\"\",ROWS($A$1:A142))","v":""},{"$f":"PROPER(IF(Table1[[#This Row],[नाम]]=\"\",\"\",Table1[[#This Row],[नाम]]))","v":""},{"$nulls":8},220,{"$nulls":3},{"$f":"SUM(Table3[[#This Row],[GPF]:[अन्य 3]])","v":220}]
[{"$f":"IF(Table3[[#This Row],[नाम]]=\"\",\"\",ROWS($A$1:A143))","v":""},{"$f":"PROPER(IF(Table1[[#This Row],[नाम]]=\"\",\"\",Table1[[#This Row],[नाम]]))","v":""},{"$nulls":8},220,{"$nulls":3},{"$f":"SUM(Table3[[#This Row],[GPF]:[अन्य 3]])","v":220}]
[{"$f":"IF(Table3[[#This Row],[नाम]]=\"\",\"\",ROWS($A$1:A144))","v":""},{"$f":"PROPER(IF(Table1[[#This Row],[नाम]]=\"\",\"\",Table1[[#This Row],[नाम]]))","v":""},{"$nulls":8},220,{"$nulls":3},{"$f":"SUM(Table3[[#This Row],[GPF]:[अन्य 3]])","v":220}]
[{"$f":"IF(Table3[[#This Row],[नाम]]=\"\",\"\",ROWS($A$1:A145))","v":""},{"$f":"PROPER(IF(Table1[[#This Row],[नाम]]=\"\",\"\",Table1[[#This Row],[नाम]]))","v":""},{"$nulls":8},220,{"$nulls":3},{"$f":"SUM(Table3[[#This Row],[GPF]:[अन्य 3]])","v":220}]
[{"$f":"IF(Table3[[#This Row],[नाम]]=\"\",\"\",ROWS($A$1:A146))","v":""},{"$f":"PROPER(IF(Table1[[#This Row],[नाम]]=\"\",\"\",Table1[[#This Row],[नाम]]))","v":""},{"$nulls":8},220,{"$nulls":3},{"$f":"SUM(Table3[[#This Row],[GPF]:[अन्य 3]])","v":220}]
[{"$f":"IF(Table3[[#This Row],[नाम]]=\"\",\"\",ROWS($A$1:A147))","v":""},{"$f":"PROPER(IF(Table1[[#This Row],[नाम]]=\"\",\"\",Table1[[#This Row],[नाम]]))","v":""},{"$nulls":8},220,{"$nulls":3},{"$f":"SUM(Table3[[#This Row],[GPF]:[अन्य 3]])","v":220}]
[{"$f":"IF(Table3[[#This Row],[नाम]]=\"\",\"\",ROWS($A$1:A148))","v":""},{"$f":"PROPER(IF(Table1[[#This Row],[नाम]]=\"\",\"\",Table1[[#This Row],[नाम]]))","v":""},{"$nulls":8},220,{"$nulls":3},{"$f":"SUM(Table3[[#This Row],[GPF]:[अन्य 3]])","v":220}]
[{"$f":"IF(Table3[[#This Row],[नाम]]=\"\",\"\",ROWS($A$1:A149))","v":""},{"$f":"PROPER(IF(Table1[[#This Row],[नाम]]=\"\",\"\",Table1[[#This Row],[नाम]]))","v":""},{"$nulls":8},220,{"$nulls":3},{"$f":"SUM(Table3[[#This Row],[GPF]:[अन्य 3]])","v":220}]
[{"$f":"IF(Table3[[#This Row],[नाम]]=\"\",\"\",ROWS($A$1:A150))","v":""},{"$f":"PROPER(IF(Table1[[#This Row],[नाम]]=\"\",\"\",Table1[[#This Row],[नाम]]))","v":""},{"$nulls":8},220,{"$nulls":3},{"$f":"SUM(Table3[[#This Row],[GPF]:[अन्य 3]])","v":220}]
[{"$f":"IF(Table3[[#This Row],[नाम]]=\"\",\"\",ROWS($A$1:A151))","v":""},{"$f":"PROPER(IF(Table1[[#This Row],[नाम]]=\"\",\"\",Table1[[#This Row],[नाम]]))","v":""},{"$nulls":8},220,{"$nulls":3},{"$f":"SUM(Table3[[#This Row],[GPF]:[अन्य 3]])","v":220}]
[{"$f":"IF(Table3[[#This Row],[नाम]]=\"\",\"\",ROWS($A$1:A152))","v":""},{"$f":"PROPER(IF(Table1[[#This Row],[नाम]]=\"\",\"\",Table1[[#This Row],[नाम]]))","v":""},{"$nulls":8},220,{"$nulls":3},{"$f":"SUM(Table3[[#This Row],[GPF]:[अन्य 3]])","v":220}]
[{"$f":"IF(Table3[[#This Row],[नाम]]=\"\",\"\",ROWS($A$1:A153))","v":""},{"$f":"PROPER(IF(Table1[[#This Row],[नाम]]=\"\",\"\",Table1[[#This Row],[नाम]]))","v":""},{"$nulls":8},220,{"$nulls":3},{"$f":"SUM(Table3[[#This Row],[GPF]:[अन्य 3]])","v":220}]
[{"$f":"IF(Table3[[#This Row],[नाम]]=\"\",\"\",ROWS($A$1:A154))","v":""},{"$f":"PROPER(IF(Table1[[#This Row],[नाम]]=\"\",\"\",Table1[[#This Row],[नाम]]))","v":""},{"$nulls":8},220,{"$nulls":3},{"$f":"SUM(Table3[[#This Row],[GPF]:[अन्य 3]])","v":220}]
[{"$f":"IF(Table3[[#This Row],[नाम]]=\"\",\"\",ROWS($A$1:A155))","v":""},{"$f":"PROPER(IF(Table1[[#This Row],[नाम]]=\"\",\"\",Table1[[#This Row],[नाम]]))","v":""},{"$nulls":8},220,{"$nulls":3},{"$f":"SUM(Table3[[#This Row],[GPF]:[अन्य 3]])","v":220}]
[{"$f":"IF(Table3[[#This Row],[नाम]]=\"\",\"\",ROWS($A$1:A156))","v":""},{"$f":"PROPER(IF(Table1[[#This Row],[नाम]]=\"\",\"\",Table1[[#This Row],[नाम]]))","v":""},{"$nulls":8},220,{"$nulls":3},{"$f":"SUM(Table3[[#This Row],[GPF]:[अन्य 3]])","v":220}]
[{"$f":"IF(Table3[[#This Row],[नाम]]=\"\",\"\",ROWS($A$1:A157))","v":""},{"$f":"PROPER(IF(Table1[[#This Row],[नाम]]=\"\",\"\",Table1[[#This Row],[नाम]]))","v":""},{"$nulls":8},220,{"$nulls":3},{"$f":"SUM(Table3[[#This Row],[GPF]:[अन्य 3]])","v":220}]
[{"$f":"IF(Table3[[#This Row],[नाम]]=\"\",\"\",ROWS($A$1:A158))","v":""},{"$f":"PROPER(IF(Table1[[#This Row],[नाम]]=\"\",\"\",Table1[[#This Row],[नाम]]))","v":""},{"$nulls":8},220,{"$nulls":3},{"$f":"SUM(Table3[[#This Row],[GPF]:[अन्य 3]])","v":220}]
[{"$f":"IF(Table3[[#This Row],[नाम]]=\"\",\"\",ROWS($A$1:A159))","v":""},{"$f":"PROPER(IF(Table1[[#This Row],[नाम]]=\"\",\"\",Table1[[#This Row],[नाम]]))","v":""},{"$nulls":8},220,{"$nulls":3},{"$f":"SUM(Table3[[#This Row],[GPF]:[अन्य 3]])","v":220}]
[{"$f":"IF(Table3[[#This Row],[नाम]]=\"\",\"\",ROWS($A$1:A160))","v":""},{"$f":"PROPER(IF(Table1[[#This Row],[नाम]]=\"\",\"\",Table1[[#This Row],[नाम]]))","v":""},{"$nulls":8},220,{"$nulls":3},{"$f":"SUM(Table3[[#This Row],[GPF]:[अन्य 3]])","v":220}]
[{"$f":"IF(Table3[[#This Row],[नाम]]=\"\",\"\",ROWS($A$1:A161))","v":""},{"$f":"PROPER(IF(Table1[[#This Row],[नाम]]=\"\",\"\",Table1[[#This Row],[नाम]]))","v":""},{"$nulls":8},220,{"$nulls":3},{"$f":"SUM(Table3[[#This Row],[GPF]:[अन्य 3]])","v":220}]
[{"$f":"IF(Table3[[#This Row],[नाम]]=\"\",\"\",ROWS($A$1:A162))","v":""},{"$f":"PROPER(IF(Table1[[#This Row],[नाम]]=\"\",\"\",Table1[[#This Row],[नाम]]))","v":""},{"$nulls":8},220,{"$nulls":3},{"$f":"SUM(Table3[[#This Row],[GPF]:[अन्य 3]])","v":220}]
[{"$f":"IF(Table3[[#This Row],[नाम]]=\"\",\"\",ROWS($A$1:A163))","v":""},{"$f":"PROPER(IF(Table1[[#This Row],[नाम]]=\"\",\"\",Table1[[#This Row],[नाम]]))","v":""},{"$nulls":8},220,{"$nulls":3},{"$f":"SUM(Table3[[#This Row],[GPF]:[अन्य 3]])","v":220}]
[{"$f":"IF(Table3[[#This Row],[नाम]]=\"\",\"\",ROWS($A$1:A164))","v":""},{"$f":"PROPER(IF(Table1[[#This Row],[नाम]]=\"\",\"\",Table1[[#This Row],[नाम]]))","v":""},{"$nulls":8},220,{"$nulls":3},{"$f":"SUM(Table3[[#This Row],[GPF]:[अन्य 3]])","v":220}]
[{"$f":"IF(Table3[[#This Row],[नाम]]=\"\",\"\",ROWS($A$1:A165))","v":""},{"$f":"PROPER(IF(Table1[[#This Row],[नाम]]=\"\",\"\",Table1[[#This Row],[नाम]]))","v":""},{"$nulls":8},220,{"$nulls":3},{"$f":"SUM(Table3[[#This Row],[GPF]:[अन्य 3]])","v":220}]
[{"$f":"IF(Table3[[#This Row],[नाम]]=\"\",\"\",ROWS($A$1:A166))","v":""},{"$f":"PROPER(IF(Table1[[#This Row],[नाम]]=\"\",\"\",Table1[[#This Row],[नाम]]))","v":""},{"$nulls":8},220,{"$nulls":3},{"$f":"SUM(Table3[[#This Row],[GPF]:[अन्य 3]])","v":220}]
[{"$f":"IF(Table3[[#This Row],[नाम]]=\"\",\"\",ROWS($A$1:A167))","v":""},{"$f":"PROPER(IF(Table1[[#This Row],[नाम]]=\"\",\"\",Table1[[#This Row],[नाम]]))","v":""},{"$nulls":8},220,{"$nulls":3},{"$f":"SUM(Table3[[#This Row],[GPF]:[अन्य 3]])","v":220}]
[{"$f":"IF(Table3[[#This Row],[नाम]]=\"\",\"\",ROWS($A$1:A168))","v":""},{"$f":"PROPER(IF(Table1[[#This Row],[नाम]]=\"\",\"\",Table1[[#This Row],[नाम]]))","v":""},{"$nulls":8},220,{"$nulls":3},{"$f":"SUM(Table3[[#This Row],[GPF]:[अन्य 3]])","v":220}]
[{"$f":"IF(Table3[[#This Row],[नाम]]=\"\",\"\",ROWS($A$1:A169))","v":""},{"$f":"PROPER(IF(Table1[[#This Row],[नाम]]=\"\",\"\",Table1[[#This Row],[नाम]]))","v":""},{"$nulls":8},220,{"$nulls":3},{"$f":"SUM(Table3[[#This Row],[GPF]:[अन्य 3]])","v":220}]
[{"$f":"IF(Table3[[#This Row],[नाम]]=\"\",\"\",ROWS($A$1:A170))","v":""},{"$f":"PROPER(IF(Table1[[#This Row],[नाम]]=\"\",\"\",Table1[[#This Row],[नाम]]))","v":""},{"$nulls":8},220,{"$nulls":3},{"$f":"SUM(Table3[[#This Row],[GPF]:[अन्य 3]])","v":220}]
[{"$f":"IF(Table3[[#This Row],[नाम]]=\"\",\"\",ROWS($A$1:A171))","v":""},{"$f":"PROPER(IF(Table1[[#This Row],[नाम]]=\"\",\"\",Table1[[#This Row],[नाम]]))","v":""},{"$nulls":8},220,{"$nulls":3},{"$f":"SUM(Table3[[#This Row],[GPF]:[अन्य 3]])","v":220}]
[{"$f":"IF(Table3[[#This Row],[नाम]]=\"\",\"\",ROWS($A$1:A172))","v":""},{"$f":"PROPER(IF(Table1[[#This Row],[नाम]]=\"\",\"\",Table1[[#This Row],[नाम]]))","v":""},{"$nulls":8},220,{"$nulls":3},{"$f":"SUM(Table3[[#This Row],[GPF]:[अन्य 3]])","v":220}]
[{"$f":"IF(Table3[[#This Row],[नाम]]=\"\",\"\",ROWS($A$1:A173))","v":""},{"$f":"PROPER(IF(Table1[[#This Row],[नाम]]=\"\",\"\",Table1[[#This Row],[नाम]]))","v":""},{"$nulls":8},220,{"$nulls":3},{"$f":"SUM(Table3[[#This Row],[GPF]:[अन्य 3]])","v":220}]
[{"$f":"IF(Table3[[#This Row],[नाम]]=\"\",\"\",ROWS($A$1:A174))","v":""},{"$f":"PROPER(IF(Table1[[#This Row],[नाम]]=\"\",\"\",Table1[[#This Row],[नाम]]))","v":""},{"$nulls":8},220,{"$nulls":3},{"$f":"SUM(Table3[[#This Row],[GPF]:[अन्य 3]])","v":220}]
[{"$f":"IF(Table3[[#This Row],[नाम]]=\"\",\"\",ROWS($A$1:A175))","v":""},{"$f":"PROPER(IF(Table1[[#This Row],[नाम]]=\"\",\"\",Table1[[#This Row],[नाम]]))","v":""},{"$nulls":8},220,{"$nulls":3},{"$f":"SUM(Table3[[#This Row],[GPF]:[अन्य 3]])","v":220}]
[{"$f":"IF(Table3[[#This Row],[नाम]]=\"\",\"\",ROWS($A$1:A176))","v":""},{"$f":"PROPER(IF(Table1[[#This Row],[नाम]]=\"\",\"\",Table1[[#This Row],[नाम]]))","v":""},{"$nulls":8},220,{"$nulls":3},{"$f":"SUM(Table3[[#This Row],[GPF]:[अन्य 3]])","v":220}]
[{"$f":"IF(Table3[[#This Row],[नाम]]=\"\",\"\",ROWS($A$1:A177))","v":""},{"$f":"PROPER(IF(Table1[[#This Row],[नाम]]=\"\",\"\",Table1[[#This Row],[नाम]]))","v":""},{"$nulls":8},220,{"$nulls":3},{"$f":"SUM(Table3[[#This Row],[GPF]:[अन्य 3]])","v":220}]
[{"$f":"IF(Table3[[#This Row],[नाम]]=\"\",\"\",ROWS($A$1:A178))","v":""},{"$f":"PROPER(IF(Table1[[#This Row],[नाम]]=\"\",\"\",Table1[[#This Row],[नाम]]))","v":""},{"$nulls":8},220,{"$nulls":3},{"$f":"SUM(Table3[[#This Row],[GPF]:[अन्य 3]])","v":220}]
[{"$f":"IF(Table3[[#This Row],[नाम]]=\"\",\"\",ROWS($A$1:A179))","v":""},{"$f":"PROPER(IF(Table1[[#This Row],[नाम]]=\"\",\"\",Table1[[#This Row],[नाम]]))","v":""},{"$nulls":8},220,{"$nulls":3},{"$f":"SUM(Table3[[#This Row],[GPF]:[अन्य 3]])","v":220}]
[{"$f":"IF(Table3[[#This Row],[नाम]]=\"\",\"\",ROWS($A$1:A180))","v":""},{"$f":"PROPER(IF(Table1[[#This Row],[नाम]]=\"\",\"\",Table1[[#This Row],[नाम]]))","v":""},{"$nulls":8},220,{"$nulls":3},{"$f":"SUM(Table3[[#This Row],[GPF]:[अन्य 3]])","v":220}]
[{"$f":"IF(Table3[[#This Row],[नाम]]=\"\",\"\",ROWS($A$1:A181))","v":""},{"$f":"PROPER(IF(Table1[[#This Row],[नाम]]=\"\",\"\",Table1[[#This Row],[नाम]]))","v":""},{"$nulls":8},220,{"$nulls":3},{"$f":"SUM(Table3[[#This Row],[GPF]:[अन्य 3]])","v":220}]
[{"$f":"IF(Table3[[#This Row],[नाम]]=\"\",\"\",ROWS($A$1:A182))","v":""},{"$f":"PROPER(IF(Table1[[#This Row],[नाम]]=\"\",\"\",Table1[[#This Row],[नाम]]))","v":""},{"$nulls":8},220,{"$nulls":3},{"$f":"SUM(Table3[[#This Row],[GPF]:[अन्य 3]])","v":220}]
[{"$f":"IF(Table3[[#This Row],[नाम]]=\"\",\"\",ROWS($A$1:A183))","v":""},{"$f":"PROPER(IF(Table1[[#This Row],[नाम]]=\"\",\"\",Table1[[#This Row],[नाम]]))","v":""},{"$nulls":8},220,{"$nulls":3},{"$f":"SUM(Table3[[#This Row],[GPF]:[अन्य 3]])","v":220}]
[{"$f":"IF(Table3[[#This Row],[नाम]]=\"\",\"\",ROWS($A$1:A184))","v":""},{"$f":"PROPER(IF(Table1[[#This Row],[नाम]]=\"\",\"\",Table1[[#This Row],[नाम]]))","v":""},{"$nulls":8},220,{"$nulls":3},{"$f":"SUM(Table3[[#This Row],[GPF]:[अन्य 3]])","v":220}]
[{"$f":"IF(Table3[[#This Row],[नाम]]=\"\",\"\",ROWS($A$1:A185))","v":""},{"$f":"PROPER(IF(Table1[[#This Row],[नाम]]=\"\",\"\",Table1[[#This Row],[नाम]]))","v":""},{"$nulls":8},220,{"$nulls":3},{"$f":"SUM(Table3[[#This Row],[GPF]:[अन्य 3]])","v":220}]
[{"$f":"IF(Table3[[#This Row],[नाम]]=\"\",\"\",ROWS($A$1:A186))","v":""},{"$f":"PROPER(IF(Table1[[#This Row],[नाम]]=\"\",\"\",Table1[[#This Row],[नाम]]))","v":""},{"$nulls":8},220,{"$nulls":3},{"$f":"SUM(Table3[[#This Row],[GPF]:[अन्य 3]])","v":220}]
[{"$f":"IF(Table3[[#This Row],[नाम]]=\"\",\"\",ROWS($A$1:A187))","v":""},{"$f":"PROPER(IF(Table1[[#This Row],[नाम]]=\"\",\"\",Table1[[#This Row],[नाम]]))","v":""},{"$nulls":8},220,{"$nulls":3},{"$f":"SUM(Table3[[#This Row],[GPF]:[अन्य 3]])","v":220}]
[{"$f":"IF(Table3[[#This Row],[नाम]]=\"\",\"\",ROWS($A$1:A188))","v":""},{"$f":"PROPER(IF(Table1[[#This Row],[नाम]]=\"\",\"\",Table1[[#This Row],[नाम]]))","v":""},{"$nulls":8},220,{"$nulls":3},{"$f":"SUM(Table3[[#This Row],[GPF]:[अन्य 3]])","v":220}]
[{"$f":"IF(Table3[[#This Row],[नाम]]=\"\",\"\",ROWS($A$1:A189))","v":""},{"$f":"PROPER(IF(Table1[[#This Row],[नाम]]=\"\",\"\",Table1[[#This Row],[नाम]]))","v":""},{"$nulls":8},220,{"$nulls":3},{"$f":"SUM(Table3[[#This Row],[GPF]:[अन्य 3]])","v":220}]
[{"$f":"IF(Table3[[#This Row],[नाम]]=\"\",\"\",ROWS($A$1:A190))","v":""},{"$f":"PROPER(IF(Table1[[#This Row],[नाम]]=\"\",\"\",Table1[[#This Row],[नाम]]))","v":""},{"$nulls":8},220,{"$nulls":3},{"$f":"SUM(Table3[[#This Row],[GPF]:[अन्य 3]])","v":220}]
[{"$f":"IF(Table3[[#This Row],[नाम]]=\"\",\"\",ROWS($A$1:A191))","v":""},{"$f":"PROPER(IF(Table1[[#This Row],[नाम]]=\"\",\"\",Table1[[#This Row],[नाम]]))","v":""},{"$nulls":8},220,{"$nulls":3},{"$f":"SUM(Table3[[#This Row],[GPF]:[अन्य 3]])","v":220}]
[{"$f":"IF(Table3[[#This Row],[नाम]]=\"\",\"\",ROWS($A$1:A192))","v":""},{"$f":"PROPER(IF(Table1[[#This Row],[नाम]]=\"\",\"\",Table1[[#This Row],[नाम]]))","v":""},{"$nulls":8},220,{"$nulls":3},{"$f":"SUM(Table3[[#This Row],[GPF]:[अन्य 3]])","v":220}]
[{"$f":"IF(Table3[[#This Row],[नाम]]=\"\",\"\",ROWS($A$1:A193))","v":""},{"$f":"PROPER(IF(Table1[[#This Row],[नाम]]=\"\",\"\",Table1[[#This Row],[नाम]]))","v":""},{"$nulls":8},220,{"$nulls":3},{"$f":"SUM(Table3[[#This Row],[GPF]:[अन्य 3]])","v":220}]
[{"$f":"IF(Table3[[#This Row],[नाम]]=\"\",\"\",ROWS($A$1:A194))","v":""},{"$f":"PROPER(IF(Table1[[#This Row],[नाम]]=\"\",\"\",Table1[[#This Row],[नाम]]))","v":""},{"$nulls":8},220,{"$nulls":3},{"$f":"SUM(Table3[[#This Row],[GPF]:[अन्य 3]])","v":220}]
[{"$f":"IF(Table3[[#This Row],[नाम]]=\"\",\"\",ROWS($A$1:A195))","v":""},{"$f":"PROPER(IF(Table1[[#This Row],[नाम]]=\"\",\"\",Table1[[#This Row],[नाम]]))","v":""},{"$nulls":8},220,{"$nulls":3},{"$f":"SUM(Table3[[#This Row],[GPF]:[अन्य 3]])","v":220}]
[{"$f":"IF(Table3[[#This Row],[नाम]]=\"\",\"\",ROWS($A$1:A196))","v":""},{"$f":"PROPER(IF(Table1[[#This Row],[नाम]]=\"\",\"\",Table1[[#This Row],[नाम]]))","v":""},{"$nulls":8},220,{"$nulls":3},{"$f":"SUM(Table3[[#This Row],[GPF]:[अन्य 3]])","v":220}]
[{"$f":"IF(Table3[[#This Row],[नाम]]=\"\",\"\",ROWS($A$1:A197))","v":""},{"$f":"PROPER(IF(Table1[[#This Row],[नाम]]=\"\",\"\",Table1[[#This Row],[नाम]]))","v":""},{"$nulls":8},220,{"$nulls":3},{"$f":"SUM(Table3[[#This Row],[GPF]:[अन्य 3]])","v":220}]
[{"$f":"IF(Table3[[#This Row],[नाम]]=\"\",\"\",ROWS($A$1:A198))","v":""},{"$f":"PROPER(IF(Table1[[#This Row],[नाम]]=\"\",\"\",Table1[[#This Row],[नाम]]))","v":""},{"$nulls":8},220,{"$nulls":3},{"$f":"SUM(Table3[[#This Row],[GPF]:[अन्य 3]])","v":220}]
[{"$f":"IF(Table3[[#This Row],[नाम]]=\"\",\"\",ROWS($A$1:A199))","v":""},{"$f":"PROPER(IF(Table1[[#This Row],[नाम]]=\"\",\"\",Table1[[#This Row],[नाम]]))","v":""},{"$nulls":8},220,{"$nulls":3},{"$f":"SUM(Table3[[#This Row],[GPF]:[अन्य 3]])","v":220}]
[{"$f":"IF(Table3[[#This Row],[नाम]]=\"\",\"\",ROWS($A$1:A200))","v":""},{"$f":"PROPER(IF(Table1[[#This Row],[नाम]]=\"\",\"\",Table1[[#This Row],[नाम]]))","v":""},{"$nulls":8},220,{"$nulls":3},{"$f":"SUM(Table3[[#This Row],[GPF]:[अन्य 3]])","v":220}]
[{"$f":"IF(Table3[[#This Row],[नाम]]=\"\",\"\",ROWS($A$1:A201))","v":""},{"$f":"PROPER(IF(Table1[[#This Row],[नाम]]=\"\",\"\",Table1[[#This Row],[नाम]]))","v":""},{"$nulls":8},220,{"$nulls":3},{"$f":"SUM(Table3[[#This Row],[GPF]:[अन्य 3]])","v":220}]
[{"$f":"IF(Table3[[#This Row],[नाम]]=\"\",\"\",ROWS($A$1:A202))","v":""},{"$f":"PROPER(IF(Table1[[#This Row],[नाम]]=\"\",\"\",Table1[[#This Row],[नाम]]))","v":""},{"$nulls":8},220,{"$nulls":3},{"$f":"SUM(Table3[[#This Row],[GPF]:[अन्य 3]])","v":220}]
[{"$f":"IF(Table3[[#This Row],[नाम]]=\"\",\"\",ROWS($A$1:A203))","v":""},{"$f":"PROPER(IF(Table1[[#This Row],[नाम]]=\"\",\"\",Table1[[#This Row],[नाम]]))","v":""},{"$nulls":8},220,{"$nulls":3},{"$f":"SUM(Table3[[#This Row],[GPF]:[अन्य 3]])","v":220}]
[{"$f":"IF(Table3[[#This Row],[नाम]]=\"\",\"\",ROWS($A$1:A204))","v":""},{"$f":"PROPER(IF(Table1[[#This Row],[नाम]]=\"\",\"\",Table1[[#This Row],[नाम]]))","v":""},{"$nulls":8},220,{"$nulls":3},{"$f":"SUM(Table3[[#This Row],[GPF]:[अन्य 3]])","v":220}]
[{"$f":"IF(Table3[[#This Row],[नाम]]=\"\",\"\",ROWS($A$1:A205))","v":""},{"$f":"PROPER(IF(Table1[[#This Row],[नाम]]=\"\",\"\",Table1[[#This Row],[नाम]]))","v":""},{"$nulls":8},220,{"$nulls":3},{"$f":"SUM(Table3[[#This Row],[GPF]:[अन्य 3]])","v":220}]
[{"$f":"IF(Table3[[#This Row],[नाम]]=\"\",\"\",ROWS($A$1:A206))","v":""},{"$f":"PROPER(IF(Table1[[#This Row],[नाम]]=\"\",\"\",Table1[[#This Row],[नाम]]))","v":""},{"$nulls":8},220,{"$nulls":3},{"$f":"SUM(Table3[[#This Row],[GPF]:[अन्य 3]])","v":220}]
[{"$f":"IF(Table3[[#This Row],[नाम]]=\"\",\"\",ROWS($A$1:A207))","v":""},{"$f":"PROPER(IF(Table1[[#This Row],[नाम]]=\"\",\"\",Table1[[#This Row],[नाम]]))","v":""},{"$nulls":8},220,{"$nulls":3},{"$f":"SUM(Table3[[#This Row],[GPF]:[अन्य 3]])","v":220}]
[{"$f":"IF(Table3[[#This Row],[नाम]]=\"\",\"\",ROWS($A$1:A208))","v":""},{"$f":"PROPER(IF(Table1[[#This Row],[नाम]]=\"\",\"\",Table1[[#This Row],[नाम]]))","v":""},{"$nulls":8},220,{"$nulls":3},{"$f":"SUM(Table3[[#This Row],[GPF]:[अन्य 3]])","v":220}]
[{"$f":"IF(Table3[[#This Row],[नाम]]=\"\",\"\",ROWS($A$1:A209))","v":""},{"$f":"PROPER(IF(Table1[[#This Row],[नाम]]=\"\",\"\",Table1[[#This Row],[नाम]]))","v":""},{"$nulls":8},220,{"$nulls":3},{"$f":"SUM(Table3[[#This Row],[GPF]:[अन्य 3]])","v":220}]
[{"$f":"IF(Table3[[#This Row],[नाम]]=\"\",\"\",ROWS($A$1:A210))","v":""},{"$f":"PROPER(IF(Table1[[#This Row],[नाम]]=\"\",\"\",Table1[[#This Row],[नाम]]))","v":""},{"$nulls":8},220,{"$nulls":3},{"$f":"SUM(Table3[[#This Row],[GPF]:[अन्य 3]])","v":220}]
[{"$f":"IF(Table3[[#This Row],[नाम]]=\"\",\"\",ROWS($A$1:A211))","v":""},{"$f":"PROPER(IF(Table1[[#This Row],[नाम]]=\"\",\"\",Table1[[#This Row],[नाम]]))","v":""},{"$nulls":8},220,{"$nulls":3},{"$f":"SUM(Table3[[#This Row],[GPF]:[अन्य 3]])","v":220}]
[{"$f":"IF(Table3[[#This Row],[नाम]]=\"\",\"\",ROWS($A$1:A212))","v":""},{"$f":"PROPER(IF(Table1[[#This Row],[नाम]]=\"\",\"\",Table1[[#This Row],[नाम]]))","v":""},{"$nulls":8},220,{"$nulls":3},{"$f":"SUM(Table3[[#This Row],[GPF]:[अन्य 3]])","v":220}]
[{"$f":"IF(Table3[[#This Row],[नाम]]=\"\",\"\",ROWS($A$1:A213))","v":""},{"$f":"PROPER(IF(Table1[[#This Row],[नाम]]=\"\",\"\",Table1[[#This Row],[नाम]]))","v":""},{"$nulls":8},220,{"$nulls":3},{"$f":"SUM(Table3[[#This Row],[GPF]:[अन्य 3]])","v":220}]
[{"$f":"IF(Table3[[#This Row],[नाम]]=\"\",\"\",ROWS($A$1:A214))","v":""},{"$f":"PROPER(IF(Table1[[#This Row],[नाम]]=\"\",\"\",Table1[[#This Row],[नाम]]))","v":""},{"$nulls":8},220,{"$nulls":3},{"$f":"SUM(Table3[[#This Row],[GPF]:[अन्य 3]])","v":220}]
[{"$f":"IF(Table3[[#This Row],[नाम]]=\"\",\"\",ROWS($A$1:A215))","v":""},{"$f":"PROPER(IF(Table1[[#This Row],[नाम]]=\"\",\"\",Table1[[#This Row],[नाम]]))","v":""},{"$nulls":8},220,{"$nulls":3},{"$f":"SUM(Table3[[#This Row],[GPF]:[अन्य 3]])","v":220}]
[{"$f":"IF(Table3[[#This Row],[नाम]]=\"\",\"\",ROWS($A$1:A216))","v":""},{"$f":"PROPER(IF(Table1[[#This Row],[नाम]]=\"\",\"\",Table1[[#This Row],[नाम]]))","v":""},{"$nulls":8},220,{"$nulls":3},{"$f":"SUM(Table3[[#This Row],[GPF]:[अन्य 3]])","v":220}]
[{"$f":"IF(Table3[[#This Row],[नाम]]=\"\",\"\",ROWS($A$1:A217))","v":""},{"$f":"PROPER(IF(Table1[[#This Row],[नाम]]=\"\",\"\",Table1[[#This Row],[नाम]]))","v":""},{"$nulls":8},220,{"$nulls":3},{"$f":"SUM(Table3[[#This Row],[GPF]:[अन्य 3]])","v":220}]
[{"$f":"IF(Table3[[#This Row],[नाम]]=\"\",\"\",ROWS($A$1:A218))","v":""},{"$f":"PROPER(IF(Table1[[#This Row],[नाम]]=\"\",\"\",Table1[[#This Row],[नाम]]))","v":""},{"$nulls":8},220,{"$nulls":3},{"$f":"SUM(Table3[[#This Row],[GPF]:[अन्य 3]])","v":220}]
[{"$f":"IF(Table3[[#This Row],[नाम]]=\"\",\"\",ROWS($A$1:A219))","v":""},{"$f":"PROPER(IF(Table1[[#This Row],[नाम]]=\"\",\"\",Table1[[#This Row],[नाम]]))","v":""},{"$nulls":8},220,{"$nulls":3},{"$f":"SUM(Table3[[#This Row],[GPF]:[अन्य 3]])","v":220}]
[{"$f":"IF(Table3[[#This Row],[नाम]]=\"\",\"\",ROWS($A$1:A220))","v":""},{"$f":"PROPER(IF(Table1[[#This Row],[नाम]]=\"\",\"\",Table1[[#This Row],[नाम]]))","v":""},{"$nulls":8},220,{"$nulls":3},{"$f":"SUM(Table3[[#This Row],[GPF]:[अन्य 3]])","v":220}]
[{"$f":"IF(Table3[[#This Row],[नाम]]=\"\",\"\",ROWS($A$1:A221))","v":""},{"$f":"PROPER(IF(Table1[[#This Row],[नाम]]=\"\",\"\",Table1[[#This Row],[नाम]]))","v":""},{"$nulls":8},220,{"$nulls":3},{"$f":"SUM(Table3[[#This Row],[GPF]:[अन्य 3]])","v":220}]
[{"$f":"IF(Table3[[#This Row],[नाम]]=\"\",\"\",ROWS($A$1:A222))","v":""},{"$f":"PROPER(IF(Table1[[#This Row],[नाम]]=\"\",\"\",Table1[[#This Row],[नाम]]))","v":""},{"$nulls":8},220,{"$nulls":3},{"$f":"SUM(Table3[[#This Row],[GPF]:[अन्य 3]])","v":220}]
[{"$f":"IF(Table3[[#This Row],[नाम]]=\"\",\"\",ROWS($A$1:A223))","v":""},{"$f":"PROPER(IF(Table1[[#This Row],[नाम]]=\"\",\"\",Table1[[#This Row],[नाम]]))","v":""},{"$nulls":8},220,{"$nulls":3},{"$f":"SUM(Table3[[#This Row],[GPF]:[अन्य 3]])","v":220}]
[{"$f":"IF(Table3[[#This Row],[नाम]]=\"\",\"\",ROWS($A$1:A224))","v":""},{"$f":"PROPER(IF(Table1[[#This Row],[नाम]]=\"\",\"\",Table1[[#This Row],[नाम]]))","v":""},{"$nulls":8},220,{"$nulls":3},{"$f":"SUM(Table3[[#This Row],[GPF]:[अन्य 3]])","v":220}]
[{"$f":"IF(Table3[[#This Row],[नाम]]=\"\",\"\",ROWS($A$1:A225))","v":""},{"$f":"PROPER(IF(Table1[[#This Row],[नाम]]=\"\",\"\",Table1[[#This Row],[नाम]]))","v":""},{"$nulls":8},220,{"$nulls":3},{"$f":"SUM(Table3[[#This Row],[GPF]:[अन्य 3]])","v":220}]
[{"$f":"IF(Table3[[#This Row],[नाम]]=\"\",\"\",ROWS($A$1:A226))","v":""},{"$f":"PROPER(IF(Table1[[#This Row],[नाम]]=\"\",\"\",Table1[[#This Row],[नाम]]))","v":""},{"$nulls":8},220,{"$nulls":3},{"$f":"SUM(Table3[[#This Row],[GPF]:[अन्य 3]])","v":220}]
[{"$f":"IF(Table3[[#This Row],[नाम]]=\"\",\"\",ROWS($A$1:A227))","v":""},{"$f":"PROPER(IF(Table1[[#This Row],[नाम]]=\"\",\"\",Table1[[#This Row],[नाम]]))","v":""},{"$nulls":8},220,{"$nulls":3},{"$f":"SUM(Table3[[#This Row],[GPF]:[अन्य 3]])","v":220}]
[{"$f":"IF(Table3[[#This Row],[नाम]]=\"\",\"\",ROWS($A$1:A228))","v":""},{"$f":"PROPER(IF(Table1[[#This Row],[नाम]]=\"\",\"\",Table1[[#This Row],[नाम]]))","v":""},{"$nulls":8},220,{"$nulls":3},{"$f":"SUM(Table3[[#This Row],[GPF]:[अन्य 3]])","v":220}]
[{"$f":"IF(Table3[[#This Row],[नाम]]=\"\",\"\",ROWS($A$1:A229))","v":""},{"$f":"PROPER(IF(Table1[[#This Row],[नाम]]=\"\",\"\",Table1[[#This Row],[नाम]]))","v":""},{"$nulls":8},220,{"$nulls":3},{"$f":"SUM(Table3[[#This Row],[GPF]:[अन्य 3]])","v":220}]
[{"$f":"IF(Table3[[#This Row],[नाम]]=\"\",\"\",ROWS($A$1:A230))","v":""},{"$f":"PROPER(IF(Table1[[#This Row],[नाम]]=\"\",\"\",Table1[[#This Row],[नाम]]))","v":""},{"$nulls":8},220,{"$nulls":3},{"$f":"SUM(Table3[[#This Row],[GPF]:[अन्य 3]])","v":220}]
[{"$f":"IF(Table3[[#This Row],[नाम]]=\"\",\"\",ROWS($A$1:A231))","v":""},{"$f":"PROPER(IF(Table1[[#This Row],[नाम]]=\"\",\"\",Table1[[#This Row],[नाम]]))","v":""},{"$nulls":8},220,{"$nulls":3},{"$f":"SUM(Table3[[#This Row],[GPF]:[अन्य 3]])","v":220}]
[{"$f":"IF(Table3[[#This Row],[नाम]]=\"\",\"\",ROWS($A$1:A232))","v":""},{"$f":"PROPER(IF(Table1[[#This Row],[नाम]]=\"\",\"\",Table1[[#This Row],[नाम]]))","v":""},{"$nulls":8},220,{"$nulls":3},{"$f":"SUM(Table3[[#This Row],[GPF]:[अन्य 3]])","v":220}]
[{"$f":"IF(Table3[[#This Row],[नाम]]=\"\",\"\",ROWS($A$1:A233))","v":""},{"$f":"PROPER(IF(Table1[[#This Row],[नाम]]=\"\",\"\",Table1[[#This Row],[नाम]]))","v":""},{"$nulls":8},220,{"$nulls":3},{"$f":"SUM(Table3[[#This Row],[GPF]:[अन्य 3]])","v":220}]
[{"$f":"IF(Table3[[#This Row],[नाम]]=\"\",\"\",ROWS($A$1:A234))","v":""},{"$f":"PROPER(IF(Table1[[#This Row],[नाम]]=\"\",\"\",Table1[[#This Row],[नाम]]))","v":""},{"$nulls":8},220,{"$nulls":3},{"$f":"SUM(Table3[[#This Row],[GPF]:[अन्य 3]])","v":220}]
[{"$f":"IF(Table3[[#This Row],[नाम]]=\"\",\"\",ROWS($A$1:A235))","v":""},{"$f":"PROPER(IF(Table1[[#This Row],[नाम]]=\"\",\"\",Table1[[#This Row],[नाम]]))","v":""},{"$nulls":8},220,{"$nulls":3},{"$f":"SUM(Table3[[#This Row],[GPF]:[अन्य 3]])","v":220}]
[{"$f":"IF(Table3[[#This Row],[नाम]]=\"\",\"\",ROWS($A$1:A236))","v":""},{"$f":"PROPER(IF(Table1[[#This Row],[नाम]]=\"\",\"\",Table1[[#This Row],[नाम]]))","v":""},{"$nulls":8},220,{"$nulls":3},{"$f":"SUM(Table3[[#This Row],[GPF]:[अन्य 3]])","v":220}]
[{"$f":"IF(Table3[[#This Row],[नाम]]=\"\",\"\",ROWS($A$1:A237))","v":""},{"$f":"PROPER(IF(Table1[[#This Row],[नाम]]=\"\",\"\",Table1[[#This Row],[नाम]]))","v":""},{"$nulls":8},220,{"$nulls":3},{"$f":"SUM(Table3[[#This Row],[GPF]:[अन्य 3]])","v":220}]
[{"$f":"IF(Table3[[#This Row],[नाम]]=\"\",\"\",ROWS($A$1:A238))","v":""},{"$f":"PROPER(IF(Table1[[#This Row],[नाम]]=\"\",\"\",Table1[[#This Row],[नाम]]))","v":""},{"$nulls":8},220,{"$nulls":3},{"$f":"SUM(Table3[[#This Row],[GPF]:[अन्य 3]])","v":220}]
[{"$f":"IF(Table3[[#This Row],[नाम]]=\"\",\"\",ROWS($A$1:A239))","v":""},{"$f":"PROPER(IF(Table1[[#This Row],[नाम]]=\"\",\"\",Table1[[#This Row],[नाम]]))","v":""},{"$nulls":8},220,{"$nulls":3},{"$f":"SUM(Table3[[#This Row],[GPF]:[अन्य 3]])","v":220}]
[{"$f":"IF(Table3[[#This Row],[नाम]]=\"\",\"\",ROWS($A$1:A240))","v":""},{"$f":"PROPER(IF(Table1[[#This Row],[नाम]]=\"\",\"\",Table1[[#This Row],[नाम]]))","v":""},{"$nulls":8},220,{"$nulls":3},{"$f":"SUM(Table3[[#This Row],[GPF]:[अन्य 3]])","v":220}]
[{"$f":"IF(Table3[[#This Row],[नाम]]=\"\",\"\",ROWS($A$1:A241))","v":""},{"$f":"PROPER(IF(Table1[[#This Row],[नाम]]=\"\",\"\",Table1[[#This Row],[नाम]]))","v":""},{"$nulls":8},220,{"$nulls":3},{"$f":"SUM(Table3[[#This Row],[GPF]:[अन्य 3]])","v":220}]
[{"$f":"IF(Table3[[#This Row],[नाम]]=\"\",\"\",ROWS($A$1:A242))","v":""},{"$f":"PROPER(IF(Table1[[#This Row],[नाम]]=\"\",\"\",Table1[[#This Row],[नाम]]))","v":""},{"$nulls":8},220,{"$nulls":3},{"$f":"SUM(Table3[[#This Row],[GPF]:[अन्य 3]])","v":220}]
[{"$f":"IF(Table3[[#This Row],[नाम]]=\"\",\"\",ROWS($A$1:A243))","v":""},{"$f":"PROPER(IF(Table1[[#This Row],[नाम]]=\"\",\"\",Table1[[#This Row],[नाम]]))","v":""},{"$nulls":8},220,{"$nulls":3},{"$f":"SUM(Table3[[#This Row],[GPF]:[अन्य 3]])","v":220}]
[{"$f":"IF(Table3[[#This Row],[नाम]]=\"\",\"\",ROWS($A$1:A244))","v":""},{"$f":"PROPER(IF(Table1[[#This Row],[नाम]]=\"\",\"\",Table1[[#This Row],[नाम]]))","v":""},{"$nulls":8},220,{"$nulls":3},{"$f":"SUM(Table3[[#This Row],[GPF]:[अन्य 3]])","v":220}]
[{"$f":"IF(Table3[[#This Row],[नाम]]=\"\",\"\",ROWS($A$1:A245))","v":""},{"$f":"PROPER(IF(Table1[[#This Row],[नाम]]=\"\",\"\",Table1[[#This Row],[नाम]]))","v":""},{"$nulls":8},220,{"$nulls":3},{"$f":"SUM(Table3[[#This Row],[GPF]:[अन्य 3]])","v":220}]
[{"$f":"IF(Table3[[#This Row],[नाम]]=\"\",\"\",ROWS($A$1:A246))","v":""},{"$f":"PROPER(IF(Table1[[#This Row],[नाम]]=\"\",\"\",Table1[[#This Row],[नाम]]))","v":""},{"$nulls":8},220,{"$nulls":3},{"$f":"SUM(Table3[[#This Row],[GPF]:[अन्य 3]])","v":220}]
[{"$f":"IF(Table3[[#This Row],[नाम]]=\"\",\"\",ROWS($A$1:A247))","v":""},{"$f":"PROPER(IF(Table1[[#This Row],[नाम]]=\"\",\"\",Table1[[#This Row],[नाम]]))","v":""},{"$nulls":8},220,{"$nulls":3},{"$f":"SUM(Table3[[#This Row],[GPF]:[अन्य 3]])","v":220}]
[{"$f":"IF(Table3[[#This Row],[नाम]]=\"\",\"\",ROWS($A$1:A248))","v":""},{"$f":"PROPER(IF(Table1[[#This Row],[नाम]]=\"\",\"\",Table1[[#This Row],[नाम]]))","v":""},{"$nulls":8},220,{"$nulls":3},{"$f":"SUM(Table3[[#This Row],[GPF]:[अन्य 3]])","v":220}]
[{"$f":"IF(Table3[[#This Row],[नाम]]=\"\",\"\",ROWS($A$1:A249))","v":""},{"$f":"PROPER(IF(Table1[[#This Row],[नाम]]=\"\",\"\",Table1[[#This Row],[नाम]]))","v":""},{"$nulls":8},220,{"$nulls":3},{"$f":"SUM(Table3[[#This Row],[GPF]:[अन्य 3]])","v":220}]
[{"$f":"IF(Table3[[#This Row],[नाम]]=\"\",\"\",ROWS($A$1:A250))","v":""},{"$f":"PROPER(IF(Table1[[#This Row],[नाम]]=\"\",\"\",Table1[[#This Row],[नाम]]))","v":""},{"$nulls":8},220,{"$nulls":3},{"$f":"SUM(Table3[[#This Row],[GPF]:[अन्य 3]])","v":220}]
[{"$f":"IF(Table3[[#This Row],[नाम]]=\"\",\"\",ROWS($A$1:A251))","v":""},{"$f":"PROPER(IF(Table1[[#This Row],[नाम]]=\"\",\"\",Table1[[#This Row],[नाम]]))","v":""},{"$nulls":8},220,{"$nulls":3},{"$f":"SUM(Table3[[#This Row],[GPF]:[अन्य 3]])","v":220}]
[{"$f":"IF(Table3[[#This Row],[नाम]]=\"\",\"\",ROWS($A$1:A252))","v":""},{"$f":"PROPER(IF(Table1[[#This Row],[नाम]]=\"\",\"\",Table1[[#This Row],[नाम]]))","v":""},{"$nulls":8},220,{"$nulls":3},{"$f":"SUM(Table3[[#This Row],[GPF]:[अन्य 3]])","v":220}]
[{"$f":"IF(Table3[[#This Row],[नाम]]=\"\",\"\",ROWS($A$1:A253))","v":""},{"$f":"PROPER(IF(Table1[[#This Row],[नाम]]=\"\",\"\",Table1[[#This Row],[नाम]]))","v":""},{"$nulls":8},220,{"$nulls":3},{"$f":"SUM(Table3[[#This Row],[GPF]:[अन्य 3]])","v":220}]
[{"$f":"IF(Table3[[#This Row],[नाम]]=\"\",\"\",ROWS($A$1:A254))","v":""},{"$f":"PROPER(IF(Table1[[#This Row],[नाम]]=\"\",\"\",Table1[[#This Row],[नाम]]))","v":""},{"$nulls":8},220,{"$nulls":3},{"$f":"SUM(Table3[[#This Row],[GPF]:[अन्य 3]])","v":220}]
[{"$f":"IF(Table3[[#This Row],[नाम]]=\"\",\"\",ROWS($A$1:A255))","v":""},{"$f":"PROPER(IF(Table1[[#This Row],[नाम]]=\"\",\"\",Table1[[#This Row],[नाम]]))","v":""},{"$nulls":8},220,{"$nulls":3},{"$f":"SUM(Table3[[#This Row],[GPF]:[अन्य 3]])","v":220}]
[{"$f":"IF(Table3[[#This Row],[नाम]]=\"\",\"\",ROWS($A$1:A256))","v":""},{"$f":"PROPER(IF(Table1[[#This Row],[नाम]]=\"\",\"\",Table1[[#This Row],[नाम]]))","v":""},{"$nulls":8},220,{"$nulls":3},{"$f":"SUM(Table3[[#This Row],[GPF]:[अन्य 3]])","v":220}]
[{"$f":"IF(Table3[[#This Row],[नाम]]=\"\",\"\",ROWS($A$1:A257))","v":""},{"$f":"PROPER(IF(Table1[[#This Row],[नाम]]=\"\",\"\",Table1[[#This Row],[नाम]]))","v":""},{"$nulls":8},220,{"$nulls":3},{"$f":"SUM(Table3[[#This Row],[GPF]:[अन्य 3]])","v":220}]
[{"$f":"IF(Table3[[#This Row],[नाम]]=\"\",\"\",ROWS($A$1:A258))","v":""},{"$f":"PROPER(IF(Table1[[#This Row],[नाम]]=\"\",\"\",Table1[[#This Row],[नाम]]))","v":""},{"$nulls":8},220,{"$nulls":3},{"$f":"SUM(Table3[[#This Row],[GPF]:[अन्य 3]])","v":220}]
[{"$f":"IF(Table3[[#This Row],[नाम]]=\"\",\"\",ROWS($A$1:A259))","v":""},{"$f":"PROPER(IF(Table1[[#This Row],[नाम]]=\"\",\"\",Table1[[#This Row],[नाम]]))","v":""},{"$nulls":8},220,{"$nulls":3},{"$f":"SUM(Table3[[#This Row],[GPF]:[अन्य 3]])","v":220}]
[{"$f":"IF(Table3[[#This Row],[नाम]]=\"\",\"\",ROWS($A$1:A260))","v":""},{"$f":"PROPER(IF(Table1[[#This Row],[नाम]]=\"\",\"\",Table1[[#This Row],[नाम]]))","v":""},{"$nulls":8},220,{"$nulls":3},{"$f":"SUM(Table3[[#This Row],[GPF]:[अन्य 3]])","v":220}]
[{"$f":"IF(Table3[[#This Row],[नाम]]=\"\",\"\",ROWS($A$1:A261))","v":""},{"$f":"PROPER(IF(Table1[[#This Row],[नाम]]=\"\",\"\",Table1[[#This Row],[नाम]]))","v":""},{"$nulls":8},220,{"$nulls":3},{"$f":"SUM(Table3[[#This Row],[GPF]:[अन्य 3]])","v":220}]
[{"$f":"IF(Table3[[#This Row],[नाम]]=\"\",\"\",ROWS($A$1:A262))","v":""},{"$f":"PROPER(IF(Table1[[#This Row],[नाम]]=\"\",\"\",Table1[[#This Row],[नाम]]))","v":""},{"$nulls":8},220,{"$nulls":3},{"$f":"SUM(Table3[[#This Row],[GPF]:[अन्य 3]])","v":220}]
[{"$f":"IF(Table3[[#This Row],[नाम]]=\"\",\"\",ROWS($A$1:A263))","v":""},{"$f":"PROPER(IF(Table1[[#This Row],[नाम]]=\"\",\"\",Table1[[#This Row],[नाम]]))","v":""},{"$nulls":8},220,{"$nulls":3},{"$f":"SUM(Table3[[#This Row],[GPF]:[अन्य 3]])","v":220}]
[{"$f":"IF(Table3[[#This Row],[नाम]]=\"\",\"\",ROWS($A$1:A264))","v":""},{"$f":"PROPER(IF(Table1[[#This Row],[नाम]]=\"\",\"\",Table1[[#This Row],[नाम]]))","v":""},{"$nulls":8},220,{"$nulls":3},{"$f":"SUM(Table3[[#This Row],[GPF]:[अन्य 3]])","v":220}]
[{"$f":"IF(Table3[[#This Row],[नाम]]=\"\",\"\",ROWS($A$1:A265))","v":""},{"$f":"PROPER(IF(Table1[[#This Row],[नाम]]=\"\",\"\",Table1[[#This Row],[नाम]]))","v":""},{"$nulls":8},220,{"$nulls":3},{"$f":"SUM(Table3[[#This Row],[GPF]:[अन्य 3]])","v":220}]
[{"$f":"IF(Table3[[#This Row],[नाम]]=\"\",\"\",ROWS($A$1:A266))","v":""},{"$f":"PROPER(IF(Table1[[#This Row],[नाम]]=\"\",\"\",Table1[[#This Row],[नाम]]))","v":""},{"$nulls":8},220,{"$nulls":3},{"$f":"SUM(Table3[[#This Row],[GPF]:[अन्य 3]])","v":220}]
[{"$f":"IF(Table3[[#This Row],[नाम]]=\"\",\"\",ROWS($A$1:A267))","v":""},{"$f":"PROPER(IF(Table1[[#This Row],[नाम]]=\"\",\"\",Table1[[#This Row],[नाम]]))","v":""},{"$nulls":8},220,{"$nulls":3},{"$f":"SUM(Table3[[#This Row],[GPF]:[अन्य 3]])","v":220}]
[{"$f":"IF(Table3[[#This Row],[नाम]]=\"\",\"\",ROWS($A$1:A268))","v":""},{"$f":"PROPER(IF(Table1[[#This Row],[नाम]]=\"\",\"\",Table1[[#This Row],[नाम]]))","v":""},{"$nulls":8},220,{"$nulls":3},{"$f":"SUM(Table3[[#This Row],[GPF]:[अन्य 3]])","v":220}]
[{"$f":"IF(Table3[[#This Row],[नाम]]=\"\",\"\",ROWS($A$1:A269))","v":""},{"$f":"PROPER(IF(Table1[[#This Row],[नाम]]=\"\",\"\",Table1[[#This Row],[नाम]]))","v":""},{"$nulls":8},220,{"$nulls":3},{"$f":"SUM(Table3[[#This Row],[GPF]:[अन्य 3]])","v":220}]
[{"$f":"IF(Table3[[#This Row],[नाम]]=\"\",\"\",ROWS($A$1:A270))","v":""},{"$f":"PROPER(IF(Table1[[#This Row],[नाम]]=\"\",\"\",Table1[[#This Row],[नाम]]))","v":""},{"$nulls":8},220,{"$nulls":3},{"$f":"SUM(Table3[[#This Row],[GPF]:[अन्य 3]])","v":220}]
[{"$f":"IF(Table3[[#This Row],[नाम]]=\"\",\"\",ROWS($A$1:A271))","v":""},{"$f":"PROPER(IF(Table1[[#This Row],[नाम]]=\"\",\"\",Table1[[#This Row],[नाम]]))","v":""},{"$nulls":8},220,{"$nulls":3},{"$f":"SUM(Table3[[#This Row],[GPF]:[अन्य 3]])","v":220}]
[{"$f":"IF(Table3[[#This Row],[नाम]]=\"\",\"\",ROWS($A$1:A272))","v":""},{"$f":"PROPER(IF(Table1[[#This Row],[नाम]]=\"\",\"\",Table1[[#This Row],[नाम]]))","v":""},{"$nulls":8},220,{"$nulls":3},{"$f":"SUM(Table3[[#This Row],[GPF]:[अन्य 3]])","v":220}]
[{"$f":"IF(Table3[[#This Row],[नाम]]=\"\",\"\",ROWS($A$1:A273))","v":""},{"$f":"PROPER(IF(Table1[[#This Row],[नाम]]=\"\",\"\",Table1[[#This Row],[नाम]]))","v":""},{"$nulls":8},220,{"$nulls":3},{"$f":"SUM(Table3[[#This Row],[GPF]:[अन्य 3]])","v":220}]
[{"$f":"IF(Table3[[#This Row],[नाम]]=\"\",\"\",ROWS($A$1:A274))","v":""},{"$f":"PROPER(IF(Table1[[#This Row],[नाम]]=\"\",\"\",Table1[[#This Row],[नाम]]))","v":""},{"$nulls":8},220,{"$nulls":3},{"$f":"SUM(Table3[[#This Row],[GPF]:[अन्य 3]])","v":220}]
[{"$f":"IF(Table3[[#This Row],[नाम]]=\"\",\"\",ROWS($A$1:A275))","v":""},{"$f":"PROPER(IF(Table1[[#This Row],[नाम]]=\"\",\"\",Table1[[#This Row],[नाम]]))","v":""},{"$nulls":8},220,{"$nulls":3},{"$f":"SUM(Table3[[#This Row],[GPF]:[अन्य 3]])","v":220}]
[{"$f":"IF(Table3[[#This Row],[नाम]]=\"\",\"\",ROWS($A$1:A276))","v":""},{"$f":"PROPER(IF(Table1[[#This Row],[नाम]]=\"\",\"\",Table1[[#This Row],[नाम]]))","v":""},{"$nulls":8},220,{"$nulls":3},{"$f":"SUM(Table3[[#This Row],[GPF]:[अन्य 3]])","v":220}]
[{"$f":"IF(Table3[[#This Row],[नाम]]=\"\",\"\",ROWS($A$1:A277))","v":""},{"$f":"PROPER(IF(Table1[[#This Row],[नाम]]=\"\",\"\",Table1[[#This Row],[नाम]]))","v":""},{"$nulls":8},220,{"$nulls":3},{"$f":"SUM(Table3[[#This Row],[GPF]:[अन्य 3]])","v":220}]
[{"$f":"IF(Table3[[#This Row],[नाम]]=\"\",\"\",ROWS($A$1:A278))","v":""},{"$f":"PROPER(IF(Table1[[#This Row],[नाम]]=\"\",\"\",Table1[[#This Row],[नाम]]))","v":""},{"$nulls":8},220,{"$nulls":3},{"$f":"SUM(Table3[[#This Row],[GPF]:[अन्य 3]])","v":220}]
[{"$f":"IF(Table3[[#This Row],[नाम]]=\"\",\"\",ROWS($A$1:A279))","v":""},{"$f":"PROPER(IF(Table1[[#This Row],[नाम]]=\"\",\"\",Table1[[#This Row],[नाम]]))","v":""},{"$nulls":8},220,{"$nulls":3},{"$f":"SUM(Table3[[#This Row],[GPF]:[अन्य 3]])","v":220}]
[{"$f":"IF(Table3[[#This Row],[नाम]]=\"\",\"\",ROWS($A$1:A280))","v":""},{"$f":"PROPER(IF(Table1[[#This Row],[नाम]]=\"\",\"\",Table1[[#This Row],[नाम]]))","v":""},{"$nulls":8},220,{"$nulls":3},{"$f":"SUM(Table3[[#This Row],[GPF]:[अन्य 3]])","v":220}]
[{"$f":"IF(Table3[[#This Row],[नाम]]=\"\",\"\",ROWS($A$1:A281))","v":""},{"$f":"PROPER(IF(Table1[[#This Row],[नाम]]=\"\",\"\",Table1[[#This Row],[नाम]]))","v":""},{"$nulls":8},220,{"$nulls":3},{"$f":"SUM(Table3[[#This Row],[GPF]:[अन्य 3]])","v":220}]
[{"$f":"IF(Table3[[#This Row],[नाम]]=\"\",\"\",ROWS($A$1:A282))","v":""},{"$f":"PROPER(IF(Table1[[#This Row],[नाम]]=\"\",\"\",Table1[[#This Row],[नाम]]))","v":""},{"$nulls":8},220,{"$nulls":3},{"$f":"SUM(Table3[[#This Row],[GPF]:[अन्य 3]])","v":220}]
[{"$f":"IF(Table3[[#This Row],[नाम]]=\"\",\"\",ROWS($A$1:A283))","v":""},{"$f":"PROPER(IF(Table1[[#This Row],[नाम]]=\"\",\"\",Table1[[#This Row],[नाम]]))","v":""},{"$nulls":8},220,{"$nulls":3},{"$f":"SUM(Table3[[#This Row],[GPF]:[अन्य 3]])","v":220}]
[{"$f":"IF(Table3[[#This Row],[नाम]]=\"\",\"\",ROWS($A$1:A284))","v":""},{"$f":"PROPER(IF(Table1[[#This Row],[नाम]]=\"\",\"\",Table1[[#This Row],[नाम]]))","v":""},{"$nulls":8},220,{"$nulls":3},{"$f":"SUM(Table3[[#This Row],[GPF]:[अन्य 3]])","v":220}]
[{"$f":"IF(Table3[[#This Row],[नाम]]=\"\",\"\",ROWS($A$1:A285))","v":""},{"$f":"PROPER(IF(Table1[[#This Row],[नाम]]=\"\",\"\",Table1[[#This Row],[नाम]]))","v":""},{"$nulls":8},220,{"$nulls":3},{"$f":"SUM(Table3[[#This Row],[GPF]:[अन्य 3]])","v":220}]
[{"$f":"IF(Table3[[#This Row],[नाम]]=\"\",\"\",ROWS($A$1:A286))","v":""},{"$f":"PROPER(IF(Table1[[#This Row],[नाम]]=\"\",\"\",Table1[[#This Row],[नाम]]))","v":""},{"$nulls":8},220,{"$nulls":3},{"$f":"SUM(Table3[[#This Row],[GPF]:[अन्य 3]])","v":220}]
[{"$f":"IF(Table3[[#This Row],[नाम]]=\"\",\"\",ROWS($A$1:A287))","v":""},{"$f":"PROPER(IF(Table1[[#This Row],[नाम]]=\"\",\"\",Table1[[#This Row],[नाम]]))","v":""},{"$nulls":8},220,{"$nulls":3},{"$f":"SUM(Table3[[#This Row],[GPF]:[अन्य 3]])","v":220}]
[{"$f":"IF(Table3[[#This Row],[नाम]]=\"\",\"\",ROWS($A$1:A288))","v":""},{"$f":"PROPER(IF(Table1[[#This Row],[नाम]]=\"\",\"\",Table1[[#This Row],[नाम]]))","v":""},{"$nulls":8},220,{"$nulls":3},{"$f":"SUM(Table3[[#This Row],[GPF]:[अन्य 3]])","v":220}]
[{"$f":"IF(Table3[[#This Row],[नाम]]=\"\",\"\",ROWS($A$1:A289))","v":""},{"$f":"PROPER(IF(Table1[[#This Row],[नाम]]=\"\",\"\",Table1[[#This Row],[नाम]]))","v":""},{"$nulls":8},220,{"$nulls":3},{"$f":"SUM(Table3[[#This Row],[GPF]:[अन्य 3]])","v":220}]
[{"$f":"IF(Table3[[#This Row],[नाम]]=\"\",\"\",ROWS($A$1:A290))","v":""},{"$f":"PROPER(IF(Table1[[#This Row],[नाम]]=\"\",\"\",Table1[[#This Row],[नाम]]))","v":""},{"$nulls":8},220,{"$nulls":3},{"$f":"SUM(Table3[[#This Row],[GPF]:[अन्य 3]])","v":220}]
[{"$f":"IF(Table3[[#This Row],[नाम]]=\"\",\"\",ROWS($A$1:A291))","v":""},{"$f":"PROPER(IF(Table1[[#This Row],[नाम]]=\"\",\"\",Table1[[#This Row],[नाम]]))","v":""},{"$nulls":8},220,{"$nulls":3},{"$f":"SUM(Table3[[#This Row],[GPF]:[अन्य 3]])","v":220}]
[{"$f":"IF(Table3[[#This Row],[नाम]]=\"\",\"\",ROWS($A$1:A292))","v":""},{"$f":"PROPER(IF(Table1[[#This Row],[नाम]]=\"\",\"\",Table1[[#This Row],[नाम]]))","v":""},{"$nulls":8},220,{"$nulls":3},{"$f":"SUM(Table3[[#This Row],[GPF]:[अन्य 3]])","v":220}]
[{"$f":"IF(Table3[[#This Row],[नाम]]=\"\",\"\",ROWS($A$1:A293))","v":""},{"$f":"PROPER(IF(Table1[[#This Row],[नाम]]=\"\",\"\",Table1[[#This Row],[नाम]]))","v":""},{"$nulls":8},220,{"$nulls":3},{"$f":"SUM(Table3[[#This Row],[GPF]:[अन्य 3]])","v":220}]
[{"$f":"IF(Table3[[#This Row],[नाम]]=\"\",\"\",ROWS($A$1:A294))","v":""},{"$f":"PROPER(IF(Table1[[#This Row],[नाम]]=\"\",\"\",Table1[[#This Row],[नाम]]))","v":""},{"$nulls":8},220,{"$nulls":3},{"$f":"SUM(Table3[[#This Row],[GPF]:[अन्य 3]])","v":220}]
[{"$f":"IF(Table3[[#This Row],[नाम]]=\"\",\"\",ROWS($A$1:A295))","v":""},{"$f":"PROPER(IF(Table1[[#This Row],[नाम]]=\"\",\"\",Table1[[#This Row],[नाम]]))","v":""},{"$nulls":8},220,{"$nulls":3},{"$f":"SUM(Table3[[#This Row],[GPF]:[अन्य 3]])","v":220}]
[{"$f":"IF(Table3[[#This Row],[नाम]]=\"\",\"\",ROWS($A$1:A296))","v":""},{"$f":"PROPER(IF(Table1[[#This Row],[नाम]]=\"\",\"\",Table1[[#This Row],[नाम]]))","v":""},{"$nulls":8},220,{"$nulls":3},{"$f":"SUM(Table3[[#This Row],[GPF]:[अन्य 3]])","v":220}]

{"sheet":"Edit Pay Posting","index":5,"n_rows":60,"n_cols":20,"rows_kept":60,"merged":[[0,0,0,13],[0,15,1,17],[1,0,1,13],[2,0,2,13],[3,1,3,3],[3,5,3,7],[3,9,3,10],[3,12,3,13],[3,15,3,17],[4,1,4,3],[4,5,4,7],[4,9,4,10],[4,12,4,13],[4,15,4,16],[5,1,5,3],[5,5,5,7],[5,9,5,10],[5,12,5,13],[5,15,6,17],[5,18,6,18],[6,0,6,13],[7,15,7,17],[8,0,12,0],[13,0,13,13],[14,0,14,13],[15,0,15,1],[16,0,16,1],[17,0,17,1],[18,0,18,1],[19,0,19,1],[20,0,20,1],[21,0,21,1],[22,0,22,1],[23,0,23,1],[24,0,24,1],[25,0,25,1],[26,0,26,13],[27,0,27,13],[28,0,28,1],[29,0,29,1],[30,0,30,1],[31,0,31,1],[32,0,32,1],[33,0,33,1],[34,0,34,1],[35,0,35,1],[36,0,36,1],[37,0,37,1],[38,0,38,1],[39,0,39,1],[40,0,40,1],[41,0,41,1],[42,0,42,1],[43,0,43,1],[44,0,44,13],[45,2,45,13],[50,0,50,1],[51,0,51,13],[52,0,53,0],[52,2,52,13],[54,0,54,13],[55,0,55,1],[56,0,56,13],[57,0,57,1],[58,0,58,13],[59,0,59,1]]}
[{"$f":"'Emp. Data'!A1","v":"Government Senior Secondary School, Rooppura"},{"$nulls":14},2,{"$nulls":3},{"$f":"VLOOKUP($P$1,Table1[#All],16,0)","v":"No"}]
["Pay Posting Register",{"$nulls":18},{"$f":"VLOOKUP($P$1,Table1[#All],7,0)","v":"Yes"}]
[]
["नाम-",{"$f":"IFERROR(PROPER(VLOOKUP($P$1,Table1[#All],2,0)),\"NoData\")","v":"Ashwini Kumar"},null,null,"पद-",{"$f":"IFERROR(PROPER(VLOOKUP($P$1,Table1[#All],3,0)),\"NoData\")","v":"Senior Teacher (Ii Gr.)"},null,null,"DOB-",{"$f":"IFERROR(VLOOKUP($P$1,Table1[#All],4,0),\"NoData\")","v":"1988-02-06"},null,"पैन नंबर-",{"$f":"IFERROR(VLOOKUP($P$1,Table1[#All],5,0),\"NoData\")","v":"XXXXK5921Q"},null,null,"If Basic Change"]
["Emp. ID-",{"$f":"IFERROR(VLOOKUP($P$1,Table1[#All],6,0),\"NoData\")","v":"RJNA201228008021"},null,null,"SI No.-",{"$f":"IFERROR(VLOOKUP($P$1,Table1[#All],9,0),\"NoData\")","v":123},null,null,"GPF No.-",{"$f":"IFERROR(VLOOKUP($P$1,Table1[#All],10,0),\"NoData\")","v":1234},null,"PRAN No.",{"$f":"IFERROR(VLOOKUP($P$1,Table1[#All],11,0),\"NoData\")","v":1234567891011},null,null,"DEC",null,47000]
["आधार कार्ड नंबर-",{"$f":"IFERROR(VLOOKUP($P$1,Table1[#All],12,0),\"NoData\")","v":"XXXXXXXX6191"},null,null,"बैंक नाम-",{"$f":"IFERROR(VLOOKUP($P$1,Table1[#All],13,0),\"NoData\")","v":"SBI"},null,null,"IFSC Cod-",{"$f":"IFERROR(VLOOKUP($P$1,Table1[#All],14,0),\"NoData\")","v":"SBIN0031733"},null,"बैंक A/c-",{"$f":"IFERROR(VLOOKUP($P$1,Table1[#All],15,0),\"NoData\")","v":1234567891011},null,null,"Surrender Month",null,null,"राजपत्रित"]
[]
[{"$f":"$B$4","v":"Ashwini Kumar"},"Month","APR","MAY","JUN","JUL","AUG","SEP","OCT","NOV","DEC","JAN","FEB","MAR",null,"OCT",null,null,"Yes"]
["वेतन एवं कटौती का विवरण","DA Rates",{"v":0.17,"d":"17%"},{"v":0.17,"d":"17%"},{"v":0.17,"d":"17%"},{"v":0.17,"d":"17%"},{"v":0.17,"d":"17%"},{"v":0.17,"d":"17%"},{"v":0.17,"d":"17%"},{"v":0.17,"d":"17%"},{"v":0.17,"d":"17%"},{"v":0.17,"d":"17%"},{"v":0.17,"d":"17%"},{"v":0.17,"d":"17%"}]
[null,"Bill No.",{"$f":"IFERROR(VLOOKUP(C8,'Bill and TV No.'!$B$3:$F$15,2,0),\"\")","v":1},{"$f":"IFERROR(VLOOKUP(D8,'Bill and TV No.'!$B$3:$F$15,2,0),\"\")","v":2},{"$f":"IFERROR(VLOOKUP(E8,'Bill and TV No.'!$B$3:$F$15,2,0),\"\")","v":3},{"$f":"IFERROR(VLOOKUP(F8,'Bill and TV No.'!$B$3:$F$15,2,0),\"\")","v":4},{"$f":"IFERROR(VLOOKUP(G8,'Bill and TV No.'!$B$3:$F$15,2,0),\"\")","v":5},{"$f":"IFERROR(VLOOKUP(H8,'Bill and TV No.'!$B$3:$F$15,2,0),\"\")","v":6},{"$f":"IFERROR(VLOOKUP(I8,'Bill and TV No.'!$B$3:$F$15,2,0),\"\")","v":7},{"$f":"IFERROR(VLOOKUP(J8,'Bill and TV No.'!$B$3:$F$15,2,0),\"\")","v":8},{"$f":"IFERROR(VLOOKUP(K8,'Bill and TV No.'!$B$3:$F$15,2,0),\"\")","v":9},{"$f":"IFERROR(VLOOKUP(L8,'Bill and TV No.'!$B$3:$F$15,2,0),\"\")","v":10},{"$f":"IFERROR(VLOOKUP(M8,'Bill and TV No.'!$B$3:$F$15,2,0),\"\")","v":11},{"$f":"IFERROR(VLOOKUP(N8,'Bill and TV No.'!$B$3:$F$15,2,0),\"\")","v":12}]
[null,"Date",{"$f":"IFERROR(VLOOKUP(C8,'Bill and TV No.'!$B$3:$F$15,3,0),\"\")","v":"2021-03-21"},{"$f":"IFERROR(VLOOKUP(D8,'Bill and TV No.'!$B$3:$F$15,3,0),\"\")","v":"2021-03-22"},{"$f":"IFERROR(VLOOKUP(E8,'Bill and TV No.'!$B$3:$F$15,3,0),\"\")","v":"2021-03-23"},{"$f":"IFERROR(VLOOKUP(F8,'Bill and TV No.'!$B$3:$F$15,3,0),\"\")","v":"2021-03-24"},{"$f":"IFERROR(VLOOKUP(G8,'Bill and TV No.'!$B$3:$F$15,3,0),\"\")","v":"2021-03-25"},{"$f":"IFERROR(VLOOKUP(H8,'Bill and TV No.'!$B$3:$F$15,3,0),\"\")","v":"2021-03-26"},{"$f":"IFERROR(VLOOKUP(I8,'Bill and TV No.'!$B$3:$F$15,3,0),\"\")","v":"2021-03-27"},{"$f":"IFERROR(VLOOKUP(J8,'Bill and TV No.'!$B$3:$F$15,3,0),\"\")","v":"2021-03-28"},{"$f":"IFERROR(VLOOKUP(K8,'Bill and TV No.'!$B$3:$F$15,3,0),\"\")","v":"2021-03-29"},{"$f":"IFERROR(VLOOKUP(L8,'Bill and TV No.'!$B$3:$F$15,3,0),\"\")","v":"2021-03-30"},{"$f":"IFERROR(VLOOKUP(M8,'Bill and TV No.'!$B$3:$F$15,3,0),\"\")","v":"2021-03-31"},{"$f":"IFERROR(VLOOKUP(N8,'Bill and TV No.'!$B$3:$F$15,3,0),\"\")","v":"2021-04-01"}]
[null,"TV No.",{"$f":"IFERROR(VLOOKUP(C8,'Bill and TV No.'!$B$3:$F$15,4,0),\"\")","v":6258},{"$f":"IFERROR(VLOOKUP(D8,'Bill and TV No.'!$B$3:$F$15,4,0),\"\")","v":6259},{"$f":"IFERROR(VLOOKUP(E8,'Bill and TV No.'!$B$3:$F$15,4,0),\"\")","v":6260},{"$f":"IFERROR(VLOOKUP(F8,'Bill and TV No.'!$B$3:$F$15,4,0),\"\")","v":6261},{"$f":"IFERROR(VLOOKUP(G8,'Bill and TV No.'!$B$3:$F$15,4,0),\"\")","v":6262},{"$f":"IFERROR(VLOOKUP(H8,'Bill and TV No.'!$B$3:$F$15,4,0),\"\")","v":6263},{"$f":"IFERROR(VLOOKUP(I8,'Bill and TV No.'!$B$3:$F$15,4,0),\"\")","v":6264},{"$f":"IFERROR(VLOOKUP(J8,'Bill and TV No.'!$B$3:$F$15,4,0),\"\")","v":6265},{"$f":"IFERROR(VLOOKUP(K8,'Bill and TV No.'!$B$3:$F$15,4,0),\"\")","v":6266},{"$f":"IFERROR(VLOOKUP(L8,'Bill and TV No.'!$B$3:$F$15,4,0),\"\")","v":6267},{"$f":"IFERROR(VLOOKUP(M8,'Bill and TV No.'!$B$3:$F$15,4,0),\"\")","v":6268},{"$f":"IFERROR(VLOOKUP(N8,'Bill and TV No.'!$B$3:$F$15,4,0),\"\")","v":6269}]
[null,"Date",{"$f":"IFERROR(VLOOKUP(C8,'Bill and TV No.'!$B$3:$F$15,5,0),\"\")","v":"2021-04-01"},{"$f":"IFERROR(VLOOKUP(D8,'Bill and TV No.'!$B$3:$F$15,5,0),\"\")","v":"2021-04-02"},{"$f":"IFERROR(VLOOKUP(E8,'Bill and TV No.'!$B$3:$F$15,5,0),\"\")","v":"2021-04-03"},{"$f":"IFERROR(VLOOKUP(F8,'Bill and TV No.'!$B$3:$F$15,5,0),\"\")","v":"2021-04-04"},{"$f":"IFERROR(VLOOKUP(G8,'Bill and TV No.'!$B$3:$F$15,5,0),\"\")","v":"2021-04-05"},{"$f":"IFERROR(VLOOKUP(H8,'Bill and TV No.'!$B$3:$F$15,5,0),\"\")","v":"2021-04-06"},{"$f":"IFERROR(VLOOKUP(I8,'Bill and TV No.'!$B$3:$F$15,5,0),\"\")","v":"2021-04-07"},{"$f":"IFERROR(VLOOKUP(J8,'Bill and TV No.'!$B$3:$F$15,5,0),\"\")","v":"2021-04-08"},{"$f":"IFERROR(VLOOKUP(K8,'Bill and TV No.'!$B$3:$F$15,5,0),\"\")","v":"2021-04-09"},{"$f":"IFERROR(VLOOKUP(L8,'Bill and TV No.'!$B$3:$F$15,5,0),\"\")","v":"2021-04-10"},{"$f":"IFERROR(VLOOKUP(M8,'Bill and TV No.'!$B$3:$F$15,5,0),\"\")","v":"2021-04-11"},{"$f":"IFERROR(VLOOKUP(N8,'Bill and TV No.'!$B$3:$F$15,5,0),\"\")","v":"2021-04-12"}]
[]
["(अ) वेतन"]
["मूल वेतन",null,{"$f":"VLOOKUP($P$1,Table2[#All],3,0)","v":43800},{"$f":"IF(D8=$P$5,$R$5,C16)","v":43800},{"$f":"IF(E8=$P$5,$R$5,D16)","v":43800},{"$f":"IF(AND($B$4=VLOOKUP($P$1,Table1[#All],2,0),$T$1=\"YES\"),$E$16,MROUND(E16*1.03,100))","v":45100},{"$f":"IF(G8=$P$5,$R$5,F16)","v":45100},{"$f":"IF(H8=$P$5,$R$5,G16)","v":45100},45100,45100,47000,47000,47000,47000]
["अवकाश वेतन ",null,{"$f":"VLOOKUP($P$1,Table2[#All],4,0)","v":0},{"$f":"C17","v":0},{"$f":"D17","v":0},0,0,0,0,0,0,0,0,0]
["विशेष वेतन",null,{"$f":"VLOOKUP($P$1,Table2[#All],5,0)","v":0},{"$f":"C18","v":0},{"$f":"D18","v":0},0,0,0,0,0,0,0,0,0]
["मंहगाई भत्ता",null,{"$f":"IF($T$1=\"Yes\",0,IF(C16=\"\",\"\",ROUND(C16*C9,0)))","v":7446},{"$f":"IF($T$1=\"Yes\",0,IF(D16=\"\",\"\",ROUND(D16*D9,0)))","v":7446},7446,7667,7667,7667,7667,7667,7990,7990,7990,7990]
["मकान किराया भत्ता",null,{"$f":"IF($T$1=\"Yes\",0,IF(OR(C16=\"\",VLOOKUP($P$1,Table1[#All],8,0)=\"NA\"),0,ROUND(C16*VLOOKUP($P$1,Table1[#All],8,0),0)))","v":3504},{"$f":"IF($T$1=\"Yes\",0,IF(OR(D16=\"\",VLOOKUP($P$1,Table1[#All],8,0)=\"NA\"),0,ROUND(D16*VLOOKUP($P$1,Table1[#All],8,0),0)))","v":3504},{"$f":"IF($T$1=\"Yes\",0,IF(OR(E16=\"\",VLOOKUP($P$1,Table1[#All],8,0)=\"NA\"),0,ROUND(E16*VLOOKUP($P$1,Table1[#All],8,0),0)))","v":3504},{"$f":"IF($T$1=\"Yes\",0,IF(OR(F16=\"\",VLOOKUP($P$1,Table1[#All],8,0)=\"NA\"),0,ROUND(F16*VLOOKUP($P$1,Table1[#All],8,0),0)))","v":3608},{"$f":"IF($T$1=\"Yes\",0,IF(OR(G16=\"\",VLOOKUP($P$1,Table1[#All],8,0)=\"NA\"),0,ROUND(G16*VLOOKUP($P$1,Table1[#All],8,0),0)))","v":3608},{"$f":"IF($T$1=\"Yes\",0,IF(OR(H16=\"\",VLOOKUP($P$1,Table1[#All],8,0)=\"NA\"),0,ROUND(H16*VLOOKUP($P$1,Table1[#All],8,0),0)))","v":3608},{"$f":"IF($T$1=\"Yes\",0,IF(OR(I16=\"\",VLOOKUP($P$1,Table1[#All],8,0)=\"NA\"),0,ROUND(I16*VLOOKUP($P$1,Table1[#All],8,0),0)))","v":3608},{"$f":"IF($T$1=\"Yes\",0,IF(OR(J16=\"\",VLOOKUP($P$1,Table1[#All],8,0)=\"NA\"),0,ROUND(J16*VLOOKUP($P$1,Table1[#All],8,0),0)))","v":3608},{"$f":"IF($T$1=\"Yes\",0,IF(OR(K16=\"\",VLOOKUP($P$1,Table1[#All],8,0)=\"NA\"),0,ROUND(K16*VLOOKUP($P$1,Table1[#All],8,0),0)))","v":3760},{"$f":"IF($T$1=\"Yes\",0,IF(OR(L16=\"\",VLOOKUP($P$1,Table1[#All],8,0)=\"NA\"),0,ROUND(L16*VLOOKUP($P$1,Table1[#All],8,0),0)))","v":3760},{"$f":"IF($T$1=\"Yes\",0,IF(OR(M16=\"\",VLOOKUP($P$1,Table1[#All],8,0)=\"NA\"),0,ROUND(M16*VLOOKUP($P$1,Table1[#All],8,0),0)))","v":3760},{"$f":"IF($T$1=\"Yes\",0,IF(OR(N16=\"\",VLOOKUP($P$1,Table1[#All],8,0)=\"NA\"),0,ROUND(N16*VLOOKUP($P$1,Table1[#All],8,0),0)))","v":3760}]
["विकलांग भत्ता",null,{"$f":"VLOOKUP($P$1,Table2[#All],6,0)","v":0},{"$f":"C21","v":0},{"$f":"D21","v":0},0,0,0,0,0,0,0,0,0]
["शहरी भत्ता ",null,{"$f":"VLOOKUP($P$1,Table2[#All],7,0)","v":0},{"$f":"C22","v":0},{"$f":"D22","v":0},0,0,0,0,0,0,0,0,0]
["अन्य 1",null,{"$f":"VLOOKUP($P$1,Table2[#All],8,0)","v":0},{"$f":"C23","v":0},{"$f":"D23","v":0},0,0,0,0,0,0,0,0,0]
["अन्य 2",null,{"$f":"VLOOKUP($P$1,Table2[#All],9,0)","v":0},{"$f":"C24","v":0},{"$f":"D24","v":0},0,0,0,0,0,0,0,0,0]
["अन्य 3",null,{"$f":"VLOOKUP($P$1,Table2[#All],10,0)","v":0},{"$f":"C25","v":0},{"$f":"D25","v":0},0,0,0,0,0,0,0,0,0]
["योग (अ)",null,{"$f":"SUM(C16:C25)","v":54750},{"$f":"SUM(D16:D25)","v":54750},54750,56375,56375,56375,56375,56375,58750,58750,58750,58750]
[]
["(ब) कटौतियां"]
["GPF",null,{"$f":"VLOOKUP($P$1,Table3[#All],3,0)","v":0},{"$f":"C29","v":0},{"$f":"D29","v":0},0,0,0,0,0,0,0,0,0]
["GPF Loan",null,{"$f":"VLOOKUP($P$1,Table3[#All],4,0)","v":0},{"$f":"C30","v":0},{"$f":"D30","v":0},0,0,0,0,0,0,0,0,0]
["NPS",null,{"$f":"IF($T$2=\"No\",0,ROUND(SUM(C16,C19)*10%,0))","v":5125},{"$f":"IF($T$2=\"No\",0,ROUND(SUM(D16,D19)*10%,0))","v":5125},5125,5277,5277,5277,5277,5277,5499,5499,5499,5499]
["SI",null,{"$f":"VLOOKUP($P$1,Table3[#All],5,0)","v":3000},{"$f":"C32","v":3000},{"$f":"D32","v":3000},3000,3000,3000,3000,3000,3000,3000,3000,3000]
["SI Loan",null,{"$f":"VLOOKUP($P$1,Table3[#All],6,0)","v":0},0,{"$f":"D33","v":0},0,0,0,0,0,0,0,0,0]
["ITAX",null,{"$f":"VLOOKUP($P$1,Table3[#All],7,0)","v":0},0,{"$f":"D34","v":0},0,0,0,0,0,0,0,0,0]
["RPMF",null,{"$f":"VLOOKUP($P$1,Table3[#All],8,0)","v":0},0,{"$f":"D35","v":0},0,0,0,0,0,0,0,0,0]
["LIC",null,{"$f":"VLOOKUP($P$1,Table3[#All],9,0)","v":0},0,{"$f":"D36","v":0},0,0,0,0,0,0,0,0,0]
["CM CORONA",null,{"$f":"VLOOKUP($P$1,Table3[#All],10,0)","v":0},0,{"$f":"D37","v":0},0,0,0,0,0,0,0,0,0]
["GIS",null,{"$f":"VLOOKUP($P$1,Table3[#All],11,0)","v":220},0,0,0,0,0,0,0,0,0,0,0]
["हितकारी निधि ",null,0,0,0,0,0,0,0,0,{"$f":"IF($S$8=\"Yes\",500,250)","v":500},0,0,0]
["अन्य 1",null,{"$f":"VLOOKUP($P$1,Table3[#All],13,0)","v":0},{"$f":"C40","v":0},{"$f":"D40","v":0},0,0,0,0,0,0,0,0,0]
["अन्य 2",null,{"$f":"VLOOKUP($P$1,Table3[#All],14,0)","v":0},{"$f":"C41","v":0},{"$f":"D41","v":0},0,0,0,0,0,0,0,0,0]
["अन्य 3",null,{"$f":"VLOOKUP($P$1,Table3[#All],15,0)","v":3220},{"$f":"C42","v":3220},{"$f":"D42","v":3220},3220,3220,3220,3220,3220,3220,3220,3220,3220]
["योग (ब)",null,{"$f":"SUM(C29:C42)","v":11565},{"$f":"SUM(D29:D42)","v":11345},11345,11497,11497,11497,11497,11497,12219,11719,11719,11719]
["कुल देय वेतन राशि (अ-ब)",null,{"$f":"C26-C43","v":43185},{"$f":"D26-D43","v":43405},43405,44878,44878,44878,44878,44878,46531,47031,47031,47031]
[]
["Arrear Type","Bill No. and TV No.","(स) शेष बकाया भुगतान का विवरण"]
["Arrear 1"]
["Arrear 2"]
["Arrear 3"]
["Arrear 4"]
["कुल राशि",null,{"$f":"SUM(C47:C50)","v":0},{"$f":"SUM(D47:D50)","v":0},0,0,0,0,0,0,0,0,0,0]
[]
["समर्पित या अंतिम उपार्जित अवकाश","Bill No. and TV No.","(द) समर्पित या अंतिम उपार्जित अवकाश का भुगतान विवरण"]
[null,null,{"$f":"ROUND(IF($P$8=C8,SUM(C16+C19)/2,0),0)","v":0},0,0,0,0,0,26384,0,0,0,0,0]
[]
["सकल योग माह",null,{"$f":"SUM(C44,C50,C54)","v":43185},{"$f":"SUM(D44,D50,D54)","v":43405},43405,44878,44878,44878,71262,44878,46531,47031,47031,47031]
[]
["लिपिक के हस्ताक्षर"]
[]
["DDO के हस्ताक्षर"]

{"sheet":"Print Pay Posting","index":6,"n_rows":60,"n_cols":14,"rows_kept":60,"merged":[[0,0,0,13],[1,0,1,13],[2,0,2,13],[3,1,3,3],[3,5,3,7],[3,9,3,10],[3,12,3,13],[4,1,4,3],[4,5,4,7],[4,9,4,10],[4,12,4,13],[5,1,5,3],[5,5,5,7],[5,9,5,10],[5,12,5,13],[6,0,6,13],[8,0,12,0],[13,0,13,13],[14,0,14,13],[15,0,15,1],[16,0,16,1],[17,0,17,1],[18,0,18,1],[19,0,19,1],[20,0,20,1],[21,0,21,1],[22,0,22,1],[23,0,23,1],[24,0,24,1],[25,0,25,1],[26,0,26,13],[27,0,27,13],[28,0,28,1],[29,0,29,1],[30,0,30,1],[31,0,31,1],[32,0,32,1],[33,0,33,1],[34,0,34,1],[35,0,35,1],[36,0,36,1],[37,0,37,1],[38,0,38,1],[39,0,39,1],[40,0,40,1],[41,0,41,1],[42,0,42,1],[43,0,43,1],[44,0,44,13],[45,2,45,13],[50,0,50,1],[51,0,51,13],[52,0,53,0],[52,2,52,13],[54,0,54,13],[55,0,55,1],[56,0,56,13],[57,0,57,1],[58,0,58,13],[59,0,59,1]]}
[{"$f":"'Edit Pay Posting'!A1","v":"Government Senior Secondary School, Rooppura"}]
["Pay Posting Register"]
[]
["नाम-",{"$f":"'Edit Pay Posting'!B4","v":"Ashwini Kumar"},null,null,"पद-",{"$f":"'Edit Pay Posting'!F4","v":"Senior Teacher (Ii Gr.)"},null,null,"DOB-",{"$f":"'Edit Pay Posting'!J4","v":"1988-02-06"},null,"पैन नंबर-",{"$f":"'Edit Pay Posting'!M4","v":"XXXXK5921Q"}]
["Emp. ID-",{"$f":"'Edit Pay Posting'!B5","v":"RJNA201228008021"},null,null,"SI No.-",{"$f":"'Edit Pay Posting'!F5","v":123},null,null,"GPF No.-",{"$f":"'Edit Pay Posting'!J5","v":1234},null,"PRAN No.",{"$f":"'Edit Pay Posting'!M5","v":1234567891011}]
["आधार कार्ड नंबर-",{"$f":"'Edit Pay Posting'!B6","v":"XXXXXXXX6191"},null,null,"बैंक नाम-",{"$f":"'Edit Pay Posting'!F6","v":"SBI"},null,null,"IFSC Cod-",{"$f":"'Edit Pay Posting'!J6","v":"SBIN0031733"},null,"बैंक A/c-",{"$f":"'Edit Pay Posting'!M6","v":1234567891011}]
[]
[{"$f":"'Edit Pay Posting'!A8","v":"Ashwini Kumar"},"Month","APR","MAY","JUN","JUL","AUG","SEP","OCT","NOV","DEC","JAN","FEB","MAR"]
["वेतन एवं कटौती का विवरण","DA Rates",{"$f":"'Edit Pay Posting'!C9","v":{"v":0.17,"d":"17%"}},{"$f":"'Edit Pay Posting'!D9","v":{"v":0.17,"d":"17%"}},{"$f":"'Edit Pay Posting'!E9","v":{"v":0.17,"d":"17%"}},{"$f":"'Edit Pay Posting'!F9","v":{"v":0.17,"d":"17%"}},{"$f":"'Edit Pay Posting'!G9","v":{"v":0.17,"d":"17%"}},{"$f":"'Edit Pay Posting'!H9","v":{"v":0.17,"d":"17%"}},{"$f":"'Edit Pay Posting'!I9","v":{"v":0.17,"d":"17%"}},{"$f":"'Edit Pay Posting'!J9","v":{"v":0.17,"d":"17%"}},{"$f":"'Edit Pay Posting'!K9","v":{"v":0.17,"d":"17%"}},{"$f":"'Edit Pay Posting'!L9","v":{"v":0.17,"d":"17%"}},{"$f":"'Edit Pay Posting'!M9","v":{"v":0.17,"d":"17%"}},{"$f":"'Edit Pay Posting'!N9","v":{"v":0.17,"d":"17%"}}]
[null,"Bill No.",{"$f":"'Edit Pay Posting'!C10","v":1},{"$f":"'Edit Pay Posting'!D10","v":2},{"$f":"'Edit Pay Posting'!E10","v":3},{"$f":"'Edit Pay Posting'!F10","v":4},{"$f":"'Edit Pay Posting'!G10","v":5},{"$f":"'Edit Pay Posting'!H10","v":6},{"$f":"'Edit Pay Posting'!I10","v":7},{"$f":"'Edit Pay Posting'!J10","v":8},{"$f":"'Edit Pay Posting'!K10","v":9},{"$f":"'Edit Pay Posting'!L10","v":10},{"$f":"'Edit Pay Posting'!M10","v":11},{"$f":"'Edit Pay Posting'!N10","v":12}]
[null,"Date",{"$f":"'Edit Pay Posting'!C11","v":"2021-03-21"},{"$f":"'Edit Pay Posting'!D11","v":"2021-03-22"},{"$f":"'Edit Pay Posting'!E11","v":"2021-03-23"},{"$f":"'Edit Pay Posting'!F11","v":"2021-03-24"},{"$f":"'Edit Pay Posting'!G11","v":"2021-03-25"},{"$f":"'Edit Pay Posting'!H11","v":"2021-03-26"},{"$f":"'Edit Pay Posting'!I11","v":"2021-03-27"},{"$f":"'Edit Pay Posting'!J11","v":"2021-03-28"},{"$f":"'Edit Pay Posting'!K11","v":"2021-03-29"},{"$f":"'Edit Pay Posting'!L11","v":"2021-03-30"},{"$f":"'Edit Pay Posting'!M11","v":"2021-03-31"},{"$f":"'Edit Pay Posting'!N11","v":"2021-04-01"}]
[null,"TV No.",{"$f":"'Edit Pay Posting'!C12","v":"1917-02-17"},{"$f":"'Edit Pay Posting'!D12","v":"1917-02-18"},{"$f":"'Edit Pay Posting'!E12","v":"1917-02-19"},{"$f":"'Edit Pay Posting'!F12","v":"1917-02-20"},{"$f":"'Edit Pay Posting'!G12","v":"1917-02-21"},{"$f":"'Edit Pay Posting'!H12","v":"1917-02-22"},{"$f":"'Edit Pay Posting'!I12","v":"1917-02-23"},{"$f":"'Edit Pay Posting'!J12","v":"1917-02-24"},{"$f":"'Edit Pay Posting'!K12","v":"1917-02-25"},{"$f":"'Edit Pay Posting'!L12","v":"1917-02-26"},{"$f":"'Edit Pay Posting'!M12","v":"1917-02-27"},{"$f":"'Edit Pay Posting'!N12","v":"1917-02-28"}]
[null,"Date",{"$f":"'Edit Pay Posting'!C13","v":"2021-04-01"},{"$f":"'Edit Pay Posting'!D13","v":"2021-04-02"},{"$f":"'Edit Pay Posting'!E13","v":"2021-04-03"},{"$f":"'Edit Pay Posting'!F13","v":"2021-04-04"},{"$f":"'Edit Pay Posting'!G13","v":"2021-04-05"},{"$f":"'Edit Pay Posting'!H13","v":"2021-04-06"},{"$f":"'Edit Pay Posting'!I13","v":"2021-04-07"},{"$f":"'Edit Pay Posting'!J13","v":"2021-04-08"},{"$f":"'Edit Pay Posting'!K13","v":"2021-04-09"},{"$f":"'Edit Pay Posting'!L13","v":"2021-04-10"},{"$f":"'Edit Pay Posting'!M13","v":"2021-04-11"},{"$f":"'Edit Pay Posting'!N13","v":"2021-04-12"}]
[]
["(अ) वेतन"]
[{"$f":"'Edit Pay Posting'!A16","v":"मूल वेतन"},null,{"$f":"'Edit Pay Posting'!C16","v":43800},{"$f":"'Edit Pay Posting'!D16","v":43800},{"$f":"'Edit Pay Posting'!E16","v":43800},{"$f":"'Edit Pay Posting'!F16","v":45100},{"$f":"'Edit Pay Posting'!G16","v":45100},{"$f":"'Edit Pay Posting'!H16","v":45100},{"$f":"'Edit Pay Posting'!I16","v":45100},{"$f":"'Edit Pay Posting'!J16","v":45100},{"$f":"'Edit Pay Posting'!K16","v":47000},{"$f":"'Edit Pay Posting'!L16","v":47000},{"$f":"'Edit Pay Posting'!M16","v":47000},{"$f":"'Edit Pay Posting'!N16","v":47000}]
[{"$f":"'Edit Pay Posting'!A17","v":"अवकाश वेतन "},null,{"$f":"'Edit Pay Posting'!C17","v":0},{"$f":"'Edit Pay Posting'!D17","v":0},{"$f":"'Edit Pay Posting'!E17","v":0},{"$f":"'Edit Pay Posting'!F17","v":0},{"$f":"'Edit Pay Posting'!G17","v":0},{"$f":"'Edit Pay Posting'!H17","v":0},{"$f":"'Edit Pay Posting'!I17","v":0},{"$f":"'Edit Pay Posting'!J17","v":0},{"$f":"'Edit Pay Posting'!K17","v":0},{"$f":"'Edit Pay Posting'!L17","v":0},{"$f":"'Edit Pay Posting'!M17","v":0},{"$f":"'Edit Pay Posting'!N17","v":0}]
[{"$f":"'Edit Pay Posting'!A18","v":"विशेष वेतन"},null,{"$f":"'Edit Pay Posting'!C18","v":0},{"$f":"'Edit Pay Posting'!D18","v":0},{"$f":"'Edit Pay Posting'!E18","v":0},{"$f":"'Edit Pay Posting'!F18","v":0},{"$f":"'Edit Pay Posting'!G18","v":0},{"$f":"'Edit Pay Posting'!H18","v":0},{"$f":"'Edit Pay Posting'!I18","v":0},{"$f":"'Edit Pay Posting'!J18","v":0},{"$f":"'Edit Pay Posting'!K18","v":0},{"$f":"'Edit Pay Posting'!L18","v":0},{"$f":"'Edit Pay Posting'!M18","v":0},{"$f":"'Edit Pay Posting'!N18","v":0}]
[{"$f":"'Edit Pay Posting'!A19","v":"मंहगाई भत्ता"},null,{"$f":"'Edit Pay Posting'!C19","v":7446},{"$f":"'Edit Pay Posting'!D19","v":7446},{"$f":"'Edit Pay Posting'!E19","v":7446},{"$f":"'Edit Pay Posting'!F19","v":7667},{"$f":"'Edit Pay Posting'!G19","v":7667},{"$f":"'Edit Pay Posting'!H19","v":7667},{"$f":"'Edit Pay Posting'!I19","v":7667},{"$f":"'Edit Pay Posting'!J19","v":7667},{"$f":"'Edit Pay Posting'!K19","v":7990},{"$f":"'Edit Pay Posting'!L19","v":7990},{"$f":"'Edit Pay Posting'!M19","v":7990},{"$f":"'Edit Pay Posting'!N19","v":7990}]
[{"$f":"'Edit Pay Posting'!A20","v":"मकान किराया भत्ता"},null,{"$f":"'Edit Pay Posting'!C20","v":3504},{"$f":"'Edit Pay Posting'!D20","v":3504},{"$f":"'Edit Pay Posting'!E20","v":3504},{"$f":"'Edit Pay Posting'!F20","v":3608},{"$f":"'Edit Pay Posting'!G20","v":3608},{"$f":"'Edit Pay Posting'!H20","v":3608},{"$f":"'Edit Pay Posting'!I20","v":3608},{"$f":"'Edit Pay Posting'!J20","v":3608},{"$f":"'Edit Pay Posting'!K20","v":3760},{"$f":"'Edit Pay Posting'!L20","v":3760},{"$f":"'Edit Pay Posting'!M20","v":3760},{"$f":"'Edit Pay Posting'!N20","v":3760}]
[{"$f":"'Edit Pay Posting'!A21","v":"विकलांग भत्ता"},null,{"$f":"'Edit Pay Posting'!C21","v":0},{"$f":"'Edit Pay Posting'!D21","v":0},{"$f":"'Edit Pay Posting'!E21","v":0},{"$f":"'Edit Pay Posting'!F21","v":0},{"$f":"'Edit Pay Posting'!G21","v":0},{"$f":"'Edit Pay Posting'!H21","v":0},{"$f":"'Edit Pay Posting'!I21","v":0},{"$f":"'Edit Pay Posting'!J21","v":0},{"$f":"'Edit Pay Posting'!K21","v":0},{"$f":"'Edit Pay Posting'!L21","v":0},{"$f":"'Edit Pay Posting'!M21","v":0},{"$f":"'Edit Pay Posting'!N21","v":0}]
[{"$f":"'Edit Pay Posting'!A22","v":"शहरी भत्ता "},null,{"$f":"'Edit Pay Posting'!C22","v":0},{"$f":"'Edit Pay Posting'!D22","v":0},{"$f":"'Edit Pay Posting'!E22","v":0},{"$f":"'Edit Pay Posting'!F22","v":0},{"$f":"'Edit Pay Posting'!G22","v":0},{"$f":"'Edit Pay Posting'!H22","v":0},{"$f":"'Edit Pay Posting'!I22","v":0},{"$f":"'Edit Pay Posting'!J22","v":0},{"$f":"'Edit Pay Posting'!K22","v":0},{"$f":"'Edit Pay Posting'!L22","v":0},{"$f":"'Edit Pay Posting'!M22","v":0},{"$f":"'Edit Pay Posting'!N22","v":0}]
[{"$f":"'Edit Pay Posting'!A23","v":"अन्य 1"},null,{"$f":"'Edit Pay Posting'!C23","v":0},{"$f":"'Edit Pay Posting'!D23","v":0},{"$f":"'Edit Pay Posting'!E23","v":0},{"$f":"'Edit Pay Posting'!F23","v":0},{"$f":"'Edit Pay Posting'!G23","v":0},{"$f":"'Edit Pay Posting'!H23","v":0},{"$f":"'Edit Pay Posting'!I23","v":0},{"$f":"'Edit Pay Posting'!J23","v":0},{"$f":"'Edit Pay Posting'!K23","v":0},{"$f":"'Edit Pay Posting'!L23","v":0},{"$f":"'Edit Pay Posting'!M23","v":0},{"$f":"'Edit Pay Posting'!N23","v":0}]
[{"$f":"'Edit Pay Posting'!A24","v":"अन्य 2"},null,{"$f":"'Edit Pay Posting'!C24","v":0},{"$f":"'Edit Pay Posting'!D24","v":0},{"$f":"'Edit Pay Posting'!E24","v":0},{"$f":"'Edit Pay Posting'!F24","v":0},{"$f":"'Edit Pay Posting'!G24","v":0},{"$f":"'Edit Pay Posting'!H24","v":0},{"$f":"'Edit Pay Posting'!I24","v":0},{"$f":"'Edit Pay Posting'!J24","v":0},{"$f":"'Edit Pay Posting'!K24","v":0},{"$f":"'Edit Pay Posting'!L24","v":0},{"$f":"'Edit Pay Posting'!M24","v":0},{"$f":"'Edit Pay Posting'!N24","v":0}]
[{"$f":"'Edit Pay Posting'!A25","v":"अन्य 3"},null,{"$f":"'Edit Pay Posting'!C25","v":0},{"$f":"'Edit Pay Posting'!D25","v":0},{"$f":"'Edit Pay Posting'!E25","v":0},{"$f":"'Edit Pay Posting'!F25","v":0},{"$f":"'Edit Pay Posting'!G25","v":0},{"$f":"'Edit Pay Posting'!H25","v":0},{"$f":"'Edit Pay Posting'!I25","v":0},{"$f":"'Edit Pay Posting'!J25","v":0},{"$f":"'Edit Pay Posting'!K25","v":0},{"$f":"'Edit Pay Posting'!L25","v":0},{"$f":"'Edit Pay Posting'!M25","v":0},{"$f":"'Edit Pay Posting'!N25","v":0}]
["योग (अ)",null,{"$f":"SUM(C16:C25)","v":54750},{"$f":"SUM(D16:D25)","v":54750},54750,56375,56375,56375,56375,56375,58750,58750,58750,58750]
[]
["(ब) कटौतियां"]
[{"$f":"'Edit Pay Posting'!A29","v":"GPF"},null,{"$f":"'Edit Pay Posting'!C29","v":0},{"$f":"'Edit Pay Posting'!D29","v":0},{"$f":"'Edit Pay Posting'!E29","v":0},{"$f":"'Edit Pay Posting'!F29","v":0},{"$f":"'Edit Pay Posting'!G29","v":0},{"$f":"'Edit Pay Posting'!H29","v":0},{"$f":"'Edit Pay Posting'!I29","v":0},{"$f":"'Edit Pay Posting'!J29","v":0},{"$f":"'Edit Pay Posting'!K29","v":0},{"$f":"'Edit Pay Posting'!L29","v":0},{"$f":"'Edit Pay Posting'!M29","v":0},{"$f":"'Edit Pay Posting'!N29","v":0}]
[{"$f":"'Edit Pay Posting'!A30","v":"GPF Loan"},null,{"$f":"'Edit Pay Posting'!C30","v":0},{"$f":"'Edit Pay Posting'!D30","v":0},{"$f":"'Edit Pay Posting'!E30","v":0},{"$f":"'Edit Pay Posting'!F30","v":0},{"$f":"'Edit Pay Posting'!G30","v":0},{"$f":"'Edit Pay Posting'!H30","v":0},{"$f":"'Edit Pay Posting'!I30","v":0},{"$f":"'Edit Pay Posting'!J30","v":0},{"$f":"'Edit Pay Posting'!K30","v":0},{"$f":"'Edit Pay Posting'!L30","v":0},{"$f":"'Edit Pay Posting'!M30","v":0},{"$f":"'Edit Pay Posting'!N30","v":0}]
[{"$f":"'Edit Pay Posting'!A31","v":"NPS"},null,{"$f":"'Edit Pay Posting'!C31","v":5125},{"$f":"'Edit Pay Posting'!D31","v":5125},{"$f":"'Edit Pay Posting'!E31","v":5125},{"$f":"'Edit Pay Posting'!F31","v":5277},{"$f":"'Edit Pay Posting'!G31","v":5277},{"$f":"'Edit Pay Posting'!H31","v":5277},{"$f":"'Edit Pay Posting'!I31","v":5277},{"$f":"'Edit Pay Posting'!J31","v":5277},{"$f":"'Edit Pay Posting'!K31","v":5499},{"$f":"'Edit Pay Posting'!L31","v":5499},{"$f":"'Edit Pay Posting'!M31","v":5499},{"$f":"'Edit Pay Posting'!N31","v":5499}]
[{"$f":"'Edit Pay Posting'!A32","v":"SI"},null,{"$f":"'Edit Pay Posting'!C32","v":3000},{"$f":"'Edit Pay Posting'!D32","v":3000},{"$f":"'Edit Pay Posting'!E32","v":3000},{"$f":"'Edit Pay Posting'!F32","v":3000},{"$f":"'Edit Pay Posting'!G32","v":3000},{"$f":"'Edit Pay Posting'!H32","v":3000},{"$f":"'Edit Pay Posting'!I32","v":3000},{"$f":"'Edit Pay Posting'!J32","v":3000},{"$f":"'Edit Pay Posting'!K32","v":3000},{"$f":"'Edit Pay Posting'!L32","v":3000},{"$f":"'Edit Pay Posting'!M32","v":3000},{"$f":"'Edit Pay Posting'!N32","v":3000}]
[{"$f":"'Edit Pay Posting'!A33","v":"SI Loan"},null,{"$f":"'Edit Pay Posting'!C33","v":0},{"$f":"'Edit Pay Posting'!D33","v":0},{"$f":"'Edit Pay Posting'!E33","v":0},{"$f":"'Edit Pay Posting'!F33","v":0},{"$f":"'Edit Pay Posting'!G33","v":0},{"$f":"'Edit Pay Posting'!H33","v":0},{"$f":"'Edit Pay Posting'!I33","v":0},{"$f":"'Edit Pay Posting'!J33","v":0},{"$f":"'Edit Pay Posting'!K33","v":0},{"$f":"'Edit Pay Posting'!L33","v":0},{"$f":"'Edit Pay Posting'!M33","v":0},{"$f":"'Edit Pay Posting'!N33","v":0}]
[{"$f":"'Edit Pay Posting'!A34","v":"ITAX"},null,{"$f":"'Edit Pay Posting'!C34","v":0},{"$f":"'Edit Pay Posting'!D34","v":0},{"$f":"'Edit Pay Posting'!E34","v":0},{"$f":"'Edit Pay Posting'!F34","v":0},{"$f":"'Edit Pay Posting'!G34","v":0},{"$f":"'Edit Pay Posting'!H34","v":0},{"$f":"'Edit Pay Posting'!I34","v":0},{"$f":"'Edit Pay Posting'!J34","v":0},{"$f":"'Edit Pay Posting'!K34","v":0},{"$f":"'Edit Pay Posting'!L34","v":0},{"$f":"'Edit Pay Posting'!M34","v":0},{"$f":"'Edit Pay Posting'!N34","v":0}]
[{"$f":"'Edit Pay Posting'!A35","v":"RPMF"},null,{"$f":"'Edit Pay Posting'!C35","v":0},{"$f":"'Edit Pay Posting'!D35","v":0},{"$f":"'Edit Pay Posting'!E35","v":0},{"$f":"'Edit Pay Posting'!F35","v":0},{"$f":"'Edit Pay Posting'!G35","v":0},{"$f":"'Edit Pay Posting'!H35","v":0},{"$f":"'Edit Pay Posting'!I35","v":0},{"$f":"'Edit Pay Posting'!J35","v":0},{"$f":"'Edit Pay Posting'!K35","v":0},{"$f":"'Edit Pay Posting'!L35","v":0},{"$f":"'Edit Pay Posting'!M35","v":0},{"$f":"'Edit Pay Posting'!N35","v":0}]
[{"$f":"'Edit Pay Posting'!A36","v":"LIC"},null,{"$f":"'Edit Pay Posting'!C36","v":0},{"$f":"'Edit Pay Posting'!D36","v":0},{"$f":"'Edit Pay Posting'!E36","v":0},{"$f":"'Edit Pay Posting'!F36","v":0},{"$f":"'Edit Pay Posting'!G36","v":0},{"$f":"'Edit Pay Posting'!H36","v":0},{"$f":"'Edit Pay Posting'!I36","v":0},{"$f":"'Edit Pay Posting'!J36","v":0},{"$f":"'Edit Pay Posting'!K36","v":0},{"$f":"'Edit Pay Posting'!L36","v":0},{"$f":"'Edit Pay Posting'!M36","v":0},{"$f":"'Edit Pay Posting'!N36","v":0}]
[{"$f":"'Edit Pay Posting'!A37","v":"CM CORONA"},null,{"$f":"'Edit Pay Posting'!C37","v":0},{"$f":"'Edit Pay Posting'!D37","v":0},{"$f":"'Edit Pay Posting'!E37","v":0},{"$f":"'Edit Pay Posting'!F37","v":0},{"$f":"'Edit Pay Posting'!G37","v":0},{"$f":"'Edit Pay Posting'!H37","v":0},{"$f":"'Edit Pay Posting'!I37","v":0},{"$f":"'Edit Pay Posting'!J37","v":0},{"$f":"'Edit Pay Posting'!K37","v":0},{"$f":"'Edit Pay Posting'!L37","v":0},{"$f":"'Edit Pay Posting'!M37","v":0},{"$f":"'Edit Pay Posting'!N37","v":0}]
[{"$f":"'Edit Pay Posting'!A38","v":"GIS"},null,{"$f":"'Edit Pay Posting'!C38","v":220},{"$f":"'Edit Pay Posting'!D38","v":0},{"$f":"'Edit Pay Posting'!E38","v":0},{"$f":"'Edit Pay Posting'!F38","v":0},{"$f":"'Edit Pay Posting'!G38","v":0},{"$f":"'Edit Pay Posting'!H38","v":0},{"$f":"'Edit Pay Posting'!I38","v":0},{"$f":"'Edit Pay Posting'!J38","v":0},{"$f":"'Edit Pay Posting'!K38","v":0},{"$f":"'Edit Pay Posting'!L38","v":0},{"$f":"'Edit Pay Posting'!M38","v":0},{"$f":"'Edit Pay Posting'!N38","v":0}]
[{"$f":"'Edit Pay Posting'!A39","v":"हितकारी निधि "},null,{"$f":"'Edit Pay Posting'!C39","v":0},{"$f":"'Edit Pay Posting'!D39","v":0},{"$f":"'Edit Pay Posting'!E39","v":0},{"$f":"'Edit Pay Posting'!F39","v":0},{"$f":"'Edit Pay Posting'!G39","v":0},{"$f":"'Edit Pay Posting'!H39","v":0},{"$f":"'Edit Pay Posting'!I39","v":0},{"$f":"'Edit Pay Posting'!J39","v":0},{"$f":"'Edit Pay Posting'!K39","v":500},{"$f":"'Edit Pay Posting'!L39","v":0},{"$f":"'Edit Pay Posting'!M39","v":0},{"$f":"'Edit Pay Posting'!N39","v":0}]
[{"$f":"'Edit Pay Posting'!A40","v":"अन्य 1"},null,{"$f":"'Edit Pay Posting'!C40","v":0},{"$f":"'Edit Pay Posting'!D40","v":0},{"$f":"'Edit Pay Posting'!E40","v":0},{"$f":"'Edit Pay Posting'!F40","v":0},{"$f":"'Edit Pay Posting'!G40","v":0},{"$f":"'Edit Pay Posting'!H40","v":0},{"$f":"'Edit Pay Posting'!I40","v":0},{"$f":"'Edit Pay Posting'!J40","v":0},{"$f":"'Edit Pay Posting'!K40","v":0},{"$f":"'Edit Pay Posting'!L40","v":0},{"$f":"'Edit Pay Posting'!M40","v":0},{"$f":"'Edit Pay Posting'!N40","v":0}]
[{"$f":"'Edit Pay Posting'!A41","v":"अन्य 2"},null,{"$f":"'Edit Pay Posting'!C41","v":0},{"$f":"'Edit Pay Posting'!D41","v":0},{"$f":"'Edit Pay Posting'!E41","v":0},{"$f":"'Edit Pay Posting'!F41","v":0},{"$f":"'Edit Pay Posting'!G41","v":0},{"$f":"'Edit Pay Posting'!H41","v":0},{"$f":"'Edit Pay Posting'!I41","v":0},{"$f":"'Edit Pay Posting'!J41","v":0},{"$f":"'Edit Pay Posting'!K41","v":0},{"$f":"'Edit Pay Posting'!L41","v":0},{"$f":"'Edit Pay Posting'!M41","v":0},{"$f":"'Edit Pay Posting'!N41","v":0}]
[{"$f":"'Edit Pay Posting'!A42","v":"अन्य 3"},null,{"$f":"'Edit Pay Posting'!C42","v":3220},{"$f":"'Edit Pay Posting'!D42","v":3220},{"$f":"'Edit Pay Posting'!E42","v":3220},{"$f":"'Edit Pay Posting'!F42","v":3220},{"$f":"'Edit Pay Posting'!G42","v":3220},{"$f":"'Edit Pay Posting'!H42","v":3220},{"$f":"'Edit Pay Posting'!I42","v":3220},{"$f":"'Edit Pay Posting'!J42","v":3220},{"$f":"'Edit Pay Posting'!K42","v":3220},{"$f":"'Edit Pay Posting'!L42","v":3220},{"$f":"'Edit Pay Posting'!M42","v":3220},{"$f":"'Edit Pay Posting'!N42","v":3220}]
[{"$f":"'Edit Pay Posting'!A43","v":"योग (ब)"},null,{"$f":"SUM(C29:C42)","v":11565},{"$f":"SUM(D29:D42)","v":11345},11345,11497,11497,11497,11497,11497,12219,11719,11719,11719]
["कुल देय वेतन राशि (अ-ब)",null,{"$f":"C26-C43","v":43185},{"$f":"D26-D43","v":43405},43405,44878,44878,44878,44878,44878,46531,47031,47031,47031]
[]
["Arrear Type","Bill No. and TV No.","(स) शेष बकाया भुगतान का विवरण"]
[{"$f":"'Edit Pay Posting'!A47","v":"Arrear 1"},{"$f":"'Edit Pay Posting'!B47","v":0},{"$f":"'Edit Pay Posting'!C47","v":0},{"$f":"'Edit Pay Posting'!D47","v":0},{"$f":"'Edit Pay Posting'!E47","v":0},{"$f":"'Edit Pay Posting'!F47","v":0},{"$f":"'Edit Pay Posting'!G47","v":0},{"$f":"'Edit Pay Posting'!H47","v":0},{"$f":"'Edit Pay Posting'!I47","v":0},{"$f":"'Edit Pay Posting'!J47","v":0},{"$f":"'Edit Pay Posting'!K47","v":0},{"$f":"'Edit Pay Posting'!L47","v":0},{"$f":"'Edit Pay Posting'!M47","v":0},{"$f":"'Edit Pay Posting'!N47","v":0}]
[{"$f":"'Edit Pay Posting'!A48","v":"Arrear 2"},{"$f":"'Edit Pay Posting'!B48","v":0},{"$f":"'Edit Pay Posting'!C48","v":0},{"$f":"'Edit Pay Posting'!D48","v":0},{"$f":"'Edit Pay Posting'!E48","v":0},{"$f":"'Edit Pay Posting'!F48","v":0},{"$f":"'Edit Pay Posting'!G48","v":0},{"$f":"'Edit Pay Posting'!H48","v":0},{"$f":"'Edit Pay Posting'!I48","v":0},{"$f":"'Edit Pay Posting'!J48","v":0},{"$f":"'Edit Pay Posting'!K48","v":0},{"$f":"'Edit Pay Posting'!L48","v":0},{"$f":"'Edit Pay Posting'!M48","v":0},{"$f":"'Edit Pay Posting'!N48","v":0}]
[{"$f":"'Edit Pay Posting'!A49","v":"Arrear 3"},{"$f":"'Edit Pay Posting'!B49","v":0},{"$f":"'Edit Pay Posting'!C49","v":0},{"$f":"'Edit Pay Posting'!D49","v":0},{"$f":"'Edit Pay Posting'!E49","v":0},{"$f":"'Edit Pay Posting'!F49","v":0},{"$f":"'Edit Pay Posting'!G49","v":0},{"$f":"'Edit Pay Posting'!H49","v":0},{"$f":"'Edit Pay Posting'!I49","v":0},{"$f":"'Edit Pay Posting'!J49","v":0},{"$f":"'Edit Pay Posting'!K49","v":0},{"$f":"'Edit Pay Posting'!L49","v":0},{"$f":"'Edit Pay Posting'!M49","v":0},{"$f":"'Edit Pay Posting'!N49","v":0}]
[{"$f":"'Edit Pay Posting'!A50","v":"Arrear 4"},{"$f":"'Edit Pay Posting'!B50","v":0},{"$f":"'Edit Pay Posting'!C50","v":0},{"$f":"'Edit Pay Posting'!D50","v":0},{"$f":"'Edit Pay Posting'!E50","v":0},{"$f":"'Edit Pay Posting'!F50","v":0},{"$f":"'Edit Pay Posting'!G50","v":0},{"$f":"'Edit Pay Posting'!H50","v":0},{"$f":"'Edit Pay Posting'!I50","v":0},{"$f":"'Edit Pay Posting'!J50","v":0},{"$f":"'Edit Pay Posting'!K50","v":0},{"$f":"'Edit Pay Posting'!L50","v":0},{"$f":"'Edit Pay Posting'!M50","v":0},{"$f":"'Edit Pay Posting'!N50","v":0}]
["कुल राशि",null,{"$f":"SUM(C47:C50)","v":0},{"$f":"SUM(D47:D50)","v":0},0,0,0,0,0,0,0,0,0,0]
[]
["समर्पित या अंतिम उपार्जित अवकाश","Bill No. and TV No.","(द) समर्पित या अंतिम उपार्जित अवकाश का भुगतान विवरण"]
[null,{"$f":"'Edit Pay Posting'!B54","v":0},{"$f":"'Edit Pay Posting'!C54","v":0},{"$f":"'Edit Pay Posting'!D54","v":0},{"$f":"'Edit Pay Posting'!E54","v":0},{"$f":"'Edit Pay Posting'!F54","v":0},{"$f":"'Edit Pay Posting'!G54","v":0},{"$f":"'Edit Pay Posting'!H54","v":0},{"$f":"'Edit Pay Posting'!I54","v":26384},{"$f":"'Edit Pay Posting'!J54","v":0},{"$f":"'Edit Pay Posting'!K54","v":0},{"$f":"'Edit Pay Posting'!L54","v":0},{"$f":"'Edit Pay Posting'!M54","v":0},{"$f":"'Edit Pay Posting'!N54","v":0}]
[]
["सकल योग माह",null,{"$f":"SUM(C44,C51,C54)","v":43185},{"$f":"SUM(D44,D51,D54)","v":43405},43405,44878,44878,44878,71262,44878,46531,47031,47031,47031]
[]
["लिपिक के हस्ताक्षर"]
[]
["DDO के हस्ताक्षर"]