{"text_format":"3","workbook":"xlsx","n_sheets":7,"sheets":["SD Teacher's Data","Emp. Data","Bill and TV No.","Allowances","Deductions","Edit Pay Posting","Print Pay Posting"],"not_rendered":{"images":2,"macros":1,"defined_names":3},"read":"whole","date_system":"1900"}

{"sheet":"SD Teacher's Data","index":0,"n_rows":17,"n_cols":13,"rows_kept":17}
["Name","EmployeeID","FatherName","Gender","DOB","Post","Subject","Date Of Joining","Address","Aadhar No","PAN No","Mobile No","Blood Group"]
["ADITYA JAKHAD","RJBN201803008697","OM PRAKASH JAKHAD","M","1994-06-16","Junior Assistant","---","2018-10-26","200 K, BAPU NAGAR BEHIND KALYAN MANDAP KUCHAMAN CITY","XXXXXXXX7055","XXXXJ2498M","XXXXXX2067","A+"]
["ASHWINI KUMAR","RJNA201228008021","Meghraj Sharma","M","1988-02-06","Senior Teacher (II Gr.)","English","2012-04-05","Shree Ram Marg, New Colony, Kuchaman City","XXXXXXXX6191","XXXXK5921Q","XXXXXX3711","O+"]
["BANWARI","RJJP200818021434","HEERA LAL","M","1977-07-13","Teacher (III Gr.) Level 2","Social Studies","2018-07-14","VPO -DHANKOLI TAH.- DEEDWANA","XXXXXXXX2855","XXXXB9607K","XXXXXX4263","O+"]
["CHETAN RAM RIYAR","RJNA199828007951","NARAYAN RAM RIYAR","M","1976-01-01","Lecturer (I Gr.)","History","2017-01-18","NEAR GEETANJALI SCHOOL,MIRDHA NAGAR, DEEDWANA ROAD,KUCHAMAN CITY, DIST-NAGAUR (RAJASTHAN)","XXXXXXXX2018","XXXXR0248H","XXXXXX5001","A+"]
["CHHOTOO SINGH","RJNA199328019992","BHAGIRATH SINGH","M","1966-06-15","Senior Teacher (II Gr.)","Hindi","2018-06-26","VILLAGE RANW POST BARWALA VIA MAKRANA DISTIC NAGOUR","XXXXXXXX5283","XXXXR5691G","XXXXXX0541","AB+"]
["HEMLATA SHARMA","RJNA200828043421","RADHYSHYAM SHARMA","F","1978-08-31","Teacher (III Gr.) Level 2","English","2016-06-09","TIWARI BHAWAN NEAR GANDI PARK KUCHAMAN CITY","XXXXXXXX6054","XXXXS2123M","XXXXXX7081","O+"]
["Kamla Barupal","RJNA199728020199","Lacchi Ram","F","1973-02-09","Senior Teacher (II Gr.)","Sanskrit","2016-12-15","57/A Jasol NAgar, Station Road, Vard NO. 11, Kuchaman city","XXXXXXXX5772","XXXXB7337G","XXXXXX6935","B+"]
["KAMLA SESMA","RJNA201828017689","NARAYAN RAM","F","1988-09-13","Lecturer (I Gr.)","Political Science","2018-08-25","LAPLI KI DHANI, NIMAS POST- MUWANA","XXXXXXXX8357","XXXXs2977h","XXXXXX0954","O+"]
["PRAMOD KANWAR","RJBM201905021820","Pappu Singh","F","1996-08-10","Senior Teacher (II Gr.)","Mathematics","2020-09-02","Village syalu kalan post ramrikh ki dhani tehsil surajgarh district jhunjhunu","XXXXXXXX9492","XXXXK0742Q","XXXXXX4400","O+"]
{"$rows_left_out":8}
{"sheet":"Emp. Data","index":1,"n_rows":299,"n_cols":16,"rows_kept":299,"merged":[[0,0,0,15],[1,0,1,15]]}
["Government Senior Secondary School, Rooppura"]
["Employee Data"]
["क्र.सं.","नाम","पद","DOB","पैन नंबर","Emp. ID","Nps Employee","HRA Rate","SI No.","GPF No.","PRAN No.","आधार कार्ड नंबर","बैंक नाम","IFSC Code","बैंक A/c","Is in Probation"]
[{"$f":"IF(Table1[[#This Row],[नाम]]=\"\",\"\",ROWS($A$1:A1))","v":1},{"$f":"PROPER(IF('SD Teacher''s Data'!A2=\"\",\"\",'SD Teacher''s Data'!A2))","v":"Aditya Jakhad"},{"$f":"PROPER(IF('SD Teacher''s Data'!F2=\"\",\"\",'SD Teacher''s Data'!F2))","v":"Junior Assistant"},{"$f":"IF('SD Teacher''s Data'!E2=\"\",\"\",'SD Teacher''s Data'!E2)","v":"1994-06-16"},{"$f":"IF('SD Teacher''s Data'!K2=\"\",\"\",'SD Teacher''s Data'!K2)","v":"XXXXJ2498M"},{"$f":"IF('SD Teacher''s Data'!B2=\"\",\"\",'SD Teacher''s Data'!B2)","v":"RJBN201803008697"},"Yes",{"v":0.08,"d":"8%"},123,1234,1234567891011,{"$f":"IF('SD Teacher''s Data'!J2=\"\",\"\",'SD Teacher''s Data'!J2)","v":"XXXXXXXX7055"},"SBI","SBIN0031733",1234567891011,"No"]
[{"$f":"IF(Table1[[#This Row],[नाम]]=\"\",\"\",ROWS($A$1:A2))","v":2},{"$f":"PROPER(IF('SD Teacher''s Data'!A3=\"\",\"\",'SD Teacher''s Data'!A3))","v":"Ashwini Kumar"},{"$f":"PROPER(IF('SD Teacher''s Data'!F3=\"\",\"\",'SD Teacher''s Data'!F3))","v":"Senior Teacher (Ii Gr.)"},{"$f":"IF('SD Teacher''s Data'!E3=\"\",\"\",'SD Teacher''s Data'!E3)","v":"1988-02-06"},{"$f":"IF('SD Teacher''s Data'!K3=\"\",\"\",'SD Teacher''s Data'!K3)","v":"XXXXK5921Q"},{"$f":"IF('SD Teacher''s Data'!B3=\"\",\"\",'SD Teacher''s Data'!B3)","v":"RJNA201228008021"},"Yes",{"v":0.08,"d":"8%"},123,1234,1234567891011,{"$f":"IF('SD Teacher''s Data'!J3=\"\",\"\",'SD Teacher''s Data'!J3)","v":"XXXXXXXX6191"},"SBI","SBIN0031733",1234567891011,"No"]
[{"$f":"IF(Table1[[#This Row],[नाम]]=\"\",\"\",ROWS($A$1:A3))","v":3},{"$f":"PROPER(IF('SD Teacher''s Data'!A4=\"\",\"\",'SD Teacher''s Data'!A4))","v":"Banwari"},{"$f":"PROPER(IF('SD Teacher''s Data'!F4=\"\",\"\",'SD Teacher''s Data'!F4))","v":"Teacher (Iii Gr.) Level 2"},{"$f":"IF('SD Teacher''s Data'!E4=\"\",\"\",'SD Teacher''s Data'!E4)","v":"1977-07-13"},{"$f":"IF('SD Teacher''s Data'!K4=\"\",\"\",'SD Teacher''s Data'!K4)","v":"XXXXB9607K"},{"$f":"IF('SD Teacher''s Data'!B4=\"\",\"\",'SD Teacher''s Data'!B4)","v":"RJJP200818021434"},"Yes",{"v":0.16,"d":"16%"},{"$nulls":3},{"$f":"IF('SD Teacher''s Data'!J4=\"\",\"\",'SD Teacher''s Data'!J4)","v":"XXXXXXXX2855"},{"$nulls":3},"Yes"]
[{"$f":"IF(Table1[[#This Row],[नाम]]=\"\",\"\",ROWS($A$1:A4))","v":4},{"$f":"PROPER(IF('SD Teacher''s Data'!A5=\"\",\"\",'SD Teacher''s Data'!A5))","v":"Chetan Ram Riyar"},{"$f":"PROPER(IF('SD Teacher''s Data'!F5=\"\",\"\",'SD Teacher''s Data'!F5))","v":"Lecturer (I Gr.)"},{"$f":"IF('SD Teacher''s Data'!E5=\"\",\"\",'SD Teacher''s Data'!E5)","v":"1976-01-01"},{"$f":"IF('SD Teacher''s Data'!K5=\"\",\"\",'SD Teacher''s Data'!K5)","v":"XXXXR0248H"},{"$f":"IF('SD Teacher''s Data'!B5=\"\",\"\",'SD Teacher''s Data'!B5)","v":"RJNA199828007951"},"No",{"$nulls":4},{"$f":"IF('SD Teacher''s Data'!J5=\"\",\"\",'SD Teacher''s Data'!J5)","v":"XXXXXXXX2018"}]
[{"$f":"IF(Table1[[#This Row],[नाम]]=\"\",\"\",ROWS($A$1:A5))","v":5},{"$f":"PROPER(IF('SD Teacher''s Data'!A6=\"\",\"\",'SD Teacher''s Data'!A6))","v":"Chhotoo Singh"},{"$f":"PROPER(IF('SD Teacher''s Data'!F6=\"\",\"\",'SD Teacher''s Data'!F6))","v":"Senior Teacher (Ii Gr.)"},{"$f":"IF('SD Teacher''s Data'!E6=\"\",\"\",'SD Teacher''s Data'!E6)","v":"1966-06-15"},{"$f":"IF('SD Teacher''s Data'!K6=\"\",\"\",'SD Teacher''s Data'!K6)","v":"XXXXR5691G"},{"$f":"IF('SD Teacher''s Data'!B6=\"\",\"\",'SD Teacher''s Data'!B6)","v":"RJNA199328019992"},{"$nulls":5},{"$f":"IF('SD Teacher''s Data'!J6=\"\",\"\",'SD Teacher''s Data'!J6)","v":"XXXXXXXX5283"}]
[{"$f":"IF(Table1[[#This Row],[नाम]]=\"\",\"\",ROWS($A$1:A6))","v":6},{"$f":"PROPER(IF('SD Teacher''s Data'!A7=\"\",\"\",'SD Teacher''s Data'!A7))","v":"Hemlata Sharma"},{"$f":"PROPER(IF('SD Teacher''s Data'!F7=\"\",\"\",'SD Teacher''s Data'!F7))","v":"Teacher (Iii Gr.) Level 2"},{"$f":"IF('SD Teacher''s Data'!E7=\"\",\"\",'SD Teacher''s Data'!E7)","v":"1978-08-31"},{"$f":"IF('SD Teacher''s Data'!K7=\"\",\"\",'SD Teacher''s Data'!K7)","v":"XXXXS2123M"},{"$f":"IF('SD Teacher''s Data'!B7=\"\",\"\",'SD Teacher''s Data'!B7)","v":"RJNA200828043421"},{"$nulls":5},{"$f":"IF('SD Teacher''s Data'!J7=\"\",\"\",'SD Teacher''s Data'!J7)","v":"XXXXXXXX6054"}]
[{"$f":"IF(Table1[[#This Row],[नाम]]=\"\",\"\",ROWS($A$1:A7))","v":7},{"$f":"PROPER(IF('SD Teacher''s Data'!A8=\"\",\"\",'SD Teacher''s Data'!A8))","v":"Kamla Barupal"},{"$f":"PROPER(IF('SD Teacher''s Data'!F8=\"\",\"\",'SD Teacher''s Data'!F8))","v":"Senior Teacher (Ii Gr.)"},{"$f":"IF('SD Teacher''s Data'!E8=\"\",\"\",'SD Teacher''s Data'!E8)","v":"1973-02-09"},{"$f":"IF('SD Teacher''s Data'!K8=\"\",\"\",'SD Teacher''s Data'!K8)","v":"XXXXB7337G"},{"$f":"IF('SD Teacher''s Data'!B8=\"\",\"\",'SD Teacher''s Data'!B8)","v":"RJNA199728020199"},{"$nulls":5},{"$f":"IF('SD Teacher''s Data'!J8=\"\",\"\",'SD Teacher''s Data'!J8)","v":"XXXXXXXX5772"}]
{"$rows_left_out":290}
{"sheet":"Bill and TV No.","index":2,"n_rows":15,"n_cols":6,"rows_kept":15,"merged":[[0,0,0,5],[1,0,1,5]]}
[{"$f":"'Emp. Data'!A1","v":"Government Senior Secondary School, Rooppura"}]
["Bill No. and TV No. Detail"]
["क्र.सं.","माह का नाम","बिल नं.","डेट","टी.वी. नं.","डेट"]
[1,"APR",1,"2021-03-21",6258,"2021-04-01"]
[2,"MAY",2,"2021-03-22",6259,"2021-04-02"]
[3,"JUN",3,"2021-03-23",6260,"2021-04-03"]
[4,"JUL",4,"2021-03-24",6261,"2021-04-04"]
[5,"AUG",5,"2021-03-25",6262,"2021-04-05"]
[6,"SEP",6,"2021-03-26",6263,"2021-04-06"]
[7,"OCT",7,"2021-03-27",6264,"2021-04-07"]
{"$rows_left_out":6}
{"sheet":"Allowances","index":3,"n_rows":299,"n_cols":11,"rows_kept":299,"merged":[[0,0,0,10],[1,0,1,10]]}
[{"$f":"'Emp. Data'!A1","v":"Government Senior Secondary School, Rooppura"}]
["Allowances Data"]
["क्र.सं.","नाम","मार्च मूल वेतन","अवकाश वेतन ","विशेष वेतन","विकलांग भत्ता","शहरी भत्ता ","अन्य 1","अन्य 2","अन्य 3","योग"]
[{"$f":"IF(Table2[[#This Row],[नाम]]=\"\",\"\",ROWS($A$1:A1))","v":1},{"$f":"PROPER(IF(Table1[[#This Row],[नाम]]=\"\",\"\",Table1[[#This Row],[नाम]]))","v":"Aditya Jakhad"},14600,{"$nulls":7},{"$f":"SUM(Table2[[#This Row],[मार्च मूल वेतन]:[अन्य 3]])","v":14600}]
[{"$f":"IF(Table2[[#This Row],[नाम]]=\"\",\"\",ROWS($A$1:A2))","v":2},{"$f":"PROPER(IF(Table1[[#This Row],[नाम]]=\"\",\"\",Table1[[#This Row],[नाम]]))","v":"Ashwini Kumar"},43800,{"$nulls":7},{"$f":"SUM(Table2[[#This Row],[मार्च मूल वेतन]:[अन्य 3]])","v":43800}]
[{"$f":"IF(Table2[[#This Row],[नाम]]=\"\",\"\",ROWS($A$1:A3))","v":3},{"$f":"PROPER(IF(Table1[[#This Row],[नाम]]=\"\",\"\",Table1[[#This Row],[नाम]]))","v":"Banwari"},{"$nulls":8},{"$f":"SUM(Table2[[#This Row],[मार्च मूल वेतन]:[अन्य 3]])","v":0}]
[{"$f":"IF(Table2[[#This Row],[नाम]]=\"\",\"\",ROWS($A$1:A4))","v":4},{"$f":"PROPER(IF(Table1[[#This Row],[नाम]]=\"\",\"\",Table1[[#This Row],[नाम]]))","v":"Chetan Ram Riyar"},{"$nulls":8},{"$f":"SUM(Table2[[#This Row],[मार्च मूल वेतन]:[अन्य 3]])","v":0}]
[{"$f":"IF(Table2[[#This Row],[नाम]]=\"\",\"\",ROWS($A$1:A5))","v":5},{"$f":"PROPER(IF(Table1[[#This Row],[नाम]]=\"\",\"\",Table1[[#This Row],[नाम]]))","v":"Chhotoo Singh"},{"$nulls":8},{"$f":"SUM(Table2[[#This Row],[मार्च मूल वेतन]:[अन्य 3]])","v":0}]
[{"$f":"IF(Table2[[#This Row],[नाम]]=\"\",\"\",ROWS($A$1:A6))","v":6},{"$f":"PROPER(IF(Table1[[#This Row],[नाम]]=\"\",\"\",Table1[[#This Row],[नाम]]))","v":"Hemlata Sharma"},{"$nulls":8},{"$f":"SUM(Table2[[#This Row],[मार्च मूल वेतन]:[अन्य 3]])","v":0}]
[{"$f":"IF(Table2[[#This Row],[नाम]]=\"\",\"\",ROWS($A$1:A7))","v":7},{"$f":"PROPER(IF(Table1[[#This Row],[नाम]]=\"\",\"\",Table1[[#This Row],[नाम]]))","v":"Kamla Barupal"},{"$nulls":8},{"$f":"SUM(Table2[[#This Row],[मार्च मूल वेतन]:[अन्य 3]])","v":0}]
{"$rows_left_out":290}
{"sheet":"Deductions","index":4,"n_rows":299,"n_cols":15,"rows_kept":299,"merged":[[0,0,0,14],[1,0,1,14]]}
[{"$f":"'Emp. Data'!$A$1","v":"Government Senior Secondary School, Rooppura"}]
["Deductions Detail"]
["क्र.सं.","नाम","GPF","GPF Loan","SI","SI Loan","ITAX","RPMF","LIC","CM CORONA","GIS","अन्य 1","अन्य 2","अन्य 3","योग (ब)"]
[{"$f":"IF(Table3[[#This Row],[नाम]]=\"\",\"\",ROWS($A$1:A1))","v":1},{"$f":"PROPER(IF(Table1[[#This Row],[नाम]]=\"\",\"\",Table1[[#This Row],[नाम]]))","v":"Aditya Jakhad"},0,0,3000,0,0,0,0,0,220,0,0,0,{"$f":"SUM(Table3[[#This Row],[GPF]:[अन्य 3]])","v":3220}]
[{"$f":"IF(Table3[[#This Row],[नाम]]=\"\",\"\",ROWS($A$1:A2))","v":2},{"$f":"PROPER(IF(Table1[[#This Row],[नाम]]=\"\",\"\",Table1[[#This Row],[नाम]]))","v":"Ashwini Kumar"},0,0,3000,0,0,0,0,0,220,0,0,0,{"$f":"SUM(Table3[[#This Row],[GPF]:[अन्य 3]])","v":3220}]
[{"$f":"IF(Table3[[#This Row],[नाम]]=\"\",\"\",ROWS($A$1:A3))","v":3},{"$f":"PROPER(IF(Table1[[#This Row],[नाम]]=\"\",\"\",Table1[[#This Row],[नाम]]))","v":"Banwari"},0,0,3000,0,0,0,0,0,220,0,0,0,{"$f":"SUM(Table3[[#This Row],[GPF]:[अन्य 3]])","v":3220}]
[{"$f":"IF(Table3[[#This Row],[नाम]]=\"\",\"\",ROWS($A$1:A4))","v":4},{"$f":"PROPER(IF(Table1[[#This Row],[नाम]]=\"\",\"\",Table1[[#This Row],[नाम]]))","v":"Chetan Ram Riyar"},{"$nulls":8},220,{"$nulls":3},{"$f":"SUM(Table3[[#This Row],[GPF]:[अन्य 3]])","v":220}]
[{"$f":"IF(Table3[[#This Row],[नाम]]=\"\",\"\",ROWS($A$1:A5))","v":5},{"$f":"PROPER(IF(Table1[[#This Row],[नाम]]=\"\",\"\",Table1[[#This Row],[नाम]]))","v":"Chhotoo Singh"},{"$nulls":8},220,{"$nulls":3},{"$f":"SUM(Table3[[#This Row],[GPF]:[अन्य 3]])","v":220}]
[{"$f":"IF(Table3[[#This Row],[नाम]]=\"\",\"\",ROWS($A$1:A6))","v":6},{"$f":"PROPER(IF(Table1[[#This Row],[नाम]]=\"\",\"\",Table1[[#This Row],[नाम]]))","v":"Hemlata Sharma"},{"$nulls":8},220,{"$nulls":3},{"$f":"SUM(Table3[[#This Row],[GPF]:[अन्य 3]])","v":220}]
[{"$f":"IF(Table3[[#This Row],[नाम]]=\"\",\"\",ROWS($A$1:A7))","v":7},{"$f":"PROPER(IF(Table1[[#This Row],[नाम]]=\"\",\"\",Table1[[#This Row],[नाम]]))","v":"Kamla Barupal"},{"$nulls":8},220,{"$nulls":3},{"$f":"SUM(Table3[[#This Row],[GPF]:[अन्य 3]])","v":220}]
{"$rows_left_out":290}
{"sheet":"Edit Pay Posting","index":5,"n_rows":60,"n_cols":20,"rows_kept":60,"merged":[[0,0,0,13],[0,15,1,17],[1,0,1,13],[2,0,2,13],[3,1,3,3],[3,5,3,7],[3,9,3,10],[3,12,3,13],[3,15,3,17],[4,1,4,3],[4,5,4,7],[4,9,4,10],[4,12,4,13],[4,15,4,16],[5,1,5,3],[5,5,5,7],[5,9,5,10],[5,12,5,13],[5,15,6,17],[5,18,6,18],[6,0,6,13],[7,15,7,17],[8,0,12,0],[13,0,13,13],[14,0,14,13],[15,0,15,1],[16,0,16,1],[17,0,17,1],[18,0,18,1],[19,0,19,1],[20,0,20,1],[21,0,21,1],[22,0,22,1],[23,0,23,1],[24,0,24,1],[25,0,25,1],[26,0,26,13],[27,0,27,13],[28,0,28,1],[29,0,29,1],[30,0,30,1],[31,0,31,1],[32,0,32,1],[33,0,33,1],[34,0,34,1],[35,0,35,1],[36,0,36,1],[37,0,37,1],[38,0,38,1],[39,0,39,1],[40,0,40,1],[41,0,41,1],[42,0,42,1],[43,0,43,1],[44,0,44,13],[45,2,45,13],[50,0,50,1],[51,0,51,13],[52,0,53,0],[52,2,52,13],[54,0,54,13],[55,0,55,1],[56,0,56,13],[57,0,57,1],[58,0,58,13],[59,0,59,1]]}
[{"$f":"'Emp. Data'!A1","v":"Government Senior Secondary School, Rooppura"},{"$nulls":14},2,{"$nulls":3},{"$f":"VLOOKUP($P$1,Table1[#All],16,0)","v":"No"}]
["Pay Posting Register",{"$nulls":18},{"$f":"VLOOKUP($P$1,Table1[#All],7,0)","v":"Yes"}]
[]
["नाम-",{"$f":"IFERROR(PROPER(VLOOKUP($P$1,Table1[#All],2,0)),\"NoData\")","v":"Ashwini Kumar"},null,null,"पद-",{"$f":"IFERROR(PROPER(VLOOKUP($P$1,Table1[#All],3,0)),\"NoData\")","v":"Senior Teacher (Ii Gr.)"},null,null,"DOB-",{"$f":"IFERROR(VLOOKUP($P$1,Table1[#All],4,0),\"NoData\")","v":"1988-02-06"},null,"पैन नंबर-",{"$f":"IFERROR(VLOOKUP($P$1,Table1[#All],5,0),\"NoData\")","v":"XXXXK5921Q"},null,null,"If Basic Change"]
["Emp. ID-",{"$f":"IFERROR(VLOOKUP($P$1,Table1[#All],6,0),\"NoData\")","v":"RJNA201228008021"},null,null,"SI No.-",{"$f":"IFERROR(VLOOKUP($P$1,Table1[#All],9,0),\"NoData\")","v":123},null,null,"GPF No.-",{"$f":"IFERROR(VLOOKUP($P$1,Table1[#All],10,0),\"NoData\")","v":1234},null,"PRAN No.",{"$f":"IFERROR(VLOOKUP($P$1,Table1[#All],11,0),\"NoData\")","v":1234567891011},null,null,"DEC",null,47000]
["आधार कार्ड नंबर-",{"$f":"IFERROR(VLOOKUP($P$1,Table1[#All],12,0),\"NoData\")","v":"XXXXXXXX6191"},null,null,"बैंक नाम-",{"$f":"IFERROR(VLOOKUP($P$1,Table1[#All],13,0),\"NoData\")","v":"SBI"},null,null,"IFSC Cod-",{"$f":"IFERROR(VLOOKUP($P$1,Table1[#All],14,0),\"NoData\")","v":"SBIN0031733"},null,"बैंक A/c-",{"$f":"IFERROR(VLOOKUP($P$1,Table1[#All],15,0),\"NoData\")","v":1234567891011},null,null,"Surrender Month",null,null,"राजपत्रित"]
[]
[{"$f":"$B$4","v":"Ashwini Kumar"},"Month","APR","MAY","JUN","JUL","AUG","SEP","OCT","NOV","DEC","JAN","FEB","MAR",null,"OCT",null,null,"Yes"]
["वेतन एवं कटौती का विवरण","DA Rates",{"v":0.17,"d":"17%"},{"v":0.17,"d":"17%"},{"v":0.17,"d":"17%"},{"v":0.17,"d":"17%"},{"v":0.17,"d":"17%"},{"v":0.17,"d":"17%"},{"v":0.17,"d":"17%"},{"v":0.17,"d":"17%"},{"v":0.17,"d":"17%"},{"v":0.17,"d":"17%"},{"v":0.17,"d":"17%"},{"v":0.17,"d":"17%"}]
[null,"Bill No.",{"$f":"IFERROR(VLOOKUP(C8,'Bill and TV No.'!$B$3:$F$15,2,0),\"\")","v":1},{"$f":"IFERROR(VLOOKUP(D8,'Bill and TV No.'!$B$3:$F$15,2,0),\"\")","v":2},{"$f":"IFERROR(VLOOKUP(E8,'Bill and TV No.'!$B$3:$F$15,2,0),\"\")","v":3},{"$f":"IFERROR(VLOOKUP(F8,'Bill and TV No.'!$B$3:$F$15,2,0),\"\")","v":4},{"$f":"IFERROR(VLOOKUP(G8,'Bill and TV No.'!$B$3:$F$15,2,0),\"\")","v":5},{"$f":"IFERROR(VLOOKUP(H8,'Bill and TV No.'!$B$3:$F$15,2,0),\"\")","v":6},{"$f":"IFERROR(VLOOKUP(I8,'Bill and TV No.'!$B$3:$F$15,2,0),\"\")","v":7},{"$f":"IFERROR(VLOOKUP(J8,'Bill and TV No.'!$B$3:$F$15,2,0),\"\")","v":8},{"$f":"IFERROR(VLOOKUP(K8,'Bill and TV No.'!$B$3:$F$15,2,0),\"\")","v":9},{"$f":"IFERROR(VLOOKUP(L8,'Bill and TV No.'!$B$3:$F$15,2,0),\"\")","v":10},{"$f":"IFERROR(VLOOKUP(M8,'Bill and TV No.'!$B$3:$F$15,2,0),\"\")","v":11},{"$f":"IFERROR(VLOOKUP(N8,'Bill and TV No.'!$B$3:$F$15,2,0),\"\")","v":12}]
{"$rows_left_out":51}
{"sheet":"Print Pay Posting","index":6,"n_rows":60,"n_cols":14,"rows_kept":60,"merged":[[0,0,0,13],[1,0,1,13],[2,0,2,13],[3,1,3,3],[3,5,3,7],[3,9,3,10],[3,12,3,13],[4,1,4,3],[4,5,4,7],[4,9,4,10],[4,12,4,13],[5,1,5,3],[5,5,5,7],[5,9,5,10],[5,12,5,13],[6,0,6,13],[8,0,12,0],[13,0,13,13],[14,0,14,13],[15,0,15,1],[16,0,16,1],[17,0,17,1],[18,0,18,1],[19,0,19,1],[20,0,20,1],[21,0,21,1],[22,0,22,1],[23,0,23,1],[24,0,24,1],[25,0,25,1],[26,0,26,13],[27,0,27,13],[28,0,28,1],[29,0,29,1],[30,0,30,1],[31,0,31,1],[32,0,32,1],[33,0,33,1],[34,0,34,1],[35,0,35,1],[36,0,36,1],[37,0,37,1],[38,0,38,1],[39,0,39,1],[40,0,40,1],[41,0,41,1],[42,0,42,1],[43,0,43,1],[44,0,44,13],[45,2,45,13],[50,0,50,1],[51,0,51,13],[52,0,53,0],[52,2,52,13],[54,0,54,13],[55,0,55,1],[56,0,56,13],[57,0,57,1],[58,0,58,13],[59,0,59,1]]}
[{"$f":"'Edit Pay Posting'!A1","v":"Government Senior Secondary School, Rooppura"}]
["Pay Posting Register"]
[]
["नाम-",{"$f":"'Edit Pay Posting'!B4","v":"Ashwini Kumar"},null,null,"पद-",{"$f":"'Edit Pay Posting'!F4","v":"Senior Teacher (Ii Gr.)"},null,null,"DOB-",{"$f":"'Edit Pay Posting'!J4","v":"1988-02-06"},null,"पैन नंबर-",{"$f":"'Edit Pay Posting'!M4","v":"XXXXK5921Q"}]
["Emp. ID-",{"$f":"'Edit Pay Posting'!B5","v":"RJNA201228008021"},null,null,"SI No.-",{"$f":"'Edit Pay Posting'!F5","v":123},null,null,"GPF No.-",{"$f":"'Edit Pay Posting'!J5","v":1234},null,"PRAN No.",{"$f":"'Edit Pay Posting'!M5","v":1234567891011}]
["आधार कार्ड नंबर-",{"$f":"'Edit Pay Posting'!B6","v":"XXXXXXXX6191"},null,null,"बैंक नाम-",{"$f":"'Edit Pay Posting'!F6","v":"SBI"},null,null,"IFSC Cod-",{"$f":"'Edit Pay Posting'!J6","v":"SBIN0031733"},null,"बैंक A/c-",{"$f":"'Edit Pay Posting'!M6","v":1234567891011}]
[]
[{"$f":"'Edit Pay Posting'!A8","v":"Ashwini Kumar"},"Month","APR","MAY","JUN","JUL","AUG","SEP","OCT","NOV","DEC","JAN","FEB","MAR"]
["वेतन एवं कटौती का विवरण","DA Rates",{"$f":"'Edit Pay Posting'!C9","v":{"v":0.17,"d":"17%"}},{"$f":"'Edit Pay Posting'!D9","v":{"v":0.17,"d":"17%"}},{"$f":"'Edit Pay Posting'!E9","v":{"v":0.17,"d":"17%"}},{"$f":"'Edit Pay Posting'!F9","v":{"v":0.17,"d":"17%"}},{"$f":"'Edit Pay Posting'!G9","v":{"v":0.17,"d":"17%"}},{"$f":"'Edit Pay Posting'!H9","v":{"v":0.17,"d":"17%"}},{"$f":"'Edit Pay Posting'!I9","v":{"v":0.17,"d":"17%"}},{"$f":"'Edit Pay Posting'!J9","v":{"v":0.17,"d":"17%"}},{"$f":"'Edit Pay Posting'!K9","v":{"v":0.17,"d":"17%"}},{"$f":"'Edit Pay Posting'!L9","v":{"v":0.17,"d":"17%"}},{"$f":"'Edit Pay Posting'!M9","v":{"v":0.17,"d":"17%"}},{"$f":"'Edit Pay Posting'!N9","v":{"v":0.17,"d":"17%"}}]
[null,"Bill No.",{"$f":"'Edit Pay Posting'!C10","v":1},{"$f":"'Edit Pay Posting'!D10","v":2},{"$f":"'Edit Pay Posting'!E10","v":3},{"$f":"'Edit Pay Posting'!F10","v":4},{"$f":"'Edit Pay Posting'!G10","v":5},{"$f":"'Edit Pay Posting'!H10","v":6},{"$f":"'Edit Pay Posting'!I10","v":7},{"$f":"'Edit Pay Posting'!J10","v":8},{"$f":"'Edit Pay Posting'!K10","v":9},{"$f":"'Edit Pay Posting'!L10","v":10},{"$f":"'Edit Pay Posting'!M10","v":11},{"$f":"'Edit Pay Posting'!N10","v":12}]
{"$rows_left_out":50}