{"text_format":"3","workbook":"xlsx","n_sheets":3,"sheets":["7TH PAY","DATA ENTRY","ORDER"],"not_rendered":{"defined_names":27},"read":"whole","date_system":"1900"}

{"sheet":"7TH PAY","index":0,"n_rows":44,"n_cols":25,"rows_kept":44,"merged":[[0,1,0,9],[0,10,0,13],[0,14,0,21],[0,22,0,24]]}
["PB","PB-1\n5200-20200",{"$nulls":8},"PB-2\n9300-34800",{"$nulls":3},"PB-3\n15600-39100",{"$nulls":7},"PB-4\n37400-67000"]
["G.P",1700,1750,1900,2000,2400,2400,2400,2800,2800,3600,4200,4800,5400,5400,6000,6600,6800,7200,7600,8200,8700,8900,9500,10000]
["L","L-1","L-2","L-3","L-4","L-5","L-6","L-7","L-8","L-9","L-10","L-11","L-12","L-13","L-14","L-15","L-16","L-17","L-18","L-19","L-20","L-21","L-22","L-23","L-24"]
[null,"LA","LB","LC","LD","LE","LF","LG","LH","LI","LJ","LK","LL","LM","LN","LO","LP","LQ","LR","LS","LT","LU","LV","LW","LX"]
[1,17700,17900,18200,19200,20800,21500,22400,26300,28700,33800,37800,44300,53100,56100,60700,67300,71000,75300,79900,88900,123100,129700,145800,148800]
[2,18200,18400,18700,19800,21400,22100,23100,27100,29600,34800,38900,45600,54700,57800,62500,69300,73100,77600,82300,91600,126800,133600,150200,153300]
[3,18700,19000,19300,20400,22000,22800,23800,27900,30500,35800,40100,47000,56300,59500,64400,71400,75300,79900,84800,94300,130600,137600,154700,157900]
[4,19300,19600,19900,21000,22700,23500,24500,28700,31400,36900,41300,48400,58000,61300,66300,73500,77600,82300,87300,97100,134500,141700,159300,162600]
[5,19900,20200,20500,21600,23400,24200,25200,29600,32300,38000,42500,49900,59700,63100,68300,75700,79900,84800,89900,100000,138500,146000,164100,167500]
[6,20500,20800,21100,22200,24100,24900,26000,30500,33300,39100,43800,51400,61500,65000,70300,78000,82300,87300,92600,103000,142700,150400,169000,172500]
[7,21100,21400,21700,22900,24800,25600,26800,31400,34300,40300,45100,52900,63300,67000,72400,80300,84800,89900,95400,106100,147000,154900,174100,177700]
[8,21700,22000,22400,23600,25500,26400,27600,32300,35300,41500,46500,54500,65200,69000,74600,82700,87300,92600,98300,109300,151400,159500,179300,183000]
[9,22400,22700,23100,24300,26300,27200,28400,33300,36400,42700,47900,56100,67200,71100,76800,85200,89900,95400,101200,112600,155900,164300,184700,188500]
[10,23100,23400,23800,25000,27100,28000,29300,34300,37500,44000,49300,57800,69200,73200,79100,87800,92600,98300,104200,116000,160600,169200,190200,194200]
[11,23800,24100,24500,25800,27900,28800,30200,35300,38600,45300,50800,59500,71300,75400,81500,90400,95400,101200,107300,119500,165400,174300,195900,200000]
[12,24500,24800,25200,26600,28700,29700,31100,36400,39800,46700,52300,61300,73400,77700,83900,93100,98300,104200,110500,123100,170400,179500,201800,206000]
[13,25200,25500,26000,27400,29600,30600,32000,37500,41000,48100,53900,63100,75600,80000,86400,95900,101200,107300,113800,126800,175500,184900,207900,212200]
[14,26000,26300,26800,28200,30500,31500,33000,38600,42200,49500,55500,65000,77900,82400,89000,98800,104200,110500,117200,130600,180800,190400,214100,218600]
[15,26800,27100,27600,29000,31400,32400,34000,39800,43500,51000,57200,67000,80200,84900,91700,101800,107300,113800,120700,134500,186200,196100]
[16,27600,27900,28400,29900,32300,33400,35000,41000,44800,52500,58900,69000,82600,87400,94500,104900,110500,117200,124300,138500,191800,202000]
[17,28400,28700,29300,30800,33300,34400,36100,42200,46100,54100,60700,71100,85100,90000,97300,108000,113800,120700,128000,142700,197600,208100]
[18,29300,29600,30200,31700,34300,35400,37200,43500,47500,55700,62500,73200,87700,92700,100200,111200,117200,124300,131800,147000,203500]
[19,30200,30500,31100,32700,35300,36500,38300,44800,48900,57400,64400,75400,90300,95500,103200,114500,120700,128000,135800,151400]
[20,31100,31400,32000,33700,36400,37600,39400,46100,50400,59100,66300,77700,93000,98400,106300,117900,124300,131800,139900,155900]
[21,32000,32300,33000,34700,37500,38700,40600,47500,51900,60900,68300,80000,95800,101400,109500,121400,128000,135800,144100,160600]
[22,33000,33300,34000,35700,38600,39900,41800,48900,53500,62700,70300,82400,98700,104400,112800,125000,131800,139900,148400,165400]
[23,34000,34300,35000,36800,39800,41100,43100,50400,55100,64600,72400,84900,101700,107500,116200,128800,135800,144100,152900,170400]
[24,35000,35300,36100,37900,41000,42300,44400,51900,56800,66500,74600,87400,104800,110700,119700,132700,139900,148400,157500,175500]
[25,36100,36400,37200,39000,42200,43600,45700,53500,58500,68500,76800,90000,107900,114000,123300,136700,144100,152900,162200,180800]
[26,37200,37500,38300,40200,43500,44900,47100,55100,60300,70600,79100,92700,111100,117400,127000,140800,148400,157500,167100,186200]
[27,38300,38600,39400,41400,44800,46200,48500,56800,62100,72700,81500,95500,114400,120900,130800,145000,152900,162200,172100,191800]
[28,39400,39800,40600,42600,46100,47600,50000,58500,64000,74900,83900,98400,117800,124500,134700,149400,157500,167100,177300,197600]
[29,40600,41000,41800,43900,47500,49000,51500,60300,65900,77100,86400,101400,121300,128200,138700,153900,162200,172100,182600,203500]
[30,41800,42200,43100,45200,48900,50500,53000,62100,67900,79400,89000,104400,124900,132000,142900,158500,167100,177300,188100]
[31,43100,43500,44400,46600,50400,52000,54600,64000,69900,81800,91700,107500,128600,136000,147200,163300,172100,182600,193700]
[32,44400,44800,45700,48000,51900,53600,56200,65900,72000,84300,94500,110700,132500,140100,151600,168200,177300,188100,199500]
[33,45700,46100,47100,49400,53500,55200,57900,67900,74200,86800,97300,114000,136500,144300,156100,173200,182600,193700]
[34,47100,47500,48500,50900,55100,56900,59600,69900,76400,89400,100200,117400,140600,148600,160800,178400,188100,199500]
[35,48500,48900,50000,52400,56800,58600,61400,72000,78700,92100,103200,120900,144800,153100,165600,183800,193700]
[36,50000,50400,51500,54000,58500,60400,63200,74200,81100,94900,106300,124500,149100,157700,170600,189300,199500]
[37,51500,51900,53000,55600,60300,62200,65100,76400,83500,97700,109500,128200,153600,162400,175700,195000]
[38,53000,53500,54600,57300,62100,64100,67100,78700,86000,100600,112800,132000,158200,167300,181000]
[39,54600,55100,56200,59000,64000,66000,69100,81100,88600,103600,116200,136000,162900,172300,186400]
[40,56200,56800,57900,60800,65900,68000,71200,83500,91300,106700,119700,140100,167800,177500,192000]

{"sheet":"DATA ENTRY","index":1,"n_rows":202,"n_cols":15,"rows_kept":202,"merged":[[0,0,0,5],[0,6,0,9],[1,6,1,9],[2,6,7,9]]}
[{"$nulls":6},"कुशालराम चौधरी"]
["क्र. स.","नाम कर्मचारी ","पद ","लेवल ","वर्तमान वेतन ","आदेश क्रमांक",9001052931,{"$nulls":7},{"$f":"ORDER!J2","v":0}]
[1,"gh","fg","L-14",56100,null,"आदेश प्रिंट हेतु आदेश क्रमांक लिखने अनिवार्य है, आदेश क्रमांक केवल संख्या में ही लिखें (जैसे-101 आदि)",{"$nulls":3},{"$f":"IFERROR(IF(A3>=1,VLOOKUP(D3,$L$3:$M$26,2,0),\"\"),\"\")","v":"LN"},"L-1","LA",null,{"$f":"IFERROR(IF(A3>=1,(IF(F3>=1,(IF($O$2=F3,A3,0)),0)),0),0)","v":0}]
[2,null,null,"L-14",18200,{"$nulls":5},{"$f":"IFERROR(IF(A4>=1,VLOOKUP(D4,$L$3:$M$26,2,0),\"\"),\"\")","v":"LN"},"L-2","LB",null,{"$f":"IFERROR(IF(A4>=1,(IF(F4>=1,(IF($O$2=F4,A4,0)),0)),0),0)","v":0}]
[3,null,null,"L-7",{"$nulls":6},{"$f":"IFERROR(IF(A5>=1,VLOOKUP(D5,$L$3:$M$26,2,0),\"\"),\"\")","v":"LG"},"L-3","LC",null,0]
[{"$nulls":10},"","L-4","LD",null,0]
[{"$nulls":10},"","L-5","LE",null,0]
[{"$nulls":10},"","L-6","LF",null,0]
[{"$nulls":10},"","L-7","LG",null,0]
[{"$nulls":10},"","L-8","LH",null,0]
[{"$nulls":10},"","L-9","LI",null,0]
[{"$nulls":10},"","L-10","LJ",null,0]
[{"$nulls":10},"","L-11","LK",null,0]
[{"$nulls":10},"","L-12","LL",null,0]
[{"$nulls":10},"","L-13","LM",null,0]
[{"$nulls":10},"","L-14","LN",null,0]
[{"$nulls":10},"","L-15","LO",null,0]
[{"$nulls":10},"","L-16","LP",null,0]
[{"$nulls":10},"","L-17","LQ",null,0]
[{"$nulls":10},"","L-18","LR",null,0]
[{"$nulls":10},"","L-19","LS",null,0]
[{"$nulls":10},"","L-20","LT",null,0]
[{"$nulls":10},"","L-21","LU",null,0]
[{"$nulls":10},"","L-22","LV",null,0]
[{"$nulls":10},"","L-23","LW",null,0]
[{"$nulls":10},"","L-24","LX",null,0]
[{"$nulls":10},"",{"$nulls":3},0]
[{"$nulls":10},"",{"$nulls":3},0]
[{"$nulls":10},"",{"$nulls":3},0]
[{"$nulls":10},"",{"$nulls":3},0]
[{"$nulls":10},"",{"$nulls":3},0]
[{"$nulls":10},"",{"$nulls":3},0]
[{"$nulls":10},"",{"$nulls":3},0]
[{"$nulls":10},"",{"$nulls":3},0]
[{"$nulls":10},"",{"$nulls":3},0]
[{"$nulls":10},"",{"$nulls":3},0]
[{"$nulls":10},"",{"$nulls":3},0]
[{"$nulls":10},"",{"$nulls":3},0]
[{"$nulls":10},"",{"$nulls":3},0]
[{"$nulls":10},"",{"$nulls":3},0]
[{"$nulls":10},"",{"$nulls":3},0]
[{"$nulls":10},"",{"$nulls":3},0]
[{"$nulls":10},"",{"$nulls":3},0]
[{"$nulls":10},"",{"$nulls":3},0]
[{"$nulls":10},"",{"$nulls":3},0]
[{"$nulls":10},"",{"$nulls":3},0]
[{"$nulls":10},"",{"$nulls":3},0]
[{"$nulls":10},"",{"$nulls":3},0]
[{"$nulls":10},"",{"$nulls":3},0]
[{"$nulls":10},"",{"$nulls":3},0]
[{"$nulls":10},"",{"$nulls":3},0]
[{"$nulls":10},"",{"$nulls":3},0]
[{"$nulls":10},"",{"$nulls":3},0]
[{"$nulls":10},"",{"$nulls":3},0]
[{"$nulls":10},"",{"$nulls":3},0]
[{"$nulls":10},"",{"$nulls":3},0]
[{"$nulls":10},"",{"$nulls":3},0]
[{"$nulls":10},"",{"$nulls":3},0]
[{"$nulls":10},"",{"$nulls":3},0]
[{"$nulls":10},"",{"$nulls":3},0]
{"$rows_left_out":143}
{"sheet":"ORDER","index":2,"n_rows":47,"n_cols":17,"rows_kept":47,"merged":[[0,0,0,7],[0,8,0,10],[1,0,1,7],[2,0,8,7],[2,8,3,10],[9,0,11,0],[9,1,11,1],[9,2,11,2],[9,3,11,3],[9,4,11,4],[9,5,11,5],[9,6,11,6],[9,7,11,7],[36,4,36,7],[37,6,37,7],[42,6,42,7],[46,4,46,7]]}
[{"$f":"'DATA ENTRY'!A1","v":0},{"$nulls":7},"नीचे आदेश क्रमांक चयन करें",{"$nulls":3},{"$f":"COUNTIF('DATA ENTRY'!F3:F202,\"0\")","v":0},{"$f":"COUNTIF('DATA ENTRY'!F3:F202,\">=1\")","v":0},null,"2020-07-01",{"$f":"COUNTIF('DATA ENTRY'!$O$3:$O$202,\"0\")","v":200}]
[" -:कार्यालय आदेश:- ",{"$nulls":10},1,{"$f":"IFERROR(IF($N$1>=L2,SMALL('DATA ENTRY'!$F$3:$F$202,$M$1+L2),0),0)","v":0},{"$f":"IFERROR(IF(M2>=1,COUNTIF('DATA ENTRY'!$F$3:$F$202,M2),0),0)","v":0},{"$f":"N2","v":0},"2021-07-01",{"$f":"COUNTIF('DATA ENTRY'!$O$3:$O$202,\">=1\")","v":0}]
["               राज्य सरकार के वित्त विभाग के आदेश क्रमांक :- F.15(1)FD(Rules)/2017 जयपुर दिनांक : 30-10-2017 व द्वितीय संशोधन दिनांक 09-12-2017 के अनुसरण में इस कार्यालय अधीन कार्यरत निम्नलिखित कार्मिकों को उनके द्वारा एक वर्ष की संतोषजनक सेवा पूर्ण पर दिनांक 01-07-2020 से वार्षिक वेतन वृद्धि उनके नाम के सम्मुख अंकित कॉलम संख्या 7 के अनुसार स्वीकृत की जाकर तदनानुसार वेतन आहरित करने की एतद् द्वारा स्वीकृति प्रदान की जाती है | वेतन वृद्धि दिनांक को कार्मिक के आकस्मिक अवकाश के अतिरिक्त अन्य अवकाश पर होने की स्थिति में वेतन वृद्धि का लाभ अवकाश से लौटने की तिथि से देय होगा |  प्रमाणित किया जाता है कि उक्त कार्मिकों ने ऐसा कोई अवकाश नहीं लिया है जिससे उनकी वेतन वृद्धि प्रभावित होती हो |",{"$nulls":7},"नीचे आदेश दिनांक हेतु दिन, माह(क्रमांक), वर्ष लिखें",null,null,{"$f":"$M$1+O2+$L$2","v":1},{"$f":"IFERROR(IF($N$1>=L3,SMALL('DATA ENTRY'!$F$3:$F$202,$M$1+L3),0),0)","v":0},{"$f":"IFERROR(IF(M3>=1,COUNTIF('DATA ENTRY'!$F$3:$F$202,M3),0),0)","v":0},{"$f":"SUM($N$2:N3)","v":0}]
[{"$nulls":11},1,{"$f":"IFERROR(IF($N$1>=L4,SMALL('DATA ENTRY'!$F$3:$F$202,$M$1+L4),0),0)","v":0},{"$f":"IFERROR(IF(M4>=1,COUNTIF('DATA ENTRY'!$F$3:$F$202,M4),0),0)","v":0},{"$f":"SUM($N$2:N4)","v":0}]
[{"$nulls":8},"दिन","माह","वर्ष",1,{"$f":"IFERROR(IF($N$1>=L5,SMALL('DATA ENTRY'!$F$3:$F$202,$M$1+L5),0),0)","v":0},{"$f":"IFERROR(IF(M5>=1,COUNTIF('DATA ENTRY'!$F$3:$F$202,M5),0),0)","v":0},{"$f":"SUM($N$2:N5)","v":0}]
[{"$nulls":11},1,{"$f":"IFERROR(IF($N$1>=L6,SMALL('DATA ENTRY'!$F$3:$F$202,$M$1+L6),0),0)","v":0},{"$f":"IFERROR(IF(M6>=1,COUNTIF('DATA ENTRY'!$F$3:$F$202,M6),0),0)","v":0},{"$f":"SUM($N$2:N6)","v":0}]
[{"$nulls":11},1,{"$f":"IFERROR(IF($N$1>=L7,SMALL('DATA ENTRY'!$F$3:$F$202,$M$1+L7),0),0)","v":0},{"$f":"IFERROR(IF(M7>=1,COUNTIF('DATA ENTRY'!$F$3:$F$202,M7),0),0)","v":0},{"$f":"SUM($N$2:N7)","v":0}]
[{"$nulls":11},1,{"$f":"IFERROR(IF($N$1>=L8,SMALL('DATA ENTRY'!$F$3:$F$202,$M$1+L8),0),0)","v":0},{"$f":"IFERROR(IF(M8>=1,COUNTIF('DATA ENTRY'!$F$3:$F$202,M8),0),0)","v":0},{"$f":"SUM($N$2:N8)","v":0}]
[{"$nulls":11},1,{"$f":"IFERROR(IF($N$1>=L9,SMALL('DATA ENTRY'!$F$3:$F$202,$M$1+L9),0),0)","v":0},{"$f":"IFERROR(IF(M9>=1,COUNTIF('DATA ENTRY'!$F$3:$F$202,M9),0),0)","v":0},{"$f":"SUM($N$2:N9)","v":0}]
["क्र.स.","नाम कर्मचारी ","पद ","लेवल ","वर्तमान वेतन ","वेतन वृद्धि तिथि ","वेतन वृद्धि पश्चात वेतन ","आगामी वेतन वृद्धि तिथि ",{"$nulls":3},1,{"$f":"IFERROR(IF($N$1>=L10,SMALL('DATA ENTRY'!$F$3:$F$202,$M$1+L10),0),0)","v":0},{"$f":"IFERROR(IF(M10>=1,COUNTIF('DATA ENTRY'!$F$3:$F$202,M10),0),0)","v":0},{"$f":"SUM($N$2:N10)","v":0}]
[{"$nulls":11},1,{"$f":"IFERROR(IF($N$1>=L11,SMALL('DATA ENTRY'!$F$3:$F$202,$M$1+L11),0),0)","v":0},{"$f":"IFERROR(IF(M11>=1,COUNTIF('DATA ENTRY'!$F$3:$F$202,M11),0),0)","v":0},{"$f":"SUM($N$2:N11)","v":0}]
[{"$nulls":11},1,{"$f":"IFERROR(IF($N$1>=L12,SMALL('DATA ENTRY'!$F$3:$F$202,$M$1+L12),0),0)","v":0},{"$f":"IFERROR(IF(M12>=1,COUNTIF('DATA ENTRY'!$F$3:$F$202,M12),0),0)","v":0},{"$f":"SUM($N$2:N12)","v":0}]
[1,2,3,4,5,6,7,8,{"$nulls":3},1,{"$f":"IFERROR(IF($N$1>=L13,SMALL('DATA ENTRY'!$F$3:$F$202,$M$1+L13),0),0)","v":0},{"$f":"IFERROR(IF(M13>=1,COUNTIF('DATA ENTRY'!$F$3:$F$202,M13),0),0)","v":0},{"$f":"SUM($N$2:N13)","v":0}]
[{"$f":"IFERROR(IF(Q14>=1,P14,0),0)","v":0},{"$f":"IFERROR(IF($A14>=1,VLOOKUP($Q14,'DATA ENTRY'!$A$3:$E$202,2,0),\"\"),\"\")","v":""},{"$f":"IFERROR(IF($A14>=1,VLOOKUP($Q14,'DATA ENTRY'!$A$3:$E$202,3,0),\"\"),\"\")","v":""},{"$f":"IFERROR(IF($A14>=1,VLOOKUP($Q14,'DATA ENTRY'!$A$3:$E$202,4,0),\"\"),\"\")","v":""},{"$f":"IFERROR(IF($A14>=1,VLOOKUP($Q14,'DATA ENTRY'!$A$3:$E$202,5,0),\"\"),\"\")","v":""},{"$f":"IFERROR(IF(A14>=1,(IF(E14>=1,$P$1,0)),0),0)","v":"00:00:00"},{"$f":"IFERROR(IF(A14>=1,(IF(E14>=1,E14+(ROUND(E14*3/10000,0)*100),0)),0),0)","v":0},{"$f":"IFERROR(IF(A14>=1,(IF(G14>=1,$P$2,0)),0),0)","v":"00:00:00"},{"$nulls":3},1,{"$f":"IFERROR(IF($N$1>=L14,SMALL('DATA ENTRY'!$F$3:$F$202,$M$1+L14),0),0)","v":0},{"$f":"IFERROR(IF(M14>=1,COUNTIF('DATA ENTRY'!$F$3:$F$202,M14),0),0)","v":0},{"$f":"SUM($N$2:N14)","v":0},1,{"$f":"IFERROR(IF($Q$2>=P14,SMALL('DATA ENTRY'!$O$3:$O$202,$Q$1+P14),0),0)","v":0}]
[{"$f":"IFERROR(IF(Q15>=1,P15,0),0)","v":0},{"$f":"IFERROR(IF($A15>=1,VLOOKUP($Q15,'DATA ENTRY'!$A$3:$E$202,2,0),\"\"),\"\")","v":""},{"$f":"IFERROR(IF($A15>=1,VLOOKUP($Q15,'DATA ENTRY'!$A$3:$E$202,3,0),\"\"),\"\")","v":""},{"$f":"IFERROR(IF($A15>=1,VLOOKUP($Q15,'DATA ENTRY'!$A$3:$E$202,4,0),\"\"),\"\")","v":""},{"$f":"IFERROR(IF($A15>=1,VLOOKUP($Q15,'DATA ENTRY'!$A$3:$E$202,5,0),\"\"),\"\")","v":""},{"$f":"IFERROR(IF(A15>=1,(IF(E15>=1,$P$1,0)),0),0)","v":"00:00:00"},{"$f":"IFERROR(IF(A15>=1,(IF(E15>=1,E15+(ROUND(E15*3/10000,0)*100),0)),0),0)","v":0},{"$f":"IFERROR(IF(A15>=1,(IF(G15>=1,$P$2,0)),0),0)","v":"00:00:00"},{"$nulls":3},1,{"$f":"IFERROR(IF($N$1>=L15,SMALL('DATA ENTRY'!$F$3:$F$202,$M$1+L15),0),0)","v":0},{"$f":"IFERROR(IF(M15>=1,COUNTIF('DATA ENTRY'!$F$3:$F$202,M15),0),0)","v":0},{"$f":"SUM($N$2:N15)","v":0},2,{"$f":"IFERROR(IF($Q$2>=P15,SMALL('DATA ENTRY'!$O$3:$O$202,$Q$1+P15),0),0)","v":0}]
[0,{"$f":"IFERROR(IF($A16>=1,VLOOKUP($Q16,'DATA ENTRY'!$A$3:$E$202,2,0),\"\"),\"\")","v":""},{"$f":"IFERROR(IF($A16>=1,VLOOKUP($Q16,'DATA ENTRY'!$A$3:$E$202,3,0),\"\"),\"\")","v":""},{"$f":"IFERROR(IF($A16>=1,VLOOKUP($Q16,'DATA ENTRY'!$A$3:$E$202,4,0),\"\"),\"\")","v":""},{"$f":"IFERROR(IF($A16>=1,VLOOKUP($Q16,'DATA ENTRY'!$A$3:$E$202,5,0),\"\"),\"\")","v":""},"00:00:00",0,"00:00:00",{"$nulls":3},1,{"$f":"IFERROR(IF($N$1>=L16,SMALL('DATA ENTRY'!$F$3:$F$202,$M$1+L16),0),0)","v":0},{"$f":"IFERROR(IF(M16>=1,COUNTIF('DATA ENTRY'!$F$3:$F$202,M16),0),0)","v":0},{"$f":"SUM($N$2:N16)","v":0},3,{"$f":"IFERROR(IF($Q$2>=P16,SMALL('DATA ENTRY'!$O$3:$O$202,$Q$1+P16),0),0)","v":0}]
[0,{"$f":"IFERROR(IF($A17>=1,VLOOKUP($Q17,'DATA ENTRY'!$A$3:$E$202,2,0),\"\"),\"\")","v":""},{"$f":"IFERROR(IF($A17>=1,VLOOKUP($Q17,'DATA ENTRY'!$A$3:$E$202,3,0),\"\"),\"\")","v":""},{"$f":"IFERROR(IF($A17>=1,VLOOKUP($Q17,'DATA ENTRY'!$A$3:$E$202,4,0),\"\"),\"\")","v":""},{"$f":"IFERROR(IF($A17>=1,VLOOKUP($Q17,'DATA ENTRY'!$A$3:$E$202,5,0),\"\"),\"\")","v":""},"00:00:00",0,"00:00:00",{"$nulls":3},1,{"$f":"IFERROR(IF($N$1>=L17,SMALL('DATA ENTRY'!$F$3:$F$202,$M$1+L17),0),0)","v":0},{"$f":"IFERROR(IF(M17>=1,COUNTIF('DATA ENTRY'!$F$3:$F$202,M17),0),0)","v":0},{"$f":"SUM($N$2:N17)","v":0},4,{"$f":"IFERROR(IF($Q$2>=P17,SMALL('DATA ENTRY'!$O$3:$O$202,$Q$1+P17),0),0)","v":0}]
[0,{"$f":"IFERROR(IF($A18>=1,VLOOKUP($Q18,'DATA ENTRY'!$A$3:$E$202,2,0),\"\"),\"\")","v":""},{"$f":"IFERROR(IF($A18>=1,VLOOKUP($Q18,'DATA ENTRY'!$A$3:$E$202,3,0),\"\"),\"\")","v":""},{"$f":"IFERROR(IF($A18>=1,VLOOKUP($Q18,'DATA ENTRY'!$A$3:$E$202,4,0),\"\"),\"\")","v":""},{"$f":"IFERROR(IF($A18>=1,VLOOKUP($Q18,'DATA ENTRY'!$A$3:$E$202,5,0),\"\"),\"\")","v":""},"00:00:00",0,"00:00:00",{"$nulls":3},1,{"$f":"IFERROR(IF($N$1>=L18,SMALL('DATA ENTRY'!$F$3:$F$202,$M$1+L18),0),0)","v":0},{"$f":"IFERROR(IF(M18>=1,COUNTIF('DATA ENTRY'!$F$3:$F$202,M18),0),0)","v":0},{"$f":"SUM($N$2:N18)","v":0},5,{"$f":"IFERROR(IF($Q$2>=P18,SMALL('DATA ENTRY'!$O$3:$O$202,$Q$1+P18),0),0)","v":0}]
[0,{"$f":"IFERROR(IF($A19>=1,VLOOKUP($Q19,'DATA ENTRY'!$A$3:$E$202,2,0),\"\"),\"\")","v":""},{"$f":"IFERROR(IF($A19>=1,VLOOKUP($Q19,'DATA ENTRY'!$A$3:$E$202,3,0),\"\"),\"\")","v":""},{"$f":"IFERROR(IF($A19>=1,VLOOKUP($Q19,'DATA ENTRY'!$A$3:$E$202,4,0),\"\"),\"\")","v":""},{"$f":"IFERROR(IF($A19>=1,VLOOKUP($Q19,'DATA ENTRY'!$A$3:$E$202,5,0),\"\"),\"\")","v":""},"00:00:00",0,"00:00:00",{"$nulls":3},1,{"$f":"IFERROR(IF($N$1>=L19,SMALL('DATA ENTRY'!$F$3:$F$202,$M$1+L19),0),0)","v":0},{"$f":"IFERROR(IF(M19>=1,COUNTIF('DATA ENTRY'!$F$3:$F$202,M19),0),0)","v":0},{"$f":"SUM($N$2:N19)","v":0},6,{"$f":"IFERROR(IF($Q$2>=P19,SMALL('DATA ENTRY'!$O$3:$O$202,$Q$1+P19),0),0)","v":0}]
[0,{"$f":"IFERROR(IF($A20>=1,VLOOKUP($Q20,'DATA ENTRY'!$A$3:$E$202,2,0),\"\"),\"\")","v":""},{"$f":"IFERROR(IF($A20>=1,VLOOKUP($Q20,'DATA ENTRY'!$A$3:$E$202,3,0),\"\"),\"\")","v":""},{"$f":"IFERROR(IF($A20>=1,VLOOKUP($Q20,'DATA ENTRY'!$A$3:$E$202,4,0),\"\"),\"\")","v":""},{"$f":"IFERROR(IF($A20>=1,VLOOKUP($Q20,'DATA ENTRY'!$A$3:$E$202,5,0),\"\"),\"\")","v":""},"00:00:00",0,"00:00:00",{"$nulls":3},1,{"$f":"IFERROR(IF($N$1>=L20,SMALL('DATA ENTRY'!$F$3:$F$202,$M$1+L20),0),0)","v":0},{"$f":"IFERROR(IF(M20>=1,COUNTIF('DATA ENTRY'!$F$3:$F$202,M20),0),0)","v":0},{"$f":"SUM($N$2:N20)","v":0},7,{"$f":"IFERROR(IF($Q$2>=P20,SMALL('DATA ENTRY'!$O$3:$O$202,$Q$1+P20),0),0)","v":0}]
[0,{"$f":"IFERROR(IF($A21>=1,VLOOKUP($Q21,'DATA ENTRY'!$A$3:$E$202,2,0),\"\"),\"\")","v":""},{"$f":"IFERROR(IF($A21>=1,VLOOKUP($Q21,'DATA ENTRY'!$A$3:$E$202,3,0),\"\"),\"\")","v":""},{"$f":"IFERROR(IF($A21>=1,VLOOKUP($Q21,'DATA ENTRY'!$A$3:$E$202,4,0),\"\"),\"\")","v":""},{"$f":"IFERROR(IF($A21>=1,VLOOKUP($Q21,'DATA ENTRY'!$A$3:$E$202,5,0),\"\"),\"\")","v":""},"00:00:00",0,"00:00:00",{"$nulls":3},1,{"$f":"IFERROR(IF($N$1>=L21,SMALL('DATA ENTRY'!$F$3:$F$202,$M$1+L21),0),0)","v":0},{"$f":"IFERROR(IF(M21>=1,COUNTIF('DATA ENTRY'!$F$3:$F$202,M21),0),0)","v":0},{"$f":"SUM($N$2:N21)","v":0},8,{"$f":"IFERROR(IF($Q$2>=P21,SMALL('DATA ENTRY'!$O$3:$O$202,$Q$1+P21),0),0)","v":0}]
[0,{"$f":"IFERROR(IF($A22>=1,VLOOKUP($Q22,'DATA ENTRY'!$A$3:$E$202,2,0),\"\"),\"\")","v":""},{"$f":"IFERROR(IF($A22>=1,VLOOKUP($Q22,'DATA ENTRY'!$A$3:$E$202,3,0),\"\"),\"\")","v":""},{"$f":"IFERROR(IF($A22>=1,VLOOKUP($Q22,'DATA ENTRY'!$A$3:$E$202,4,0),\"\"),\"\")","v":""},{"$f":"IFERROR(IF($A22>=1,VLOOKUP($Q22,'DATA ENTRY'!$A$3:$E$202,5,0),\"\"),\"\")","v":""},"00:00:00",0,"00:00:00",{"$nulls":7},9,{"$f":"IFERROR(IF($Q$2>=P22,SMALL('DATA ENTRY'!$O$3:$O$202,$Q$1+P22),0),0)","v":0}]
[0,{"$f":"IFERROR(IF($A23>=1,VLOOKUP($Q23,'DATA ENTRY'!$A$3:$E$202,2,0),\"\"),\"\")","v":""},{"$f":"IFERROR(IF($A23>=1,VLOOKUP($Q23,'DATA ENTRY'!$A$3:$E$202,3,0),\"\"),\"\")","v":""},{"$f":"IFERROR(IF($A23>=1,VLOOKUP($Q23,'DATA ENTRY'!$A$3:$E$202,4,0),\"\"),\"\")","v":""},{"$f":"IFERROR(IF($A23>=1,VLOOKUP($Q23,'DATA ENTRY'!$A$3:$E$202,5,0),\"\"),\"\")","v":""},"00:00:00",0,"00:00:00",{"$nulls":7},10,{"$f":"IFERROR(IF($Q$2>=P23,SMALL('DATA ENTRY'!$O$3:$O$202,$Q$1+P23),0),0)","v":0}]
[0,{"$f":"IFERROR(IF($A24>=1,VLOOKUP($Q24,'DATA ENTRY'!$A$3:$E$202,2,0),\"\"),\"\")","v":""},{"$f":"IFERROR(IF($A24>=1,VLOOKUP($Q24,'DATA ENTRY'!$A$3:$E$202,3,0),\"\"),\"\")","v":""},{"$f":"IFERROR(IF($A24>=1,VLOOKUP($Q24,'DATA ENTRY'!$A$3:$E$202,4,0),\"\"),\"\")","v":""},{"$f":"IFERROR(IF($A24>=1,VLOOKUP($Q24,'DATA ENTRY'!$A$3:$E$202,5,0),\"\"),\"\")","v":""},"00:00:00",0,"00:00:00",{"$nulls":7},11,{"$f":"IFERROR(IF($Q$2>=P24,SMALL('DATA ENTRY'!$O$3:$O$202,$Q$1+P24),0),0)","v":0}]
[0,{"$f":"IFERROR(IF($A25>=1,VLOOKUP($Q25,'DATA ENTRY'!$A$3:$E$202,2,0),\"\"),\"\")","v":""},{"$f":"IFERROR(IF($A25>=1,VLOOKUP($Q25,'DATA ENTRY'!$A$3:$E$202,3,0),\"\"),\"\")","v":""},{"$f":"IFERROR(IF($A25>=1,VLOOKUP($Q25,'DATA ENTRY'!$A$3:$E$202,4,0),\"\"),\"\")","v":""},{"$f":"IFERROR(IF($A25>=1,VLOOKUP($Q25,'DATA ENTRY'!$A$3:$E$202,5,0),\"\"),\"\")","v":""},"00:00:00",0,"00:00:00",{"$nulls":7},12,{"$f":"IFERROR(IF($Q$2>=P25,SMALL('DATA ENTRY'!$O$3:$O$202,$Q$1+P25),0),0)","v":0}]
[0,{"$f":"IFERROR(IF($A26>=1,VLOOKUP($Q26,'DATA ENTRY'!$A$3:$E$202,2,0),\"\"),\"\")","v":""},{"$f":"IFERROR(IF($A26>=1,VLOOKUP($Q26,'DATA ENTRY'!$A$3:$E$202,3,0),\"\"),\"\")","v":""},{"$f":"IFERROR(IF($A26>=1,VLOOKUP($Q26,'DATA ENTRY'!$A$3:$E$202,4,0),\"\"),\"\")","v":""},{"$f":"IFERROR(IF($A26>=1,VLOOKUP($Q26,'DATA ENTRY'!$A$3:$E$202,5,0),\"\"),\"\")","v":""},"00:00:00",0,"00:00:00",{"$nulls":7},13,{"$f":"IFERROR(IF($Q$2>=P26,SMALL('DATA ENTRY'!$O$3:$O$202,$Q$1+P26),0),0)","v":0}]
[0,{"$f":"IFERROR(IF($A27>=1,VLOOKUP($Q27,'DATA ENTRY'!$A$3:$E$202,2,0),\"\"),\"\")","v":""},{"$f":"IFERROR(IF($A27>=1,VLOOKUP($Q27,'DATA ENTRY'!$A$3:$E$202,3,0),\"\"),\"\")","v":""},{"$f":"IFERROR(IF($A27>=1,VLOOKUP($Q27,'DATA ENTRY'!$A$3:$E$202,4,0),\"\"),\"\")","v":""},{"$f":"IFERROR(IF($A27>=1,VLOOKUP($Q27,'DATA ENTRY'!$A$3:$E$202,5,0),\"\"),\"\")","v":""},"00:00:00",0,"00:00:00",{"$nulls":7},14,{"$f":"IFERROR(IF($Q$2>=P27,SMALL('DATA ENTRY'!$O$3:$O$202,$Q$1+P27),0),0)","v":0}]
[0,{"$f":"IFERROR(IF($A28>=1,VLOOKUP($Q28,'DATA ENTRY'!$A$3:$E$202,2,0),\"\"),\"\")","v":""},{"$f":"IFERROR(IF($A28>=1,VLOOKUP($Q28,'DATA ENTRY'!$A$3:$E$202,3,0),\"\"),\"\")","v":""},{"$f":"IFERROR(IF($A28>=1,VLOOKUP($Q28,'DATA ENTRY'!$A$3:$E$202,4,0),\"\"),\"\")","v":""},{"$f":"IFERROR(IF($A28>=1,VLOOKUP($Q28,'DATA ENTRY'!$A$3:$E$202,5,0),\"\"),\"\")","v":""},"00:00:00",0,"00:00:00",{"$nulls":7},15,{"$f":"IFERROR(IF($Q$2>=P28,SMALL('DATA ENTRY'!$O$3:$O$202,$Q$1+P28),0),0)","v":0}]
[0,{"$f":"IFERROR(IF($A29>=1,VLOOKUP($Q29,'DATA ENTRY'!$A$3:$E$202,2,0),\"\"),\"\")","v":""},{"$f":"IFERROR(IF($A29>=1,VLOOKUP($Q29,'DATA ENTRY'!$A$3:$E$202,3,0),\"\"),\"\")","v":""},{"$f":"IFERROR(IF($A29>=1,VLOOKUP($Q29,'DATA ENTRY'!$A$3:$E$202,4,0),\"\"),\"\")","v":""},{"$f":"IFERROR(IF($A29>=1,VLOOKUP($Q29,'DATA ENTRY'!$A$3:$E$202,5,0),\"\"),\"\")","v":""},"00:00:00",0,"00:00:00",{"$nulls":7},16,{"$f":"IFERROR(IF($Q$2>=P29,SMALL('DATA ENTRY'!$O$3:$O$202,$Q$1+P29),0),0)","v":0}]
[0,{"$f":"IFERROR(IF($A30>=1,VLOOKUP($Q30,'DATA ENTRY'!$A$3:$E$202,2,0),\"\"),\"\")","v":""},{"$f":"IFERROR(IF($A30>=1,VLOOKUP($Q30,'DATA ENTRY'!$A$3:$E$202,3,0),\"\"),\"\")","v":""},{"$f":"IFERROR(IF($A30>=1,VLOOKUP($Q30,'DATA ENTRY'!$A$3:$E$202,4,0),\"\"),\"\")","v":""},{"$f":"IFERROR(IF($A30>=1,VLOOKUP($Q30,'DATA ENTRY'!$A$3:$E$202,5,0),\"\"),\"\")","v":""},"00:00:00",0,"00:00:00",{"$nulls":7},17,{"$f":"IFERROR(IF($Q$2>=P30,SMALL('DATA ENTRY'!$O$3:$O$202,$Q$1+P30),0),0)","v":0}]
[0,{"$f":"IFERROR(IF($A31>=1,VLOOKUP($Q31,'DATA ENTRY'!$A$3:$E$202,2,0),\"\"),\"\")","v":""},{"$f":"IFERROR(IF($A31>=1,VLOOKUP($Q31,'DATA ENTRY'!$A$3:$E$202,3,0),\"\"),\"\")","v":""},{"$f":"IFERROR(IF($A31>=1,VLOOKUP($Q31,'DATA ENTRY'!$A$3:$E$202,4,0),\"\"),\"\")","v":""},{"$f":"IFERROR(IF($A31>=1,VLOOKUP($Q31,'DATA ENTRY'!$A$3:$E$202,5,0),\"\"),\"\")","v":""},"00:00:00",0,"00:00:00",{"$nulls":7},18,{"$f":"IFERROR(IF($Q$2>=P31,SMALL('DATA ENTRY'!$O$3:$O$202,$Q$1+P31),0),0)","v":0}]
[0,{"$f":"IFERROR(IF($A32>=1,VLOOKUP($Q32,'DATA ENTRY'!$A$3:$E$202,2,0),\"\"),\"\")","v":""},{"$f":"IFERROR(IF($A32>=1,VLOOKUP($Q32,'DATA ENTRY'!$A$3:$E$202,3,0),\"\"),\"\")","v":""},{"$f":"IFERROR(IF($A32>=1,VLOOKUP($Q32,'DATA ENTRY'!$A$3:$E$202,4,0),\"\"),\"\")","v":""},{"$f":"IFERROR(IF($A32>=1,VLOOKUP($Q32,'DATA ENTRY'!$A$3:$E$202,5,0),\"\"),\"\")","v":""},"00:00:00",0,"00:00:00",{"$nulls":7},19,{"$f":"IFERROR(IF($Q$2>=P32,SMALL('DATA ENTRY'!$O$3:$O$202,$Q$1+P32),0),0)","v":0}]
[0,{"$f":"IFERROR(IF($A33>=1,VLOOKUP($Q33,'DATA ENTRY'!$A$3:$E$202,2,0),\"\"),\"\")","v":""},{"$f":"IFERROR(IF($A33>=1,VLOOKUP($Q33,'DATA ENTRY'!$A$3:$E$202,3,0),\"\"),\"\")","v":""},{"$f":"IFERROR(IF($A33>=1,VLOOKUP($Q33,'DATA ENTRY'!$A$3:$E$202,4,0),\"\"),\"\")","v":""},{"$f":"IFERROR(IF($A33>=1,VLOOKUP($Q33,'DATA ENTRY'!$A$3:$E$202,5,0),\"\"),\"\")","v":""},"00:00:00",0,"00:00:00",{"$nulls":7},20,{"$f":"IFERROR(IF($Q$2>=P33,SMALL('DATA ENTRY'!$O$3:$O$202,$Q$1+P33),0),0)","v":0}]
[]
[]
[]
[{"$nulls":4},"हस्ताक्षर DDO मय मोहर"]
["क्रमांक- ",{"$f":"J2","v":0},{"$nulls":3},"दिनाक -",{"$f":"IFERROR(IF(B38>=1,(IF(I6>=1,(IF(J6>=1,(IF(K6>=2000,DATE(K6,J6,I6),0)),0)),0)),0),0)","v":"00:00:00"}]
["प्रतिलिपि सूचनार्थ :-"]
["1. उपकोष कार्यालय .............................."]
["2. लेखा शाखा "]
["3. सम्बंधित कार्मिक व्यक्तिगत पंजिका "]
["4. रक्षित पत्रावली "]
[]
[]
[]
[{"$nulls":4},"हस्ताक्षर DDO मय मोहर"]