{"text_format":"3","workbook":"xlsx","n_sheets":6,"sheets":["Instructions","Master Data","Extra Ded. ","GA55 ","COMPUTATION","Form No. 16"],"not_rendered":{"images":9,"external_links":2,"defined_names":11,"comments":2},"read":"whole","date_system":"1900"}

{"sheet":"Instructions","index":0,"n_rows":28,"n_cols":4,"rows_kept":28,"merged":[[2,1,2,2],[3,1,5,1],[7,1,7,2],[8,1,8,2],[9,1,9,2],[11,1,11,2],[12,1,12,2],[14,1,14,2],[15,1,15,2],[16,1,16,2],[17,1,17,2],[18,1,18,2],[20,2,21,2]]}
[null,null,"Instructions"]
[]
[null,";g ,Dly izksxzke esjs ije~ iwT; xq:nso Jh Jh 1008 oklqnso th egkjkt o esjs bZ\"V izHkq t;  ctjaxcyh o ikcwth egkjkt dks lefiZr gSaA esjs ekrk & firk o xq:tuksa ds vk'khokZn ls ;g izksxzke e/;izns'k jkT; ds lHkh foHkkx ds dkfeZdksa dh lsok esa lknj izLrqr gSaA"]
[null,null,"How to use this Programme"]
[null,null,"If you have Hindi font problem, then first you should install Hindi font KRUTI DEV 010  in your computer."]
[null,null,"lcls igys vki jktLFkku lHkh 'kSf{kd osclkbZV ij ,Dly xq: ghjkyky tkV }kjk fufeZr vk;dj x.kuk ,Dly ,Iyhds'ku 2020&21 ds viMsV otZu+ dks MkmuyksM djsasaA blds vykok vki Google ij Heeralal Jat fy[kdj lpZ djsaxs rks Hkh vkidks ist fey tk;sxkA tgka ls vki ;g izksxzke MkmuyksM dj ldrs gSaA mlds ckn ftrusa dkfeZdksa dh vk;dj x.kuk djuh gS] mruh gh ,Dly izksxzke 'khV dks muds uke ls vyx vyx Qkby esa  Save  dj ysosaA izR;sad dkfeZd ds fy, ds fy, ,d QkbZy dks mi;ksx esa ysosaA "]
[null,"t; xq:nso ","vki bl ,Dly izksxzke ij dk;Z djus ls igys bUde VSDl foHkkx ds u;s :Yl o fu;e bUde VSDl foHkkx dh website vFkok ys[kk foK vDVqcj 2020 dkss t:j i<+sA oSls bl ,Dly izksxzke esa iq.kZ lko/kkuh cjrh xbZ gSa] fQj Hkh foHkkx ds fu;e gh loksZijh o fljks/kk;Z gSaA"]
[null,"Most Doable Work",null,"ije~ iwT; xq:nso"]
{"$rows_left_out":21}
{"sheet":"Master Data","index":1,"n_rows":36,"n_cols":30,"rows_kept":36,"merged":[[1,1,1,3],[1,4,1,7],[3,1,3,2],[3,3,3,8],[3,10,3,13],[5,1,5,2],[5,3,5,4],[5,5,5,6],[5,7,5,8],[7,1,7,2],[7,3,7,4],[7,5,7,6],[7,7,7,8],[9,1,9,2],[9,3,9,4],[9,5,9,6],[9,7,9,8],[11,1,11,2],[11,3,11,4],[11,5,11,6],[11,7,11,8],[11,10,11,13],[13,1,13,2],[13,3,13,4],[13,5,13,6],[13,7,13,8],[15,1,15,2],[15,3,15,4],[15,5,15,6],[15,7,15,8],[17,1,17,2],[17,3,17,4],[17,5,17,6],[17,7,17,8],[17,10,17,13],[19,4,19,7],[22,1,22,3],[22,5,22,7],[24,1,24,3],[24,5,24,7],[28,2,28,10],[29,5,29,7]]}
[{"$nulls":28},1,"2020-04-01"]
[null,"https://www.youtube.com/watch?v=kSG6hPX7VSQ",null,null,"EMPLOYEE  PERSONAL  DETAIL",{"$nulls":14},"JUN",20,{"$nulls":5},"2019-08-01",null,2,"2020-05-01"]
[{"$nulls":28},3,"2020-06-01"]
[null,"Office Name :-",null,"PRINCIPAL, H.S.S.Girls PICHHORE (3932003025) M.P.\n",{"$nulls":15},"JUL",{"$nulls":3},1000,null,null,"2019-09-01",null,4,"2020-07-01"]
[{"$nulls":28},5,"2020-08-01"]
[null,"Employee Name :-",null,"Heeralal jat",null,"Designation :-",null,"Middle Teacher",{"$nulls":11},"AUG",{"$nulls":3},620,null,null,"2019-10-01",null,6,"2020-09-01"]
[{"$nulls":28},7,"2020-10-01"]
[null,"School Name :-","Posting Place :-","GHS HARIJAN BASTI PICHHORE ",null,"DDO Name :-",null,"B.E.O.PICHHOR",{"$nulls":11},"SEP",{"$nulls":6},"2019-11-01",null,8,"2020-11-01"]
{"$rows_left_out":29}
{"sheet":"Extra Ded. ","index":2,"n_rows":24,"n_cols":9,"rows_kept":24,"merged":[[0,0,0,2],[1,1,1,2],[2,2,2,8],[5,2,5,3],[5,5,23,5],[5,6,5,7],[5,9,23,9],[6,2,6,3],[6,6,6,7],[7,2,7,3],[7,6,7,7],[8,2,8,3],[8,6,8,7],[9,2,9,3],[9,6,9,7],[10,2,10,3],[10,6,10,7],[11,2,11,3],[11,6,11,7],[12,2,12,3],[12,6,12,7],[13,2,13,3],[13,6,13,7],[14,2,14,3],[14,6,14,7],[15,2,15,3],[15,6,15,7],[16,2,16,3],[16,6,16,7],[17,2,17,3],[17,6,17,7],[18,2,18,3],[18,6,18,7],[19,2,19,3],[19,6,19,7],[20,2,20,3],[20,6,20,7],[21,2,21,3],[21,6,21,7],[22,2,22,3],[22,6,22,7],[23,2,23,3],[23,6,23,7],[24,2,24,8]]}
["https://www.youtube.com/watch?v=NWwIhkhEUoc"]
[null,"अधिक जानकारी के लिए ऊपर Youtube video का लिंक दिया गया है। "]
[null,null,"osru dVkSrh ds vfrfjDr dVkSfr;k ftlds rgr vki vk;dj esa NwV pkgrs gSa] rFkk vfrfjDr ¼vU;½ vk; dks ;gkW ij bUnzkt djsA"]
[]
[]
[null,null,"1- edku fdjk;k HkRrk ¼;fn jlhn ds ek/;e ls NwV ysuh gS rks ;gkW fy[ksa½",{"$nulls":3},"20- bfDoVh fyad lsfoax Ldhe"]
[null,null,"2- LVs.MMZ fMMsD'ku (Standard Deduction)  50]000 ¼vf/kdre½",null,50000,null,"21- x`g fdjk;k] /kkjk 10¼13-A½ ds vUrxrZ ,oa /kkjk 10¼14½ds vUrxrZ vU; Hkrs tks dj eqDÙk gSA "]
[null,null,"3- euksjatu Hkrk /kkjk 16 (ii) ds vUrxZr ",{"$nulls":3},"22- LFkfxr okf\"kZdh ¼Defferred Annuty)"]
{"$rows_left_out":17}
{"sheet":"GA55 ","index":3,"n_rows":30,"n_cols":29,"rows_kept":30,"merged":[[0,1,0,25],[0,26,0,28],[1,0,1,2],[1,3,1,7],[1,8,1,11],[1,12,1,15],[1,16,1,19],[1,20,1,26],[1,27,1,28],[2,0,2,1],[2,2,2,4],[2,6,2,8],[2,10,2,13],[2,14,2,16],[2,17,2,21],[2,22,2,25],[2,26,2,28],[3,0,3,12],[3,13,3,25],[3,26,4,26],[3,27,4,27],[3,28,4,28],[28,2,28,7],[28,18,28,26],[29,2,29,7],[29,18,29,26]]}
[null,{"$f":"IF(AND('Master Data'!D4=\"\"),\"\",CONCATENATE(\"Office Name :- \",PROPER('Master Data'!D4)))","v":"Office Name :- Principal, H.S.S.Girls Pichhore (3932003025) M.P.\n"}]
["Employee Name :-",null,null,{"$f":"UPPER(IF('Master Data'!D6=\"\",\"\",'Master Data'!D6))","v":"HEERALAL JAT"},{"$nulls":4},"Designation :-",{"$nulls":3},{"$f":"UPPER(IF('Master Data'!H6=\"\",\"\",'Master Data'!H6))","v":"MIDDLE TEACHER"},{"$nulls":3},"Posting Place :-",{"$nulls":3},{"$f":"UPPER(IF('Master Data'!D8=\"\",\"\",'Master Data'!D8))","v":"GHS HARIJAN BASTI PICHHORE "},{"$nulls":6},"osru Mªk ekufp="]
["PAN No. :-",null,{"$f":"UPPER(IF('Master Data'!D12=\"\",\"\",'Master Data'!D12))","v":"ABCDE1234H"},null,null,"E. ID",{"$f":"IF(AND('Master Data'!D10=\"\"),\"\",'Master Data'!D10)","v":390263384},null,null,"GPF",{"$f":"IF(AND('Master Data'!D14=\"\"),\"\",'Master Data'!D14)","v":11},{"$nulls":3},"PRAN No. :-",null,null,{"$f":"IF(AND('Master Data'!D16=\"\"),\"\",'Master Data'!D16)","v":110161963331},{"$nulls":4},"Bank A/C.",{"$nulls":3},{"$f":"IF(AND('Master Data'!H16=\"\"),\"\",'Master Data'!H16)","v":121212121212121}]
["Details of Payment",{"$nulls":12},"Details of Deduction\n",{"$nulls":12}," Net   Salary ","Voucher N0.","Voucher Date "]
["S.N.","Month","Basic  Pay","Dearness Pay\n","DA "," Conv. All. For. Phy. Cha/\nConv. All. ","HRA","CCA","Interim Relief","Other\nPaymen"," PP on pay"," Fixed T.A./\nSumptuary All. "," Gross Salary","S.I.","GPF","NPS","GIS\n","Recovery"," Relief Fund "," Income Tax/\nProfess.Tax/\nFBF "," GIS  (All India) "," HRR "," Court Deduction ","Other"," Other AG Deduction "," Total Deduction"]
[1,"2020-03-01",35800,null,1234,null,398,200,{"$nulls":4},{"$f":"IF(AND(B6=\"\"),\"\",SUM(C6:L6))","v":37632},null,null,{"$f":"IF(AND('GA55 '!$B6=\"\"),\"\",ROUND((C6+D6+E6)*0.1,0))","v":3703},200,null,1000,208,{"$nulls":5},{"$f":"IF(AND(B6=\"\",M6=\"\"),\"\",SUM(N6:Y6))","v":5111},{"$f":"IF(AND(Z6=\"\",M6=\"\"),\"\",SUM(M6-Z6))","v":32521}]
[2,"2020-04-01",{"$f":"IF(AND('GA55 '!$B7=\"\"),\"\",'GA55 '!C$6)","v":35800},{"$f":"IF(AND('Master Data'!$I$23='Master Data'!$Y$19),0,IF(AND('GA55 '!$B7=\"\"),\"\",'GA55 '!D$6))","v":0},{"$f":"IF(AND('Master Data'!$I$23='Master Data'!$Y$19),0,IF(AND('GA55 '!$B7=\"\"),\"\",'GA55 '!E$6))","v":1234},{"$f":"IF(AND('Master Data'!$I$23='Master Data'!$Y$19),\"\",IF(AND('GA55 '!$B7=\"\"),\"\",'GA55 '!F$6))","v":0},{"$f":"IF(AND('Master Data'!$I$23='Master Data'!$Y$19),\"\",IF(AND('GA55 '!$B7=\"\"),\"\",'GA55 '!G$6))","v":398},{"$f":"IF(AND('Master Data'!$I$23='Master Data'!$Y$19),\"\",IF(AND('GA55 '!$B7=\"\"),\"\",'GA55 '!H$6))","v":200},{"$f":"IF(AND('Master Data'!$I$23='Master Data'!$Y$19),\"\",IF(AND('GA55 '!$B7=\"\"),\"\",'GA55 '!I$6))","v":0},{"$f":"IF(AND('Master Data'!$I$23='Master Data'!$Y$19),\"\",IF(AND('GA55 '!$B7=\"\"),\"\",'GA55 '!J$6))","v":0},{"$f":"IF(AND('Master Data'!$I$23='Master Data'!$Y$19),\"\",IF(AND('GA55 '!$B7=\"\"),\"\",'GA55 '!K$6))","v":0},{"$f":"IF(AND('Master Data'!$I$23='Master Data'!$Y$19),\"\",IF(AND('GA55 '!$B7=\"\"),\"\",'GA55 '!L$6))","v":0},{"$f":"IF(AND(B7=\"\"),\"\",SUM(C7:L7))","v":37632},{"$f":"IF(AND('Master Data'!$I$23='Master Data'!$Y$19),\"\",IF(AND('GA55 '!$B7=\"\"),\"\",'GA55 '!N$6))","v":0},{"$f":"IF(AND('Master Data'!$I$23='Master Data'!$Y$19),\"\",IF(AND('GA55 '!$B7=\"\"),\"\",'GA55 '!O$6))","v":0},{"$f":"IF(AND('GA55 '!$B7=\"\"),\"\",ROUND((C7+D7+E7)*0.1,0))","v":3703},{"$f":"IF(AND('Master Data'!$I$23='Master Data'!$Y$19),\"\",IF(AND('GA55 '!$B7=\"\"),\"\",'GA55 '!Q$6))","v":200},{"$f":"IF(AND('Master Data'!$I$23='Master Data'!$Y$19),\"\",IF(AND('GA55 '!$B7=\"\"),\"\",'GA55 '!R$6))","v":0},{"$f":"IF(AND('Master Data'!$I$23='Master Data'!$Y$19),\"\",IF(AND('GA55 '!$B7=\"\"),\"\",'GA55 '!S$6))","v":1000},{"$f":"IF(AND('Master Data'!$I$23='Master Data'!$Y$19),\"\",IF(AND('GA55 '!$B7=\"\"),\"\",'GA55 '!T$6))","v":208},{"$f":"IF(AND('Master Data'!$I$23='Master Data'!$Y$19),\"\",IF(AND('GA55 '!$B7=\"\"),\"\",'GA55 '!U$6))","v":0},{"$f":"IF(AND('Master Data'!$I$23='Master Data'!$Y$19),\"\",IF(AND('GA55 '!$B7=\"\"),\"\",'GA55 '!V$6))","v":0},{"$f":"IF(AND('Master Data'!$I$23='Master Data'!$Y$19),\"\",IF(AND('GA55 '!$B7=\"\"),\"\",'GA55 '!W$6))","v":0},{"$f":"IF(AND('Master Data'!$I$23='Master Data'!$Y$19),\"\",IF(AND('GA55 '!$B7=\"\"),\"\",'GA55 '!X$6))","v":0},{"$f":"IF(AND('Master Data'!$I$23='Master Data'!$Y$19),\"\",IF(AND('GA55 '!$B7=\"\"),\"\",'GA55 '!Y$6))","v":0},{"$f":"IF(AND(B7=\"\",M7=\"\"),\"\",SUM(N7:Y7))","v":5111},{"$f":"IF(AND(Z7=\"\",M7=\"\"),\"\",SUM(M7-Z7))","v":32521}]
[3,"2020-05-01",{"$f":"IF(AND('GA55 '!$B8=\"\"),\"\",'GA55 '!C$6)","v":35800},{"$f":"IF(AND('Master Data'!$I$23='Master Data'!$Y$19),0,IF(AND('GA55 '!$B8=\"\"),\"\",'GA55 '!D$6))","v":0},{"$f":"IF(AND('Master Data'!$I$23='Master Data'!$Y$19),0,IF(AND('GA55 '!$B8=\"\"),\"\",'GA55 '!E$6))","v":1234},{"$f":"IF(AND('Master Data'!$I$23='Master Data'!$Y$19),\"\",IF(AND('GA55 '!$B8=\"\"),\"\",'GA55 '!F$6))","v":0},{"$f":"IF(AND('Master Data'!$I$23='Master Data'!$Y$19),\"\",IF(AND('GA55 '!$B8=\"\"),\"\",'GA55 '!G$6))","v":398},{"$f":"IF(AND('Master Data'!$I$23='Master Data'!$Y$19),\"\",IF(AND('GA55 '!$B8=\"\"),\"\",'GA55 '!H$6))","v":200},{"$f":"IF(AND('Master Data'!$I$23='Master Data'!$Y$19),\"\",IF(AND('GA55 '!$B8=\"\"),\"\",'GA55 '!I$6))","v":0},{"$f":"IF(AND('Master Data'!$I$23='Master Data'!$Y$19),\"\",IF(AND('GA55 '!$B8=\"\"),\"\",'GA55 '!J$6))","v":0},{"$f":"IF(AND('Master Data'!$I$23='Master Data'!$Y$19),\"\",IF(AND('GA55 '!$B8=\"\"),\"\",'GA55 '!K$6))","v":0},{"$f":"IF(AND('Master Data'!$I$23='Master Data'!$Y$19),\"\",IF(AND('GA55 '!$B8=\"\"),\"\",'GA55 '!L$6))","v":0},{"$f":"IF(AND(B8=\"\"),\"\",SUM(C8:L8))","v":37632},{"$f":"IF(AND('Master Data'!$I$23='Master Data'!$Y$19),\"\",IF(AND('GA55 '!$B8=\"\"),\"\",'GA55 '!N$6))","v":0},{"$f":"IF(AND('Master Data'!$I$23='Master Data'!$Y$19),\"\",IF(AND('GA55 '!$B8=\"\"),\"\",'GA55 '!O$6))","v":0},{"$f":"IF(AND('GA55 '!$B8=\"\"),\"\",ROUND((C8+D8+E8)*0.1,0))","v":3703},{"$f":"IF(AND('Master Data'!$I$23='Master Data'!$Y$19),\"\",IF(AND('GA55 '!$B8=\"\"),\"\",'GA55 '!Q$6))","v":200},{"$f":"IF(AND('Master Data'!$I$23='Master Data'!$Y$19),\"\",IF(AND('GA55 '!$B8=\"\"),\"\",'GA55 '!R$6))","v":0},{"$f":"IF(AND('Master Data'!$I$23='Master Data'!$Y$19),\"\",IF(AND('GA55 '!$B8=\"\"),\"\",'GA55 '!S$6))","v":1000},{"$f":"IF(AND('Master Data'!$I$23='Master Data'!$Y$19),\"\",IF(AND('GA55 '!$B8=\"\"),\"\",'GA55 '!T$6))","v":208},{"$f":"IF(AND('Master Data'!$I$23='Master Data'!$Y$19),\"\",IF(AND('GA55 '!$B8=\"\"),\"\",'GA55 '!U$6))","v":0},{"$f":"IF(AND('Master Data'!$I$23='Master Data'!$Y$19),\"\",IF(AND('GA55 '!$B8=\"\"),\"\",'GA55 '!V$6))","v":0},{"$f":"IF(AND('Master Data'!$I$23='Master Data'!$Y$19),\"\",IF(AND('GA55 '!$B8=\"\"),\"\",'GA55 '!W$6))","v":0},{"$f":"IF(AND('Master Data'!$I$23='Master Data'!$Y$19),\"\",IF(AND('GA55 '!$B8=\"\"),\"\",'GA55 '!X$6))","v":0},{"$f":"IF(AND('Master Data'!$I$23='Master Data'!$Y$19),\"\",IF(AND('GA55 '!$B8=\"\"),\"\",'GA55 '!Y$6))","v":0},5111,32521]
{"$rows_left_out":23}
{"sheet":"COMPUTATION","index":4,"n_rows":69,"n_cols":34,"rows_kept":69,"merged":[[0,0,0,14],[1,2,1,4],[1,5,1,6],[1,7,1,8],[1,9,1,10],[1,11,1,14],[2,1,2,2],[2,3,2,7],[2,9,2,11],[2,13,2,14],[3,0,4,0],[3,1,3,12],[3,17,7,21],[4,1,4,12],[5,1,5,12],[6,1,6,12],[7,0,9,0],[7,1,7,9],[7,10,7,12],[7,13,8,14],[8,1,8,9],[8,10,8,12],[9,1,9,9],[9,10,9,12],[10,1,10,12],[11,0,13,0],[11,1,11,7],[11,8,11,9],[11,10,11,12],[11,13,13,14],[12,1,13,2],[12,3,12,4],[12,5,12,7],[12,8,12,9],[12,10,12,12],[13,3,13,4],[13,5,13,7],[13,8,13,9],[13,10,13,12],[14,1,14,12],[15,1,15,3],[15,4,15,5],[15,6,15,7],[15,9,15,12],[16,1,16,3],[16,4,16,5],[16,6,16,7],[16,9,16,12],[17,1,17,12],[18,0,34,0],[18,1,18,14],[18,17,18,18],[19,1,19,14],[20,2,20,4],[20,8,20,10],[20,13,30,14],[21,2,21,4],[21,8,21,10],[21,16,23,20],[22,2,22,4],[22,8,22,10],[22,33,23,36],[23,2,23,4],[23,8,23,10],[24,2,24,4],[24,8,24,10],[25,2,25,4],[25,8,25,10],[25,16,30,18],[26,2,26,4],[26,8,26,10],[27,2,27,4],[27,8,27,10],[28,2,28,4],[28,8,28,10],[29,2,29,4],[29,8,29,10],[30,2,30,4],[30,7,30,10],[31,1,31,12],[31,18,33,18],[32,1,32,12],[33,1,33,12],[34,1,34,12],[35,0,44,0],[35,1,35,14],[36,1,36,12],[37,1,37,12],[38,1,38,12],[39,1,39,12],[40,1,40,12],[40,17,42,21],[41,1,41,12],[42,1,42,12],[43,1,43,12],[43,17,44,18],[44,1,44,12],[45,1,45,12],[46,1,46,12],[47,1,47,12],[48,0,61,0],[48,1,48,14],[48,23,48,25],[48,27,48,29],[49,1,49,4],[49,5,49,8],[49,9,49,12],[50,1,50,3],[50,5,50,7],[50,9,50,11],[51,1,51,3],[51,5,51,7],[51,9,51,11],[52,1,52,3],[52,5,52,7],[52,9,52,11],[53,1,53,3],[53,5,53,7],[53,9,53,11],[54,1,54,3],[54,5,54,7],[54,9,54,11],[54,17,56,21],[55,1,55,3],[55,5,55,7],[55,9,55,11],[56,1,56,3],[56,5,56,7],[56,9,56,11],[57,1,57,12],[58,1,58,12],[58,16,59,18],[59,1,59,12],[60,2,60,12],[61,1,61,12],[62,1,62,12],[63,1,63,12],[64,0,65,0],[64,1,65,3],[64,4,64,6],[64,7,64,8],[64,10,64,11],[64,12,64,13],[65,4,65,6],[65,7,65,8],[65,10,65,11],[65,12,65,13],[66,0,66,12],[68,11,68,13]]}
[{"$f":"IF(AND('Master Data'!D4=\"\"),\"\",CONCATENATE(\"Office Name :- \",PROPER('Master Data'!D4)))","v":"Office Name :- Principal, H.S.S.Girls Pichhore (3932003025) M.P.\n"},{"$nulls":18},2]
[null,null,"vk;dj x.kuk izi= o\"kZ &",null,null,"2020-2021",null,"¼dj fu/kkZj.k o\"kZ &",null,"2021-2022)",null,{"$f":"IF(T14=T2,\"Old Tax Regime\",\"New Tax Regime\")","v":"Old Tax Regime"},{"$nulls":7},1]
[1,"uke deZpkjh %",null,{"$f":"UPPER('Master Data'!D6)","v":"HEERALAL JAT"},{"$nulls":4}," in %",{"$f":"UPPER('Master Data'!H6)","v":"MIDDLE TEACHER"},null,null,"PAN :",{"$f":"UPPER('Master Data'!D12)","v":"ABCDE1234H"}]
[2,"vk; % o\"kZ&2020&21 esa izkIr dqy osru ¼ dj ;ksX; lqfo/kkvksa ds eqY; lfgr ½",{"$nulls":11},"#-",{"$f":"'GA55 '!M27","v":451584},null,null,"आप विद्यमान आयकर दर या नवीन आयकर दर दोनों में से किसी एक विकल्प को चुनकर आयकर गणना प्रपत्र तैयार कर सकते है।  "]
[null,"ljdkj }kjk ns; NPS dh jkf'k &",{"$nulls":11},"#-",{"$f":"IF('Master Data'!H18=\"Yes\",0,IF('Master Data'!I25='Master Data'!V19,'GA55 '!P27,0))","v":44436}]
[3,"x`g fdjk;k] /kkjk 10¼13-A½ ds vUrxrZ ,oa /kkjk 10¼14½ds vUrxrZ vU; Hkrs tks dj eqDÙk gSA ",{"$nulls":11},"#-",{"$f":"IF(T14=T2,SUM('Extra Ded. '!I7+'Extra Ded. '!E6+'Master Data'!E23),\"0\")","v":0},null,"E"]
[4,"                                                              'ks\"k ¼2&3½",{"$nulls":11},"#-",{"$f":"(O4+O5)-O6","v":496020}]
[5," ¼i½euksjatu Hkrk /kkjk 16 ¼ii½ ds vUrxrZ ",{"$nulls":8},{"$f":"IF(T14=T2,'Extra Ded. '!E8,\"0\")","v":{"v":0,"d":"0.00"}}]
{"$rows_left_out":62}
{"sheet":"Form No. 16","index":5,"n_rows":141,"n_cols":11,"rows_kept":141,"merged":[[0,1,0,11],[1,1,1,11],[2,1,2,11],[3,1,3,11],[4,1,4,5],[4,6,4,11],[5,1,5,5],[5,6,5,11],[6,1,6,5],[6,6,6,11],[7,1,7,3],[7,4,7,5],[7,6,7,8],[7,9,7,11],[8,1,8,3],[8,4,8,5],[8,6,8,8],[8,9,8,11],[9,1,9,5],[9,6,9,7],[9,8,9,11],[10,2,10,5],[10,6,11,7],[10,8,10,9],[10,10,10,11],[11,2,11,3],[11,8,11,9],[11,10,11,11],[12,1,12,11],[13,2,13,4],[13,6,13,8],[13,9,13,11],[14,2,14,4],[14,6,14,8],[14,9,14,11],[15,2,15,4],[15,6,15,8],[15,9,15,11],[16,2,16,4],[16,6,16,8],[16,9,16,11],[17,2,17,4],[17,6,17,8],[17,9,17,11],[18,1,18,4],[18,6,18,8],[18,9,18,11],[19,1,19,11],[20,1,20,11],[21,1,22,1],[21,2,22,3],[21,4,21,11],[22,6,22,8],[22,9,22,11],[23,2,23,3],[23,6,23,8],[23,9,23,11],[24,2,24,3],[24,6,24,8],[24,9,24,11],[25,2,25,3],[25,6,25,8],[25,9,25,11],[26,2,26,3],[26,6,26,8],[26,9,26,11],[27,2,27,3],[27,6,27,8],[27,9,27,11],[28,2,28,3],[28,6,28,8],[28,9,28,11],[29,2,29,3],[29,6,29,8],[29,9,29,11],[30,2,30,3],[30,6,30,8],[30,9,30,11],[31,2,31,3],[31,6,31,8],[31,9,31,11],[32,2,32,3],[32,6,32,8],[32,9,32,11],[33,2,33,3],[33,6,33,8],[33,9,33,11],[34,2,34,3],[34,6,34,8],[34,9,34,11],[35,2,35,3],[35,6,35,8],[35,9,35,11],[36,2,36,3],[36,6,36,8],[36,9,36,11],[37,2,37,3],[37,4,37,11],[38,1,38,11],[39,1,39,11],[40,1,41,1],[40,2,41,3],[40,4,40,11],[41,4,41,5],[41,6,41,7],[41,8,41,9],[41,10,41,11],[42,2,42,3],[42,4,42,5],[42,6,42,7],[42,8,42,9],[42,10,42,11],[43,2,43,3],[43,4,43,5],[43,6,43,7],[43,8,43,9],[43,10,43,11],[44,2,44,3],[44,4,44,5],[44,6,44,7],[44,8,44,9],[44,10,44,11],[45,2,45,3],[45,4,45,5],[45,6,45,7],[45,8,45,9],[45,10,45,11],[46,2,46,3],[46,4,46,5],[46,6,46,7],[46,8,46,9],[46,10,46,11],[47,2,47,3],[47,4,47,5],[47,6,47,7],[47,8,47,9],[47,10,47,11],[48,2,48,3],[48,4,48,5],[48,6,48,7],[48,8,48,9],[48,10,48,11],[49,2,49,3],[49,4,49,5],[49,6,49,7],[49,8,49,9],[49,10,49,11],[50,2,50,3],[50,4,50,5],[50,6,50,7],[50,8,50,9],[50,10,50,11],[51,2,51,3],[51,4,51,5],[51,6,51,7],[51,8,51,9],[51,10,51,11],[52,2,52,3],[52,4,52,5],[52,6,52,7],[52,8,52,9],[52,10,52,11],[53,2,53,3],[53,4,53,5],[53,6,53,7],[53,8,53,9],[53,10,53,11],[54,2,54,3],[54,4,54,5],[54,6,54,7],[54,8,54,9],[54,10,54,11],[55,2,55,3],[55,4,55,5],[55,6,55,7],[55,8,55,9],[55,10,55,11],[56,2,56,3],[56,4,56,11],[57,1,57,11],[58,1,58,11],[59,2,59,4],[59,6,59,9],[59,10,59,11],[60,1,60,2],[60,3,60,5],[60,6,60,11],[61,3,61,7],[61,8,61,11],[62,1,62,11],[63,1,63,11],[64,1,64,2],[64,3,64,4],[64,5,64,11],[65,1,65,2],[65,3,65,4],[65,5,65,11],[66,1,66,2],[66,3,66,4],[66,6,66,11],[67,1,67,11],[68,1,68,11],[69,1,69,5],[69,6,69,7],[69,8,72,9],[69,10,85,11],[70,1,70,5],[70,6,70,7],[71,1,71,5],[71,6,71,7],[72,1,72,5],[72,6,72,7],[73,1,73,5],[73,6,76,7],[73,8,73,9],[74,1,74,5],[74,8,77,9],[75,1,75,5],[76,1,76,3],[77,1,77,3],[77,6,77,7],[78,1,78,5],[78,6,79,7],[78,8,78,9],[79,1,79,5],[79,8,82,9],[80,1,80,2],[80,3,80,5],[80,6,80,7],[81,1,81,2],[81,3,81,5],[81,6,81,7],[82,1,82,2],[82,3,82,5],[82,6,82,7],[83,1,83,2],[83,3,83,4],[83,6,84,7],[83,8,83,9],[84,1,84,2],[84,3,84,4],[84,8,84,9],[85,1,85,5],[85,6,93,7],[85,8,85,9],[86,1,86,5],[86,8,89,9],[86,10,86,11],[87,1,87,5],[87,10,90,11],[88,1,88,4],[89,1,89,4],[90,1,90,4],[90,8,90,9],[91,1,91,5],[91,8,93,9],[91,10,91,11],[92,1,92,5],[92,10,93,11],[93,1,93,5],[94,1,94,5],[94,6,94,7],[94,8,94,9],[94,10,94,11],[95,1,109,1],[95,3,107,3],[95,4,95,5],[95,6,95,7],[95,8,106,9],[95,10,106,11],[96,4,96,5],[96,6,96,7],[97,4,97,5],[97,6,97,7],[98,4,98,5],[98,6,98,7],[99,4,99,5],[99,6,99,7],[100,4,100,5],[100,6,100,7],[101,4,101,5],[101,6,101,7],[102,4,102,5],[102,6,102,7],[103,4,103,5],[103,6,103,7],[104,4,104,5],[104,6,104,7],[105,4,105,5],[105,6,105,7],[106,4,106,5],[106,6,106,7],[107,4,107,5],[107,6,107,7],[107,8,107,9],[107,10,107,11],[108,2,108,5],[108,6,108,7],[108,8,108,9],[108,10,108,11],[109,2,109,5],[109,6,109,7],[109,8,109,9],[109,10,109,11],[110,8,110,10],[111,1,111,11],[112,1,112,5],[112,6,112,7],[112,8,112,9],[112,10,112,11],[113,2,113,5],[113,6,113,7],[113,8,113,9],[113,10,120,11],[114,2,114,5],[114,6,114,7],[114,8,114,9],[115,2,115,5],[115,6,115,7],[115,8,115,9],[116,2,116,5],[116,6,116,7],[116,8,116,9],[117,2,117,5],[117,6,117,7],[117,8,117,9],[118,2,118,5],[118,6,118,7],[118,8,118,9],[119,2,119,5],[119,6,119,7],[119,8,119,9],[120,2,120,5],[120,6,120,7],[120,8,120,9],[121,2,121,5],[121,6,121,7],[121,8,121,9],[121,10,121,11],[122,1,122,5],[122,6,122,7],[122,8,122,9],[122,10,122,11],[123,1,123,3],[123,4,123,5],[123,6,123,7],[123,8,123,9],[123,10,123,11],[124,1,124,9],[124,10,124,11],[125,1,125,5],[125,8,125,9],[125,10,125,11],[126,1,126,5],[126,6,126,7],[126,8,126,9],[126,10,126,11],[127,1,127,5],[127,6,127,7],[127,8,127,9],[127,10,127,11],[128,1,128,5],[128,6,128,7],[128,8,128,9],[128,10,128,11],[129,1,129,5],[129,6,129,7],[129,8,129,9],[129,10,129,11],[130,1,130,5],[130,6,130,7],[130,8,130,9],[130,10,130,11],[131,1,131,9],[131,10,131,11],[132,1,132,9],[132,10,132,11],[133,1,133,11],[134,2,134,4],[134,6,134,9],[134,10,134,11],[135,1,135,2],[135,3,135,5],[135,6,135,11],[136,3,136,7],[136,8,136,11],[137,1,137,11],[138,1,138,2],[138,3,138,4],[138,5,138,11],[139,1,139,2],[139,3,139,4],[139,5,139,11],[140,1,140,2],[140,3,140,4],[140,6,140,11]]}
[null,"FORM NO. 16"]
[null,"[(See Rule 31(1)(a)]"]
[null,"PART-A"]
[null,"Certificate under section 203 of the income-tax act, 1961 for Tax deducted at source on Salary."]
[null,"Name and address of the Employer",{"$nulls":4},"Name and adress of the Employee"]
[null,{"$f":"IF('Master Data'!H8=\"\",\"\",UPPER('Master Data'!H8))","v":"B.E.O.PICHHOR"},{"$nulls":4},{"$f":"IF('Master Data'!D6=\"\",\"\",UPPER('Master Data'!D6))","v":"HEERALAL JAT"}]
[{"$nulls":6},{"$f":"IF('Master Data'!D8=\"\",\"\",UPPER('Master Data'!D8))","v":"GHS HARIJAN BASTI PICHHORE "}]
[null,"PAN of the Deductor",null,null,"TAN of  the Deductor",null,"PAN of the Employee",null,null,"Employee Ref No."]
{"$rows_left_out":133}