{"text_format":"3","workbook":"xlsx","n_sheets":6,"sheets":["Instructions","Cash Book Mad","Opening Balance","Entry Cr&Dr","Receipt","Payment"],"not_rendered":{"images":6,"defined_names":10,"comments":1},"read":"whole","date_system":"1900"}

{"sheet":"Instructions","index":0,"n_rows":29,"n_cols":6,"rows_kept":29,"merged":[[2,0,2,9],[4,0,4,9],[6,0,6,9],[8,0,8,9],[10,0,10,9],[12,0,12,9],[14,0,14,9],[16,0,16,9],[18,0,18,9],[20,0,20,9],[22,1,22,8],[28,0,29,2],[28,5,29,9]]}
["गुरुजनों सादर नमस्कार "]
[]
["आपकी सेवार्थ मेरा एक और छोटा सा प्रयास ----------------"]
[]
["CASH BOOK"]
[]
["कैश बुक भरते समय होने वाली गलतियाँ जैसे बैलेंस का न मिलना, जोड़ घटाव में गलती आदि से बचने के लिए मैने यह एक प्रयास किया है हो सकता है इसमें कोई कमी हो तो आप विद्वजनो से निवेदन है की आप मुझे इसमें जो करेक्शन्स करने है उनके बारे में अवगत करावे ताकि मै इसे और सुविधाजनक बना सकू |"]
[]
{"$rows_left_out":22}
{"sheet":"Cash Book Mad","index":1,"n_rows":32,"n_cols":7,"rows_kept":32,"merged":[[0,0,0,5],[1,1,31,5],[8,6,9,10]]}
["Government Senior Secondary School, Rooppura"]
["Mad","इस लिस्ट में आप अपनी कैश बुक में प्रचलित मद लिखे अगर लिखे गये मदों के अलावा भी आपके मद है तो आप लिस्ट में जहा other लिखा है वहा पर ऐड कर सकते है |"]
["CSG"]
["Vikas Kosh"]
["Scout Guide"]
["SMC Training"]
["Internet"]
["Cycle and Transport Voucher"]
{"$rows_left_out":25}
{"sheet":"Opening Balance","index":2,"n_rows":41,"n_cols":12,"rows_kept":41,"merged":[[0,0,0,9],[0,10,3,14],[1,0,1,1],[1,8,1,9],[2,0,3,0],[2,1,3,1],[2,2,2,3],[2,4,2,5],[2,6,2,7],[2,8,2,9],[5,3,38,3],[5,5,38,5],[5,7,38,7],[5,9,38,9],[11,11,13,15],[21,11,23,15],[39,0,39,1],[40,0,40,1],[40,2,40,3],[40,4,40,5],[40,6,40,7],[40,8,40,9]]}
[{"$f":"'Cash Book Mad'!A1","v":"Government Senior Secondary School, Rooppura"},{"$nulls":9},"Blue Color की cells में एंट्री नहीं करनी है केवल Opening Balance वाले कॉलम मद के सामने वाले कॉलम में In Bank और Cash में एंट्री करे |"]
["Opening Balance Date-",{"$nulls":7},"2020-07-01"]
["क्र.स.","मद ","Opening Balance ",null,"After Receipt Balance",null,"Payment",null,"Closing Balance (After Payment)"]
[null,null,"In Bank","Cash","In Bank","Cash","By Bank","Cash","In Bank","Cash"]
[1,{"$f":"'Cash Book Mad'!A3","v":"CSG"},{"v":0,"d":"0.00"},{"v":550,"d":"550.00"},{"$f":"IFERROR(HLOOKUP(B5,receipt_entry,47,0),\"\")","v":{"v":50000,"d":"50000.00"}},{"$f":"Receipt!X48","v":{"v":5550,"d":"5550.00"}},{"$f":"IFERROR(HLOOKUP(B5,payment_entry,44,0),\"\")","v":{"v":0,"d":"0.00"}},{"$f":"Payment!X45","v":{"v":0,"d":"0.00"}},{"$f":"IFERROR(E5-G5,\"\")","v":{"v":50000,"d":"50000.00"}},{"$f":"F5-H5","v":{"v":5550,"d":"5550.00"}}]
[2,{"$f":"'Cash Book Mad'!A4","v":"Vikas Kosh"},{"v":10226.4,"d":"10226.40"},null,{"$f":"IFERROR(HLOOKUP(B6,receipt_entry,47,0),\"\")","v":{"v":15226.4,"d":"15226.40"}},null,{"$f":"IFERROR(HLOOKUP(B6,payment_entry,44,0),\"\")","v":{"v":0,"d":"0.00"}},null,{"$f":"IFERROR(E6-G6,\"\")","v":{"v":15226.4,"d":"15226.40"}}]
[3,{"$f":"'Cash Book Mad'!A5","v":"Scout Guide"},{"v":7150,"d":"7150.00"},null,{"$f":"IFERROR(HLOOKUP(B7,receipt_entry,47,0),\"\")","v":{"v":7150,"d":"7150.00"}},null,{"$f":"IFERROR(HLOOKUP(B7,payment_entry,44,0),\"\")","v":{"v":0,"d":"0.00"}},null,{"v":7150,"d":"7150.00"}]
[4,{"$f":"'Cash Book Mad'!A6","v":"SMC Training"},{"v":0,"d":"0.00"},null,{"$f":"IFERROR(HLOOKUP(B8,receipt_entry,47,0),\"\")","v":{"v":0,"d":"0.00"}},null,{"$f":"IFERROR(HLOOKUP(B8,payment_entry,44,0),\"\")","v":{"v":0,"d":"0.00"}},null,{"v":0,"d":"0.00"}]
{"$rows_left_out":34}
{"sheet":"Entry Cr&Dr","index":3,"n_rows":45,"n_cols":16,"rows_kept":45,"merged":[[0,0,0,10],[0,11,3,16],[2,0,2,4],[2,5,44,5],[2,6,2,10],[6,11,6,13],[6,15,6,17],[9,13,9,15]]}
[{"$f":"'Cash Book Mad'!A1","v":"Government Senior Secondary School, Rooppura"},{"$nulls":10},"Receipt वाले कोलम में जो राशि जिस मद में आई है वो मद सेलेक्ट करके विवरण लिखे तथा राशि का इन्द्राज करे |\nPayment वाले कोलम में जो राशि आपने खर्च की उसका मद सेलेक्ट करके विवरण लिखे तथा राशि का इन्द्राज करे |"]
[]
["Receipt ",{"$nulls":5},"Payment"]
["दिनाक","मद (जिसमे राशि आई है)","राशि प्राप्त होने का अन्य विवरण ","राशि (जो आई है)","राशि जमा होने का तरीका",null,"दिनाक","मद (जिसमे से राशि खर्च हुई है)","किसको दिया गया ","राशि (जो दी गई)","राशि देने का तरीका"]
["2020-07-01","CSG","samsa dwara prapt",{"v":50000,"d":"50000.00"},"Online",null,"2020-07-01","Gas Subcidy, MDM, Cook-Cum Helper","toshina mahila ko cheque dwara bhugtan",{"v":16944,"d":"16944.00"},"By Cheque"]
["2020-07-02","Vikas Kosh","Raseed Number 50/15 Dated 02-07-20",{"v":5000,"d":"5000.00"},"Cash",null,"2020-07-02","Gas Subcidy, MDM, Cook-Cum Helper","sri banwari ko cheque dwara bhugtan",{"v":1965,"d":"1965.00"},"By Cheque"]
["2020-07-03",{"$nulls":5},"2020-07-03","Gas Subcidy, MDM, Cook-Cum Helper","ashok kumar fal sabji",{"v":12579,"d":"12579.00"},"By Cheque","Receipt प्रिंट एंड चेक  करने के लिए यहाँ Click करे |",{"$nulls":3},"Payment प्रिंट एंड चेक  करने के लिए यहाँ Click करे |"]
["2020-07-04",{"$nulls":5},"2020-07-04","Gas Subcidy, MDM, Cook-Cum Helper","jeewan ram jhala kirana",{"v":19057,"d":"19057.00"},"By Cheque"]
{"$rows_left_out":38}
{"sheet":"Receipt","index":4,"n_rows":48,"n_cols":27,"rows_kept":48,"merged":[[0,0,0,24],[2,1,2,2],[2,26,4,31],[7,26,7,32],[47,0,47,2]]}
["Receipt"]
["दिनाक","मद जिसमे राशि प्राप्त हुई ","किससे प्राप्त हुआ","CSG","Vikas Kosh","FVC","Internet","Gas Subcidy, MDM, Cook-Cum Helper","Scholarship","Scout Guide","Cycle and Transport Voucher","Science","SMC Training","Bhawan Nirman","School Repairing","Lab","Liberary","Electricty/Water Bill","Game related","Other1","Other2","Bank Interest","योग","Cash","बैंक"]
[{"$f":"'Opening Balance'!I2","v":"2020-07-01"},"Opening Balance",null,{"$f":"VLOOKUP(D2,opening_bal,2,0)","v":{"v":0,"d":"0.00"}},{"v":10226.4,"d":"10226.40"},{"v":500,"d":"500.00"},{"v":3252,"d":"3252.00"},60663.42,{"v":3600,"d":"3600.00"},{"v":7150,"d":"7150.00"},{"v":20740,"d":"20740.00"},{"v":10000,"d":"10000.00"},{"v":0,"d":"0.00"},{"v":0,"d":"0.00"},{"v":0,"d":"0.00"},{"v":0,"d":"0.00"},{"v":0,"d":"0.00"},{"v":0,"d":"0.00"},{"v":0,"d":"0.00"},{"v":3526,"d":"3526.00"},{"v":0,"d":"0.00"},32824.72,{"$f":"IF(SUM(D3:V3,X3)=0,\"\",SUM(D3:V3,X3))","v":{"v":153032.53999999998,"d":"153032.54"}},{"$f":"'Opening Balance'!D5","v":{"v":550,"d":"550.00"}},{"$f":"W3-X3","v":{"v":152482.53999999998,"d":"152482.54"}},null,"इस शीट में केवल cash वाले कोलम में एंट्री करे जो राशि कैश में आई है उसका इन्द्राज cash वाले कोलम में करे |बाकी अन्य किसी भी कोलम में एंट्री करने की आवश्यकता नही है |आसमानी कलर वाले कोलम में मद समान होने चाहिए |"]
[{"$f":"IF('Entry Cr&Dr'!A5=\"\",\"\",'Entry Cr&Dr'!A5)","v":"2020-07-01"},{"$f":"IF('Entry Cr&Dr'!B5=\"\",\"\",'Entry Cr&Dr'!B5)","v":"CSG"},{"$f":"IF('Entry Cr&Dr'!C5=\"\",\"\",'Entry Cr&Dr'!C5)","v":"samsa dwara prapt"},{"$f":"IF(D2=$B$4,'Entry Cr&Dr'!$D$5,\"\")","v":{"v":50000,"d":"50000.00"}},{"$f":"IF(E2=$B$4,'Entry Cr&Dr'!$D$5,\"\")","v":""},{"$f":"IF(F2=$B$4,'Entry Cr&Dr'!$D$5,\"\")","v":""},{"$f":"IF(G2=$B$4,'Entry Cr&Dr'!$D$5,\"\")","v":""},{"$f":"IF(H2=$B$4,'Entry Cr&Dr'!$D$5,\"\")","v":""},{"$f":"IF(I2=$B$4,'Entry Cr&Dr'!$D$5,\"\")","v":""},{"$f":"IF(J2=$B$4,'Entry Cr&Dr'!$D$5,\"\")","v":""},{"$f":"IF(K2=$B$4,'Entry Cr&Dr'!$D$5,\"\")","v":""},{"$f":"IF(L2=$B$4,'Entry Cr&Dr'!$D$5,\"\")","v":""},{"$f":"IF(M2=$B$4,'Entry Cr&Dr'!$D$5,\"\")","v":""},{"$f":"IF(N2=$B$4,'Entry Cr&Dr'!$D$5,\"\")","v":""},{"$f":"IF(O2=$B$4,'Entry Cr&Dr'!$D$5,\"\")","v":""},{"$f":"IF(P2=$B$4,'Entry Cr&Dr'!$D$5,\"\")","v":""},{"$f":"IF(Q2=$B$4,'Entry Cr&Dr'!$D$5,\"\")","v":""},{"$f":"IF(R2=$B$4,'Entry Cr&Dr'!$D$5,\"\")","v":""},{"$f":"IF(S2=$B$4,'Entry Cr&Dr'!$D$5,\"\")","v":""},{"$f":"IF(T2=$B$4,'Entry Cr&Dr'!$D$5,\"\")","v":""},{"$f":"IF(U2=$B$4,'Entry Cr&Dr'!$D$5,\"\")","v":""},{"$f":"IF(V2=$B$4,'Entry Cr&Dr'!$D$5,\"\")","v":""},{"$f":"IF(SUM(D4:V4)=0,\"\",SUM(D4:V4))","v":{"v":50000,"d":"50000.00"}},null,{"$f":"IFERROR(IF(W4-X4=0,\"\",W4-X4),\"\")","v":{"v":50000,"d":"50000.00"}}]
[{"$f":"IF('Entry Cr&Dr'!A6=\"\",\"\",'Entry Cr&Dr'!A6)","v":"2020-07-02"},{"$f":"IF('Entry Cr&Dr'!B6=\"\",\"\",'Entry Cr&Dr'!B6)","v":"Vikas Kosh"},{"$f":"IF('Entry Cr&Dr'!C6=\"\",\"\",'Entry Cr&Dr'!C6)","v":"Raseed Number 50/15 Dated 02-07-20"},{"$f":"IF(D2=$B$5,'Entry Cr&Dr'!$D$6,\"\")","v":""},{"$f":"IF(E2=$B$5,'Entry Cr&Dr'!$D$6,\"\")","v":{"v":5000,"d":"5000.00"}},{"$f":"IF(F2=$B$5,'Entry Cr&Dr'!$D$6,\"\")","v":""},{"$f":"IF(G2=$B$5,'Entry Cr&Dr'!$D$6,\"\")","v":""},{"$f":"IF(H2=$B$5,'Entry Cr&Dr'!$D$6,\"\")","v":""},{"$f":"IF(I2=$B$5,'Entry Cr&Dr'!$D$6,\"\")","v":""},{"$f":"IF(J2=$B$5,'Entry Cr&Dr'!$D$6,\"\")","v":""},{"$f":"IF(K2=$B$5,'Entry Cr&Dr'!$D$6,\"\")","v":""},{"$f":"IF(L2=$B$5,'Entry Cr&Dr'!$D$6,\"\")","v":""},{"$f":"IF(M2=$B$5,'Entry Cr&Dr'!$D$6,\"\")","v":""},{"$f":"IF(N2=$B$5,'Entry Cr&Dr'!$D$6,\"\")","v":""},{"$f":"IF(O2=$B$5,'Entry Cr&Dr'!$D$6,\"\")","v":""},{"$f":"IF(P2=$B$5,'Entry Cr&Dr'!$D$6,\"\")","v":""},{"$f":"IF(Q2=$B$5,'Entry Cr&Dr'!$D$6,\"\")","v":""},{"$f":"IF(R2=$B$5,'Entry Cr&Dr'!$D$6,\"\")","v":""},{"$f":"IF(S2=$B$5,'Entry Cr&Dr'!$D$6,\"\")","v":""},{"$f":"IF(T2=$B$5,'Entry Cr&Dr'!$D$6,\"\")","v":""},{"$f":"IF(U2=$B$5,'Entry Cr&Dr'!$D$6,\"\")","v":""},{"$f":"IF(V2=$B$5,'Entry Cr&Dr'!$D$6,\"\")","v":""},{"$f":"IF(SUM(D5:V5)=0,\"\",SUM(D5:V5))","v":{"v":5000,"d":"5000.00"}},{"v":5000,"d":"5000.00"},{"$f":"IFERROR(IF(W5-X5=0,\"\",W5-X5),\"\")","v":""}]
[{"$f":"IF('Entry Cr&Dr'!A7=\"\",\"\",'Entry Cr&Dr'!A7)","v":"2020-07-03"},{"$f":"IF('Entry Cr&Dr'!B7=\"\",\"\",'Entry Cr&Dr'!B7)","v":""},{"$f":"IF('Entry Cr&Dr'!C7=\"\",\"\",'Entry Cr&Dr'!C7)","v":""},{"$f":"IF(D2=$B$6,'Entry Cr&Dr'!$D$7,\"\")","v":""},{"$f":"IF(E2=$B$6,'Entry Cr&Dr'!$D$7,\"\")","v":""},{"$f":"IF(F2=$B$6,'Entry Cr&Dr'!$D$7,\"\")","v":""},{"$f":"IF(G2=$B$6,'Entry Cr&Dr'!$D$7,\"\")","v":""},{"$f":"IF(H2=$B$6,'Entry Cr&Dr'!$D$7,\"\")","v":""},{"$f":"IF(I2=$B$6,'Entry Cr&Dr'!$D$7,\"\")","v":""},{"$f":"IF(J2=$B$6,'Entry Cr&Dr'!$D$7,\"\")","v":""},{"$f":"IF(K2=$B$6,'Entry Cr&Dr'!$D$7,\"\")","v":""},{"$f":"IF(L2=$B$6,'Entry Cr&Dr'!$D$7,\"\")","v":""},{"$f":"IF(M2=$B$6,'Entry Cr&Dr'!$D$7,\"\")","v":""},{"$f":"IF(N2=$B$6,'Entry Cr&Dr'!$D$7,\"\")","v":""},{"$f":"IF(O2=$B$6,'Entry Cr&Dr'!$D$7,\"\")","v":""},{"$f":"IF(P2=$B$6,'Entry Cr&Dr'!$D$7,\"\")","v":""},{"$f":"IF(Q2=$B$6,'Entry Cr&Dr'!$D$7,\"\")","v":""},{"$f":"IF(R2=$B$6,'Entry Cr&Dr'!$D$7,\"\")","v":""},{"$f":"IF(S2=$B$6,'Entry Cr&Dr'!$D$7,\"\")","v":""},{"$f":"IF(T2=$B$6,'Entry Cr&Dr'!$D$7,\"\")","v":""},{"$f":"IF(U2=$B$6,'Entry Cr&Dr'!$D$7,\"\")","v":""},{"$f":"IF(V2=$B$6,'Entry Cr&Dr'!$D$7,\"\")","v":""},"",null,""]
[{"$f":"IF('Entry Cr&Dr'!A8=\"\",\"\",'Entry Cr&Dr'!A8)","v":"2020-07-04"},{"$f":"IF('Entry Cr&Dr'!B8=\"\",\"\",'Entry Cr&Dr'!B8)","v":""},{"$f":"IF('Entry Cr&Dr'!C8=\"\",\"\",'Entry Cr&Dr'!C8)","v":""},{"$f":"IF(D2=$B$7,'Entry Cr&Dr'!$D$8,\"\")","v":""},{"$f":"IF(E2=$B$7,'Entry Cr&Dr'!$D$8,\"\")","v":""},{"$f":"IF(F2=$B$7,'Entry Cr&Dr'!$D$8,\"\")","v":""},{"$f":"IF(G2=$B$7,'Entry Cr&Dr'!$D$8,\"\")","v":""},{"$f":"IF(H2=$B$7,'Entry Cr&Dr'!$D$8,\"\")","v":""},{"$f":"IF(I2=$B$7,'Entry Cr&Dr'!$D$8,\"\")","v":""},{"$f":"IF(J2=$B$7,'Entry Cr&Dr'!$D$8,\"\")","v":""},{"$f":"IF(K2=$B$7,'Entry Cr&Dr'!$D$8,\"\")","v":""},{"$f":"IF(L2=$B$7,'Entry Cr&Dr'!$D$8,\"\")","v":""},{"$f":"IF(M2=$B$7,'Entry Cr&Dr'!$D$8,\"\")","v":""},{"$f":"IF(N2=$B$7,'Entry Cr&Dr'!$D$8,\"\")","v":""},{"$f":"IF(O2=$B$7,'Entry Cr&Dr'!$D$8,\"\")","v":""},{"$f":"IF(P2=$B$7,'Entry Cr&Dr'!$D$8,\"\")","v":""},{"$f":"IF(Q2=$B$7,'Entry Cr&Dr'!$D$8,\"\")","v":""},{"$f":"IF(R2=$B$7,'Entry Cr&Dr'!$D$8,\"\")","v":""},{"$f":"IF(S2=$B$7,'Entry Cr&Dr'!$D$8,\"\")","v":""},{"$f":"IF(T2=$B$7,'Entry Cr&Dr'!$D$8,\"\")","v":""},{"$f":"IF(U2=$B$7,'Entry Cr&Dr'!$D$8,\"\")","v":""},{"$f":"IF(V2=$B$7,'Entry Cr&Dr'!$D$8,\"\")","v":""},"",null,""]
[{"$f":"IF('Entry Cr&Dr'!A9=\"\",\"\",'Entry Cr&Dr'!A9)","v":"2020-07-05"},{"$f":"IF('Entry Cr&Dr'!B9=\"\",\"\",'Entry Cr&Dr'!B9)","v":""},{"$f":"IF('Entry Cr&Dr'!C9=\"\",\"\",'Entry Cr&Dr'!C9)","v":""},{"$f":"IF(D2=$B$8,'Entry Cr&Dr'!$D$9,\"\")","v":""},{"$f":"IF(E2=$B$8,'Entry Cr&Dr'!$D$9,\"\")","v":""},{"$f":"IF(F2=$B$8,'Entry Cr&Dr'!$D$9,\"\")","v":""},{"$f":"IF(G2=$B$8,'Entry Cr&Dr'!$D$9,\"\")","v":""},{"$f":"IF(H2=$B$8,'Entry Cr&Dr'!$D$9,\"\")","v":""},{"$f":"IF(I2=$B$8,'Entry Cr&Dr'!$D$9,\"\")","v":""},{"$f":"IF(J2=$B$8,'Entry Cr&Dr'!$D$9,\"\")","v":""},{"$f":"IF(K2=$B$8,'Entry Cr&Dr'!$D$9,\"\")","v":""},{"$f":"IF(L2=$B$8,'Entry Cr&Dr'!$D$9,\"\")","v":""},{"$f":"IF(M2=$B$8,'Entry Cr&Dr'!$D$9,\"\")","v":""},{"$f":"IF(N2=$B$8,'Entry Cr&Dr'!$D$9,\"\")","v":""},{"$f":"IF(O2=$B$8,'Entry Cr&Dr'!$D$9,\"\")","v":""},{"$f":"IF(P2=$B$8,'Entry Cr&Dr'!$D$9,\"\")","v":""},{"$f":"IF(Q2=$B$8,'Entry Cr&Dr'!$D$9,\"\")","v":""},{"$f":"IF(R2=$B$8,'Entry Cr&Dr'!$D$9,\"\")","v":""},{"$f":"IF(S2=$B$8,'Entry Cr&Dr'!$D$9,\"\")","v":""},{"$f":"IF(T2=$B$8,'Entry Cr&Dr'!$D$9,\"\")","v":""},{"$f":"IF(U2=$B$8,'Entry Cr&Dr'!$D$9,\"\")","v":""},{"$f":"IF(V2=$B$8,'Entry Cr&Dr'!$D$9,\"\")","v":""},"",null,"",null,"Click Here to check ENTRY "]
{"$rows_left_out":41}
{"sheet":"Payment","index":5,"n_rows":47,"n_cols":27,"rows_kept":47,"merged":[[0,0,0,24],[2,26,4,31],[8,26,8,32],[44,0,44,2],[45,0,45,2],[46,0,46,2]]}
["Payment"]
["दिनाक","मद जिससे राशि गई","किसको दिया का विवरण","CSG","Vikas Kosh","FVC","Internet","Gas Subcidy, MDM, Cook-Cum Helper","Scholarship","Scout Guide","Cycle and Transport Voucher","Science","SMC Training","Bhawan Nirman","School Repairing","Lab","Liberary","Electricty/Water Bill","Game related","Other1","Other2","Bank Interest","योग","Cash","बैंक"]
[{"$f":"IF('Entry Cr&Dr'!G5=\"\",\"\",'Entry Cr&Dr'!G5)","v":"2020-07-01"},{"$f":"IF('Entry Cr&Dr'!H5=\"\",\"\",'Entry Cr&Dr'!H5)","v":"Gas Subcidy, MDM, Cook-Cum Helper"},{"$f":"IF('Entry Cr&Dr'!I5=\"\",\"\",'Entry Cr&Dr'!I5)","v":"toshina mahila ko cheque dwara bhugtan"},{"$f":"IF(D2=$B$3,'Entry Cr&Dr'!$J$5,\"\")","v":""},{"$f":"IF(E2=$B$3,'Entry Cr&Dr'!$J$5,\"\")","v":""},{"$f":"IF(F2=$B$3,'Entry Cr&Dr'!$J$5,\"\")","v":""},{"$f":"IF(G2=$B$3,'Entry Cr&Dr'!$J$5,\"\")","v":""},{"$f":"IF(H2=$B$3,'Entry Cr&Dr'!$J$5,\"\")","v":{"v":16944,"d":"16944.00"}},{"$f":"IF(I2=$B$3,'Entry Cr&Dr'!$J$5,\"\")","v":""},{"$f":"IF(J2=$B$3,'Entry Cr&Dr'!$J$5,\"\")","v":""},{"$f":"IF(K2=$B$3,'Entry Cr&Dr'!$J$5,\"\")","v":""},{"$f":"IF(L2=$B$3,'Entry Cr&Dr'!$J$5,\"\")","v":""},{"$f":"IF(M2=$B$3,'Entry Cr&Dr'!$J$5,\"\")","v":""},{"$f":"IF(N2=$B$3,'Entry Cr&Dr'!$J$5,\"\")","v":""},{"$f":"IF(O2=$B$3,'Entry Cr&Dr'!$J$5,\"\")","v":""},{"$f":"IF(P2=$B$3,'Entry Cr&Dr'!$J$5,\"\")","v":""},{"$f":"IF(Q2=$B$3,'Entry Cr&Dr'!$J$5,\"\")","v":""},{"$f":"IF(R2=$B$3,'Entry Cr&Dr'!$J$5,\"\")","v":""},{"$f":"IF(S2=$B$3,'Entry Cr&Dr'!$J$5,\"\")","v":""},{"$f":"IF(T2=$B$3,'Entry Cr&Dr'!$J$5,\"\")","v":""},{"$f":"IF(U2=$B$3,'Entry Cr&Dr'!$J$5,\"\")","v":""},{"$f":"IF(V2=$B$3,'Entry Cr&Dr'!$J$5,\"\")","v":""},{"$f":"IF(SUM(D3:V3)=0,\"\",SUM(D3:V3))","v":{"v":16944,"d":"16944.00"}},null,{"$f":"IFERROR(IF(W3-X3=0,\"\",W3-X3),\"\")","v":{"v":16944,"d":"16944.00"}},null,"इस शीट में केवल cash वाले कोलम में एंट्री करे जिस राशि का पेमेंट आपने कैश में दिया है उसका इन्द्राज cash वाले कोलम में करे |बाकी अन्य किसी भी कोलम में एंट्री करने की आवश्यकता नही है | आसमानी कलर वाले कोलम में मद समान होने चाहिए |"]
[{"$f":"IF('Entry Cr&Dr'!G6=\"\",\"\",'Entry Cr&Dr'!G6)","v":"2020-07-02"},{"$f":"IF('Entry Cr&Dr'!H6=\"\",\"\",'Entry Cr&Dr'!H6)","v":"Gas Subcidy, MDM, Cook-Cum Helper"},{"$f":"IF('Entry Cr&Dr'!I6=\"\",\"\",'Entry Cr&Dr'!I6)","v":"sri banwari ko cheque dwara bhugtan"},{"$f":"IF(D2=$B$4,'Entry Cr&Dr'!$J$6,\"\")","v":""},{"$f":"IF(E2=$B$4,'Entry Cr&Dr'!$J$6,\"\")","v":""},{"$f":"IF(F2=$B$4,'Entry Cr&Dr'!$J$6,\"\")","v":""},{"$f":"IF(G2=$B$4,'Entry Cr&Dr'!$J$6,\"\")","v":""},{"$f":"IF(H2=$B$4,'Entry Cr&Dr'!$J$6,\"\")","v":{"v":1965,"d":"1965.00"}},{"$f":"IF(I2=$B$4,'Entry Cr&Dr'!$J$6,\"\")","v":""},{"$f":"IF(J2=$B$4,'Entry Cr&Dr'!$J$6,\"\")","v":""},{"$f":"IF(K2=$B$4,'Entry Cr&Dr'!$J$6,\"\")","v":""},{"$f":"IF(L2=$B$4,'Entry Cr&Dr'!$J$6,\"\")","v":""},{"$f":"IF(M2=$B$4,'Entry Cr&Dr'!$J$6,\"\")","v":""},{"$f":"IF(N2=$B$4,'Entry Cr&Dr'!$J$6,\"\")","v":""},{"$f":"IF(O2=$B$4,'Entry Cr&Dr'!$J$6,\"\")","v":""},{"$f":"IF(P2=$B$4,'Entry Cr&Dr'!$J$6,\"\")","v":""},{"$f":"IF(Q2=$B$4,'Entry Cr&Dr'!$J$6,\"\")","v":""},{"$f":"IF(R2=$B$4,'Entry Cr&Dr'!$J$6,\"\")","v":""},{"$f":"IF(S2=$B$4,'Entry Cr&Dr'!$J$6,\"\")","v":""},{"$f":"IF(T2=$B$4,'Entry Cr&Dr'!$J$6,\"\")","v":""},{"$f":"IF(U2=$B$4,'Entry Cr&Dr'!$J$6,\"\")","v":""},{"$f":"IF(V2=$B$4,'Entry Cr&Dr'!$J$6,\"\")","v":""},{"$f":"IF(SUM(D4:V4)=0,\"\",SUM(D4:V4))","v":{"v":1965,"d":"1965.00"}},null,{"$f":"IFERROR(IF(W4-X4=0,\"\",W4-X4),\"\")","v":{"v":1965,"d":"1965.00"}}]
[{"$f":"IF('Entry Cr&Dr'!G7=\"\",\"\",'Entry Cr&Dr'!G7)","v":"2020-07-03"},{"$f":"IF('Entry Cr&Dr'!H7=\"\",\"\",'Entry Cr&Dr'!H7)","v":"Gas Subcidy, MDM, Cook-Cum Helper"},{"$f":"IF('Entry Cr&Dr'!I7=\"\",\"\",'Entry Cr&Dr'!I7)","v":"ashok kumar fal sabji"},{"$f":"IF(D2=$B$5,'Entry Cr&Dr'!$J$7,\"\")","v":""},{"$f":"IF(E2=$B$5,'Entry Cr&Dr'!$J$7,\"\")","v":""},{"$f":"IF(F2=$B$5,'Entry Cr&Dr'!$J$7,\"\")","v":""},{"$f":"IF(G2=$B$5,'Entry Cr&Dr'!$J$7,\"\")","v":""},{"$f":"IF(H2=$B$5,'Entry Cr&Dr'!$J$7,\"\")","v":{"v":12579,"d":"12579.00"}},{"$f":"IF(I2=$B$5,'Entry Cr&Dr'!$J$7,\"\")","v":""},{"$f":"IF(J2=$B$5,'Entry Cr&Dr'!$J$7,\"\")","v":""},{"$f":"IF(K2=$B$5,'Entry Cr&Dr'!$J$7,\"\")","v":""},{"$f":"IF(L2=$B$5,'Entry Cr&Dr'!$J$7,\"\")","v":""},{"$f":"IF(M2=$B$5,'Entry Cr&Dr'!$J$7,\"\")","v":""},{"$f":"IF(N2=$B$5,'Entry Cr&Dr'!$J$7,\"\")","v":""},{"$f":"IF(O2=$B$5,'Entry Cr&Dr'!$J$7,\"\")","v":""},{"$f":"IF(P2=$B$5,'Entry Cr&Dr'!$J$7,\"\")","v":""},{"$f":"IF(Q2=$B$5,'Entry Cr&Dr'!$J$7,\"\")","v":""},{"$f":"IF(R2=$B$5,'Entry Cr&Dr'!$J$7,\"\")","v":""},{"$f":"IF(S2=$B$5,'Entry Cr&Dr'!$J$7,\"\")","v":""},{"$f":"IF(T2=$B$5,'Entry Cr&Dr'!$J$7,\"\")","v":""},{"$f":"IF(U2=$B$5,'Entry Cr&Dr'!$J$7,\"\")","v":""},{"$f":"IF(V2=$B$5,'Entry Cr&Dr'!$J$7,\"\")","v":""},{"v":12579,"d":"12579.00"},null,{"v":12579,"d":"12579.00"}]
[{"$f":"IF('Entry Cr&Dr'!G8=\"\",\"\",'Entry Cr&Dr'!G8)","v":"2020-07-04"},{"$f":"IF('Entry Cr&Dr'!H8=\"\",\"\",'Entry Cr&Dr'!H8)","v":"Gas Subcidy, MDM, Cook-Cum Helper"},{"$f":"IF('Entry Cr&Dr'!I8=\"\",\"\",'Entry Cr&Dr'!I8)","v":"jeewan ram jhala kirana"},{"$f":"IF(D2=$B$6,'Entry Cr&Dr'!$J$8,\"\")","v":""},{"$f":"IF(E2=$B$6,'Entry Cr&Dr'!$J$8,\"\")","v":""},{"$f":"IF(F2=$B$6,'Entry Cr&Dr'!$J$8,\"\")","v":""},{"$f":"IF(G2=$B$6,'Entry Cr&Dr'!$J$8,\"\")","v":""},{"$f":"IF(H2=$B$6,'Entry Cr&Dr'!$J$8,\"\")","v":{"v":19057,"d":"19057.00"}},{"$f":"IF(I2=$B$6,'Entry Cr&Dr'!$J$8,\"\")","v":""},{"$f":"IF(J2=$B$6,'Entry Cr&Dr'!$J$8,\"\")","v":""},{"$f":"IF(K2=$B$6,'Entry Cr&Dr'!$J$8,\"\")","v":""},{"$f":"IF(L2=$B$6,'Entry Cr&Dr'!$J$8,\"\")","v":""},{"$f":"IF(M2=$B$6,'Entry Cr&Dr'!$J$8,\"\")","v":""},{"$f":"IF(N2=$B$6,'Entry Cr&Dr'!$J$8,\"\")","v":""},{"$f":"IF(O2=$B$6,'Entry Cr&Dr'!$J$8,\"\")","v":""},{"$f":"IF(P2=$B$6,'Entry Cr&Dr'!$J$8,\"\")","v":""},{"$f":"IF(Q2=$B$6,'Entry Cr&Dr'!$J$8,\"\")","v":""},{"$f":"IF(R2=$B$6,'Entry Cr&Dr'!$J$8,\"\")","v":""},{"$f":"IF(S2=$B$6,'Entry Cr&Dr'!$J$8,\"\")","v":""},{"$f":"IF(T2=$B$6,'Entry Cr&Dr'!$J$8,\"\")","v":""},{"$f":"IF(U2=$B$6,'Entry Cr&Dr'!$J$8,\"\")","v":""},{"$f":"IF(V2=$B$6,'Entry Cr&Dr'!$J$8,\"\")","v":""},{"v":19057,"d":"19057.00"},null,{"v":19057,"d":"19057.00"}]
[{"$f":"IF('Entry Cr&Dr'!G9=\"\",\"\",'Entry Cr&Dr'!G9)","v":"2020-07-05"},{"$f":"IF('Entry Cr&Dr'!H9=\"\",\"\",'Entry Cr&Dr'!H9)","v":""},{"$f":"IF('Entry Cr&Dr'!I9=\"\",\"\",'Entry Cr&Dr'!I9)","v":""},{"$f":"IF(D2=$B$7,'Entry Cr&Dr'!$J$9,\"\")","v":""},{"$f":"IF(E2=$B$7,'Entry Cr&Dr'!$J$9,\"\")","v":""},{"$f":"IF(F2=$B$7,'Entry Cr&Dr'!$J$9,\"\")","v":""},{"$f":"IF(G2=$B$7,'Entry Cr&Dr'!$J$9,\"\")","v":""},{"$f":"IF(H2=$B$7,'Entry Cr&Dr'!$J$9,\"\")","v":""},{"$f":"IF(I2=$B$7,'Entry Cr&Dr'!$J$9,\"\")","v":""},{"$f":"IF(J2=$B$7,'Entry Cr&Dr'!$J$9,\"\")","v":""},{"$f":"IF(K2=$B$7,'Entry Cr&Dr'!$J$9,\"\")","v":""},{"$f":"IF(L2=$B$7,'Entry Cr&Dr'!$J$9,\"\")","v":""},{"$f":"IF(M2=$B$7,'Entry Cr&Dr'!$J$9,\"\")","v":""},{"$f":"IF(N2=$B$7,'Entry Cr&Dr'!$J$9,\"\")","v":""},{"$f":"IF(O2=$B$7,'Entry Cr&Dr'!$J$9,\"\")","v":""},{"$f":"IF(P2=$B$7,'Entry Cr&Dr'!$J$9,\"\")","v":""},{"$f":"IF(Q2=$B$7,'Entry Cr&Dr'!$J$9,\"\")","v":""},{"$f":"IF(R2=$B$7,'Entry Cr&Dr'!$J$9,\"\")","v":""},{"$f":"IF(S2=$B$7,'Entry Cr&Dr'!$J$9,\"\")","v":""},{"$f":"IF(T2=$B$7,'Entry Cr&Dr'!$J$9,\"\")","v":""},{"$f":"IF(U2=$B$7,'Entry Cr&Dr'!$J$9,\"\")","v":""},{"$f":"IF(V2=$B$7,'Entry Cr&Dr'!$J$9,\"\")","v":""},"",null,""]
[{"$f":"IF('Entry Cr&Dr'!G10=\"\",\"\",'Entry Cr&Dr'!G10)","v":"2020-07-06"},{"$f":"IF('Entry Cr&Dr'!H10=\"\",\"\",'Entry Cr&Dr'!H10)","v":""},{"$f":"IF('Entry Cr&Dr'!I10=\"\",\"\",'Entry Cr&Dr'!I10)","v":""},{"$f":"IF(D2=$B$8,'Entry Cr&Dr'!$J$10,\"\")","v":""},{"$f":"IF(E2=$B$8,'Entry Cr&Dr'!$J$10,\"\")","v":""},{"$f":"IF(F2=$B$8,'Entry Cr&Dr'!$J$10,\"\")","v":""},{"$f":"IF(G2=$B$8,'Entry Cr&Dr'!$J$10,\"\")","v":""},{"$f":"IF(H2=$B$8,'Entry Cr&Dr'!$J$10,\"\")","v":""},{"$f":"IF(I2=$B$8,'Entry Cr&Dr'!$J$10,\"\")","v":""},{"$f":"IF(J2=$B$8,'Entry Cr&Dr'!$J$10,\"\")","v":""},{"$f":"IF(K2=$B$8,'Entry Cr&Dr'!$J$10,\"\")","v":""},{"$f":"IF(L2=$B$8,'Entry Cr&Dr'!$J$10,\"\")","v":""},{"$f":"IF(M2=$B$8,'Entry Cr&Dr'!$J$10,\"\")","v":""},{"$f":"IF(N2=$B$8,'Entry Cr&Dr'!$J$10,\"\")","v":""},{"$f":"IF(O2=$B$8,'Entry Cr&Dr'!$J$10,\"\")","v":""},{"$f":"IF(P2=$B$8,'Entry Cr&Dr'!$J$10,\"\")","v":""},{"$f":"IF(Q2=$B$8,'Entry Cr&Dr'!$J$10,\"\")","v":""},{"$f":"IF(R2=$B$8,'Entry Cr&Dr'!$J$10,\"\")","v":""},{"$f":"IF(S2=$B$8,'Entry Cr&Dr'!$J$10,\"\")","v":""},{"$f":"IF(T2=$B$8,'Entry Cr&Dr'!$J$10,\"\")","v":""},{"$f":"IF(U2=$B$8,'Entry Cr&Dr'!$J$10,\"\")","v":""},{"$f":"IF(V2=$B$8,'Entry Cr&Dr'!$J$10,\"\")","v":""},"",null,""]
{"$rows_left_out":39}