{"text_format":"3","workbook":"xlsx","n_sheets":7,"sheets":["Instructions","Cash Book Mad","Opening Balance","Datebysmry","Entry Cr&Dr","Receipt","Payment"],"not_rendered":{"images":6,"defined_names":12,"comments":1},"read":"whole","date_system":"1900"}

{"sheet":"Instructions","index":0,"n_rows":29,"n_cols":6,"rows_kept":29,"merged":[[2,0,2,9],[4,0,4,9],[6,0,6,9],[8,0,8,9],[10,0,10,9],[12,0,12,9],[14,0,14,9],[16,0,16,9],[18,0,18,9],[20,0,20,9],[22,1,22,8],[28,0,29,2],[28,5,29,9]]}
["गुरुजनों सादर नमस्कार "]
[]
["आपकी सेवार्थ मेरा एक और छोटा सा प्रयास ----------------"]
[]
["CASH BOOK"]
[]
["कैश बुक भरते समय होने वाली गलतियाँ जैसे बैलेंस का न मिलना, जोड़ घटाव में गलती आदि से बचने के लिए मैने यह एक प्रयास किया है हो सकता है इसमें कोई कमी हो तो आप विद्वजनो से निवेदन है की आप मुझे इसमें जो करेक्शन्स करने है उनके बारे में अवगत करावे ताकि मै इसे और सुविधाजनक बना सकू |"]
[]
["इसे प्रयोग में लेने का तरीका "]
[]
{"$rows_left_out":20}
{"sheet":"Cash Book Mad","index":1,"n_rows":29,"n_cols":7,"rows_kept":29,"merged":[[0,0,0,5],[1,1,28,5],[8,6,9,10]]}
["Government Senior Secondary School, Rooppura"]
["Mad","इस लिस्ट में आप अपनी कैश बुक में प्रचलित मद लिखे अगर लिखे गये मदों के अलावा भी आपके मद है तो आप लिस्ट में जहा other लिखा है वहा पर ऐड कर सकते है |"]
["CSG"]
["Vikas Kosh"]
["Scout Guide"]
["SMC Training"]
["Internet"]
["Cycle and Transport Voucher"]
["Scholarship",{"$nulls":5},"Opening Balance भरने के लिए इस आइकॉन पर क्लिक करे |"]
["Science"]
{"$rows_left_out":20}
{"sheet":"Opening Balance","index":2,"n_rows":33,"n_cols":12,"rows_kept":33,"merged":[[0,0,0,9],[0,10,3,14],[1,0,1,1],[1,8,1,9],[2,0,3,0],[2,1,3,1],[2,2,2,3],[2,4,2,5],[2,6,2,7],[2,8,2,9],[5,3,30,3],[5,5,30,5],[5,7,30,7],[5,9,30,9],[11,11,13,15],[21,11,23,15],[31,0,31,1],[32,0,32,1],[32,2,32,3],[32,4,32,5],[32,6,32,7],[32,8,32,9]]}
[{"$f":"'Cash Book Mad'!A1","v":"Government Senior Secondary School, Rooppura"},{"$nulls":9},"Blue Color की cells में एंट्री नहीं करनी है केवल Opening Balance वाले कॉलम मद के सामने वाले कॉलम में In Bank और Cash में एंट्री करे |"]
["Opening Balance Date-",{"$nulls":7},"2020-07-01"]
["क्र.स.","मद ","Opening Balance ",null,"After Receipt Balance",null,"Payment",null,"Closing Balance (After Payment)"]
[null,null,"In Bank","Cash","In Bank","Cash","By Bank","Cash","In Bank","Cash"]
[1,{"$f":"'Cash Book Mad'!A3","v":"CSG"},{"v":0,"d":"0.00"},{"v":550,"d":"550.00"},{"$f":"IFERROR(HLOOKUP(B5,receipt_entry,27,0),\"\")","v":{"v":50500,"d":"50500.00"}},{"$f":"Receipt!Q28","v":{"v":550,"d":"550.00"}},{"$f":"IFERROR(HLOOKUP(B5,payment_entry,25,0),\"\")","v":{"v":5500,"d":"5500.00"}},{"$f":"Payment!Q26","v":{"v":0,"d":"0.00"}},{"$f":"IFERROR(E5-G5,\"\")","v":{"v":45000,"d":"45000.00"}},{"$f":"F5-H5","v":{"v":550,"d":"550.00"}}]
[2,{"$f":"'Cash Book Mad'!A4","v":"Vikas Kosh"},{"v":10226.4,"d":"10226.40"},null,{"v":10226.4,"d":"10226.40"},null,{"v":0,"d":"0.00"},null,{"$f":"IFERROR(E6-G6,\"\")","v":{"v":10226.4,"d":"10226.40"}}]
[3,{"$f":"'Cash Book Mad'!A5","v":"Scout Guide"},{"v":7150,"d":"7150.00"},null,{"v":7150,"d":"7150.00"},null,{"v":0,"d":"0.00"},null,{"v":7150,"d":"7150.00"}]
[4,{"$f":"'Cash Book Mad'!A6","v":"SMC Training"},{"v":0,"d":"0.00"},null,{"v":0,"d":"0.00"},null,{"v":0,"d":"0.00"},null,{"v":0,"d":"0.00"}]
[5,{"$f":"'Cash Book Mad'!A7","v":"Internet"},{"v":3252,"d":"3252.00"},null,{"v":3252,"d":"3252.00"},null,{"v":0,"d":"0.00"},null,{"v":3252,"d":"3252.00"}]
[6,{"$f":"'Cash Book Mad'!A8","v":"Cycle and Transport Voucher"},{"v":20740,"d":"20740.00"},null,{"v":20740,"d":"20740.00"},null,{"v":0,"d":"0.00"},null,{"v":20740,"d":"20740.00"}]
{"$rows_left_out":24}
{"sheet":"Datebysmry","index":3,"n_rows":8,"n_cols":11,"rows_kept":8,"merged":[[0,0,0,8],[0,10,4,13],[2,0,2,8],[4,1,4,3],[4,5,4,8]]}
[{"$f":"'Cash Book Mad'!A1","v":"Government Senior Secondary School, Rooppura"},{"$nulls":9},"जिस दिनाक एवं जिस मद की समरी देखनी हो वो दिनाक लिखे एवं मद ड्राप डाउन लिस्ट में से चयन करे |"]
[]
["Date by Summary"]
[]
["Date","2020-07-01",null,null,"मद","Vikas Kosh"]
[]
[{"$nulls":3},"S.No.","Credit","Debit"]
[{"$nulls":3},1,{"$f":"SUMIFS('Entry Cr&Dr'!$D$5:$D$25,'Entry Cr&Dr'!$B$5:$B$25,Datebysmry!$F$5,'Entry Cr&Dr'!$A$5:$A$25,Datebysmry!$B$5)","v":{"v":0,"d":"0.00"}},{"$f":"SUMIFS('Entry Cr&Dr'!$J$5:$J$25,'Entry Cr&Dr'!$H$5:$H$25,Datebysmry!$F$5,'Entry Cr&Dr'!$G$5:$G$25,Datebysmry!$B$5)","v":{"v":0,"d":"0.00"}}]

{"sheet":"Entry Cr&Dr","index":4,"n_rows":10,"n_cols":16,"rows_kept":10,"merged":[[0,0,0,10],[0,11,3,16],[2,0,2,4],[2,6,2,10],[3,5,31,5],[6,11,6,13],[6,15,6,17],[9,13,9,15]]}
[{"$f":"'Cash Book Mad'!A1","v":"Government Senior Secondary School, Rooppura"},{"$nulls":10},"Receipt वाले कोलम में जो राशि जिस मद में आई है वो मद सेलेक्ट करके विवरण लिखे तथा राशि का इन्द्राज करे |\nPayment वाले कोलम में जो राशि आपने खर्च की उसका मद सेलेक्ट करके विवरण लिखे तथा राशि का इन्द्राज करे |"]
[]
["Receipt ",{"$nulls":5},"Payment"]
["दिनाक","मद (जिसमे राशि आई है)","राशि प्राप्त होने का अन्य विवरण ","राशि (जो आई है)","राशि जमा होने का तरीका",null,"दिनाक","मद (जिसमे से राशि खर्च हुई है)","किसको दिया गया ","राशि (जो दी गई)","राशि देने का तरीका"]
["2020-07-01","CSG","lelk }kjk tek",{"v":50000,"d":"50000.00"},"Online",null,"2020-07-01","CSG","dEI;wVj dk;Z ds fy, pSd ua- 452515 }kjk Hkwxrku",{"v":2500,"d":"2500.00"},"By Cheque"]
["2020-07-02","CSG","lelk }kjk tek",{"v":500,"d":"500.00"},"Cash",null,"2020-07-03","CSG","बिजली बिल के जमा",{"v":3000,"d":"3000.00"},"By Cheque"]
[{"$nulls":11},"Receipt प्रिंट एंड चेक  करने के लिए यहाँ Click करे |",{"$nulls":3},"Payment प्रिंट एंड चेक  करने के लिए यहाँ Click करे |"]
[]
[]
[{"$nulls":13},"क्या करू ????????"]
{"$rows_left_out":1}
{"sheet":"Receipt","index":5,"n_rows":28,"n_cols":20,"rows_kept":28,"merged":[[0,0,0,17],[2,1,2,2],[2,19,4,24],[7,19,7,25],[27,0,27,2]]}
["Receipt"]
["दिनाक","मद जिसमे राशि प्राप्त हुई ","किससे प्राप्त हुआ","CSG","Vikas Kosh","FVC","Internet","Gas Subcidy, MDM, Cook-Cum Helper","Scholarship","Scout Guide","Cycle and Transport Voucher","Science","SMC Training","Other1","Bank Interest","योग","Cash","बैंक"]
[{"$f":"'Opening Balance'!I2","v":"2020-07-01"},"Opening Balance",null,{"$f":"VLOOKUP(D2,opening_bal,2,0)","v":{"v":0,"d":"0.00"}},{"v":10226.4,"d":"10226.40"},{"v":500,"d":"500.00"},{"v":3252,"d":"3252.00"},60663.42,{"v":3600,"d":"3600.00"},{"v":7150,"d":"7150.00"},{"v":20740,"d":"20740.00"},{"v":10000,"d":"10000.00"},{"v":0,"d":"0.00"},{"v":3526,"d":"3526.00"},32824.72,{"$f":"SUM(,D3:O3)","v":{"v":152482.53999999998,"d":"152482.54"}},{"$f":"'Opening Balance'!D5","v":{"v":550,"d":"550.00"}},{"$f":"P3-Q3","v":{"v":151932.53999999998,"d":"151932.54"}},null,"इस शीट में केवल cash वाले कोलम में एंट्री करे जो राशि कैश में आई है उसका इन्द्राज cash वाले कोलम में करे |बाकी अन्य किसी भी कोलम में एंट्री करने की आवश्यकता नही है |आसमानी कलर वाले कोलम में मद समान होने चाहिए |"]
[{"$f":"'Entry Cr&Dr'!A5","v":"2020-07-01"},{"$f":"'Entry Cr&Dr'!B5","v":"CSG"},{"$f":"'Entry Cr&Dr'!C5","v":"lelk }kjk tek"},{"$f":"IF(D2=$B$4,'Entry Cr&Dr'!$D$5,\"\")","v":{"v":50000,"d":"50000.00"}},{"$f":"IF(E2=$B$4,'Entry Cr&Dr'!$D$5,\"\")","v":""},{"$f":"IF(F2=$B$4,'Entry Cr&Dr'!$D$5,\"\")","v":""},{"$f":"IF(G2=$B$4,'Entry Cr&Dr'!$D$5,\"\")","v":""},{"$f":"IF(H2=$B$4,'Entry Cr&Dr'!$D$5,\"\")","v":""},{"$f":"IF(I2=$B$4,'Entry Cr&Dr'!$D$5,\"\")","v":""},{"$f":"IF(J2=$B$4,'Entry Cr&Dr'!$D$5,\"\")","v":""},{"$f":"IF(K2=$B$4,'Entry Cr&Dr'!$D$5,\"\")","v":""},{"$f":"IF(L2=$B$4,'Entry Cr&Dr'!$D$5,\"\")","v":""},{"$f":"IF(M2=$B$4,'Entry Cr&Dr'!$D$5,\"\")","v":""},{"$f":"IF(N2=$B$4,'Entry Cr&Dr'!$D$5,\"\")","v":""},{"$f":"IF(O2=$B$4,'Entry Cr&Dr'!$D$5,\"\")","v":""},{"$f":"SUM(,D4:O4)","v":{"v":50000,"d":"50000.00"}},null,{"$f":"P4-Q4","v":{"v":50000,"d":"50000.00"}}]
[{"$f":"'Entry Cr&Dr'!A6","v":"2020-07-02"},{"$f":"'Entry Cr&Dr'!B6","v":"CSG"},{"$f":"'Entry Cr&Dr'!C6","v":"lelk }kjk tek"},{"$f":"IF(D2=$B$5,'Entry Cr&Dr'!$D$6,\"\")","v":{"v":500,"d":"500.00"}},{"$f":"IF(E2=$B$5,'Entry Cr&Dr'!$D$6,\"\")","v":""},{"$f":"IF(F2=$B$5,'Entry Cr&Dr'!$D$6,\"\")","v":""},{"$f":"IF(G2=$B$5,'Entry Cr&Dr'!$D$6,\"\")","v":""},{"$f":"IF(H2=$B$5,'Entry Cr&Dr'!$D$6,\"\")","v":""},{"$f":"IF(I2=$B$5,'Entry Cr&Dr'!$D$6,\"\")","v":""},{"$f":"IF(J2=$B$5,'Entry Cr&Dr'!$D$6,\"\")","v":""},{"$f":"IF(K2=$B$5,'Entry Cr&Dr'!$D$6,\"\")","v":""},{"$f":"IF(L2=$B$5,'Entry Cr&Dr'!$D$6,\"\")","v":""},{"$f":"IF(M2=$B$5,'Entry Cr&Dr'!$D$6,\"\")","v":""},{"$f":"IF(N2=$B$5,'Entry Cr&Dr'!$D$6,\"\")","v":""},{"$f":"IF(O2=$B$5,'Entry Cr&Dr'!$D$6,\"\")","v":""},{"v":500,"d":"500.00"},null,{"v":500,"d":"500.00"}]
[{"$f":"'Entry Cr&Dr'!A7","v":"00:00:00"},{"$f":"'Entry Cr&Dr'!B7","v":0},{"$f":"'Entry Cr&Dr'!C7","v":0},{"$f":"IF(D2=$B$6,'Entry Cr&Dr'!$D$7,\"\")","v":""},{"$f":"IF(E2=$B$6,'Entry Cr&Dr'!$D$7,\"\")","v":""},{"$f":"IF(F2=$B$6,'Entry Cr&Dr'!$D$7,\"\")","v":""},{"$f":"IF(G2=$B$6,'Entry Cr&Dr'!$D$7,\"\")","v":""},{"$f":"IF(H2=$B$6,'Entry Cr&Dr'!$D$7,\"\")","v":""},{"$f":"IF(I2=$B$6,'Entry Cr&Dr'!$D$7,\"\")","v":""},{"$f":"IF(J2=$B$6,'Entry Cr&Dr'!$D$7,\"\")","v":""},{"$f":"IF(K2=$B$6,'Entry Cr&Dr'!$D$7,\"\")","v":""},{"$f":"IF(L2=$B$6,'Entry Cr&Dr'!$D$7,\"\")","v":""},{"$f":"IF(M2=$B$6,'Entry Cr&Dr'!$D$7,\"\")","v":""},{"$f":"IF(N2=$B$6,'Entry Cr&Dr'!$D$7,\"\")","v":""},{"$f":"IF(O2=$B$6,'Entry Cr&Dr'!$D$7,\"\")","v":""},{"v":0,"d":"0.00"},null,{"v":0,"d":"0.00"}]
[{"$f":"'Entry Cr&Dr'!A8","v":"00:00:00"},{"$f":"'Entry Cr&Dr'!B8","v":0},{"$f":"'Entry Cr&Dr'!C8","v":0},{"$f":"IF(D2=$B$7,'Entry Cr&Dr'!$D$8,\"\")","v":""},{"$f":"IF(E2=$B$7,'Entry Cr&Dr'!$D$8,\"\")","v":""},{"$f":"IF(F2=$B$7,'Entry Cr&Dr'!$D$8,\"\")","v":""},{"$f":"IF(G2=$B$7,'Entry Cr&Dr'!$D$8,\"\")","v":""},{"$f":"IF(H2=$B$7,'Entry Cr&Dr'!$D$8,\"\")","v":""},{"$f":"IF(I2=$B$7,'Entry Cr&Dr'!$D$8,\"\")","v":""},{"$f":"IF(J2=$B$7,'Entry Cr&Dr'!$D$8,\"\")","v":""},{"$f":"IF(K2=$B$7,'Entry Cr&Dr'!$D$8,\"\")","v":""},{"$f":"IF(L2=$B$7,'Entry Cr&Dr'!$D$8,\"\")","v":""},{"$f":"IF(M2=$B$7,'Entry Cr&Dr'!$D$8,\"\")","v":""},{"$f":"IF(N2=$B$7,'Entry Cr&Dr'!$D$8,\"\")","v":""},{"$f":"IF(O2=$B$7,'Entry Cr&Dr'!$D$8,\"\")","v":""},{"v":0,"d":"0.00"},null,{"v":0,"d":"0.00"}]
[{"$f":"'Entry Cr&Dr'!A9","v":"00:00:00"},{"$f":"'Entry Cr&Dr'!B9","v":0},{"$f":"'Entry Cr&Dr'!C9","v":0},{"$f":"IF(D2=$B$8,'Entry Cr&Dr'!$D$9,\"\")","v":""},{"$f":"IF(E2=$B$8,'Entry Cr&Dr'!$D$9,\"\")","v":""},{"$f":"IF(F2=$B$8,'Entry Cr&Dr'!$D$9,\"\")","v":""},{"$f":"IF(G2=$B$8,'Entry Cr&Dr'!$D$9,\"\")","v":""},{"$f":"IF(H2=$B$8,'Entry Cr&Dr'!$D$9,\"\")","v":""},{"$f":"IF(I2=$B$8,'Entry Cr&Dr'!$D$9,\"\")","v":""},{"$f":"IF(J2=$B$8,'Entry Cr&Dr'!$D$9,\"\")","v":""},{"$f":"IF(K2=$B$8,'Entry Cr&Dr'!$D$9,\"\")","v":""},{"$f":"IF(L2=$B$8,'Entry Cr&Dr'!$D$9,\"\")","v":""},{"$f":"IF(M2=$B$8,'Entry Cr&Dr'!$D$9,\"\")","v":""},{"$f":"IF(N2=$B$8,'Entry Cr&Dr'!$D$9,\"\")","v":""},{"$f":"IF(O2=$B$8,'Entry Cr&Dr'!$D$9,\"\")","v":""},{"v":0,"d":"0.00"},null,{"v":0,"d":"0.00"},null,"Click Here to check ENTRY "]
[{"$f":"'Entry Cr&Dr'!A10","v":"00:00:00"},{"$f":"'Entry Cr&Dr'!B10","v":0},{"$f":"'Entry Cr&Dr'!C10","v":0},{"$f":"IF(D2=$B$9,'Entry Cr&Dr'!$D$10,\"\")","v":""},{"$f":"IF(E2=$B$9,'Entry Cr&Dr'!$D$10,\"\")","v":""},{"$f":"IF(F2=$B$9,'Entry Cr&Dr'!$D$10,\"\")","v":""},{"$f":"IF(G2=$B$9,'Entry Cr&Dr'!$D$10,\"\")","v":""},{"$f":"IF(H2=$B$9,'Entry Cr&Dr'!$D$10,\"\")","v":""},{"$f":"IF(I2=$B$9,'Entry Cr&Dr'!$D$10,\"\")","v":""},{"$f":"IF(J2=$B$9,'Entry Cr&Dr'!$D$10,\"\")","v":""},{"$f":"IF(K2=$B$9,'Entry Cr&Dr'!$D$10,\"\")","v":""},{"$f":"IF(L2=$B$9,'Entry Cr&Dr'!$D$10,\"\")","v":""},{"$f":"IF(M2=$B$9,'Entry Cr&Dr'!$D$10,\"\")","v":""},{"$f":"IF(N2=$B$9,'Entry Cr&Dr'!$D$10,\"\")","v":""},{"$f":"IF(O2=$B$9,'Entry Cr&Dr'!$D$10,\"\")","v":""},{"v":0,"d":"0.00"},null,{"v":0,"d":"0.00"}]
[{"$f":"'Entry Cr&Dr'!A11","v":"00:00:00"},{"$f":"'Entry Cr&Dr'!B11","v":0},{"$f":"'Entry Cr&Dr'!C11","v":0},{"$f":"IF(D2=$B$10,'Entry Cr&Dr'!$D$11,\"\")","v":""},{"$f":"IF(E2=$B$10,'Entry Cr&Dr'!$D$11,\"\")","v":""},{"$f":"IF(F2=$B$10,'Entry Cr&Dr'!$D$11,\"\")","v":""},{"$f":"IF(G2=$B$10,'Entry Cr&Dr'!$D$11,\"\")","v":""},{"$f":"IF(H2=$B$10,'Entry Cr&Dr'!$D$11,\"\")","v":""},{"$f":"IF(I2=$B$10,'Entry Cr&Dr'!$D$11,\"\")","v":""},{"$f":"IF(J2=$B$10,'Entry Cr&Dr'!$D$11,\"\")","v":""},{"$f":"IF(K2=$B$10,'Entry Cr&Dr'!$D$11,\"\")","v":""},{"$f":"IF(L2=$B$10,'Entry Cr&Dr'!$D$11,\"\")","v":""},{"$f":"IF(M2=$B$10,'Entry Cr&Dr'!$D$11,\"\")","v":""},{"$f":"IF(N2=$B$10,'Entry Cr&Dr'!$D$11,\"\")","v":""},{"$f":"IF(O2=$B$10,'Entry Cr&Dr'!$D$11,\"\")","v":""},{"v":0,"d":"0.00"},null,{"v":0,"d":"0.00"}]
{"$rows_left_out":19}
{"sheet":"Payment","index":6,"n_rows":28,"n_cols":20,"rows_kept":28,"merged":[[0,0,0,17],[2,19,4,24],[8,19,8,25],[25,0,25,2],[26,0,26,2],[27,0,27,2]]}
["Payment"]
["दिनाक","मद जिससे राशि गई","किसको दिया का विवरण","CSG","Vikas Kosh","FVC","Internet","Gas Subcidy, MDM, Cook-Cum Helper","Scholarship","Scout Guide","Cycle and Transport Voucher","Science","SMC Training","Other1","Bank Interest","योग","Cash","बैंक"]
[{"$f":"'Entry Cr&Dr'!G5","v":"2020-07-01"},{"$f":"'Entry Cr&Dr'!H5","v":"CSG"},{"$f":"'Entry Cr&Dr'!I5","v":"dEI;wVj dk;Z ds fy, pSd ua- 452515 }kjk Hkwxrku"},{"$f":"IF(D2=$B$3,'Entry Cr&Dr'!$J$5,\"\")","v":{"v":2500,"d":"2500.00"}},{"$f":"IF(E2=$B$3,'Entry Cr&Dr'!$J$5,\"\")","v":""},{"$f":"IF(F2=$B$3,'Entry Cr&Dr'!$J$5,\"\")","v":""},{"$f":"IF(G2=$B$3,'Entry Cr&Dr'!$J$5,\"\")","v":""},{"$f":"IF(H2=$B$3,'Entry Cr&Dr'!$J$5,\"\")","v":""},{"$f":"IF(I2=$B$3,'Entry Cr&Dr'!$J$5,\"\")","v":""},{"$f":"IF(J2=$B$3,'Entry Cr&Dr'!$J$5,\"\")","v":""},{"$f":"IF(K2=$B$3,'Entry Cr&Dr'!$J$5,\"\")","v":""},{"$f":"IF(L2=$B$3,'Entry Cr&Dr'!$J$5,\"\")","v":""},{"$f":"IF(M2=$B$3,'Entry Cr&Dr'!$J$5,\"\")","v":""},{"$f":"IF(N2=$B$3,'Entry Cr&Dr'!$J$5,\"\")","v":""},{"$f":"IF(O2=$B$3,'Entry Cr&Dr'!$J$5,\"\")","v":""},{"$f":"SUM(D3:O3)","v":{"v":2500,"d":"2500.00"}},null,{"$f":"P3-Q3","v":{"v":2500,"d":"2500.00"}},null,"इस शीट में केवल cash वाले कोलम में एंट्री करे जिस राशि का पेमेंट आपने कैश में दिया है उसका इन्द्राज cash वाले कोलम में करे |बाकी अन्य किसी भी कोलम में एंट्री करने की आवश्यकता नही है | आसमानी कलर वाले कोलम में मद समान होने चाहिए |"]
[{"$f":"'Entry Cr&Dr'!G6","v":"2020-07-03"},{"$f":"'Entry Cr&Dr'!H6","v":"CSG"},{"$f":"'Entry Cr&Dr'!I6","v":"बिजली बिल के जमा"},{"$f":"IF(D2=$B$4,'Entry Cr&Dr'!$J$6,\"\")","v":{"v":3000,"d":"3000.00"}},{"$f":"IF(E2=$B$4,'Entry Cr&Dr'!$J$6,\"\")","v":""},{"$f":"IF(F2=$B$4,'Entry Cr&Dr'!$J$6,\"\")","v":""},{"$f":"IF(G2=$B$4,'Entry Cr&Dr'!$J$6,\"\")","v":""},{"$f":"IF(H2=$B$4,'Entry Cr&Dr'!$J$6,\"\")","v":""},{"$f":"IF(I2=$B$4,'Entry Cr&Dr'!$J$6,\"\")","v":""},{"$f":"IF(J2=$B$4,'Entry Cr&Dr'!$J$6,\"\")","v":""},{"$f":"IF(K2=$B$4,'Entry Cr&Dr'!$J$6,\"\")","v":""},{"$f":"IF(L2=$B$4,'Entry Cr&Dr'!$J$6,\"\")","v":""},{"$f":"IF(M2=$B$4,'Entry Cr&Dr'!$J$6,\"\")","v":""},{"$f":"IF(N2=$B$4,'Entry Cr&Dr'!$J$6,\"\")","v":""},{"$f":"IF(O2=$B$4,'Entry Cr&Dr'!$J$6,\"\")","v":""},{"$f":"SUM(D4:O4)","v":{"v":3000,"d":"3000.00"}},null,{"$f":"P4-Q4","v":{"v":3000,"d":"3000.00"}}]
[{"$f":"'Entry Cr&Dr'!G7","v":"00:00:00"},{"$f":"'Entry Cr&Dr'!H7","v":0},{"$f":"'Entry Cr&Dr'!I7","v":0},{"$f":"IF(D2=$B$5,'Entry Cr&Dr'!$J$7,\"\")","v":""},{"$f":"IF(E2=$B$5,'Entry Cr&Dr'!$J$7,\"\")","v":""},{"$f":"IF(F2=$B$5,'Entry Cr&Dr'!$J$7,\"\")","v":""},{"$f":"IF(G2=$B$5,'Entry Cr&Dr'!$J$7,\"\")","v":""},{"$f":"IF(H2=$B$5,'Entry Cr&Dr'!$J$7,\"\")","v":""},{"$f":"IF(I2=$B$5,'Entry Cr&Dr'!$J$7,\"\")","v":""},{"$f":"IF(J2=$B$5,'Entry Cr&Dr'!$J$7,\"\")","v":""},{"$f":"IF(K2=$B$5,'Entry Cr&Dr'!$J$7,\"\")","v":""},{"$f":"IF(L2=$B$5,'Entry Cr&Dr'!$J$7,\"\")","v":""},{"$f":"IF(M2=$B$5,'Entry Cr&Dr'!$J$7,\"\")","v":""},{"$f":"IF(N2=$B$5,'Entry Cr&Dr'!$J$7,\"\")","v":""},{"$f":"IF(O2=$B$5,'Entry Cr&Dr'!$J$7,\"\")","v":""},{"v":0,"d":"0.00"},null,{"v":0,"d":"0.00"}]
[{"$f":"'Entry Cr&Dr'!G8","v":"00:00:00"},{"$f":"'Entry Cr&Dr'!H8","v":0},{"$f":"'Entry Cr&Dr'!I8","v":0},{"$f":"IF(D2=$B$6,'Entry Cr&Dr'!$J$8,\"\")","v":""},{"$f":"IF(E2=$B$6,'Entry Cr&Dr'!$J$8,\"\")","v":""},{"$f":"IF(F2=$B$6,'Entry Cr&Dr'!$J$8,\"\")","v":""},{"$f":"IF(G2=$B$6,'Entry Cr&Dr'!$J$8,\"\")","v":""},{"$f":"IF(H2=$B$6,'Entry Cr&Dr'!$J$8,\"\")","v":""},{"$f":"IF(I2=$B$6,'Entry Cr&Dr'!$J$8,\"\")","v":""},{"$f":"IF(J2=$B$6,'Entry Cr&Dr'!$J$8,\"\")","v":""},{"$f":"IF(K2=$B$6,'Entry Cr&Dr'!$J$8,\"\")","v":""},{"$f":"IF(L2=$B$6,'Entry Cr&Dr'!$J$8,\"\")","v":""},{"$f":"IF(M2=$B$6,'Entry Cr&Dr'!$J$8,\"\")","v":""},{"$f":"IF(N2=$B$6,'Entry Cr&Dr'!$J$8,\"\")","v":""},{"$f":"IF(O2=$B$6,'Entry Cr&Dr'!$J$8,\"\")","v":""},{"v":0,"d":"0.00"},null,{"v":0,"d":"0.00"}]
[{"$f":"'Entry Cr&Dr'!G9","v":"00:00:00"},{"$f":"'Entry Cr&Dr'!H9","v":0},{"$f":"'Entry Cr&Dr'!I9","v":0},{"$f":"IF(D2=$B$7,'Entry Cr&Dr'!$J$9,\"\")","v":""},{"$f":"IF(E2=$B$7,'Entry Cr&Dr'!$J$9,\"\")","v":""},{"$f":"IF(F2=$B$7,'Entry Cr&Dr'!$J$9,\"\")","v":""},{"$f":"IF(G2=$B$7,'Entry Cr&Dr'!$J$9,\"\")","v":""},{"$f":"IF(H2=$B$7,'Entry Cr&Dr'!$J$9,\"\")","v":""},{"$f":"IF(I2=$B$7,'Entry Cr&Dr'!$J$9,\"\")","v":""},{"$f":"IF(J2=$B$7,'Entry Cr&Dr'!$J$9,\"\")","v":""},{"$f":"IF(K2=$B$7,'Entry Cr&Dr'!$J$9,\"\")","v":""},{"$f":"IF(L2=$B$7,'Entry Cr&Dr'!$J$9,\"\")","v":""},{"$f":"IF(M2=$B$7,'Entry Cr&Dr'!$J$9,\"\")","v":""},{"$f":"IF(N2=$B$7,'Entry Cr&Dr'!$J$9,\"\")","v":""},{"$f":"IF(O2=$B$7,'Entry Cr&Dr'!$J$9,\"\")","v":""},{"v":0,"d":"0.00"},null,{"v":0,"d":"0.00"}]
[{"$f":"'Entry Cr&Dr'!G10","v":"00:00:00"},{"$f":"'Entry Cr&Dr'!H10","v":0},{"$f":"'Entry Cr&Dr'!I10","v":0},{"$f":"IF(D2=$B$8,'Entry Cr&Dr'!$J$10,\"\")","v":""},{"$f":"IF(E2=$B$8,'Entry Cr&Dr'!$J$10,\"\")","v":""},{"$f":"IF(F2=$B$8,'Entry Cr&Dr'!$J$10,\"\")","v":""},{"$f":"IF(G2=$B$8,'Entry Cr&Dr'!$J$10,\"\")","v":""},{"$f":"IF(H2=$B$8,'Entry Cr&Dr'!$J$10,\"\")","v":""},{"$f":"IF(I2=$B$8,'Entry Cr&Dr'!$J$10,\"\")","v":""},{"$f":"IF(J2=$B$8,'Entry Cr&Dr'!$J$10,\"\")","v":""},{"$f":"IF(K2=$B$8,'Entry Cr&Dr'!$J$10,\"\")","v":""},{"$f":"IF(L2=$B$8,'Entry Cr&Dr'!$J$10,\"\")","v":""},{"$f":"IF(M2=$B$8,'Entry Cr&Dr'!$J$10,\"\")","v":""},{"$f":"IF(N2=$B$8,'Entry Cr&Dr'!$J$10,\"\")","v":""},{"$f":"IF(O2=$B$8,'Entry Cr&Dr'!$J$10,\"\")","v":""},{"v":0,"d":"0.00"},null,{"v":0,"d":"0.00"}]
[{"$f":"'Entry Cr&Dr'!G11","v":"00:00:00"},{"$f":"'Entry Cr&Dr'!H11","v":0},{"$f":"'Entry Cr&Dr'!I11","v":0},{"$f":"IF(D2=$B$9,'Entry Cr&Dr'!$J$11,\"\")","v":""},{"$f":"IF(E2=$B$9,'Entry Cr&Dr'!$J$11,\"\")","v":""},{"$f":"IF(F2=$B$9,'Entry Cr&Dr'!$J$11,\"\")","v":""},{"$f":"IF(G2=$B$9,'Entry Cr&Dr'!$J$11,\"\")","v":""},{"$f":"IF(H2=$B$9,'Entry Cr&Dr'!$J$11,\"\")","v":""},{"$f":"IF(I2=$B$9,'Entry Cr&Dr'!$J$11,\"\")","v":""},{"$f":"IF(J2=$B$9,'Entry Cr&Dr'!$J$11,\"\")","v":""},{"$f":"IF(K2=$B$9,'Entry Cr&Dr'!$J$11,\"\")","v":""},{"$f":"IF(L2=$B$9,'Entry Cr&Dr'!$J$11,\"\")","v":""},{"$f":"IF(M2=$B$9,'Entry Cr&Dr'!$J$11,\"\")","v":""},{"$f":"IF(N2=$B$9,'Entry Cr&Dr'!$J$11,\"\")","v":""},{"$f":"IF(O2=$B$9,'Entry Cr&Dr'!$J$11,\"\")","v":""},{"v":0,"d":"0.00"},null,{"v":0,"d":"0.00"},null,"Click Here to check ENTRY "]
[{"$f":"'Entry Cr&Dr'!G12","v":"00:00:00"},{"$f":"'Entry Cr&Dr'!H12","v":0},{"$f":"'Entry Cr&Dr'!I12","v":0},{"$f":"IF(D2=$B$10,'Entry Cr&Dr'!$J$12,\"\")","v":""},{"$f":"IF(E2=$B$10,'Entry Cr&Dr'!$J$12,\"\")","v":""},{"$f":"IF(F2=$B$10,'Entry Cr&Dr'!$J$12,\"\")","v":""},{"$f":"IF(G2=$B$10,'Entry Cr&Dr'!$J$12,\"\")","v":""},{"$f":"IF(H2=$B$10,'Entry Cr&Dr'!$J$12,\"\")","v":""},{"$f":"IF(I2=$B$10,'Entry Cr&Dr'!$J$12,\"\")","v":""},{"$f":"IF(J2=$B$10,'Entry Cr&Dr'!$J$12,\"\")","v":""},{"$f":"IF(K2=$B$10,'Entry Cr&Dr'!$J$12,\"\")","v":""},{"$f":"IF(L2=$B$10,'Entry Cr&Dr'!$J$12,\"\")","v":""},{"$f":"IF(M2=$B$10,'Entry Cr&Dr'!$J$12,\"\")","v":""},{"$f":"IF(N2=$B$10,'Entry Cr&Dr'!$J$12,\"\")","v":""},{"$f":"IF(O2=$B$10,'Entry Cr&Dr'!$J$12,\"\")","v":""},{"v":0,"d":"0.00"},null,{"v":0,"d":"0.00"}]
{"$rows_left_out":18}