{"text_format":"3","workbook":"xlsx","n_sheets":20,"sheets":["Sheet2","REPORTS","PRF-5","PRF-4","PRF-3","PRF-2","PRF-1","A-BASE","A-SA1","A-SA2","A-SA3","B-SA1","B-SA2","B-SA3","LSRW-1","LSRW-2","LSRW-3","LSRW-4","LSRW-5","PORTFOLIO"],"not_rendered":{"images":6,"defined_names":18},"read":"whole","date_system":"1900"}

{"sheet":"Sheet2","index":0,"n_rows":21,"n_cols":12,"rows_kept":21,"merged":[[0,0,0,15],[1,0,19,0],[1,1,1,4],[1,15,19,15],[2,1,2,8],[3,1,3,8],[4,1,4,7],[6,1,12,14],[16,1,16,14],[17,1,17,3],[17,4,17,7],[17,8,17,10],[17,11,17,14],[18,1,18,3],[18,4,18,7],[18,8,18,10],[18,11,18,14],[19,1,19,3],[19,4,19,7],[19,8,19,10],[19,11,19,14],[20,0,24,15]]}
["HOW TO USE"]
[null,"In report section,"]
[null,"you will get access of Profile sheets (classwise)»"]
[null,"learning objectivewise Grading sheets (classwise)»"]
[null,"and Assessmentwise format A and B»"]
[]
[null,"First, update class profile and then classwise learning objective grading sheets clicking on direct access link from report section. Remember, you have to fill up only white Cells. Accordingly filled up data, format A and format B will be calculated automatically. Just click on them and print out.You can also print the class profile and learning objectivewise grading sheets of all classes."]
{"$rows_empty":9}
[null,"In objective wise grading sheets"]
[null,"L stands for ",null,null,"Listening with understanding",{"$nulls":3},"W stands for",null,null,"Writing"]
[null,"S stands for",null,null,"Speaking with confidence",{"$nulls":3},"FG stands for",null,null,"Functional Grammar"]
[null,"R stands for",null,null,"Reading with comprehension",{"$nulls":3},"AG stands for",null,null,"Aggregate Grade"]
["THIS PROGRAMME WORKS BETTER ONLY ON PC AND LAPTOP"]

{"sheet":"REPORTS","index":1,"n_rows":8,"n_cols":15,"rows_kept":8,"merged":[[0,0,1,20],[2,0,2,20],[3,0,3,20],[4,0,4,20],[5,0,5,20],[6,0,6,2],[6,3,6,13],[6,14,6,16],[6,17,6,20],[7,0,7,1],[7,2,7,5],[7,6,7,9],[7,10,7,20],[8,0,25,20]]}
["CONTINUOUS AND COMPREHENSIVE EVALUATION 2018-19"]
[]
["PROGRAMMER_HARISH JAIPAL MALI"]
["POSTING PLACE ADARSH GOVT SR SEC SCHOOL PANCHDEVAL PINDWARA"]
["CONTACT- 9828745480 harishjaipalmali@gmail.com"]
["FILL UP YOUR PROFILE"]
["SCHOOL NAME-",{"$nulls":13},"DISE CODE"]
["SUBJECT-",{"$nulls":5},"SUBJECT TEACHER NAME-"]

{"sheet":"PRF-5","index":2,"n_rows":67,"n_cols":16,"rows_kept":67,"merged":[[0,0,1,15],[2,0,2,15],[3,0,3,15],[4,0,4,2],[4,4,4,5],[4,6,4,7],[4,8,4,10],[4,11,4,13],[5,0,6,0],[5,1,6,1],[5,2,6,2],[5,3,6,3],[5,4,6,4],[5,5,6,5],[5,6,6,6],[5,7,6,7],[5,8,5,9],[5,10,5,11],[5,12,5,13],[5,14,5,15]]}
[{"$f":"REPORTS!$D$7","v":0}]
[]
["lrr ,oa O;kid ewY;kadu dk;ZØe 2018&19"]
["fo|ky; esa cPpksa ds 'kSf{kd Lrj dh fLFkfr"]
["CLASS-",null,null,"5TH","SUBJECT-",null,{"$f":"REPORTS!C8","v":0},null,"SUBJECT TEACHER-",null,null,{"$f":"REPORTS!K8","v":0}]
["Ø0la0","d{kk","jksy uEcj","uke fo|kFkhZ","firk dk uke","ekrk dk uke","izos“kkad","tUe fnukad","vk/kkj js[kk ewY;kadu ",null,"SA-1",null,"SA-2",null,"SA-3"]
[{"$nulls":8},"d{kk Lrj","izkIr xzsM","d{kk Lrj","izkIr xzsM","d{kk Lrj","izkIr xzsM","d{kk Lrj","izkIr xzsM"]
[1,5,501,"ARJUN KUMAR","ASHUTOSH","VINITA DEVI",1015,"2007-03-12",4,{"$f":"'LSRW-5'!L10","v":"B"},4,{"$f":"'LSRW-5'!S10","v":"A"},5,{"$f":"'LSRW-5'!Z10","v":"B"},5,{"$f":"'LSRW-5'!AG10","v":"B"}]
[2,5,502,"MAHAK KUMARI","VASANT KUMAR","SUNITA DEVI",1025,"2007-08-05",5,{"$f":"'LSRW-5'!L11","v":"B"},5,{"$f":"'LSRW-5'!S11","v":"B"},5,{"$f":"'LSRW-5'!Z11","v":"A"},5,{"$f":"'LSRW-5'!AG11","v":"A"}]
[{"$nulls":9},{"$f":"'LSRW-5'!L12","v":0},null,{"$f":"'LSRW-5'!S12","v":0},null,{"$f":"'LSRW-5'!Z12","v":0},null,{"$f":"'LSRW-5'!AG12","v":0}]
[{"$nulls":9},{"$f":"'LSRW-5'!L13","v":0},null,{"$f":"'LSRW-5'!S13","v":0},null,{"$f":"'LSRW-5'!Z13","v":0},null,{"$f":"'LSRW-5'!AG13","v":0}]
[{"$nulls":9},{"$f":"'LSRW-5'!L14","v":0},null,{"$f":"'LSRW-5'!S14","v":0},null,{"$f":"'LSRW-5'!Z14","v":0},null,{"$f":"'LSRW-5'!AG14","v":0}]
[{"$nulls":9},{"$f":"'LSRW-5'!L15","v":0},null,{"$f":"'LSRW-5'!S15","v":0},null,{"$f":"'LSRW-5'!Z15","v":0},null,{"$f":"'LSRW-5'!AG15","v":0}]
[{"$nulls":9},{"$f":"'LSRW-5'!L16","v":0},null,{"$f":"'LSRW-5'!S16","v":0},null,{"$f":"'LSRW-5'!Z16","v":0},null,{"$f":"'LSRW-5'!AG16","v":0}]
[{"$nulls":9},{"$f":"'LSRW-5'!L17","v":0},null,{"$f":"'LSRW-5'!S17","v":0},null,{"$f":"'LSRW-5'!Z17","v":0},null,{"$f":"'LSRW-5'!AG17","v":0}]
[{"$nulls":9},{"$f":"'LSRW-5'!L18","v":0},null,{"$f":"'LSRW-5'!S18","v":0},null,{"$f":"'LSRW-5'!Z18","v":0},null,{"$f":"'LSRW-5'!AG18","v":0}]
[{"$nulls":9},{"$f":"'LSRW-5'!L19","v":0},null,{"$f":"'LSRW-5'!S19","v":0},null,{"$f":"'LSRW-5'!Z19","v":0},null,{"$f":"'LSRW-5'!AG19","v":0}]
[{"$nulls":9},{"$f":"'LSRW-5'!L20","v":0},null,{"$f":"'LSRW-5'!S20","v":0},null,{"$f":"'LSRW-5'!Z20","v":0},null,{"$f":"'LSRW-5'!AG20","v":0}]
[{"$nulls":9},{"$f":"'LSRW-5'!L21","v":0},null,{"$f":"'LSRW-5'!S21","v":0},null,{"$f":"'LSRW-5'!Z21","v":0},null,{"$f":"'LSRW-5'!AG21","v":0}]
[{"$nulls":9},{"$f":"'LSRW-5'!L22","v":0},null,{"$f":"'LSRW-5'!S22","v":0},null,{"$f":"'LSRW-5'!Z22","v":0},null,{"$f":"'LSRW-5'!AG22","v":0}]
[{"$nulls":9},{"$f":"'LSRW-5'!L23","v":0},null,{"$f":"'LSRW-5'!S23","v":0},null,{"$f":"'LSRW-5'!Z23","v":0},null,{"$f":"'LSRW-5'!AG23","v":0}]
[{"$nulls":9},{"$f":"'LSRW-5'!L24","v":0},null,{"$f":"'LSRW-5'!S24","v":0},null,{"$f":"'LSRW-5'!Z24","v":0},null,{"$f":"'LSRW-5'!AG24","v":0}]
[{"$nulls":9},{"$f":"'LSRW-5'!L25","v":0},null,{"$f":"'LSRW-5'!S25","v":0},null,{"$f":"'LSRW-5'!Z25","v":0},null,{"$f":"'LSRW-5'!AG25","v":0}]
[{"$nulls":9},{"$f":"'LSRW-5'!L26","v":0},null,{"$f":"'LSRW-5'!S26","v":0},null,{"$f":"'LSRW-5'!Z26","v":0},null,{"$f":"'LSRW-5'!AG26","v":0}]
[{"$nulls":9},{"$f":"'LSRW-5'!L27","v":0},null,{"$f":"'LSRW-5'!S27","v":0},null,{"$f":"'LSRW-5'!Z27","v":0},null,{"$f":"'LSRW-5'!AG27","v":0}]
[{"$nulls":9},{"$f":"'LSRW-5'!L28","v":0},null,{"$f":"'LSRW-5'!S28","v":0},null,{"$f":"'LSRW-5'!Z28","v":0},null,{"$f":"'LSRW-5'!AG28","v":0}]
[{"$nulls":9},{"$f":"'LSRW-5'!L29","v":0},null,{"$f":"'LSRW-5'!S29","v":0},null,{"$f":"'LSRW-5'!Z29","v":0},null,{"$f":"'LSRW-5'!AG29","v":0}]
[{"$nulls":9},{"$f":"'LSRW-5'!L30","v":0},null,{"$f":"'LSRW-5'!S30","v":0},null,{"$f":"'LSRW-5'!Z30","v":0},null,{"$f":"'LSRW-5'!AG30","v":0}]
[{"$nulls":9},{"$f":"'LSRW-5'!L31","v":0},null,{"$f":"'LSRW-5'!S31","v":0},null,{"$f":"'LSRW-5'!Z31","v":0},null,{"$f":"'LSRW-5'!AG31","v":0}]
[{"$nulls":9},{"$f":"'LSRW-5'!L32","v":0},null,{"$f":"'LSRW-5'!S32","v":0},null,{"$f":"'LSRW-5'!Z32","v":0},null,{"$f":"'LSRW-5'!AG32","v":0}]
[{"$nulls":9},{"$f":"'LSRW-5'!L33","v":0},null,{"$f":"'LSRW-5'!S33","v":0},null,{"$f":"'LSRW-5'!Z33","v":0},null,{"$f":"'LSRW-5'!AG33","v":0}]
[{"$nulls":9},{"$f":"'LSRW-5'!L34","v":0},null,{"$f":"'LSRW-5'!S34","v":0},null,{"$f":"'LSRW-5'!Z34","v":0},null,{"$f":"'LSRW-5'!AG34","v":0}]
[{"$nulls":9},{"$f":"'LSRW-5'!L35","v":0},null,{"$f":"'LSRW-5'!S35","v":0},null,{"$f":"'LSRW-5'!Z35","v":0},null,{"$f":"'LSRW-5'!AG35","v":0}]
[{"$nulls":9},{"$f":"'LSRW-5'!L36","v":0},null,{"$f":"'LSRW-5'!S36","v":0},null,{"$f":"'LSRW-5'!Z36","v":0},null,{"$f":"'LSRW-5'!AG36","v":0}]
[{"$nulls":9},{"$f":"'LSRW-5'!L37","v":0},null,{"$f":"'LSRW-5'!S37","v":0},null,{"$f":"'LSRW-5'!Z37","v":0},null,{"$f":"'LSRW-5'!AG37","v":0}]
[{"$nulls":9},{"$f":"'LSRW-5'!L38","v":0},null,{"$f":"'LSRW-5'!S38","v":0},null,{"$f":"'LSRW-5'!Z38","v":0},null,{"$f":"'LSRW-5'!AG38","v":0}]
[{"$nulls":9},{"$f":"'LSRW-5'!L39","v":0},null,{"$f":"'LSRW-5'!S39","v":0},null,{"$f":"'LSRW-5'!Z39","v":0},null,{"$f":"'LSRW-5'!AG39","v":0}]
[{"$nulls":9},{"$f":"'LSRW-5'!L40","v":0},null,{"$f":"'LSRW-5'!S40","v":0},null,{"$f":"'LSRW-5'!Z40","v":0},null,{"$f":"'LSRW-5'!AG40","v":0}]
[{"$nulls":9},{"$f":"'LSRW-5'!L41","v":0},null,{"$f":"'LSRW-5'!S41","v":0},null,{"$f":"'LSRW-5'!Z41","v":0},null,{"$f":"'LSRW-5'!AG41","v":0}]
[{"$nulls":9},{"$f":"'LSRW-5'!L42","v":0},null,{"$f":"'LSRW-5'!S42","v":0},null,{"$f":"'LSRW-5'!Z42","v":0},null,{"$f":"'LSRW-5'!AG42","v":0}]
[{"$nulls":9},{"$f":"'LSRW-5'!L43","v":0},null,{"$f":"'LSRW-5'!S43","v":0},null,{"$f":"'LSRW-5'!Z43","v":0},null,{"$f":"'LSRW-5'!AG43","v":0}]
[{"$nulls":9},{"$f":"'LSRW-5'!L44","v":0},null,{"$f":"'LSRW-5'!S44","v":0},null,{"$f":"'LSRW-5'!Z44","v":0},null,{"$f":"'LSRW-5'!AG44","v":0}]
[{"$nulls":9},{"$f":"'LSRW-5'!L45","v":0},null,{"$f":"'LSRW-5'!S45","v":0},null,{"$f":"'LSRW-5'!Z45","v":0},null,{"$f":"'LSRW-5'!AG45","v":0}]
[{"$nulls":9},{"$f":"'LSRW-5'!L46","v":0},null,{"$f":"'LSRW-5'!S46","v":0},null,{"$f":"'LSRW-5'!Z46","v":0},null,{"$f":"'LSRW-5'!AG46","v":0}]
[{"$nulls":9},{"$f":"'LSRW-5'!L47","v":0},null,{"$f":"'LSRW-5'!S47","v":0},null,{"$f":"'LSRW-5'!Z47","v":0},null,{"$f":"'LSRW-5'!AG47","v":0}]
[{"$nulls":9},{"$f":"'LSRW-5'!L48","v":0},null,{"$f":"'LSRW-5'!S48","v":0},null,{"$f":"'LSRW-5'!Z48","v":0},null,{"$f":"'LSRW-5'!AG48","v":0}]
[{"$nulls":9},{"$f":"'LSRW-5'!L49","v":0},null,{"$f":"'LSRW-5'!S49","v":0},null,{"$f":"'LSRW-5'!Z49","v":0},null,{"$f":"'LSRW-5'!AG49","v":0}]
[{"$nulls":9},{"$f":"'LSRW-5'!L50","v":0},null,{"$f":"'LSRW-5'!S50","v":0},null,{"$f":"'LSRW-5'!Z50","v":0},null,{"$f":"'LSRW-5'!AG50","v":0}]
[{"$nulls":9},{"$f":"'LSRW-5'!L51","v":0},null,{"$f":"'LSRW-5'!S51","v":0},null,{"$f":"'LSRW-5'!Z51","v":0},null,{"$f":"'LSRW-5'!AG51","v":0}]
[{"$nulls":9},{"$f":"'LSRW-5'!L52","v":0},null,{"$f":"'LSRW-5'!S52","v":0},null,{"$f":"'LSRW-5'!Z52","v":0},null,{"$f":"'LSRW-5'!AG52","v":0}]
[{"$nulls":9},{"$f":"'LSRW-5'!L53","v":0},null,{"$f":"'LSRW-5'!S53","v":0},null,{"$f":"'LSRW-5'!Z53","v":0},null,{"$f":"'LSRW-5'!AG53","v":0}]
[{"$nulls":9},{"$f":"'LSRW-5'!L54","v":0},null,{"$f":"'LSRW-5'!S54","v":0},null,{"$f":"'LSRW-5'!Z54","v":0},null,{"$f":"'LSRW-5'!AG54","v":0}]
[{"$nulls":9},{"$f":"'LSRW-5'!L55","v":0},null,{"$f":"'LSRW-5'!S55","v":0},null,{"$f":"'LSRW-5'!Z55","v":0},null,{"$f":"'LSRW-5'!AG55","v":0}]
[{"$nulls":9},{"$f":"'LSRW-5'!L56","v":0},null,{"$f":"'LSRW-5'!S56","v":0},null,{"$f":"'LSRW-5'!Z56","v":0},null,{"$f":"'LSRW-5'!AG56","v":0}]
[{"$nulls":9},{"$f":"'LSRW-5'!L57","v":0},null,{"$f":"'LSRW-5'!S57","v":0},null,{"$f":"'LSRW-5'!Z57","v":0},null,{"$f":"'LSRW-5'!AG57","v":0}]
[{"$nulls":9},{"$f":"'LSRW-5'!L58","v":0},null,{"$f":"'LSRW-5'!S58","v":0},null,{"$f":"'LSRW-5'!Z58","v":0},null,{"$f":"'LSRW-5'!AG58","v":0}]
[{"$nulls":9},{"$f":"'LSRW-5'!L59","v":0},null,{"$f":"'LSRW-5'!S59","v":0},null,{"$f":"'LSRW-5'!Z59","v":0},null,{"$f":"'LSRW-5'!AG59","v":0}]
[{"$nulls":9},{"$f":"'LSRW-5'!L60","v":0},null,{"$f":"'LSRW-5'!S60","v":0},null,{"$f":"'LSRW-5'!Z60","v":0},null,{"$f":"'LSRW-5'!AG60","v":0}]
[{"$nulls":9},{"$f":"'LSRW-5'!L61","v":0},null,{"$f":"'LSRW-5'!S61","v":0},null,{"$f":"'LSRW-5'!Z61","v":0},null,{"$f":"'LSRW-5'!AG61","v":0}]
[{"$nulls":9},{"$f":"'LSRW-5'!L62","v":0},null,{"$f":"'LSRW-5'!S62","v":0},null,{"$f":"'LSRW-5'!Z62","v":0},null,{"$f":"'LSRW-5'!AG62","v":0}]
[{"$nulls":9},{"$f":"'LSRW-5'!L63","v":0},null,{"$f":"'LSRW-5'!S63","v":0},null,{"$f":"'LSRW-5'!Z63","v":0},null,{"$f":"'LSRW-5'!AG63","v":0}]
[{"$nulls":9},{"$f":"'LSRW-5'!L64","v":0},null,{"$f":"'LSRW-5'!S64","v":0},null,{"$f":"'LSRW-5'!Z64","v":0},null,{"$f":"'LSRW-5'!AG64","v":0}]
[{"$nulls":9},{"$f":"'LSRW-5'!L65","v":0},null,{"$f":"'LSRW-5'!S65","v":0},null,{"$f":"'LSRW-5'!Z65","v":0},null,{"$f":"'LSRW-5'!AG65","v":0}]
[{"$nulls":9},{"$f":"'LSRW-5'!L66","v":0},null,{"$f":"'LSRW-5'!S66","v":0},null,{"$f":"'LSRW-5'!Z66","v":0},null,{"$f":"'LSRW-5'!AG66","v":0}]
[{"$nulls":9},{"$f":"'LSRW-5'!L67","v":0},null,{"$f":"'LSRW-5'!S67","v":0},null,{"$f":"'LSRW-5'!Z67","v":0},null,{"$f":"'LSRW-5'!AG67","v":0}]
[{"$nulls":9},{"$f":"'LSRW-5'!L68","v":0},null,{"$f":"'LSRW-5'!S68","v":0},null,{"$f":"'LSRW-5'!Z68","v":0},null,{"$f":"'LSRW-5'!AG68","v":0}]
[{"$nulls":9},{"$f":"'LSRW-5'!L69","v":0},null,{"$f":"'LSRW-5'!S69","v":0},null,{"$f":"'LSRW-5'!Z69","v":0},null,{"$f":"'LSRW-5'!AG69","v":0}]

{"sheet":"PRF-4","index":3,"n_rows":67,"n_cols":16,"rows_kept":67,"merged":[[0,0,1,15],[2,0,2,15],[3,0,3,15],[4,0,4,2],[4,4,4,5],[4,6,4,7],[4,8,4,10],[4,11,4,13],[5,0,6,0],[5,1,6,1],[5,2,6,2],[5,3,6,3],[5,4,6,4],[5,5,6,5],[5,6,6,6],[5,7,6,7],[5,8,5,9],[5,10,5,11],[5,12,5,13],[5,14,5,15]]}
[{"$f":"REPORTS!D7","v":0},{"$nulls":4},{"$f":"REPORTS!$D$7","v":0}]
[]
["lrr ,oa O;kid ewY;kadu dk;ZØe 2018&19"]
["fo|ky; esa cPpksa ds 'kSf{kd Lrj dh fLFkfr"]
["CLASS-",null,null,"4TH","SUBJECT-",null,{"$f":"REPORTS!C8","v":0},null,"SUBJECT TEACHER-",null,null,{"$f":"REPORTS!K8","v":0}]
["Ø0la0","d{kk","jksy uEcj","uke fo|kFkhZ","firk dk uke","ekrk dk uke","izos“kkad","tUe fnukad","vk/kkj js[kk ewY;kadu ",null,"SA-1",null,"SA-2",null,"SA-3"]
[{"$nulls":8},"d{kk Lrj","izkIr xzsM","d{kk Lrj","izkIr xzsM","d{kk Lrj","izkIr xzsM","d{kk Lrj","izkIr xzsM"]
[{"$nulls":9},{"$f":"'LSRW-4'!L10","v":0},null,{"$f":"'LSRW-4'!S10","v":0},null,{"$f":"'LSRW-4'!Z10","v":0},null,{"$f":"'LSRW-4'!AG10","v":0}]
[{"$nulls":9},{"$f":"'LSRW-4'!L11","v":0},null,{"$f":"'LSRW-4'!S11","v":0},null,{"$f":"'LSRW-4'!Z11","v":0},null,{"$f":"'LSRW-4'!AG11","v":0}]
[{"$nulls":9},{"$f":"'LSRW-4'!L12","v":0},null,{"$f":"'LSRW-4'!S12","v":0},null,{"$f":"'LSRW-4'!Z12","v":0},null,{"$f":"'LSRW-4'!AG12","v":0}]
[{"$nulls":9},{"$f":"'LSRW-4'!L13","v":0},null,{"$f":"'LSRW-4'!S13","v":0},null,{"$f":"'LSRW-4'!Z13","v":0},null,{"$f":"'LSRW-4'!AG13","v":0}]
[{"$nulls":9},{"$f":"'LSRW-4'!L14","v":0},null,{"$f":"'LSRW-4'!S14","v":0},null,{"$f":"'LSRW-4'!Z14","v":0},null,{"$f":"'LSRW-4'!AG14","v":0}]
[{"$nulls":9},{"$f":"'LSRW-4'!L15","v":0},null,{"$f":"'LSRW-4'!S15","v":0},null,{"$f":"'LSRW-4'!Z15","v":0},null,{"$f":"'LSRW-4'!AG15","v":0}]
[{"$nulls":9},{"$f":"'LSRW-4'!L16","v":0},null,{"$f":"'LSRW-4'!S16","v":0},null,{"$f":"'LSRW-4'!Z16","v":0},null,{"$f":"'LSRW-4'!AG16","v":0}]
[{"$nulls":9},{"$f":"'LSRW-4'!L17","v":0},null,{"$f":"'LSRW-4'!S17","v":0},null,{"$f":"'LSRW-4'!Z17","v":0},null,{"$f":"'LSRW-4'!AG17","v":0}]
[{"$nulls":9},{"$f":"'LSRW-4'!L18","v":0},null,{"$f":"'LSRW-4'!S18","v":0},null,{"$f":"'LSRW-4'!Z18","v":0},null,{"$f":"'LSRW-4'!AG18","v":0}]
[{"$nulls":9},{"$f":"'LSRW-4'!L19","v":0},null,{"$f":"'LSRW-4'!S19","v":0},null,{"$f":"'LSRW-4'!Z19","v":0},null,{"$f":"'LSRW-4'!AG19","v":0}]
[{"$nulls":9},{"$f":"'LSRW-4'!L20","v":0},null,{"$f":"'LSRW-4'!S20","v":0},null,{"$f":"'LSRW-4'!Z20","v":0},null,{"$f":"'LSRW-4'!AG20","v":0}]
[{"$nulls":9},{"$f":"'LSRW-4'!L21","v":0},null,{"$f":"'LSRW-4'!S21","v":0},null,{"$f":"'LSRW-4'!Z21","v":0},null,{"$f":"'LSRW-4'!AG21","v":0}]
[{"$nulls":9},{"$f":"'LSRW-4'!L22","v":0},null,{"$f":"'LSRW-4'!S22","v":0},null,{"$f":"'LSRW-4'!Z22","v":0},null,{"$f":"'LSRW-4'!AG22","v":0}]
[{"$nulls":9},{"$f":"'LSRW-4'!L23","v":0},null,{"$f":"'LSRW-4'!S23","v":0},null,{"$f":"'LSRW-4'!Z23","v":0},null,{"$f":"'LSRW-4'!AG23","v":0}]
[{"$nulls":9},{"$f":"'LSRW-4'!L24","v":0},null,{"$f":"'LSRW-4'!S24","v":0},null,{"$f":"'LSRW-4'!Z24","v":0},null,{"$f":"'LSRW-4'!AG24","v":0}]
[{"$nulls":9},{"$f":"'LSRW-4'!L25","v":0},null,{"$f":"'LSRW-4'!S25","v":0},null,{"$f":"'LSRW-4'!Z25","v":0},null,{"$f":"'LSRW-4'!AG25","v":0}]
[{"$nulls":9},{"$f":"'LSRW-4'!L26","v":0},null,{"$f":"'LSRW-4'!S26","v":0},null,{"$f":"'LSRW-4'!Z26","v":0},null,{"$f":"'LSRW-4'!AG26","v":0}]
[{"$nulls":9},{"$f":"'LSRW-4'!L27","v":0},null,{"$f":"'LSRW-4'!S27","v":0},null,{"$f":"'LSRW-4'!Z27","v":0},null,{"$f":"'LSRW-4'!AG27","v":0}]
[{"$nulls":9},{"$f":"'LSRW-4'!L28","v":0},null,{"$f":"'LSRW-4'!S28","v":0},null,{"$f":"'LSRW-4'!Z28","v":0},null,{"$f":"'LSRW-4'!AG28","v":0}]
[{"$nulls":9},{"$f":"'LSRW-4'!L29","v":0},null,{"$f":"'LSRW-4'!S29","v":0},null,{"$f":"'LSRW-4'!Z29","v":0},null,{"$f":"'LSRW-4'!AG29","v":0}]
[{"$nulls":9},{"$f":"'LSRW-4'!L30","v":0},null,{"$f":"'LSRW-4'!S30","v":0},null,{"$f":"'LSRW-4'!Z30","v":0},null,{"$f":"'LSRW-4'!AG30","v":0}]
[{"$nulls":9},{"$f":"'LSRW-4'!L31","v":0},null,{"$f":"'LSRW-4'!S31","v":0},null,{"$f":"'LSRW-4'!Z31","v":0},null,{"$f":"'LSRW-4'!AG31","v":0}]
[{"$nulls":9},{"$f":"'LSRW-4'!L32","v":0},null,{"$f":"'LSRW-4'!S32","v":0},null,{"$f":"'LSRW-4'!Z32","v":0},null,{"$f":"'LSRW-4'!AG32","v":0}]
[{"$nulls":9},{"$f":"'LSRW-4'!L33","v":0},null,{"$f":"'LSRW-4'!S33","v":0},null,{"$f":"'LSRW-4'!Z33","v":0},null,{"$f":"'LSRW-4'!AG33","v":0}]
[{"$nulls":9},{"$f":"'LSRW-4'!L34","v":0},null,{"$f":"'LSRW-4'!S34","v":0},null,{"$f":"'LSRW-4'!Z34","v":0},null,{"$f":"'LSRW-4'!AG34","v":0}]
[{"$nulls":9},{"$f":"'LSRW-4'!L35","v":0},null,{"$f":"'LSRW-4'!S35","v":0},null,{"$f":"'LSRW-4'!Z35","v":0},null,{"$f":"'LSRW-4'!AG35","v":0}]
[{"$nulls":9},{"$f":"'LSRW-4'!L36","v":0},null,{"$f":"'LSRW-4'!S36","v":0},null,{"$f":"'LSRW-4'!Z36","v":0},null,{"$f":"'LSRW-4'!AG36","v":0}]
[{"$nulls":9},{"$f":"'LSRW-4'!L37","v":0},null,{"$f":"'LSRW-4'!S37","v":0},null,{"$f":"'LSRW-4'!Z37","v":0},null,{"$f":"'LSRW-4'!AG37","v":0}]
[{"$nulls":9},{"$f":"'LSRW-4'!L38","v":0},null,{"$f":"'LSRW-4'!S38","v":0},null,{"$f":"'LSRW-4'!Z38","v":0},null,{"$f":"'LSRW-4'!AG38","v":0}]
[{"$nulls":9},{"$f":"'LSRW-4'!L39","v":0},null,{"$f":"'LSRW-4'!S39","v":0},null,{"$f":"'LSRW-4'!Z39","v":0},null,{"$f":"'LSRW-4'!AG39","v":0}]
[{"$nulls":9},{"$f":"'LSRW-4'!L40","v":0},null,{"$f":"'LSRW-4'!S40","v":0},null,{"$f":"'LSRW-4'!Z40","v":0},null,{"$f":"'LSRW-4'!AG40","v":0}]
[{"$nulls":9},{"$f":"'LSRW-4'!L41","v":0},null,{"$f":"'LSRW-4'!S41","v":0},null,{"$f":"'LSRW-4'!Z41","v":0},null,{"$f":"'LSRW-4'!AG41","v":0}]
[{"$nulls":9},{"$f":"'LSRW-4'!L42","v":0},null,{"$f":"'LSRW-4'!S42","v":0},null,{"$f":"'LSRW-4'!Z42","v":0},null,{"$f":"'LSRW-4'!AG42","v":0}]
[{"$nulls":9},{"$f":"'LSRW-4'!L43","v":0},null,{"$f":"'LSRW-4'!S43","v":0},null,{"$f":"'LSRW-4'!Z43","v":0},null,{"$f":"'LSRW-4'!AG43","v":0}]
[{"$nulls":9},{"$f":"'LSRW-4'!L44","v":0},null,{"$f":"'LSRW-4'!S44","v":0},null,{"$f":"'LSRW-4'!Z44","v":0},null,{"$f":"'LSRW-4'!AG44","v":0}]
[{"$nulls":9},{"$f":"'LSRW-4'!L45","v":0},null,{"$f":"'LSRW-4'!S45","v":0},null,{"$f":"'LSRW-4'!Z45","v":0},null,{"$f":"'LSRW-4'!AG45","v":0}]
[{"$nulls":9},{"$f":"'LSRW-4'!L46","v":0},null,{"$f":"'LSRW-4'!S46","v":0},null,{"$f":"'LSRW-4'!Z46","v":0},null,{"$f":"'LSRW-4'!AG46","v":0}]
[{"$nulls":9},{"$f":"'LSRW-4'!L47","v":0},null,{"$f":"'LSRW-4'!S47","v":0},null,{"$f":"'LSRW-4'!Z47","v":0},null,{"$f":"'LSRW-4'!AG47","v":0}]
[{"$nulls":9},{"$f":"'LSRW-4'!L48","v":0},null,{"$f":"'LSRW-4'!S48","v":0},null,{"$f":"'LSRW-4'!Z48","v":0},null,{"$f":"'LSRW-4'!AG48","v":0}]
[{"$nulls":9},{"$f":"'LSRW-4'!L49","v":0},null,{"$f":"'LSRW-4'!S49","v":0},null,{"$f":"'LSRW-4'!Z49","v":0},null,{"$f":"'LSRW-4'!AG49","v":0}]
[{"$nulls":9},{"$f":"'LSRW-4'!L50","v":0},null,{"$f":"'LSRW-4'!S50","v":0},null,{"$f":"'LSRW-4'!Z50","v":0},null,{"$f":"'LSRW-4'!AG50","v":0}]
[{"$nulls":9},{"$f":"'LSRW-4'!L51","v":0},null,{"$f":"'LSRW-4'!S51","v":0},null,{"$f":"'LSRW-4'!Z51","v":0},null,{"$f":"'LSRW-4'!AG51","v":0}]
[{"$nulls":9},{"$f":"'LSRW-4'!L52","v":0},null,{"$f":"'LSRW-4'!S52","v":0},null,{"$f":"'LSRW-4'!Z52","v":0},null,{"$f":"'LSRW-4'!AG52","v":0}]
[{"$nulls":9},{"$f":"'LSRW-4'!L53","v":0},null,{"$f":"'LSRW-4'!S53","v":0},null,{"$f":"'LSRW-4'!Z53","v":0},null,{"$f":"'LSRW-4'!AG53","v":0}]
[{"$nulls":9},{"$f":"'LSRW-4'!L54","v":0},null,{"$f":"'LSRW-4'!S54","v":0},null,{"$f":"'LSRW-4'!Z54","v":0},null,{"$f":"'LSRW-4'!AG54","v":0}]
[{"$nulls":9},{"$f":"'LSRW-4'!L55","v":0},null,{"$f":"'LSRW-4'!S55","v":0},null,{"$f":"'LSRW-4'!Z55","v":0},null,{"$f":"'LSRW-4'!AG55","v":0}]
[{"$nulls":9},{"$f":"'LSRW-4'!L56","v":0},null,{"$f":"'LSRW-4'!S56","v":0},null,{"$f":"'LSRW-4'!Z56","v":0},null,{"$f":"'LSRW-4'!AG56","v":0}]
[{"$nulls":9},{"$f":"'LSRW-4'!L57","v":0},null,{"$f":"'LSRW-4'!S57","v":0},null,{"$f":"'LSRW-4'!Z57","v":0},null,{"$f":"'LSRW-4'!AG57","v":0}]
[{"$nulls":9},{"$f":"'LSRW-4'!L58","v":0},null,{"$f":"'LSRW-4'!S58","v":0},null,{"$f":"'LSRW-4'!Z58","v":0},null,{"$f":"'LSRW-4'!AG58","v":0}]
[{"$nulls":9},{"$f":"'LSRW-4'!L59","v":0},null,{"$f":"'LSRW-4'!S59","v":0},null,{"$f":"'LSRW-4'!Z59","v":0},null,{"$f":"'LSRW-4'!AG59","v":0}]
[{"$nulls":9},{"$f":"'LSRW-4'!L60","v":0},null,{"$f":"'LSRW-4'!S60","v":0},null,{"$f":"'LSRW-4'!Z60","v":0},null,{"$f":"'LSRW-4'!AG60","v":0}]
[{"$nulls":9},{"$f":"'LSRW-4'!L61","v":0},null,{"$f":"'LSRW-4'!S61","v":0},null,{"$f":"'LSRW-4'!Z61","v":0},null,{"$f":"'LSRW-4'!AG61","v":0}]
[{"$nulls":9},{"$f":"'LSRW-4'!L62","v":0},null,{"$f":"'LSRW-4'!S62","v":0},null,{"$f":"'LSRW-4'!Z62","v":0},null,{"$f":"'LSRW-4'!AG62","v":0}]
[{"$nulls":9},{"$f":"'LSRW-4'!L63","v":0},null,{"$f":"'LSRW-4'!S63","v":0},null,{"$f":"'LSRW-4'!Z63","v":0},null,{"$f":"'LSRW-4'!AG63","v":0}]
[{"$nulls":9},{"$f":"'LSRW-4'!L64","v":0},null,{"$f":"'LSRW-4'!S64","v":0},null,{"$f":"'LSRW-4'!Z64","v":0},null,{"$f":"'LSRW-4'!AG64","v":0}]
[{"$nulls":9},{"$f":"'LSRW-4'!L65","v":0},null,{"$f":"'LSRW-4'!S65","v":0},null,{"$f":"'LSRW-4'!Z65","v":0},null,{"$f":"'LSRW-4'!AG65","v":0}]
[{"$nulls":9},{"$f":"'LSRW-4'!L66","v":0},null,{"$f":"'LSRW-4'!S66","v":0},null,{"$f":"'LSRW-4'!Z66","v":0},null,{"$f":"'LSRW-4'!AG66","v":0}]
[{"$nulls":9},{"$f":"'LSRW-4'!L67","v":0},null,{"$f":"'LSRW-4'!S67","v":0},null,{"$f":"'LSRW-4'!Z67","v":0},null,{"$f":"'LSRW-4'!AG67","v":0}]
[{"$nulls":9},{"$f":"'LSRW-4'!L68","v":0},null,{"$f":"'LSRW-4'!S68","v":0},null,{"$f":"'LSRW-4'!Z68","v":0},null,{"$f":"'LSRW-4'!AG68","v":0}]
[{"$nulls":9},{"$f":"'LSRW-4'!L69","v":0},null,{"$f":"'LSRW-4'!S69","v":0},null,{"$f":"'LSRW-4'!Z69","v":0},null,{"$f":"'LSRW-4'!AG69","v":0}]

{"sheet":"PRF-3","index":4,"n_rows":67,"n_cols":16,"rows_kept":67,"merged":[[0,0,1,15],[2,0,2,15],[3,0,3,15],[4,0,4,2],[4,4,4,5],[4,6,4,7],[4,8,4,10],[4,11,4,13],[5,0,6,0],[5,1,6,1],[5,2,6,2],[5,3,6,3],[5,4,6,4],[5,5,6,5],[5,6,6,6],[5,7,6,7],[5,8,5,9],[5,10,5,11],[5,12,5,13],[5,14,5,15]]}
[{"$f":"REPORTS!$D$7","v":0}]
[]
["lrr ,oa O;kid ewY;kadu dk;ZØe 2018&19"]
["fo|ky; esa cPpksa ds 'kSf{kd Lrj dh fLFkfr"]
["CLASS-",null,null,"3RD","SUBJECT-",null,{"$f":"REPORTS!C8","v":0},null,"SUBJECT TEACHER-",null,null,{"$f":"REPORTS!K8","v":0}]
["Ø0la0","d{kk","jksy uEcj","uke fo|kFkhZ","firk dk uke","ekrk dk uke","izos“kkad","tUe fnukad","vk/kkj js[kk ewY;kadu ",null,"SA-1",null,"SA-2",null,"SA-3"]
[{"$nulls":8},"d{kk Lrj","izkIr xzsM","d{kk Lrj","izkIr xzsM","d{kk Lrj","izkIr xzsM","d{kk Lrj","izkIr xzsM"]
[{"$nulls":9},{"$f":"'LSRW-3'!L10","v":0},null,{"$f":"'LSRW-3'!S10","v":0},null,{"$f":"'LSRW-3'!Z10","v":0},null,{"$f":"'LSRW-3'!AG10","v":0}]
[{"$nulls":9},{"$f":"'LSRW-3'!L11","v":0},null,{"$f":"'LSRW-3'!S11","v":0},null,{"$f":"'LSRW-3'!Z11","v":0},null,{"$f":"'LSRW-3'!AG11","v":0}]
[{"$nulls":9},{"$f":"'LSRW-3'!L12","v":0},null,{"$f":"'LSRW-3'!S12","v":0},null,{"$f":"'LSRW-3'!Z12","v":0},null,{"$f":"'LSRW-3'!AG12","v":0}]
[{"$nulls":9},{"$f":"'LSRW-3'!L13","v":0},null,{"$f":"'LSRW-3'!S13","v":0},null,{"$f":"'LSRW-3'!Z13","v":0},null,{"$f":"'LSRW-3'!AG13","v":0}]
[{"$nulls":9},{"$f":"'LSRW-3'!L14","v":0},null,{"$f":"'LSRW-3'!S14","v":0},null,{"$f":"'LSRW-3'!Z14","v":0},null,{"$f":"'LSRW-3'!AG14","v":0}]
[{"$nulls":9},{"$f":"'LSRW-3'!L15","v":0},null,{"$f":"'LSRW-3'!S15","v":0},null,{"$f":"'LSRW-3'!Z15","v":0},null,{"$f":"'LSRW-3'!AG15","v":0}]
[{"$nulls":9},{"$f":"'LSRW-3'!L16","v":0},null,{"$f":"'LSRW-3'!S16","v":0},null,{"$f":"'LSRW-3'!Z16","v":0},null,{"$f":"'LSRW-3'!AG16","v":0}]
[{"$nulls":9},{"$f":"'LSRW-3'!L17","v":0},null,{"$f":"'LSRW-3'!S17","v":0},null,{"$f":"'LSRW-3'!Z17","v":0},null,{"$f":"'LSRW-3'!AG17","v":0}]
[{"$nulls":9},{"$f":"'LSRW-3'!L18","v":0},null,{"$f":"'LSRW-3'!S18","v":0},null,{"$f":"'LSRW-3'!Z18","v":0},null,{"$f":"'LSRW-3'!AG18","v":0}]
[{"$nulls":9},{"$f":"'LSRW-3'!L19","v":0},null,{"$f":"'LSRW-3'!S19","v":0},null,{"$f":"'LSRW-3'!Z19","v":0},null,{"$f":"'LSRW-3'!AG19","v":0}]
[{"$nulls":9},{"$f":"'LSRW-3'!L20","v":0},null,{"$f":"'LSRW-3'!S20","v":0},null,{"$f":"'LSRW-3'!Z20","v":0},null,{"$f":"'LSRW-3'!AG20","v":0}]
[{"$nulls":9},{"$f":"'LSRW-3'!L21","v":0},null,{"$f":"'LSRW-3'!S21","v":0},null,{"$f":"'LSRW-3'!Z21","v":0},null,{"$f":"'LSRW-3'!AG21","v":0}]
[{"$nulls":9},{"$f":"'LSRW-3'!L22","v":0},null,{"$f":"'LSRW-3'!S22","v":0},null,{"$f":"'LSRW-3'!Z22","v":0},null,{"$f":"'LSRW-3'!AG22","v":0}]
[{"$nulls":9},{"$f":"'LSRW-3'!L23","v":0},null,{"$f":"'LSRW-3'!S23","v":0},null,{"$f":"'LSRW-3'!Z23","v":0},null,{"$f":"'LSRW-3'!AG23","v":0}]
[{"$nulls":9},{"$f":"'LSRW-3'!L24","v":0},null,{"$f":"'LSRW-3'!S24","v":0},null,{"$f":"'LSRW-3'!Z24","v":0},null,{"$f":"'LSRW-3'!AG24","v":0}]
[{"$nulls":9},{"$f":"'LSRW-3'!L25","v":0},null,{"$f":"'LSRW-3'!S25","v":0},null,{"$f":"'LSRW-3'!Z25","v":0},null,{"$f":"'LSRW-3'!AG25","v":0}]
[{"$nulls":9},{"$f":"'LSRW-3'!L26","v":0},null,{"$f":"'LSRW-3'!S26","v":0},null,{"$f":"'LSRW-3'!Z26","v":0},null,{"$f":"'LSRW-3'!AG26","v":0}]
[{"$nulls":9},{"$f":"'LSRW-3'!L27","v":0},null,{"$f":"'LSRW-3'!S27","v":0},null,{"$f":"'LSRW-3'!Z27","v":0},null,{"$f":"'LSRW-3'!AG27","v":0}]
[{"$nulls":9},{"$f":"'LSRW-3'!L28","v":0},null,{"$f":"'LSRW-3'!S28","v":0},null,{"$f":"'LSRW-3'!Z28","v":0},null,{"$f":"'LSRW-3'!AG28","v":0}]
[{"$nulls":9},{"$f":"'LSRW-3'!L29","v":0},null,{"$f":"'LSRW-3'!S29","v":0},null,{"$f":"'LSRW-3'!Z29","v":0},null,{"$f":"'LSRW-3'!AG29","v":0}]
[{"$nulls":9},{"$f":"'LSRW-3'!L30","v":0},null,{"$f":"'LSRW-3'!S30","v":0},null,{"$f":"'LSRW-3'!Z30","v":0},null,{"$f":"'LSRW-3'!AG30","v":0}]
[{"$nulls":9},{"$f":"'LSRW-3'!L31","v":0},null,{"$f":"'LSRW-3'!S31","v":0},null,{"$f":"'LSRW-3'!Z31","v":0},null,{"$f":"'LSRW-3'!AG31","v":0}]
[{"$nulls":9},{"$f":"'LSRW-3'!L32","v":0},null,{"$f":"'LSRW-3'!S32","v":0},null,{"$f":"'LSRW-3'!Z32","v":0},null,{"$f":"'LSRW-3'!AG32","v":0}]
[{"$nulls":9},{"$f":"'LSRW-3'!L33","v":0},null,{"$f":"'LSRW-3'!S33","v":0},null,{"$f":"'LSRW-3'!Z33","v":0},null,{"$f":"'LSRW-3'!AG33","v":0}]
[{"$nulls":9},{"$f":"'LSRW-3'!L34","v":0},null,{"$f":"'LSRW-3'!S34","v":0},null,{"$f":"'LSRW-3'!Z34","v":0},null,{"$f":"'LSRW-3'!AG34","v":0}]
[{"$nulls":9},{"$f":"'LSRW-3'!L35","v":0},null,{"$f":"'LSRW-3'!S35","v":0},null,{"$f":"'LSRW-3'!Z35","v":0},null,{"$f":"'LSRW-3'!AG35","v":0}]
[{"$nulls":9},{"$f":"'LSRW-3'!L36","v":0},null,{"$f":"'LSRW-3'!S36","v":0},null,{"$f":"'LSRW-3'!Z36","v":0},null,{"$f":"'LSRW-3'!AG36","v":0}]
[{"$nulls":9},{"$f":"'LSRW-3'!L37","v":0},null,{"$f":"'LSRW-3'!S37","v":0},null,{"$f":"'LSRW-3'!Z37","v":0},null,{"$f":"'LSRW-3'!AG37","v":0}]
[{"$nulls":9},{"$f":"'LSRW-3'!L38","v":0},null,{"$f":"'LSRW-3'!S38","v":0},null,{"$f":"'LSRW-3'!Z38","v":0},null,{"$f":"'LSRW-3'!AG38","v":0}]
[{"$nulls":9},{"$f":"'LSRW-3'!L39","v":0},null,{"$f":"'LSRW-3'!S39","v":0},null,{"$f":"'LSRW-3'!Z39","v":0},null,{"$f":"'LSRW-3'!AG39","v":0}]
[{"$nulls":9},{"$f":"'LSRW-3'!L40","v":0},null,{"$f":"'LSRW-3'!S40","v":0},null,{"$f":"'LSRW-3'!Z40","v":0},null,{"$f":"'LSRW-3'!AG40","v":0}]
[{"$nulls":9},{"$f":"'LSRW-3'!L41","v":0},null,{"$f":"'LSRW-3'!S41","v":0},null,{"$f":"'LSRW-3'!Z41","v":0},null,{"$f":"'LSRW-3'!AG41","v":0}]
[{"$nulls":9},{"$f":"'LSRW-3'!L42","v":0},null,{"$f":"'LSRW-3'!S42","v":0},null,{"$f":"'LSRW-3'!Z42","v":0},null,{"$f":"'LSRW-3'!AG42","v":0}]
[{"$nulls":9},{"$f":"'LSRW-3'!L43","v":0},null,{"$f":"'LSRW-3'!S43","v":0},null,{"$f":"'LSRW-3'!Z43","v":0},null,{"$f":"'LSRW-3'!AG43","v":0}]
[{"$nulls":9},{"$f":"'LSRW-3'!L44","v":0},null,{"$f":"'LSRW-3'!S44","v":0},null,{"$f":"'LSRW-3'!Z44","v":0},null,{"$f":"'LSRW-3'!AG44","v":0}]
[{"$nulls":9},{"$f":"'LSRW-3'!L45","v":0},null,{"$f":"'LSRW-3'!S45","v":0},null,{"$f":"'LSRW-3'!Z45","v":0},null,{"$f":"'LSRW-3'!AG45","v":0}]
[{"$nulls":9},{"$f":"'LSRW-3'!L46","v":0},null,{"$f":"'LSRW-3'!S46","v":0},null,{"$f":"'LSRW-3'!Z46","v":0},null,{"$f":"'LSRW-3'!AG46","v":0}]
[{"$nulls":9},{"$f":"'LSRW-3'!L47","v":0},null,{"$f":"'LSRW-3'!S47","v":0},null,{"$f":"'LSRW-3'!Z47","v":0},null,{"$f":"'LSRW-3'!AG47","v":0}]
[{"$nulls":9},{"$f":"'LSRW-3'!L48","v":0},null,{"$f":"'LSRW-3'!S48","v":0},null,{"$f":"'LSRW-3'!Z48","v":0},null,{"$f":"'LSRW-3'!AG48","v":0}]
[{"$nulls":9},{"$f":"'LSRW-3'!L49","v":0},null,{"$f":"'LSRW-3'!S49","v":0},null,{"$f":"'LSRW-3'!Z49","v":0},null,{"$f":"'LSRW-3'!AG49","v":0}]
[{"$nulls":9},{"$f":"'LSRW-3'!L50","v":0},null,{"$f":"'LSRW-3'!S50","v":0},null,{"$f":"'LSRW-3'!Z50","v":0},null,{"$f":"'LSRW-3'!AG50","v":0}]
[{"$nulls":9},{"$f":"'LSRW-3'!L51","v":0},null,{"$f":"'LSRW-3'!S51","v":0},null,{"$f":"'LSRW-3'!Z51","v":0},null,{"$f":"'LSRW-3'!AG51","v":0}]
[{"$nulls":9},{"$f":"'LSRW-3'!L52","v":0},null,{"$f":"'LSRW-3'!S52","v":0},null,{"$f":"'LSRW-3'!Z52","v":0},null,{"$f":"'LSRW-3'!AG52","v":0}]
[{"$nulls":9},{"$f":"'LSRW-3'!L53","v":0},null,{"$f":"'LSRW-3'!S53","v":0},null,{"$f":"'LSRW-3'!Z53","v":0},null,{"$f":"'LSRW-3'!AG53","v":0}]
[{"$nulls":9},{"$f":"'LSRW-3'!L54","v":0},null,{"$f":"'LSRW-3'!S54","v":0},null,{"$f":"'LSRW-3'!Z54","v":0},null,{"$f":"'LSRW-3'!AG54","v":0}]
[{"$nulls":9},{"$f":"'LSRW-3'!L55","v":0},null,{"$f":"'LSRW-3'!S55","v":0},null,{"$f":"'LSRW-3'!Z55","v":0},null,{"$f":"'LSRW-3'!AG55","v":0}]
[{"$nulls":9},{"$f":"'LSRW-3'!L56","v":0},null,{"$f":"'LSRW-3'!S56","v":0},null,{"$f":"'LSRW-3'!Z56","v":0},null,{"$f":"'LSRW-3'!AG56","v":0}]
[{"$nulls":9},{"$f":"'LSRW-3'!L57","v":0},null,{"$f":"'LSRW-3'!S57","v":0},null,{"$f":"'LSRW-3'!Z57","v":0},null,{"$f":"'LSRW-3'!AG57","v":0}]
[{"$nulls":9},{"$f":"'LSRW-3'!L58","v":0},null,{"$f":"'LSRW-3'!S58","v":0},null,{"$f":"'LSRW-3'!Z58","v":0},null,{"$f":"'LSRW-3'!AG58","v":0}]
[{"$nulls":9},{"$f":"'LSRW-3'!L59","v":0},null,{"$f":"'LSRW-3'!S59","v":0},null,{"$f":"'LSRW-3'!Z59","v":0},null,{"$f":"'LSRW-3'!AG59","v":0}]
[{"$nulls":9},{"$f":"'LSRW-3'!L60","v":0},null,{"$f":"'LSRW-3'!S60","v":0},null,{"$f":"'LSRW-3'!Z60","v":0},null,{"$f":"'LSRW-3'!AG60","v":0}]
[{"$nulls":9},{"$f":"'LSRW-3'!L61","v":0},null,{"$f":"'LSRW-3'!S61","v":0},null,{"$f":"'LSRW-3'!Z61","v":0},null,{"$f":"'LSRW-3'!AG61","v":0}]
[{"$nulls":9},{"$f":"'LSRW-3'!L62","v":0},null,{"$f":"'LSRW-3'!S62","v":0},null,{"$f":"'LSRW-3'!Z62","v":0},null,{"$f":"'LSRW-3'!AG62","v":0}]
[{"$nulls":9},{"$f":"'LSRW-3'!L63","v":0},null,{"$f":"'LSRW-3'!S63","v":0},null,{"$f":"'LSRW-3'!Z63","v":0},null,{"$f":"'LSRW-3'!AG63","v":0}]
[{"$nulls":9},{"$f":"'LSRW-3'!L64","v":0},null,{"$f":"'LSRW-3'!S64","v":0},null,{"$f":"'LSRW-3'!Z64","v":0},null,{"$f":"'LSRW-3'!AG64","v":0}]
[{"$nulls":9},{"$f":"'LSRW-3'!L65","v":0},null,{"$f":"'LSRW-3'!S65","v":0},null,{"$f":"'LSRW-3'!Z65","v":0},null,{"$f":"'LSRW-3'!AG65","v":0}]
[{"$nulls":9},{"$f":"'LSRW-3'!L66","v":0},null,{"$f":"'LSRW-3'!S66","v":0},null,{"$f":"'LSRW-3'!Z66","v":0},null,{"$f":"'LSRW-3'!AG66","v":0}]
[{"$nulls":9},{"$f":"'LSRW-3'!L67","v":0},null,{"$f":"'LSRW-3'!S67","v":0},null,{"$f":"'LSRW-3'!Z67","v":0},null,{"$f":"'LSRW-3'!AG67","v":0}]
[{"$nulls":9},{"$f":"'LSRW-3'!L68","v":0},null,{"$f":"'LSRW-3'!S68","v":0},null,{"$f":"'LSRW-3'!Z68","v":0},null,{"$f":"'LSRW-3'!AG68","v":0}]
[{"$nulls":9},{"$f":"'LSRW-3'!L69","v":0},null,{"$f":"'LSRW-3'!S69","v":0},null,{"$f":"'LSRW-3'!Z69","v":0},null,{"$f":"'LSRW-3'!AG69","v":0}]

{"sheet":"PRF-2","index":5,"n_rows":67,"n_cols":16,"rows_kept":67,"merged":[[0,0,1,15],[2,0,2,15],[3,0,3,15],[4,0,4,2],[4,4,4,5],[4,6,4,7],[4,8,4,10],[4,11,4,13],[5,0,6,0],[5,1,6,1],[5,2,6,2],[5,3,6,3],[5,4,6,4],[5,5,6,5],[5,6,6,6],[5,7,6,7],[5,8,5,9],[5,10,5,11],[5,12,5,13],[5,14,5,15]]}
[{"$f":"REPORTS!$D$7","v":0}]
[]
["lrr ,oa O;kid ewY;kadu dk;ZØe 2018&19"]
["fo|ky; esa cPpksa ds 'kSf{kd Lrj dh fLFkfr"]
["CLASS-",null,null,"2ND","SUBJECT-",null,{"$f":"REPORTS!C8","v":0},null,"SUBJECT TEACHER-",null,null,{"$f":"REPORTS!K8","v":0}]
["Ø0la0","d{kk","jksy uEcj","uke fo|kFkhZ","firk dk uke","ekrk dk uke","izos“kkad","tUe fnukad","vk/kkj js[kk ewY;kadu ",null,"SA-1",null,"SA-2",null,"SA-3"]
[{"$nulls":8},"d{kk Lrj","izkIr xzsM","d{kk Lrj","izkIr xzsM","d{kk Lrj","izkIr xzsM","d{kk Lrj","izkIr xzsM"]
[{"$nulls":9},{"$f":"'LSRW-2'!L10","v":0},null,{"$f":"'LSRW-2'!S10","v":0},null,{"$f":"'LSRW-2'!Z10","v":0},null,{"$f":"'LSRW-2'!AG10","v":0}]
[{"$nulls":9},{"$f":"'LSRW-2'!L11","v":0},null,{"$f":"'LSRW-2'!S11","v":0},null,{"$f":"'LSRW-2'!Z11","v":0},null,{"$f":"'LSRW-2'!AG11","v":0}]
[{"$nulls":9},{"$f":"'LSRW-2'!L12","v":0},null,{"$f":"'LSRW-2'!S12","v":0},null,{"$f":"'LSRW-2'!Z12","v":0},null,{"$f":"'LSRW-2'!AG12","v":0}]
[{"$nulls":9},{"$f":"'LSRW-2'!L13","v":0},null,{"$f":"'LSRW-2'!S13","v":0},null,{"$f":"'LSRW-2'!Z13","v":0},null,{"$f":"'LSRW-2'!AG13","v":0}]
[{"$nulls":9},{"$f":"'LSRW-2'!L14","v":0},null,{"$f":"'LSRW-2'!S14","v":0},null,{"$f":"'LSRW-2'!Z14","v":0},null,{"$f":"'LSRW-2'!AG14","v":0}]
[{"$nulls":9},{"$f":"'LSRW-2'!L15","v":0},null,{"$f":"'LSRW-2'!S15","v":0},null,{"$f":"'LSRW-2'!Z15","v":0},null,{"$f":"'LSRW-2'!AG15","v":0}]
[{"$nulls":9},{"$f":"'LSRW-2'!L16","v":0},null,{"$f":"'LSRW-2'!S16","v":0},null,{"$f":"'LSRW-2'!Z16","v":0},null,{"$f":"'LSRW-2'!AG16","v":0}]
[{"$nulls":9},{"$f":"'LSRW-2'!L17","v":0},null,{"$f":"'LSRW-2'!S17","v":0},null,{"$f":"'LSRW-2'!Z17","v":0},null,{"$f":"'LSRW-2'!AG17","v":0}]
[{"$nulls":9},{"$f":"'LSRW-2'!L18","v":0},null,{"$f":"'LSRW-2'!S18","v":0},null,{"$f":"'LSRW-2'!Z18","v":0},null,{"$f":"'LSRW-2'!AG18","v":0}]
[{"$nulls":9},{"$f":"'LSRW-2'!L19","v":0},null,{"$f":"'LSRW-2'!S19","v":0},null,{"$f":"'LSRW-2'!Z19","v":0},null,{"$f":"'LSRW-2'!AG19","v":0}]
[{"$nulls":9},{"$f":"'LSRW-2'!L20","v":0},null,{"$f":"'LSRW-2'!S20","v":0},null,{"$f":"'LSRW-2'!Z20","v":0},null,{"$f":"'LSRW-2'!AG20","v":0}]
[{"$nulls":9},{"$f":"'LSRW-2'!L21","v":0},null,{"$f":"'LSRW-2'!S21","v":0},null,{"$f":"'LSRW-2'!Z21","v":0},null,{"$f":"'LSRW-2'!AG21","v":0}]
[{"$nulls":9},{"$f":"'LSRW-2'!L22","v":0},null,{"$f":"'LSRW-2'!S22","v":0},null,{"$f":"'LSRW-2'!Z22","v":0},null,{"$f":"'LSRW-2'!AG22","v":0}]
[{"$nulls":9},{"$f":"'LSRW-2'!L23","v":0},null,{"$f":"'LSRW-2'!S23","v":0},null,{"$f":"'LSRW-2'!Z23","v":0},null,{"$f":"'LSRW-2'!AG23","v":0}]
[{"$nulls":9},{"$f":"'LSRW-2'!L24","v":0},null,{"$f":"'LSRW-2'!S24","v":0},null,{"$f":"'LSRW-2'!Z24","v":0},null,{"$f":"'LSRW-2'!AG24","v":0}]
[{"$nulls":9},{"$f":"'LSRW-2'!L25","v":0},null,{"$f":"'LSRW-2'!S25","v":0},null,{"$f":"'LSRW-2'!Z25","v":0},null,{"$f":"'LSRW-2'!AG25","v":0}]
[{"$nulls":9},{"$f":"'LSRW-2'!L26","v":0},null,{"$f":"'LSRW-2'!S26","v":0},null,{"$f":"'LSRW-2'!Z26","v":0},null,{"$f":"'LSRW-2'!AG26","v":0}]
[{"$nulls":9},{"$f":"'LSRW-2'!L27","v":0},null,{"$f":"'LSRW-2'!S27","v":0},null,{"$f":"'LSRW-2'!Z27","v":0},null,{"$f":"'LSRW-2'!AG27","v":0}]
[{"$nulls":9},{"$f":"'LSRW-2'!L28","v":0},null,{"$f":"'LSRW-2'!S28","v":0},null,{"$f":"'LSRW-2'!Z28","v":0},null,{"$f":"'LSRW-2'!AG28","v":0}]
[{"$nulls":9},{"$f":"'LSRW-2'!L29","v":0},null,{"$f":"'LSRW-2'!S29","v":0},null,{"$f":"'LSRW-2'!Z29","v":0},null,{"$f":"'LSRW-2'!AG29","v":0}]
[{"$nulls":9},{"$f":"'LSRW-2'!L30","v":0},null,{"$f":"'LSRW-2'!S30","v":0},null,{"$f":"'LSRW-2'!Z30","v":0},null,{"$f":"'LSRW-2'!AG30","v":0}]
[{"$nulls":9},{"$f":"'LSRW-2'!L31","v":0},null,{"$f":"'LSRW-2'!S31","v":0},null,{"$f":"'LSRW-2'!Z31","v":0},null,{"$f":"'LSRW-2'!AG31","v":0}]
[{"$nulls":9},{"$f":"'LSRW-2'!L32","v":0},null,{"$f":"'LSRW-2'!S32","v":0},null,{"$f":"'LSRW-2'!Z32","v":0},null,{"$f":"'LSRW-2'!AG32","v":0}]
[{"$nulls":9},{"$f":"'LSRW-2'!L33","v":0},null,{"$f":"'LSRW-2'!S33","v":0},null,{"$f":"'LSRW-2'!Z33","v":0},null,{"$f":"'LSRW-2'!AG33","v":0}]
[{"$nulls":9},{"$f":"'LSRW-2'!L34","v":0},null,{"$f":"'LSRW-2'!S34","v":0},null,{"$f":"'LSRW-2'!Z34","v":0},null,{"$f":"'LSRW-2'!AG34","v":0}]
[{"$nulls":9},{"$f":"'LSRW-2'!L35","v":0},null,{"$f":"'LSRW-2'!S35","v":0},null,{"$f":"'LSRW-2'!Z35","v":0},null,{"$f":"'LSRW-2'!AG35","v":0}]
[{"$nulls":9},{"$f":"'LSRW-2'!L36","v":0},null,{"$f":"'LSRW-2'!S36","v":0},null,{"$f":"'LSRW-2'!Z36","v":0},null,{"$f":"'LSRW-2'!AG36","v":0}]
[{"$nulls":9},{"$f":"'LSRW-2'!L37","v":0},null,{"$f":"'LSRW-2'!S37","v":0},null,{"$f":"'LSRW-2'!Z37","v":0},null,{"$f":"'LSRW-2'!AG37","v":0}]
[{"$nulls":9},{"$f":"'LSRW-2'!L38","v":0},null,{"$f":"'LSRW-2'!S38","v":0},null,{"$f":"'LSRW-2'!Z38","v":0},null,{"$f":"'LSRW-2'!AG38","v":0}]
[{"$nulls":9},{"$f":"'LSRW-2'!L39","v":0},null,{"$f":"'LSRW-2'!S39","v":0},null,{"$f":"'LSRW-2'!Z39","v":0},null,{"$f":"'LSRW-2'!AG39","v":0}]
[{"$nulls":9},{"$f":"'LSRW-2'!L40","v":0},null,{"$f":"'LSRW-2'!S40","v":0},null,{"$f":"'LSRW-2'!Z40","v":0},null,{"$f":"'LSRW-2'!AG40","v":0}]
[{"$nulls":9},{"$f":"'LSRW-2'!L41","v":0},null,{"$f":"'LSRW-2'!S41","v":0},null,{"$f":"'LSRW-2'!Z41","v":0},null,{"$f":"'LSRW-2'!AG41","v":0}]
[{"$nulls":9},{"$f":"'LSRW-2'!L42","v":0},null,{"$f":"'LSRW-2'!S42","v":0},null,{"$f":"'LSRW-2'!Z42","v":0},null,{"$f":"'LSRW-2'!AG42","v":0}]
[{"$nulls":9},{"$f":"'LSRW-2'!L43","v":0},null,{"$f":"'LSRW-2'!S43","v":0},null,{"$f":"'LSRW-2'!Z43","v":0},null,{"$f":"'LSRW-2'!AG43","v":0}]
[{"$nulls":9},{"$f":"'LSRW-2'!L44","v":0},null,{"$f":"'LSRW-2'!S44","v":0},null,{"$f":"'LSRW-2'!Z44","v":0},null,{"$f":"'LSRW-2'!AG44","v":0}]
[{"$nulls":9},{"$f":"'LSRW-2'!L45","v":0},null,{"$f":"'LSRW-2'!S45","v":0},null,{"$f":"'LSRW-2'!Z45","v":0},null,{"$f":"'LSRW-2'!AG45","v":0}]
[{"$nulls":9},{"$f":"'LSRW-2'!L46","v":0},null,{"$f":"'LSRW-2'!S46","v":0},null,{"$f":"'LSRW-2'!Z46","v":0},null,{"$f":"'LSRW-2'!AG46","v":0}]
[{"$nulls":9},{"$f":"'LSRW-2'!L47","v":0},null,{"$f":"'LSRW-2'!S47","v":0},null,{"$f":"'LSRW-2'!Z47","v":0},null,{"$f":"'LSRW-2'!AG47","v":0}]
[{"$nulls":9},{"$f":"'LSRW-2'!L48","v":0},null,{"$f":"'LSRW-2'!S48","v":0},null,{"$f":"'LSRW-2'!Z48","v":0},null,{"$f":"'LSRW-2'!AG48","v":0}]
[{"$nulls":9},{"$f":"'LSRW-2'!L49","v":0},null,{"$f":"'LSRW-2'!S49","v":0},null,{"$f":"'LSRW-2'!Z49","v":0},null,{"$f":"'LSRW-2'!AG49","v":0}]
[{"$nulls":9},{"$f":"'LSRW-2'!L50","v":0},null,{"$f":"'LSRW-2'!S50","v":0},null,{"$f":"'LSRW-2'!Z50","v":0},null,{"$f":"'LSRW-2'!AG50","v":0}]
[{"$nulls":9},{"$f":"'LSRW-2'!L51","v":0},null,{"$f":"'LSRW-2'!S51","v":0},null,{"$f":"'LSRW-2'!Z51","v":0},null,{"$f":"'LSRW-2'!AG51","v":0}]
[{"$nulls":9},{"$f":"'LSRW-2'!L52","v":0},null,{"$f":"'LSRW-2'!S52","v":0},null,{"$f":"'LSRW-2'!Z52","v":0},null,{"$f":"'LSRW-2'!AG52","v":0}]
[{"$nulls":9},{"$f":"'LSRW-2'!L53","v":0},null,{"$f":"'LSRW-2'!S53","v":0},null,{"$f":"'LSRW-2'!Z53","v":0},null,{"$f":"'LSRW-2'!AG53","v":0}]
[{"$nulls":9},{"$f":"'LSRW-2'!L54","v":0},null,{"$f":"'LSRW-2'!S54","v":0},null,{"$f":"'LSRW-2'!Z54","v":0},null,{"$f":"'LSRW-2'!AG54","v":0}]
[{"$nulls":9},{"$f":"'LSRW-2'!L55","v":0},null,{"$f":"'LSRW-2'!S55","v":0},null,{"$f":"'LSRW-2'!Z55","v":0},null,{"$f":"'LSRW-2'!AG55","v":0}]
[{"$nulls":9},{"$f":"'LSRW-2'!L56","v":0},null,{"$f":"'LSRW-2'!S56","v":0},null,{"$f":"'LSRW-2'!Z56","v":0},null,{"$f":"'LSRW-2'!AG56","v":0}]
[{"$nulls":9},{"$f":"'LSRW-2'!L57","v":0},null,{"$f":"'LSRW-2'!S57","v":0},null,{"$f":"'LSRW-2'!Z57","v":0},null,{"$f":"'LSRW-2'!AG57","v":0}]
[{"$nulls":9},{"$f":"'LSRW-2'!L58","v":0},null,{"$f":"'LSRW-2'!S58","v":0},null,{"$f":"'LSRW-2'!Z58","v":0},null,{"$f":"'LSRW-2'!AG58","v":0}]
[{"$nulls":9},{"$f":"'LSRW-2'!L59","v":0},null,{"$f":"'LSRW-2'!S59","v":0},null,{"$f":"'LSRW-2'!Z59","v":0},null,{"$f":"'LSRW-2'!AG59","v":0}]
[{"$nulls":9},{"$f":"'LSRW-2'!L60","v":0},null,{"$f":"'LSRW-2'!S60","v":0},null,{"$f":"'LSRW-2'!Z60","v":0},null,{"$f":"'LSRW-2'!AG60","v":0}]
[{"$nulls":9},{"$f":"'LSRW-2'!L61","v":0},null,{"$f":"'LSRW-2'!S61","v":0},null,{"$f":"'LSRW-2'!Z61","v":0},null,{"$f":"'LSRW-2'!AG61","v":0}]
[{"$nulls":9},{"$f":"'LSRW-2'!L62","v":0},null,{"$f":"'LSRW-2'!S62","v":0},null,{"$f":"'LSRW-2'!Z62","v":0},null,{"$f":"'LSRW-2'!AG62","v":0}]
[{"$nulls":9},{"$f":"'LSRW-2'!L63","v":0},null,{"$f":"'LSRW-2'!S63","v":0},null,{"$f":"'LSRW-2'!Z63","v":0},null,{"$f":"'LSRW-2'!AG63","v":0}]
[{"$nulls":9},{"$f":"'LSRW-2'!L64","v":0},null,{"$f":"'LSRW-2'!S64","v":0},null,{"$f":"'LSRW-2'!Z64","v":0},null,{"$f":"'LSRW-2'!AG64","v":0}]
[{"$nulls":9},{"$f":"'LSRW-2'!L65","v":0},null,{"$f":"'LSRW-2'!S65","v":0},null,{"$f":"'LSRW-2'!Z65","v":0},null,{"$f":"'LSRW-2'!AG65","v":0}]
[{"$nulls":9},{"$f":"'LSRW-2'!L66","v":0},null,{"$f":"'LSRW-2'!S66","v":0},null,{"$f":"'LSRW-2'!Z66","v":0},null,{"$f":"'LSRW-2'!AG66","v":0}]
[{"$nulls":9},{"$f":"'LSRW-2'!L67","v":0},null,{"$f":"'LSRW-2'!S67","v":0},null,{"$f":"'LSRW-2'!Z67","v":0},null,{"$f":"'LSRW-2'!AG67","v":0}]
[{"$nulls":9},{"$f":"'LSRW-2'!L68","v":0},null,{"$f":"'LSRW-2'!S68","v":0},null,{"$f":"'LSRW-2'!Z68","v":0},null,{"$f":"'LSRW-2'!AG68","v":0}]
[{"$nulls":9},{"$f":"'LSRW-2'!L69","v":0},null,{"$f":"'LSRW-2'!S69","v":0},null,{"$f":"'LSRW-2'!Z69","v":0},null,{"$f":"'LSRW-2'!AG69","v":0}]

{"sheet":"PRF-1","index":6,"n_rows":67,"n_cols":16,"rows_kept":67,"merged":[[0,0,1,15],[2,0,2,15],[3,0,3,15],[4,0,4,2],[4,4,4,5],[4,6,4,7],[4,8,4,10],[4,11,4,13],[5,0,6,0],[5,1,6,1],[5,2,6,2],[5,3,6,3],[5,4,6,4],[5,5,6,5],[5,6,6,6],[5,7,6,7],[5,8,5,9],[5,10,5,11],[5,12,5,13],[5,14,5,15]]}
[{"$f":"REPORTS!$D$7","v":0}]
[]
["lrr ,oa O;kid ewY;kadu dk;ZØe 2018&19"]
["fo|ky; esa cPpksa ds 'kSf{kd Lrj dh fLFkfr"]
["CLASS-",null,null,"1ST","SUBJECT-",null,{"$f":"REPORTS!C8","v":0},null,"SUBJECT TEACHER-",null,null,{"$f":"REPORTS!K8","v":0}]
["Ø0la0","d{kk","jksy uEcj","uke fo|kFkhZ","firk dk uke","ekrk dk uke","izos“kkad","tUe fnukad","vk/kkj js[kk ewY;kadu ",null,"SA-1",null,"SA-2",null,"SA-3"]
[{"$nulls":8},"d{kk Lrj","izkIr xzsM","d{kk Lrj","izkIr xzsM","d{kk Lrj","izkIr xzsM","d{kk Lrj","izkIr xzsM"]
[{"$nulls":9},{"$f":"'LSRW-1'!L10","v":0},null,{"$f":"'LSRW-1'!S10","v":0},null,{"$f":"'LSRW-1'!Z10","v":0},null,{"$f":"'LSRW-1'!AG10","v":0}]
[{"$nulls":9},{"$f":"'LSRW-1'!L11","v":0},null,{"$f":"'LSRW-1'!S11","v":0},null,{"$f":"'LSRW-1'!Z11","v":0},null,{"$f":"'LSRW-1'!AG11","v":0}]
[{"$nulls":9},{"$f":"'LSRW-1'!L12","v":0},null,{"$f":"'LSRW-1'!S12","v":0},null,{"$f":"'LSRW-1'!Z12","v":0},null,{"$f":"'LSRW-1'!AG12","v":0}]
[{"$nulls":9},{"$f":"'LSRW-1'!L13","v":0},null,{"$f":"'LSRW-1'!S13","v":0},null,{"$f":"'LSRW-1'!Z13","v":0},null,{"$f":"'LSRW-1'!AG13","v":0}]
[{"$nulls":9},{"$f":"'LSRW-1'!L14","v":0},null,{"$f":"'LSRW-1'!S14","v":0},null,{"$f":"'LSRW-1'!Z14","v":0},null,{"$f":"'LSRW-1'!AG14","v":0}]
[{"$nulls":9},{"$f":"'LSRW-1'!L15","v":0},null,{"$f":"'LSRW-1'!S15","v":0},null,{"$f":"'LSRW-1'!Z15","v":0},null,{"$f":"'LSRW-1'!AG15","v":0}]
[{"$nulls":9},{"$f":"'LSRW-1'!L16","v":0},null,{"$f":"'LSRW-1'!S16","v":0},null,{"$f":"'LSRW-1'!Z16","v":0},null,{"$f":"'LSRW-1'!AG16","v":0}]
[{"$nulls":9},{"$f":"'LSRW-1'!L17","v":0},null,{"$f":"'LSRW-1'!S17","v":0},null,{"$f":"'LSRW-1'!Z17","v":0},null,{"$f":"'LSRW-1'!AG17","v":0}]
[{"$nulls":9},{"$f":"'LSRW-1'!L18","v":0},null,{"$f":"'LSRW-1'!S18","v":0},null,{"$f":"'LSRW-1'!Z18","v":0},null,{"$f":"'LSRW-1'!AG18","v":0}]
[{"$nulls":9},{"$f":"'LSRW-1'!L19","v":0},null,{"$f":"'LSRW-1'!S19","v":0},null,{"$f":"'LSRW-1'!Z19","v":0},null,{"$f":"'LSRW-1'!AG19","v":0}]
[{"$nulls":9},{"$f":"'LSRW-1'!L20","v":0},null,{"$f":"'LSRW-1'!S20","v":0},null,{"$f":"'LSRW-1'!Z20","v":0},null,{"$f":"'LSRW-1'!AG20","v":0}]
[{"$nulls":9},{"$f":"'LSRW-1'!L21","v":0},null,{"$f":"'LSRW-1'!S21","v":0},null,{"$f":"'LSRW-1'!Z21","v":0},null,{"$f":"'LSRW-1'!AG21","v":0}]
[{"$nulls":9},{"$f":"'LSRW-1'!L22","v":0},null,{"$f":"'LSRW-1'!S22","v":0},null,{"$f":"'LSRW-1'!Z22","v":0},null,{"$f":"'LSRW-1'!AG22","v":0}]
[{"$nulls":9},{"$f":"'LSRW-1'!L23","v":0},null,{"$f":"'LSRW-1'!S23","v":0},null,{"$f":"'LSRW-1'!Z23","v":0},null,{"$f":"'LSRW-1'!AG23","v":0}]
[{"$nulls":9},{"$f":"'LSRW-1'!L24","v":0},null,{"$f":"'LSRW-1'!S24","v":0},null,{"$f":"'LSRW-1'!Z24","v":0},null,{"$f":"'LSRW-1'!AG24","v":0}]
[{"$nulls":9},{"$f":"'LSRW-1'!L25","v":0},null,{"$f":"'LSRW-1'!S25","v":0},null,{"$f":"'LSRW-1'!Z25","v":0},null,{"$f":"'LSRW-1'!AG25","v":0}]
[{"$nulls":9},{"$f":"'LSRW-1'!L26","v":0},null,{"$f":"'LSRW-1'!S26","v":0},null,{"$f":"'LSRW-1'!Z26","v":0},null,{"$f":"'LSRW-1'!AG26","v":0}]
[{"$nulls":9},{"$f":"'LSRW-1'!L27","v":0},null,{"$f":"'LSRW-1'!S27","v":0},null,{"$f":"'LSRW-1'!Z27","v":0},null,{"$f":"'LSRW-1'!AG27","v":0}]
[{"$nulls":9},{"$f":"'LSRW-1'!L28","v":0},null,{"$f":"'LSRW-1'!S28","v":0},null,{"$f":"'LSRW-1'!Z28","v":0},null,{"$f":"'LSRW-1'!AG28","v":0}]
[{"$nulls":9},{"$f":"'LSRW-1'!L29","v":0},null,{"$f":"'LSRW-1'!S29","v":0},null,{"$f":"'LSRW-1'!Z29","v":0},null,{"$f":"'LSRW-1'!AG29","v":0}]
[{"$nulls":9},{"$f":"'LSRW-1'!L30","v":0},null,{"$f":"'LSRW-1'!S30","v":0},null,{"$f":"'LSRW-1'!Z30","v":0},null,{"$f":"'LSRW-1'!AG30","v":0}]
[{"$nulls":9},{"$f":"'LSRW-1'!L31","v":0},null,{"$f":"'LSRW-1'!S31","v":0},null,{"$f":"'LSRW-1'!Z31","v":0},null,{"$f":"'LSRW-1'!AG31","v":0}]
[{"$nulls":9},{"$f":"'LSRW-1'!L32","v":0},null,{"$f":"'LSRW-1'!S32","v":0},null,{"$f":"'LSRW-1'!Z32","v":0},null,{"$f":"'LSRW-1'!AG32","v":0}]
[{"$nulls":9},{"$f":"'LSRW-1'!L33","v":0},null,{"$f":"'LSRW-1'!S33","v":0},null,{"$f":"'LSRW-1'!Z33","v":0},null,{"$f":"'LSRW-1'!AG33","v":0}]
[{"$nulls":9},{"$f":"'LSRW-1'!L34","v":0},null,{"$f":"'LSRW-1'!S34","v":0},null,{"$f":"'LSRW-1'!Z34","v":0},null,{"$f":"'LSRW-1'!AG34","v":0}]
[{"$nulls":9},{"$f":"'LSRW-1'!L35","v":0},null,{"$f":"'LSRW-1'!S35","v":0},null,{"$f":"'LSRW-1'!Z35","v":0},null,{"$f":"'LSRW-1'!AG35","v":0}]
[{"$nulls":9},{"$f":"'LSRW-1'!L36","v":0},null,{"$f":"'LSRW-1'!S36","v":0},null,{"$f":"'LSRW-1'!Z36","v":0},null,{"$f":"'LSRW-1'!AG36","v":0}]
[{"$nulls":9},{"$f":"'LSRW-1'!L37","v":0},null,{"$f":"'LSRW-1'!S37","v":0},null,{"$f":"'LSRW-1'!Z37","v":0},null,{"$f":"'LSRW-1'!AG37","v":0}]
[{"$nulls":9},{"$f":"'LSRW-1'!L38","v":0},null,{"$f":"'LSRW-1'!S38","v":0},null,{"$f":"'LSRW-1'!Z38","v":0},null,{"$f":"'LSRW-1'!AG38","v":0}]
[{"$nulls":9},{"$f":"'LSRW-1'!L39","v":0},null,{"$f":"'LSRW-1'!S39","v":0},null,{"$f":"'LSRW-1'!Z39","v":0},null,{"$f":"'LSRW-1'!AG39","v":0}]
[{"$nulls":9},{"$f":"'LSRW-1'!L40","v":0},null,{"$f":"'LSRW-1'!S40","v":0},null,{"$f":"'LSRW-1'!Z40","v":0},null,{"$f":"'LSRW-1'!AG40","v":0}]
[{"$nulls":9},{"$f":"'LSRW-1'!L41","v":0},null,{"$f":"'LSRW-1'!S41","v":0},null,{"$f":"'LSRW-1'!Z41","v":0},null,{"$f":"'LSRW-1'!AG41","v":0}]
[{"$nulls":9},{"$f":"'LSRW-1'!L42","v":0},null,{"$f":"'LSRW-1'!S42","v":0},null,{"$f":"'LSRW-1'!Z42","v":0},null,{"$f":"'LSRW-1'!AG42","v":0}]
[{"$nulls":9},{"$f":"'LSRW-1'!L43","v":0},null,{"$f":"'LSRW-1'!S43","v":0},null,{"$f":"'LSRW-1'!Z43","v":0},null,{"$f":"'LSRW-1'!AG43","v":0}]
[{"$nulls":9},{"$f":"'LSRW-1'!L44","v":0},null,{"$f":"'LSRW-1'!S44","v":0},null,{"$f":"'LSRW-1'!Z44","v":0},null,{"$f":"'LSRW-1'!AG44","v":0}]
[{"$nulls":9},{"$f":"'LSRW-1'!L45","v":0},null,{"$f":"'LSRW-1'!S45","v":0},null,{"$f":"'LSRW-1'!Z45","v":0},null,{"$f":"'LSRW-1'!AG45","v":0}]
[{"$nulls":9},{"$f":"'LSRW-1'!L46","v":0},null,{"$f":"'LSRW-1'!S46","v":0},null,{"$f":"'LSRW-1'!Z46","v":0},null,{"$f":"'LSRW-1'!AG46","v":0}]
[{"$nulls":9},{"$f":"'LSRW-1'!L47","v":0},null,{"$f":"'LSRW-1'!S47","v":0},null,{"$f":"'LSRW-1'!Z47","v":0},null,{"$f":"'LSRW-1'!AG47","v":0}]
[{"$nulls":9},{"$f":"'LSRW-1'!L48","v":0},null,{"$f":"'LSRW-1'!S48","v":0},null,{"$f":"'LSRW-1'!Z48","v":0},null,{"$f":"'LSRW-1'!AG48","v":0}]
[{"$nulls":9},{"$f":"'LSRW-1'!L49","v":0},null,{"$f":"'LSRW-1'!S49","v":0},null,{"$f":"'LSRW-1'!Z49","v":0},null,{"$f":"'LSRW-1'!AG49","v":0}]
[{"$nulls":9},{"$f":"'LSRW-1'!L50","v":0},null,{"$f":"'LSRW-1'!S50","v":0},null,{"$f":"'LSRW-1'!Z50","v":0},null,{"$f":"'LSRW-1'!AG50","v":0}]
[{"$nulls":9},{"$f":"'LSRW-1'!L51","v":0},null,{"$f":"'LSRW-1'!S51","v":0},null,{"$f":"'LSRW-1'!Z51","v":0},null,{"$f":"'LSRW-1'!AG51","v":0}]
[{"$nulls":9},{"$f":"'LSRW-1'!L52","v":0},null,{"$f":"'LSRW-1'!S52","v":0},null,{"$f":"'LSRW-1'!Z52","v":0},null,{"$f":"'LSRW-1'!AG52","v":0}]
[{"$nulls":9},{"$f":"'LSRW-1'!L53","v":0},null,{"$f":"'LSRW-1'!S53","v":0},null,{"$f":"'LSRW-1'!Z53","v":0},null,{"$f":"'LSRW-1'!AG53","v":0}]
[{"$nulls":9},{"$f":"'LSRW-1'!L54","v":0},null,{"$f":"'LSRW-1'!S54","v":0},null,{"$f":"'LSRW-1'!Z54","v":0},null,{"$f":"'LSRW-1'!AG54","v":0}]
[{"$nulls":9},{"$f":"'LSRW-1'!L55","v":0},null,{"$f":"'LSRW-1'!S55","v":0},null,{"$f":"'LSRW-1'!Z55","v":0},null,{"$f":"'LSRW-1'!AG55","v":0}]
[{"$nulls":9},{"$f":"'LSRW-1'!L56","v":0},null,{"$f":"'LSRW-1'!S56","v":0},null,{"$f":"'LSRW-1'!Z56","v":0},null,{"$f":"'LSRW-1'!AG56","v":0}]
[{"$nulls":9},{"$f":"'LSRW-1'!L57","v":0},null,{"$f":"'LSRW-1'!S57","v":0},null,{"$f":"'LSRW-1'!Z57","v":0},null,{"$f":"'LSRW-1'!AG57","v":0}]
[{"$nulls":9},{"$f":"'LSRW-1'!L58","v":0},null,{"$f":"'LSRW-1'!S58","v":0},null,{"$f":"'LSRW-1'!Z58","v":0},null,{"$f":"'LSRW-1'!AG58","v":0}]
[{"$nulls":9},{"$f":"'LSRW-1'!L59","v":0},null,{"$f":"'LSRW-1'!S59","v":0},null,{"$f":"'LSRW-1'!Z59","v":0},null,{"$f":"'LSRW-1'!AG59","v":0}]
[{"$nulls":9},{"$f":"'LSRW-1'!L60","v":0},null,{"$f":"'LSRW-1'!S60","v":0},null,{"$f":"'LSRW-1'!Z60","v":0},null,{"$f":"'LSRW-1'!AG60","v":0}]
[{"$nulls":9},{"$f":"'LSRW-1'!L61","v":0},null,{"$f":"'LSRW-1'!S61","v":0},null,{"$f":"'LSRW-1'!Z61","v":0},null,{"$f":"'LSRW-1'!AG61","v":0}]
[{"$nulls":9},{"$f":"'LSRW-1'!L62","v":0},null,{"$f":"'LSRW-1'!S62","v":0},null,{"$f":"'LSRW-1'!Z62","v":0},null,{"$f":"'LSRW-1'!AG62","v":0}]
[{"$nulls":9},{"$f":"'LSRW-1'!L63","v":0},null,{"$f":"'LSRW-1'!S63","v":0},null,{"$f":"'LSRW-1'!Z63","v":0},null,{"$f":"'LSRW-1'!AG63","v":0}]
[{"$nulls":9},{"$f":"'LSRW-1'!L64","v":0},null,{"$f":"'LSRW-1'!S64","v":0},null,{"$f":"'LSRW-1'!Z64","v":0},null,{"$f":"'LSRW-1'!AG64","v":0}]
[{"$nulls":9},{"$f":"'LSRW-1'!L65","v":0},null,{"$f":"'LSRW-1'!S65","v":0},null,{"$f":"'LSRW-1'!Z65","v":0},null,{"$f":"'LSRW-1'!AG65","v":0}]
[{"$nulls":9},{"$f":"'LSRW-1'!L66","v":0},null,{"$f":"'LSRW-1'!S66","v":0},null,{"$f":"'LSRW-1'!Z66","v":0},null,{"$f":"'LSRW-1'!AG66","v":0}]
[{"$nulls":9},{"$f":"'LSRW-1'!L67","v":0},null,{"$f":"'LSRW-1'!S67","v":0},null,{"$f":"'LSRW-1'!Z67","v":0},null,{"$f":"'LSRW-1'!AG67","v":0}]
[{"$nulls":3},"शालापूर्व ",{"$nulls":5},{"$f":"'LSRW-1'!L68","v":0},null,{"$f":"'LSRW-1'!S68","v":0},null,{"$f":"'LSRW-1'!Z68","v":0},null,{"$f":"'LSRW-1'!AG68","v":0}]
[{"$nulls":3},1,{"$nulls":5},{"$f":"'LSRW-1'!L69","v":0},null,{"$f":"'LSRW-1'!S69","v":0},null,{"$f":"'LSRW-1'!Z69","v":0},null,{"$f":"'LSRW-1'!AG69","v":0}]

{"sheet":"A-BASE","index":7,"n_rows":13,"n_cols":24,"rows_kept":13,"merged":[[0,0,1,4],[0,5,1,23],[2,0,2,23],[3,0,3,23],[4,0,4,23],[5,0,5,3],[5,4,5,13],[5,14,5,19],[5,20,5,23],[6,0,6,3],[6,4,6,13],[6,14,6,19],[6,20,6,23],[7,0,7,23],[8,0,11,2],[8,3,8,5],[8,6,8,8],[8,9,8,12],[8,13,8,17],[8,18,8,23],[9,3,11,3],[9,4,9,5],[9,6,11,6],[9,7,9,8],[9,9,11,9],[9,10,9,12],[9,13,11,13],[9,14,9,17],[9,18,11,18],[9,19,9,23],[10,4,11,4],[10,5,11,5],[10,7,11,7],[10,8,11,8],[10,10,11,10],[10,11,11,11],[10,12,11,12],[10,14,11,14],[10,15,11,15],[10,16,11,16],[10,17,11,17],[10,19,11,19],[10,20,11,20],[10,21,11,21],[10,22,11,22],[10,23,11,23],[12,0,15,2],[12,3,15,3],[12,4,15,4],[12,5,15,5],[12,6,15,6],[12,7,15,7],[12,8,15,8],[12,9,15,9],[12,10,15,10],[12,11,15,11],[12,12,15,12],[12,13,15,13],[12,14,15,14],[12,15,15,15],[12,16,15,16],[12,17,15,17],[12,18,15,18],[12,19,15,19],[12,20,15,20],[12,21,15,21],[12,22,15,22],[12,23,15,23]]}
["fo|ky; dk uke %&",{"$nulls":4},{"$f":"REPORTS!$D$7","v":0}]
[]
["lrr ,oa O;kid ewY;kadu dk;ZØe 2018&19"]
["fo|ky; esa cPpksa ds 'kSf{kd Lrj dh fLFkfr"]
["izi= & ^v*"]
["fo|ky; dk uke %&",{"$nulls":3},{"$f":"REPORTS!$D$7","v":0},{"$nulls":9},"ewY;kadu&",{"$nulls":5},"BASELINE"]
["fo‘k;k/;kid dk uke&",{"$nulls":3},{"$f":"REPORTS!K8","v":0},{"$nulls":9},"fo|ky; dk MkbZl dksM %&",{"$nulls":5},{"$f":"REPORTS!R7","v":0}]
[]
["fo\"k;",null,null,"d{kk&1",null,null,"d{kk&2",null,null,"d{kk&3",{"$nulls":3},"d{kk&4",{"$nulls":4},"d{kk&5"]
[{"$nulls":3},"ukekadu","d{kkLrj",null,"ukekadu","d{kkLrj",null,"ukekadu","d{kkLrj",null,null,"ukekadu","d{kkLrj",{"$nulls":3},"ukekadu","d{kkLrj"]
[{"$nulls":4},"शालापूर्व ",1,null,1,2,null,1,2,3,null,1,2,3,4,null,1,2,3,4,5]
[]
[{"$f":"REPORTS!C8","v":0},null,null,{"$f":"SUM(E13:F16)","v":0},{"$f":"COUNTIF('PRF-1'!I8:I67,E11)","v":0},{"$f":"COUNTIF('PRF-1'!I8:I67,1)","v":0},{"$f":"SUM(H13:I16)","v":0},{"$f":"COUNTIF('PRF-2'!I8:I67,1)","v":0},{"$f":"COUNTIF('PRF-2'!I8:I67,2)","v":0},{"$f":"SUM(K13:M16)","v":0},{"$f":"COUNTIF('PRF-3'!I8:I67,1)","v":0},{"$f":"COUNTIF('PRF-3'!I8:I67,2)","v":0},{"$f":"COUNTIF('PRF-3'!I8:I67,3)","v":0},{"$f":"SUM(O13:R16)","v":0},{"$f":"COUNTIF('PRF-4'!I8:I67,1)","v":0},{"$f":"COUNTIF('PRF-4'!I8:I67,2)","v":0},{"$f":"COUNTIF('PRF-4'!I8:I67,3)","v":0},{"$f":"COUNTIF('PRF-4'!I8:I67,4)","v":0},{"$f":"SUM(T13:X16)","v":2},{"$f":"COUNTIF('PRF-5'!I8:I67,1)","v":0},{"$f":"COUNTIF('PRF-5'!I8:I67,2)","v":0},{"$f":"COUNTIF('PRF-5'!I8:I67,3)","v":0},{"$f":"COUNTIF('PRF-5'!I8:I67,4)","v":1},{"$f":"COUNTIF('PRF-5'!I8:I67,5)","v":1}]

{"sheet":"A-SA1","index":8,"n_rows":13,"n_cols":24,"rows_kept":13,"merged":[[0,0,1,4],[0,5,1,23],[2,0,2,23],[3,0,3,23],[4,0,4,23],[5,0,5,3],[5,4,5,13],[5,14,5,19],[5,20,5,23],[6,0,6,3],[6,4,6,13],[6,14,6,19],[6,20,6,23],[7,0,7,23],[8,0,11,2],[8,3,8,5],[8,6,8,8],[8,9,8,12],[8,13,8,17],[8,18,8,23],[9,3,11,3],[9,4,9,5],[9,6,11,6],[9,7,9,8],[9,9,11,9],[9,10,9,12],[9,13,11,13],[9,14,9,17],[9,18,11,18],[9,19,9,23],[10,4,11,4],[10,5,11,5],[10,7,11,7],[10,8,11,8],[10,10,11,10],[10,11,11,11],[10,12,11,12],[10,14,11,14],[10,15,11,15],[10,16,11,16],[10,17,11,17],[10,19,11,19],[10,20,11,20],[10,21,11,21],[10,22,11,22],[10,23,11,23],[12,0,15,2],[12,3,15,3],[12,4,15,4],[12,5,15,5],[12,6,15,6],[12,7,15,7],[12,8,15,8],[12,9,15,9],[12,10,15,10],[12,11,15,11],[12,12,15,12],[12,13,15,13],[12,14,15,14],[12,15,15,15],[12,16,15,16],[12,17,15,17],[12,18,15,18],[12,19,15,19],[12,20,15,20],[12,21,15,21],[12,22,15,22],[12,23,15,23]]}
["fo|ky; dk uke %&",{"$nulls":4},{"$f":"REPORTS!$D$7","v":0}]
[]
["lrr ,oa O;kid ewY;kadu dk;ZØe 2018&19"]
["fo|ky; esa cPpksa ds 'kSf{kd Lrj dh fLFkfr"]
["izi= & ^v*"]
["fo|ky; dk uke %&",{"$nulls":3},{"$f":"REPORTS!$D$7","v":0},{"$nulls":9},"ewY;kadu&",{"$nulls":5},"SA-1"]
["fo‘k;k/;kid dk uke&",{"$nulls":3},{"$f":"REPORTS!K8","v":0},{"$nulls":9},"fo|ky; dk MkbZl dksM %&",{"$nulls":5},{"$f":"REPORTS!R7","v":0}]
[]
["fo\"k;",null,null,"d{kk&1",null,null,"d{kk&2",null,null,"d{kk&3",{"$nulls":3},"d{kk&4",{"$nulls":4},"d{kk&5"]
[{"$nulls":3},"ukekadu","d{kkLrj",null,"ukekadu","d{kkLrj",null,"ukekadu","d{kkLrj",null,null,"ukekadu","d{kkLrj",{"$nulls":3},"ukekadu","d{kkLrj"]
[{"$nulls":4},"शालापूर्व ",1,null,1,2,null,1,2,3,null,1,2,3,4,null,1,2,3,4,5]
[]
[{"$f":"REPORTS!C8","v":0},null,null,{"$f":"SUM(E13:F16)","v":0},{"$f":"COUNTIF('PRF-1'!K8:K67,E11)","v":0},{"$f":"COUNTIF('PRF-1'!K8:K61,1)","v":0},{"$f":"SUM(H13:I16)","v":0},{"$f":"COUNTIF('PRF-2'!K8:K67,1)","v":0},{"$f":"COUNTIF('PRF-2'!K8:L67,2)","v":0},{"$f":"SUM(K13:M16)","v":0},{"$f":"COUNTIF('PRF-3'!K8:K67,1)","v":0},{"$f":"COUNTIF('PRF-3'!K8:K67,2)","v":0},{"$f":"COUNTIF('PRF-3'!K8:K67,3)","v":0},{"$f":"SUM(O13:R16)","v":0},{"$f":"COUNTIF('PRF-4'!K8:K67,1)","v":0},{"$f":"COUNTIF('PRF-4'!K8:K67,2)","v":0},{"$f":"COUNTIF('PRF-4'!K8:K67,3)","v":0},{"$f":"COUNTIF('PRF-4'!K8:K67,4)","v":0},{"$f":"SUM(T13:X16)","v":2},{"$f":"COUNTIF('PRF-5'!K8:K67,1)","v":0},{"$f":"COUNTIF('PRF-5'!K8:K67,2)","v":0},{"$f":"COUNTIF('PRF-5'!K8:K67,3)","v":0},{"$f":"COUNTIF('PRF-5'!K8:K67,4)","v":1},{"$f":"COUNTIF('PRF-5'!K8:K67,5)","v":1}]

{"sheet":"A-SA2","index":9,"n_rows":13,"n_cols":24,"rows_kept":13,"merged":[[0,0,1,4],[0,5,1,23],[2,0,2,23],[3,0,3,23],[4,0,4,23],[5,0,5,3],[5,4,5,13],[5,14,5,19],[5,20,5,23],[6,0,6,3],[6,4,6,13],[6,14,6,19],[6,20,6,23],[7,0,7,23],[8,0,11,2],[8,3,8,5],[8,6,8,8],[8,9,8,12],[8,13,8,17],[8,18,8,23],[9,3,11,3],[9,4,9,5],[9,6,11,6],[9,7,9,8],[9,9,11,9],[9,10,9,12],[9,13,11,13],[9,14,9,17],[9,18,11,18],[9,19,9,23],[10,4,11,4],[10,5,11,5],[10,7,11,7],[10,8,11,8],[10,10,11,10],[10,11,11,11],[10,12,11,12],[10,14,11,14],[10,15,11,15],[10,16,11,16],[10,17,11,17],[10,19,11,19],[10,20,11,20],[10,21,11,21],[10,22,11,22],[10,23,11,23],[12,0,15,2],[12,3,15,3],[12,4,15,4],[12,5,15,5],[12,6,15,6],[12,7,15,7],[12,8,15,8],[12,9,15,9],[12,10,15,10],[12,11,15,11],[12,12,15,12],[12,13,15,13],[12,14,15,14],[12,15,15,15],[12,16,15,16],[12,17,15,17],[12,18,15,18],[12,19,15,19],[12,20,15,20],[12,21,15,21],[12,22,15,22],[12,23,15,23]]}
["fo|ky; dk uke %&",{"$nulls":4},{"$f":"REPORTS!$D$7","v":0}]
[]
["lrr ,oa O;kid ewY;kadu dk;ZØe 2018&19"]
["fo|ky; esa cPpksa ds 'kSf{kd Lrj dh fLFkfr"]
["izi= & ^v*"]
["fo|ky; dk uke %&",{"$nulls":3},{"$f":"REPORTS!$D$7","v":0},{"$nulls":9},"ewY;kadu&",{"$nulls":5},"SA-2"]
["fo‘k;k/;kid dk uke&",{"$nulls":3},{"$f":"REPORTS!K8","v":0},{"$nulls":9},"fo|ky; dk MkbZl dksM %&",{"$nulls":5},{"$f":"REPORTS!R7","v":0}]
[]
["fo\"k;",null,null,"d{kk&1",null,null,"d{kk&2",null,null,"d{kk&3",{"$nulls":3},"d{kk&4",{"$nulls":4},"d{kk&5"]
[{"$nulls":3},"ukekadu","d{kkLrj",null,"ukekadu","d{kkLrj",null,"ukekadu","d{kkLrj",null,null,"ukekadu","d{kkLrj",{"$nulls":3},"ukekadu","d{kkLrj"]
[{"$nulls":4},"शालापूर्व ",1,null,1,2,null,1,2,3,null,1,2,3,4,null,1,2,3,4,5]
[]
[{"$f":"REPORTS!C8","v":0},null,null,{"$f":"SUM(E13:F16)","v":0},{"$f":"COUNTIF('PRF-1'!M8:M67,E11)","v":0},{"$f":"COUNTIF('PRF-1'!M8:M67,1)","v":0},{"$f":"SUM(H13:I16)","v":0},{"$f":"COUNTIF('PRF-2'!M8:M67,1)","v":0},{"$f":"COUNTIF('PRF-2'!M8:M67,2)","v":0},{"$f":"SUM(K13:M16)","v":0},{"$f":"COUNTIF('PRF-3'!M8:M67,1)","v":0},{"$f":"COUNTIF('PRF-3'!M8:M67,2)","v":0},{"$f":"COUNTIF('PRF-3'!M8:M67,3)","v":0},{"$f":"SUM(O13:R16)","v":0},{"$f":"COUNTIF('PRF-4'!M8:M67,1)","v":0},{"$f":"COUNTIF('PRF-4'!M8:M67,2)","v":0},{"$f":"COUNTIF('PRF-4'!M8:M67,3)","v":0},{"$f":"COUNTIF('PRF-4'!M8:M67,4)","v":0},{"$f":"SUM(T13:X16)","v":2},{"$f":"COUNTIF('PRF-5'!M8:M67,1)","v":0},{"$f":"COUNTIF('PRF-5'!M8:M67,2)","v":0},{"$f":"COUNTIF('PRF-5'!M8:M67,3)","v":0},{"$f":"COUNTIF('PRF-5'!M8:M67,4)","v":0},{"$f":"COUNTIF('PRF-5'!M8:M67,5)","v":2}]

{"sheet":"A-SA3","index":10,"n_rows":13,"n_cols":24,"rows_kept":13,"merged":[[0,0,1,4],[0,5,1,23],[2,0,2,23],[3,0,3,23],[4,0,4,23],[5,0,5,3],[5,4,5,13],[5,14,5,19],[5,20,5,23],[6,0,6,3],[6,4,6,13],[6,14,6,19],[6,20,6,23],[7,0,7,23],[8,0,11,2],[8,3,8,5],[8,6,8,8],[8,9,8,12],[8,13,8,17],[8,18,8,23],[9,3,11,3],[9,4,9,5],[9,6,11,6],[9,7,9,8],[9,9,11,9],[9,10,9,12],[9,13,11,13],[9,14,9,17],[9,18,11,18],[9,19,9,23],[10,4,11,4],[10,5,11,5],[10,7,11,7],[10,8,11,8],[10,10,11,10],[10,11,11,11],[10,12,11,12],[10,14,11,14],[10,15,11,15],[10,16,11,16],[10,17,11,17],[10,19,11,19],[10,20,11,20],[10,21,11,21],[10,22,11,22],[10,23,11,23],[12,0,15,2],[12,3,15,3],[12,4,15,4],[12,5,15,5],[12,6,15,6],[12,7,15,7],[12,8,15,8],[12,9,15,9],[12,10,15,10],[12,11,15,11],[12,12,15,12],[12,13,15,13],[12,14,15,14],[12,15,15,15],[12,16,15,16],[12,17,15,17],[12,18,15,18],[12,19,15,19],[12,20,15,20],[12,21,15,21],[12,22,15,22],[12,23,15,23]]}
["fo|ky; dk uke %&",{"$nulls":4},{"$f":"REPORTS!$D$7","v":0}]
[]
["lrr ,oa O;kid ewY;kadu dk;ZØe 2018&19"]
["fo|ky; esa cPpksa ds 'kSf{kd Lrj dh fLFkfr"]
["izi= & ^v*"]
["fo|ky; dk uke %&",{"$nulls":3},{"$f":"REPORTS!$D$7","v":0},{"$nulls":9},"ewY;kadu&",{"$nulls":5},"SA-3"]
["fo‘k;k/;kid dk uke&",{"$nulls":3},{"$f":"REPORTS!K8","v":0},{"$nulls":9},"fo|ky; dk MkbZl dksM %&",{"$nulls":5},{"$f":"REPORTS!R7","v":0}]
[]
["fo\"k;",null,null,"d{kk&1",null,null,"d{kk&2",null,null,"d{kk&3",{"$nulls":3},"d{kk&4",{"$nulls":4},"d{kk&5"]
[{"$nulls":3},"ukekadu","d{kkLrj",null,"ukekadu","d{kkLrj",null,"ukekadu","d{kkLrj",null,null,"ukekadu","d{kkLrj",{"$nulls":3},"ukekadu","d{kkLrj"]
[{"$nulls":4},"शालापूर्व ",1,null,1,2,null,1,2,3,null,1,2,3,4,null,1,2,3,4,5]
[]
[{"$f":"REPORTS!C8","v":0},null,null,{"$f":"SUM(E13:F16)","v":0},{"$f":"COUNTIF('PRF-1'!O8:O67,E11)","v":0},{"$f":"COUNTIF('PRF-1'!O8:O67,1)","v":0},{"$f":"SUM(H13:I16)","v":0},{"$f":"COUNTIF('PRF-2'!O8:O67,1)","v":0},{"$f":"COUNTIF('PRF-2'!O8:O67,2)","v":0},{"$f":"SUM(K13:M16)","v":0},{"$f":"COUNTIF('PRF-3'!O8:O67,1)","v":0},{"$f":"COUNTIF('PRF-3'!O8:O67,2)","v":0},{"$f":"COUNTIF('PRF-3'!O8:O67,3)","v":0},{"$f":"SUM(O13:R16)","v":0},{"$f":"COUNTIF('PRF-4'!O8:O67,1)","v":0},{"$f":"COUNTIF('PRF-4'!O8:O67,2)","v":0},{"$f":"COUNTIF('PRF-4'!O8:O67,3)","v":0},{"$f":"COUNTIF('PRF-4'!O8:O67,4)","v":0},{"$f":"SUM(T13:X16)","v":2},{"$f":"COUNTIF('PRF-5'!O8:O67,1)","v":0},{"$f":"COUNTIF('PRF-5'!O8:O67,2)","v":0},{"$f":"COUNTIF('PRF-5'!O8:O67,3)","v":0},{"$f":"COUNTIF('PRF-5'!O8:O67,4)","v":0},{"$f":"COUNTIF('PRF-5'!O8:O67,5)","v":2}]

{"sheet":"B-SA1","index":11,"n_rows":18,"n_cols":23,"rows_kept":18,"merged":[[0,0,1,4],[0,5,1,22],[2,0,2,22],[3,0,3,22],[4,0,4,22],[5,0,5,3],[5,4,5,12],[5,13,5,18],[5,19,5,22],[6,0,6,3],[6,4,6,7],[6,13,6,18],[6,19,6,22],[7,0,8,2],[7,3,8,7],[7,8,7,10],[7,11,7,13],[7,14,7,16],[7,17,7,19],[7,20,7,22],[9,0,18,2],[9,3,10,7],[9,8,10,8],[9,9,10,9],[9,10,10,10],[9,11,10,11],[9,12,10,12],[9,13,10,13],[9,14,10,14],[9,15,10,15],[9,16,10,16],[9,17,10,17],[9,18,10,18],[9,19,10,19],[9,20,10,20],[9,21,10,21],[9,22,10,22],[11,3,12,7],[11,8,12,8],[11,9,12,9],[11,10,12,10],[11,11,12,11],[11,12,12,12],[11,13,12,13],[11,14,12,14],[11,15,12,15],[11,16,12,16],[11,17,12,17],[11,18,12,18],[11,19,12,19],[11,20,12,20],[11,21,12,21],[11,22,12,22],[13,3,14,7],[13,8,14,8],[13,9,14,9],[13,10,14,10],[13,11,14,11],[13,12,14,12],[13,13,14,13],[13,14,14,14],[13,15,14,15],[13,16,14,16],[13,17,14,17],[13,18,14,18],[13,19,14,19],[13,20,14,20],[13,21,14,21],[13,22,14,22],[15,3,16,7],[15,8,16,8],[15,9,16,9],[15,10,16,10],[15,11,16,11],[15,12,16,12],[15,13,16,13],[15,14,16,14],[15,15,16,15],[15,16,16,16],[15,17,16,17],[15,18,16,18],[15,19,16,19],[15,20,16,20],[15,21,16,21],[15,22,16,22],[17,3,18,7],[17,8,18,8],[17,9,18,9],[17,10,18,10],[17,11,18,11],[17,12,18,12],[17,13,18,13],[17,14,18,14],[17,15,18,15],[17,16,18,16],[17,17,18,17],[17,18,18,18],[17,19,18,19],[17,20,18,20],[17,21,18,21],[17,22,18,22]]}
["fo|ky; dk uke %&",{"$nulls":4},{"$f":"REPORTS!$D$7","v":0}]
[]
["lrr ,oa O;kid ewY;kadu dk;ZØe 2018&19"]
["d{kkokj ,oa vf/kxe mÌs“;ksa ds vuqlkj d{kkLrj ds Nk«kksa dh xzsMhax"]
["izi= & ^c*"]
["fo‘k;k/;kid dk uke&",{"$nulls":3},{"$f":"REPORTS!K8","v":0},{"$nulls":8},"fnukad&",{"$nulls":5},"2018-11-22"]
["ekg dk uke&",{"$nulls":3},"MAY",{"$nulls":8},"ASSESSMENT-",{"$nulls":5},"SA-1"]
["SUBJECT",null,null,"LEARNING OBJECTIVES",{"$nulls":4},"CLASS-1",null,null,"CLASS-2",null,null,"CLASS-3",null,null,"CLASS-4",null,null,"CLASS-5"]
[{"$nulls":8},"A","B","C","A","B","C","A","B","C","A","B","C","A","B","C"]
[{"$f":"REPORTS!C8","v":0},null,null,"Listening with Understanding",{"$nulls":4},{"$f":"COUNTIF('LSRW-1'!N10:N69,\"A\")","v":0},{"$f":"COUNTIF('LSRW-1'!N10:N69,\"B\")","v":0},{"$f":"COUNTIF('LSRW-1'!N10:N69,\"C\")","v":0},{"$f":"COUNTIF('LSRW-2'!N10:N69,\"A\")","v":0},{"$f":"COUNTIF('LSRW-2'!N10:N69,\"B\")","v":0},{"$f":"COUNTIF('LSRW-2'!N10:N69,\"C\")","v":0},{"$f":"COUNTIF('LSRW-3'!N10:N69,\"A\")","v":0},{"$f":"COUNTIF('LSRW-3'!N10:N69,\"B\")","v":0},{"$f":"COUNTIF('LSRW-3'!N10:N69,\"C\")","v":0},{"$f":"COUNTIF('LSRW-4'!N10:N69,\"A\")","v":0},{"$f":"COUNTIF('LSRW-4'!N10:N69,\"B\")","v":0},{"$f":"COUNTIF('LSRW-4'!N10:N69,\"C\")","v":0},{"$f":"COUNTIF('LSRW-5'!N10:N69,\"A\")","v":2},{"$f":"COUNTIF('LSRW-5'!N10:N69,\"B\")","v":0},{"$f":"COUNTIF('LSRW-5'!N10:N69,\"C\")","v":0}]
[]
[{"$nulls":3},"Speaking with Confidence",{"$nulls":4},{"$f":"COUNTIF('LSRW-1'!O10:O69,\"A\")","v":0},{"$f":"COUNTIF('LSRW-1'!O10:O69,\"B\")","v":0},{"$f":"COUNTIF('LSRW-1'!O10:O69,\"C\")","v":0},{"$f":"COUNTIF('LSRW-2'!O10:O69,\"A\")","v":0},{"$f":"COUNTIF('LSRW-2'!O10:O69,\"B\")","v":0},{"$f":"COUNTIF('LSRW-2'!O10:O69,\"C\")","v":0},{"$f":"COUNTIF('LSRW-3'!O10:O69,\"A\")","v":0},{"$f":"COUNTIF('LSRW-3'!O10:O69,\"B\")","v":0},{"$f":"COUNTIF('LSRW-3'!O10:O69,\"C\")","v":0},{"$f":"COUNTIF('LSRW-4'!O10:O69,\"A\")","v":0},{"$f":"COUNTIF('LSRW-4'!O10:O69,\"B\")","v":0},{"$f":"COUNTIF('LSRW-4'!O10:O69,\"C\")","v":0},{"$f":"COUNTIF('LSRW-5'!O10:O69,\"A\")","v":0},{"$f":"COUNTIF('LSRW-5'!O10:O69,\"B\")","v":2},{"$f":"COUNTIF('LSRW-5'!O10:O69,\"C\")","v":0}]
[]
[{"$nulls":3},"Reading with Comprehension",{"$nulls":4},{"$f":"COUNTIFS('LSRW-1'!$M10:$M67,\"1\",'LSRW-1'!$P10:$P67,\"A\")","v":0},{"$f":"COUNTIFS('LSRW-1'!M10:M67,\"1\",'LSRW-1'!P10:P67,\"B\")","v":0},{"$f":"COUNTIFS('LSRW-1'!M10:M67,\"1\",'LSRW-1'!P10:P67,\"C\")","v":0},{"$f":"COUNTIFS('LSRW-2'!$M10:$M67,\"2\",'LSRW-2'!$P10:$P67,\"A\")","v":0},{"$f":"COUNTIFS('LSRW-2'!$M10:$M67,\"2\",'LSRW-2'!$P10:$P67,\"B\")","v":0},{"$f":"COUNTIFS('LSRW-2'!$M10:$M67,\"2\",'LSRW-2'!$P10:$P67,\"C\")","v":0},{"$f":"COUNTIFS('LSRW-3'!$M10:$M67,\"3\",'LSRW-3'!$P10:$P67,\"A\")","v":0},{"$f":"COUNTIFS('LSRW-3'!$M10:$M67,\"3\",'LSRW-3'!$P10:$P67,\"B\")","v":0},{"$f":"COUNTIFS('LSRW-3'!$M10:$M67,\"3\",'LSRW-3'!$P10:$P67,\"C\")","v":0},{"$f":"COUNTIFS('LSRW-4'!$M10:$M67,\"4\",'LSRW-4'!$P10:$P67,\"A\")","v":0},{"$f":"COUNTIFS('LSRW-4'!$M10:$M67,\"4\",'LSRW-4'!$P10:$P67,\"B\")","v":0},{"$f":"COUNTIFS('LSRW-4'!$M10:$M67,\"4\",'LSRW-4'!$P10:$P67,\"C\")","v":0},{"$f":"COUNTIFS('LSRW-5'!$M10:$M67,\"5\",'LSRW-5'!$P10:$P67,\"A\")","v":1},{"$f":"COUNTIFS('LSRW-5'!$M10:$M67,\"5\",'LSRW-5'!$P10:$P67,\"B\")","v":0},{"$f":"COUNTIFS('LSRW-5'!$M10:$M67,\"5\",'LSRW-5'!$P10:$P67,\"C\")","v":0}]
[]
[{"$nulls":3},"Writing",{"$nulls":4},{"$f":"COUNTIFS('LSRW-1'!M10:M67,\"1\",'LSRW-1'!Q10:Q67,\"A\")","v":0},{"$f":"COUNTIFS('LSRW-1'!M10:M67,\"1\",'LSRW-1'!Q10:Q67,\"B\")","v":0},{"$f":"COUNTIFS('LSRW-1'!M10:M67,\"1\",'LSRW-1'!Q10:Q67,\"C\")","v":0},{"$f":"COUNTIFS('LSRW-2'!$M10:$M67,\"2\",'LSRW-2'!$Q10:$Q67,\"A\")","v":0},{"$f":"COUNTIFS('LSRW-2'!$M10:$M67,\"2\",'LSRW-2'!$Q10:$Q67,\"B\")","v":0},{"$f":"COUNTIFS('LSRW-2'!$M10:$M67,\"2\",'LSRW-2'!$Q10:$Q67,\"C\")","v":0},{"$f":"COUNTIFS('LSRW-3'!$M10:$M67,\"3\",'LSRW-3'!$Q10:$Q67,\"A\")","v":0},{"$f":"COUNTIFS('LSRW-3'!$M10:$M67,\"3\",'LSRW-3'!$Q10:$Q67,\"B\")","v":0},{"$f":"COUNTIFS('LSRW-3'!$M10:$M67,\"3\",'LSRW-3'!$Q10:$Q67,\"C\")","v":0},{"$f":"COUNTIFS('LSRW-4'!$M10:$M67,\"4\",'LSRW-4'!$Q10:$Q67,\"A\")","v":0},{"$f":"COUNTIFS('LSRW-4'!$M10:$M67,\"4\",'LSRW-4'!$Q10:$Q67,\"B\")","v":0},{"$f":"COUNTIFS('LSRW-4'!$M10:$M67,\"4\",'LSRW-4'!$Q10:$Q67,\"C\")","v":0},{"$f":"COUNTIFS('LSRW-5'!$M10:$M67,\"5\",'LSRW-5'!$Q10:$Q67,\"A\")","v":0},{"$f":"COUNTIFS('LSRW-5'!$M10:$M67,\"5\",'LSRW-5'!$Q10:$Q67,\"B\")","v":1},{"$f":"COUNTIFS('LSRW-5'!$M10:$M67,\"5\",'LSRW-5'!$Q10:$Q67,\"C\")","v":0}]
[]
[{"$nulls":3},"Functional Grammar",{"$nulls":4},{"$f":"COUNTIFS('LSRW-1'!M10:M67,\"1\",'LSRW-1'!R10:R67,\"A\")","v":0},{"$f":"COUNTIFS('LSRW-1'!M10:M67,\"1\",'LSRW-1'!R10:R67,\"B\")","v":0},{"$f":"COUNTIFS('LSRW-1'!M10:M67,\"1\",'LSRW-1'!R10:R67,\"C\")","v":0},{"$f":"COUNTIFS('LSRW-2'!$M10:$M67,\"2\",'LSRW-2'!$R10:$R67,\"A\")","v":0},{"$f":"COUNTIFS('LSRW-2'!$M10:$M67,\"2\",'LSRW-2'!$R10:$R67,\"B\")","v":0},{"$f":"COUNTIFS('LSRW-2'!$M10:$M67,\"2\",'LSRW-2'!$R10:$R67,\"C\")","v":0},{"$f":"COUNTIFS('LSRW-3'!$M10:$M67,\"3\",'LSRW-3'!$R10:$R67,\"A\")","v":0},{"$f":"COUNTIFS('LSRW-3'!$M10:$M67,\"3\",'LSRW-3'!$R10:$R67,\"B\")","v":0},{"$f":"COUNTIFS('LSRW-3'!$M10:$M67,\"3\",'LSRW-3'!$R10:$R67,\"C\")","v":0},{"$f":"COUNTIFS('LSRW-4'!$M10:$M67,\"4\",'LSRW-4'!$R10:$R67,\"A\")","v":0},{"$f":"COUNTIFS('LSRW-4'!$M10:$M67,\"4\",'LSRW-4'!$R10:$R67,\"B\")","v":0},{"$f":"COUNTIFS('LSRW-4'!$M10:$M67,\"4\",'LSRW-4'!$R10:$R67,\"C\")","v":0},{"$f":"COUNTIFS('LSRW-5'!$M10:$M67,\"5\",'LSRW-5'!$R10:$R67,\"A\")","v":0},{"$f":"COUNTIFS('LSRW-5'!$M10:$M67,\"5\",'LSRW-5'!$R10:$R67,\"B\")","v":1},{"$f":"COUNTIFS('LSRW-5'!$M10:$M67,\"5\",'LSRW-5'!$R10:$R67,\"C\")","v":0}]

{"sheet":"B-SA2","index":12,"n_rows":18,"n_cols":23,"rows_kept":18,"merged":[[0,0,1,4],[0,5,1,22],[2,0,2,22],[3,0,3,22],[4,0,4,22],[5,0,5,3],[5,4,5,12],[5,13,5,18],[5,19,5,22],[6,0,6,3],[6,4,6,7],[6,13,6,18],[6,19,6,22],[7,0,8,2],[7,3,8,7],[7,8,7,10],[7,11,7,13],[7,14,7,16],[7,17,7,19],[7,20,7,22],[9,0,18,2],[9,3,10,7],[9,8,10,8],[9,9,10,9],[9,10,10,10],[9,11,10,11],[9,12,10,12],[9,13,10,13],[9,14,10,14],[9,15,10,15],[9,16,10,16],[9,17,10,17],[9,18,10,18],[9,19,10,19],[9,20,10,20],[9,21,10,21],[9,22,10,22],[11,3,12,7],[11,8,12,8],[11,9,12,9],[11,10,12,10],[11,11,12,11],[11,12,12,12],[11,13,12,13],[11,14,12,14],[11,15,12,15],[11,16,12,16],[11,17,12,17],[11,18,12,18],[11,19,12,19],[11,20,12,20],[11,21,12,21],[11,22,12,22],[13,3,14,7],[13,8,14,8],[13,9,14,9],[13,10,14,10],[13,11,14,11],[13,12,14,12],[13,13,14,13],[13,14,14,14],[13,15,14,15],[13,16,14,16],[13,17,14,17],[13,18,14,18],[13,19,14,19],[13,20,14,20],[13,21,14,21],[13,22,14,22],[15,3,16,7],[15,8,16,8],[15,9,16,9],[15,10,16,10],[15,11,16,11],[15,12,16,12],[15,13,16,13],[15,14,16,14],[15,15,16,15],[15,16,16,16],[15,17,16,17],[15,18,16,18],[15,19,16,19],[15,20,16,20],[15,21,16,21],[15,22,16,22],[17,3,18,7],[17,8,18,8],[17,9,18,9],[17,10,18,10],[17,11,18,11],[17,12,18,12],[17,13,18,13],[17,14,18,14],[17,15,18,15],[17,16,18,16],[17,17,18,17],[17,18,18,18],[17,19,18,19],[17,20,18,20],[17,21,18,21],[17,22,18,22]]}
["fo|ky; dk uke %&",{"$nulls":4},{"$f":"REPORTS!$D$7","v":0}]
[]
["lrr ,oa O;kid ewY;kadu dk;ZØe 2018&19"]
["d{kkokj ,oa vf/kxe mÌs“;ksa ds vuqlkj d{kkLrj ds Nk«kksa dh xzsMhax"]
["izi= & ^c*"]
["fo‘k;k/;kid dk uke&",{"$nulls":3},{"$f":"REPORTS!K8","v":0},{"$nulls":8},"fnukad&",{"$nulls":5},"2018-02-12"]
["ekg dk uke&",{"$nulls":3},"JULY",{"$nulls":8},"ASSESSMENT-",{"$nulls":5},"SA-2"]
["SUBJECT",null,null,"LEARNING OBJECTIVES",{"$nulls":4},"CLASS-1",null,null,"CLASS-2",null,null,"CLASS-3",null,null,"CLASS-4",null,null,"CLASS-5"]
[{"$nulls":8},"A","B","C","A","B","C","A","B","C","A","B","C","A","B","C"]
[{"$f":"REPORTS!C8","v":0},null,null,"Listening with Understanding",{"$nulls":4},{"$f":"COUNTIF('LSRW-1'!U10:U69,\"A\")","v":0},{"$f":"COUNTIF('LSRW-1'!U10:U69,\"B\")","v":0},{"$f":"COUNTIF('LSRW-1'!U10:U69,\"C\")","v":0},{"$f":"COUNTIF('LSRW-2'!U10:U1048576,\"A\")","v":0},{"$f":"COUNTIF('LSRW-2'!U10:U1048576,\"B\")","v":0},{"$f":"COUNTIF('LSRW-2'!U10:U1048576,\"C\")","v":0},{"$f":"COUNTIF('LSRW-3'!U10:U69,\"A\")","v":0},{"$f":"COUNTIF('LSRW-3'!U10:U69,\"B\")","v":0},{"$f":"COUNTIF('LSRW-3'!U10:U69,\"C\")","v":0},{"$f":"COUNTIF('LSRW-4'!U10:U69,\"A\")","v":0},{"$f":"COUNTIF('LSRW-4'!U10:U69,\"B\")","v":0},{"$f":"COUNTIF('LSRW-4'!U10:U69,\"C\")","v":0},{"$f":"COUNTIF('LSRW-5'!U10:U69,\"A\")","v":2},{"$f":"COUNTIF('LSRW-5'!U10:U69,\"B\")","v":0},{"$f":"COUNTIF('LSRW-5'!U10:U69,\"C\")","v":0}]
[]
[{"$nulls":3},"Speaking with Confidence",{"$nulls":4},{"$f":"COUNTIF('LSRW-1'!V10:V69,\"A\")","v":0},{"$f":"COUNTIF('LSRW-1'!V10:V69,\"B\")","v":0},{"$f":"COUNTIF('LSRW-1'!V10:V69,\"C\")","v":0},{"$f":"COUNTIF('LSRW-2'!V10:V69,\"A\")","v":0},{"$f":"COUNTIF('LSRW-2'!V10:V69,\"B\")","v":0},{"$f":"COUNTIF('LSRW-2'!V10:V69,\"C\")","v":0},{"$f":"COUNTIF('LSRW-3'!V10:V69,\"A\")","v":0},{"$f":"COUNTIF('LSRW-3'!V10:V69,\"B\")","v":0},{"$f":"COUNTIF('LSRW-3'!V10:V69,\"C\")","v":0},{"$f":"COUNTIF('LSRW-4'!V10:V69,\"A\")","v":0},{"$f":"COUNTIF('LSRW-4'!V10:V69,\"B\")","v":0},{"$f":"COUNTIF('LSRW-4'!V10:V69,\"C\")","v":0},{"$f":"COUNTIF('LSRW-5'!V10:V69,\"A\")","v":2},{"$f":"COUNTIF('LSRW-5'!V10:V69,\"B\")","v":0},{"$f":"COUNTIF('LSRW-5'!V10:V69,\"C\")","v":0}]
[]
[{"$nulls":3},"Reading with Comprehension",{"$nulls":4},{"$f":"COUNTIFS('LSRW-1'!T10:T67,\"1\",'LSRW-1'!W10:W67,\"A\")","v":0},{"$f":"COUNTIFS('LSRW-1'!T10:T67,\"1\",'LSRW-1'!W10:W67,\"B\")","v":0},{"$f":"COUNTIFS('LSRW-1'!T10:T67,\"1\",'LSRW-1'!W10:W67,\"C\")","v":0},{"$f":"COUNTIFS('LSRW-2'!$T10:$T67,\"2\",'LSRW-2'!$W10:$W67,\"A\")","v":0},{"$f":"COUNTIFS('LSRW-2'!$T10:$T67,\"2\",'LSRW-2'!$W10:$W67,\"B\")","v":0},{"$f":"COUNTIFS('LSRW-2'!$T10:$T67,\"2\",'LSRW-2'!$W10:$W67,\"C\")","v":0},{"$f":"COUNTIFS('LSRW-3'!$T10:$T67,\"3\",'LSRW-3'!$W10:$W67,\"A\")","v":0},{"$f":"COUNTIFS('LSRW-3'!$T10:$T67,\"3\",'LSRW-3'!$W10:$W67,\"B\")","v":0},{"$f":"COUNTIFS('LSRW-3'!$T10:$T67,\"3\",'LSRW-3'!$W10:$W67,\"C\")","v":0},{"$f":"COUNTIFS('LSRW-4'!$T10:$T67,\"4\",'LSRW-4'!$W10:$W67,\"A\")","v":0},{"$f":"COUNTIFS('LSRW-4'!$T10:$T67,\"4\",'LSRW-4'!$W10:$W67,\"B\")","v":0},{"$f":"COUNTIFS('LSRW-4'!$T10:$T67,\"4\",'LSRW-4'!$W10:$W67,\"C\")","v":0},{"$f":"COUNTIFS('LSRW-5'!$T10:$T67,\"5\",'LSRW-5'!$W10:$W67,\"A\")","v":1},{"$f":"COUNTIFS('LSRW-5'!$T10:$T67,\"5\",'LSRW-5'!$W10:$W67,\"B\")","v":1},{"$f":"COUNTIFS('LSRW-5'!$T10:$T67,\"5\",'LSRW-5'!$W10:$W67,\"C\")","v":0}]
[]
[{"$nulls":3},"Writing",{"$nulls":4},{"$f":"COUNTIFS('LSRW-1'!T10:T67,\"1\",'LSRW-1'!X10:X67,\"A\")","v":0},{"$f":"COUNTIFS('LSRW-1'!T10:T67,\"1\",'LSRW-1'!X10:X67,\"B\")","v":0},{"$f":"COUNTIFS('LSRW-1'!T10:T67,\"1\",'LSRW-1'!X10:X67,\"C\")","v":0},{"$f":"COUNTIFS('LSRW-2'!$T10:$T67,\"2\",'LSRW-2'!$X10:$X67,\"A\")","v":0},{"$f":"COUNTIFS('LSRW-2'!$T10:$T67,\"2\",'LSRW-2'!$X10:$X67,\"B\")","v":0},{"$f":"COUNTIFS('LSRW-2'!$T10:$T67,\"2\",'LSRW-2'!$X10:$X67,\"C\")","v":0},{"$f":"COUNTIFS('LSRW-3'!$T10:$T67,\"3\",'LSRW-3'!$X10:$X67,\"A\")","v":0},{"$f":"COUNTIFS('LSRW-3'!$T10:$T67,\"3\",'LSRW-3'!$X10:$X67,\"B\")","v":0},{"$f":"COUNTIFS('LSRW-3'!$T10:$T67,\"3\",'LSRW-3'!$X10:$X67,\"C\")","v":0},{"$f":"COUNTIFS('LSRW-4'!$T10:$T67,\"4\",'LSRW-4'!$X10:$X67,\"A\")","v":0},{"$f":"COUNTIFS('LSRW-4'!$T10:$T67,\"4\",'LSRW-4'!$X10:$X67,\"B\")","v":0},{"$f":"COUNTIFS('LSRW-4'!$T10:$T67,\"4\",'LSRW-4'!$X10:$X67,\"C\")","v":0},{"$f":"COUNTIFS('LSRW-5'!$T10:$T67,\"5\",'LSRW-5'!$X10:$X67,\"A\")","v":1},{"$f":"COUNTIFS('LSRW-5'!$T10:$T67,\"5\",'LSRW-5'!$X10:$X67,\"B\")","v":1},{"$f":"COUNTIFS('LSRW-5'!$T10:$T67,\"5\",'LSRW-5'!$X10:$X67,\"C\")","v":0}]
[]
[{"$nulls":3},"Functional Grammar",{"$nulls":4},{"$f":"COUNTIFS('LSRW-1'!T10:T67,\"1\",'LSRW-1'!Y10:Y67,\"A\")","v":0},{"$f":"COUNTIFS('LSRW-1'!T10:T67,\"1\",'LSRW-1'!Y10:Y67,\"B\")","v":0},{"$f":"COUNTIFS('LSRW-1'!T10:T67,\"1\",'LSRW-1'!Y10:Y67,\"C\")","v":0},{"$f":"COUNTIFS('LSRW-2'!$T10:$T67,\"2\",'LSRW-2'!$Y10:$Y67,\"A\")","v":0},{"$f":"COUNTIFS('LSRW-2'!$T10:$T67,\"2\",'LSRW-2'!$Y10:$Y67,\"B\")","v":0},{"$f":"COUNTIFS('LSRW-2'!$T10:$T67,\"2\",'LSRW-2'!$Y10:$Y67,\"C\")","v":0},{"$f":"COUNTIFS('LSRW-3'!$T10:$T67,\"3\",'LSRW-3'!$Y10:$Y67,\"A\")","v":0},{"$f":"COUNTIFS('LSRW-3'!$T10:$T67,\"3\",'LSRW-3'!$Y10:$Y67,\"B\")","v":0},{"$f":"COUNTIFS('LSRW-3'!$T10:$T67,\"3\",'LSRW-3'!$Y10:$Y67,\"C\")","v":0},{"$f":"COUNTIFS('LSRW-4'!$T10:$T67,\"4\",'LSRW-4'!$Y10:$Y67,\"A\")","v":0},{"$f":"COUNTIFS('LSRW-4'!$T10:$T67,\"4\",'LSRW-4'!$Y10:$Y67,\"B\")","v":0},{"$f":"COUNTIFS('LSRW-4'!$T10:$T67,\"4\",'LSRW-4'!$Y10:$Y67,\"C\")","v":0},{"$f":"COUNTIFS('LSRW-5'!$T10:$T67,\"5\",'LSRW-5'!$Y10:$Y67,\"A\")","v":0},{"$f":"COUNTIFS('LSRW-5'!$T10:$T67,\"5\",'LSRW-5'!$Y10:$Y67,\"B\")","v":2},{"$f":"COUNTIFS('LSRW-5'!$T10:$T67,\"5\",'LSRW-5'!$Y10:$Y67,\"C\")","v":0}]

{"sheet":"B-SA3","index":13,"n_rows":18,"n_cols":23,"rows_kept":18,"merged":[[0,0,1,4],[0,5,1,22],[2,0,2,22],[3,0,3,22],[4,0,4,22],[5,0,5,3],[5,4,5,12],[5,13,5,18],[5,19,5,22],[6,0,6,3],[6,4,6,7],[6,13,6,18],[6,19,6,22],[7,0,8,2],[7,3,8,7],[7,8,7,10],[7,11,7,13],[7,14,7,16],[7,17,7,19],[7,20,7,22],[9,0,18,2],[9,3,10,7],[9,8,10,8],[9,9,10,9],[9,10,10,10],[9,11,10,11],[9,12,10,12],[9,13,10,13],[9,14,10,14],[9,15,10,15],[9,16,10,16],[9,17,10,17],[9,18,10,18],[9,19,10,19],[9,20,10,20],[9,21,10,21],[9,22,10,22],[11,3,12,7],[11,8,12,8],[11,9,12,9],[11,10,12,10],[11,11,12,11],[11,12,12,12],[11,13,12,13],[11,14,12,14],[11,15,12,15],[11,16,12,16],[11,17,12,17],[11,18,12,18],[11,19,12,19],[11,20,12,20],[11,21,12,21],[11,22,12,22],[13,3,14,7],[13,8,14,8],[13,9,14,9],[13,10,14,10],[13,11,14,11],[13,12,14,12],[13,13,14,13],[13,14,14,14],[13,15,14,15],[13,16,14,16],[13,17,14,17],[13,18,14,18],[13,19,14,19],[13,20,14,20],[13,21,14,21],[13,22,14,22],[15,3,16,7],[15,8,16,8],[15,9,16,9],[15,10,16,10],[15,11,16,11],[15,12,16,12],[15,13,16,13],[15,14,16,14],[15,15,16,15],[15,16,16,16],[15,17,16,17],[15,18,16,18],[15,19,16,19],[15,20,16,20],[15,21,16,21],[15,22,16,22],[17,3,18,7],[17,8,18,8],[17,9,18,9],[17,10,18,10],[17,11,18,11],[17,12,18,12],[17,13,18,13],[17,14,18,14],[17,15,18,15],[17,16,18,16],[17,17,18,17],[17,18,18,18],[17,19,18,19],[17,20,18,20],[17,21,18,21],[17,22,18,22]]}
["fo|ky; dk uke %&",{"$nulls":4},{"$f":"REPORTS!$D$7","v":0}]
[]
["lrr ,oa O;kid ewY;kadu dk;ZØe 2018&19"]
["d{kkokj ,oa vf/kxe mÌs“;ksa ds vuqlkj d{kkLrj ds Nk«kksa dh xzsMhax"]
["izi= & ^c*"]
["fo‘k;k/;kid dk uke&",{"$nulls":3},{"$f":"REPORTS!K8","v":0},{"$nulls":8},"fnukad&",{"$nulls":5},"2018-02-02"]
["ekg dk uke&",{"$nulls":3},"JANUARY",{"$nulls":8},"ASSESSMENT-",{"$nulls":5},"SA-3"]
["SUBJECT",null,null,"LEARNING OBJECTIVES",{"$nulls":4},"CLASS-1",null,null,"CLASS-2",null,null,"CLASS-3",null,null,"CLASS-4",null,null,"CLASS-5"]
[{"$nulls":8},"A","B","C","A","B","C","A","B","C","A","B","C","A","B","C"]
[{"$f":"REPORTS!C8","v":0},null,null,"Listening with Understanding",{"$nulls":4},{"$f":"COUNTIF('LSRW-1'!AB10:AB69,\"A\")","v":0},{"$f":"COUNTIF('LSRW-1'!AB10:AB69,\"B\")","v":0},{"$f":"COUNTIF('LSRW-1'!AB10:AB69,\"C\")","v":0},{"$f":"COUNTIF('LSRW-2'!AB10:AB69,\"A\")","v":0},{"$f":"COUNTIF('LSRW-2'!AB10:AB69,\"B\")","v":0},{"$f":"COUNTIF('LSRW-2'!AB10:AB69,\"C\")","v":0},{"$f":"COUNTIF('LSRW-3'!AB10:AB69,\"A\")","v":0},{"$f":"COUNTIF('LSRW-3'!AB10:AB69,\"B\")","v":0},{"$f":"COUNTIF('LSRW-3'!AB10:AB69,\"C\")","v":0},{"$f":"COUNTIF('LSRW-4'!AB10:AB69,\"A\")","v":0},{"$f":"COUNTIF('LSRW-4'!AB10:AB69,\"B\")","v":0},{"$f":"COUNTIF('LSRW-4'!AB10:AB69,\"C\")","v":0},{"$f":"COUNTIF('LSRW-5'!AB10:AB69,\"A\")","v":2},{"$f":"COUNTIF('LSRW-5'!AB10:AB69,\"B\")","v":0},{"$f":"COUNTIF('LSRW-5'!AB10:AB69,\"C\")","v":0}]
[]
[{"$nulls":3},"Speaking with Confidence",{"$nulls":4},{"$f":"COUNTIF('LSRW-1'!AC10:AC69,\"A\")","v":0},{"$f":"COUNTIF('LSRW-1'!AC10:AC69,\"B\")","v":0},{"$f":"COUNTIF('LSRW-1'!AC10:AC69,\"C\")","v":0},{"$f":"COUNTIF('LSRW-2'!AC10:AC69,\"A\")","v":0},{"$f":"COUNTIF('LSRW-2'!AC10:AC69,\"B\")","v":0},{"$f":"COUNTIF('LSRW-2'!AC10:AC69,\"C\")","v":0},{"$f":"COUNTIF('LSRW-3'!AC10:AC69,\"A\")","v":0},{"$f":"COUNTIF('LSRW-3'!AC10:AC69,\"B\")","v":0},{"$f":"COUNTIF('LSRW-3'!AC10:AC69,\"C\")","v":0},{"$f":"COUNTIF('LSRW-4'!AC10:AC69,\"A\")","v":0},{"$f":"COUNTIF('LSRW-4'!AC10:AC69,\"B\")","v":0},{"$f":"COUNTIF('LSRW-4'!AC10:AC69,\"C\")","v":0},{"$f":"COUNTIF('LSRW-5'!AC10:AC69,\"A\")","v":2},{"$f":"COUNTIF('LSRW-5'!AC10:AC69,\"B\")","v":0},{"$f":"COUNTIF('LSRW-5'!AC10:AC69,\"C\")","v":0}]
[]
[{"$nulls":3},"Reading with Comprehension",{"$nulls":4},{"$f":"COUNTIFS('LSRW-1'!AA10:AA67,\"1\",'LSRW-1'!AD10:AD67,\"A\")","v":0},{"$f":"COUNTIFS('LSRW-1'!AA10:AA67,\"1\",'LSRW-1'!AD10:AD67,\"B\")","v":0},{"$f":"COUNTIFS('LSRW-1'!AA10:AA67,\"1\",'LSRW-1'!AD10:AD67,\"C\")","v":0},{"$f":"COUNTIFS('LSRW-2'!$AA10:$AA67,\"2\",'LSRW-2'!$AD10:$AD67,\"A\")","v":0},{"$f":"COUNTIFS('LSRW-2'!$AA10:$AA67,\"2\",'LSRW-2'!$AD10:$AD67,\"B\")","v":0},{"$f":"COUNTIFS('LSRW-2'!$AA10:$AA67,\"2\",'LSRW-2'!$AD10:$AD67,\"C\")","v":0},{"$f":"COUNTIFS('LSRW-3'!$AA10:$AA67,\"3\",'LSRW-3'!$AD10:$AD67,\"A\")","v":0},{"$f":"COUNTIFS('LSRW-3'!$AA10:$AA67,\"3\",'LSRW-3'!$AD10:$AD67,\"B\")","v":0},{"$f":"COUNTIFS('LSRW-3'!$AA10:$AA67,\"3\",'LSRW-3'!$AD10:$AD67,\"C\")","v":0},{"$f":"COUNTIFS('LSRW-4'!$AA10:$AA67,\"4\",'LSRW-4'!$AD10:$AD67,\"A\")","v":0},{"$f":"COUNTIFS('LSRW-4'!$AA10:$AA67,\"4\",'LSRW-4'!$AD10:$AD67,\"B\")","v":0},{"$f":"COUNTIFS('LSRW-4'!$AA10:$AA67,\"4\",'LSRW-4'!$AD10:$AD67,\"C\")","v":0},{"$f":"COUNTIFS('LSRW-5'!$AA10:$AA67,\"5\",'LSRW-5'!$AD10:$AD67,\"A\")","v":1},{"$f":"COUNTIFS('LSRW-5'!$AA10:$AA67,\"5\",'LSRW-5'!$AD10:$AD67,\"B\")","v":1},{"$f":"COUNTIFS('LSRW-5'!$AA10:$AA67,\"5\",'LSRW-5'!$AD10:$AD67,\"C\")","v":0}]
[]
[{"$nulls":3},"Writing",{"$nulls":4},{"$f":"COUNTIFS('LSRW-1'!AA10:AA67,\"1\",'LSRW-1'!AE10:AE67,\"A\")","v":0},{"$f":"COUNTIFS('LSRW-1'!$AA10:$AA67,\"1\",'LSRW-1'!$AE10:$AE67,\"B\")","v":0},{"$f":"COUNTIFS('LSRW-1'!AA10:AA67,\"1\",'LSRW-1'!AE10:AE67,\"C\")","v":0},{"$f":"COUNTIFS('LSRW-2'!$AA10:$AA67,\"2\",'LSRW-2'!$AE10:$AE67,\"A\")","v":0},{"$f":"COUNTIFS('LSRW-2'!$AA10:$AA67,\"2\",'LSRW-2'!$AE10:$AE67,\"B\")","v":0},{"$f":"COUNTIFS('LSRW-2'!$AA10:$AA67,\"2\",'LSRW-2'!$AE10:$AE67,\"C\")","v":0},{"$f":"COUNTIFS('LSRW-3'!$AA10:$AA67,\"3\",'LSRW-3'!$AE10:$AE67,\"A\")","v":0},{"$f":"COUNTIFS('LSRW-3'!$AA10:$AA67,\"3\",'LSRW-3'!$AE10:$AE67,\"B\")","v":0},{"$f":"COUNTIFS('LSRW-3'!$AA10:$AA67,\"3\",'LSRW-3'!$AE10:$AE67,\"C\")","v":0},{"$f":"COUNTIFS('LSRW-4'!$AA10:$AA67,\"4\",'LSRW-4'!$AE10:$AE67,\"A\")","v":0},{"$f":"COUNTIFS('LSRW-4'!$AA10:$AA67,\"4\",'LSRW-4'!$AE10:$AE67,\"B\")","v":0},{"$f":"COUNTIFS('LSRW-4'!$AA10:$AA67,\"4\",'LSRW-4'!$AE10:$AE67,\"C\")","v":0},{"$f":"COUNTIFS('LSRW-5'!$AA10:$AA67,\"5\",'LSRW-5'!$AE10:$AE67,\"A\")","v":2},{"$f":"COUNTIFS('LSRW-5'!$AA10:$AA67,\"5\",'LSRW-5'!$AE10:$AE67,\"B\")","v":0},{"$f":"COUNTIFS('LSRW-5'!$AA10:$AA67,\"5\",'LSRW-5'!$AE10:$AE67,\"C\")","v":0}]
[]
[{"$nulls":3},"Functional Grammar",{"$nulls":4},{"$f":"COUNTIFS('LSRW-1'!AA10:AA67,\"1\",'LSRW-1'!AF10:AF67,\"A\")","v":0},{"$f":"COUNTIFS('LSRW-1'!AA10:AA67,\"1\",'LSRW-1'!AF10:AF67,\"B\")","v":0},{"$f":"COUNTIFS('LSRW-1'!AA10:AA67,\"1\",'LSRW-1'!AF10:AF67,\"C\")","v":0},{"$f":"COUNTIFS('LSRW-2'!$AA10:$AA67,\"2\",'LSRW-2'!$AF10:$AF67,\"A\")","v":0},{"$f":"COUNTIFS('LSRW-2'!$AA10:$AA67,\"2\",'LSRW-2'!$AF10:$AF67,\"B\")","v":0},{"$f":"COUNTIFS('LSRW-2'!$AA10:$AA67,\"2\",'LSRW-2'!$AF10:$AF67,\"C\")","v":0},{"$f":"COUNTIFS('LSRW-3'!$AA10:$AA67,\"3\",'LSRW-3'!$AF10:$AF67,\"A\")","v":0},{"$f":"COUNTIFS('LSRW-3'!$AA10:$AA67,\"3\",'LSRW-3'!$AF10:$AF67,\"B\")","v":0},{"$f":"COUNTIFS('LSRW-3'!$AA10:$AA67,\"3\",'LSRW-3'!$AF10:$AF67,\"C\")","v":0},{"$f":"COUNTIFS('LSRW-4'!$AA10:$AA67,\"4\",'LSRW-4'!$AF10:$AF67,\"A\")","v":0},{"$f":"COUNTIFS('LSRW-4'!$AA10:$AA67,\"4\",'LSRW-4'!$AF10:$AF67,\"B\")","v":0},{"$f":"COUNTIFS('LSRW-4'!$AA10:$AA67,\"4\",'LSRW-4'!$AF10:$AF67,\"C\")","v":0},{"$f":"COUNTIFS('LSRW-5'!$AA10:$AA67,\"5\",'LSRW-5'!$AF10:$AF67,\"A\")","v":1},{"$f":"COUNTIFS('LSRW-5'!$AA10:$AA67,\"5\",'LSRW-5'!$AF10:$AF67,\"B\")","v":1},{"$f":"COUNTIFS('LSRW-5'!$AA10:$AA67,\"5\",'LSRW-5'!$AF10:$AF67,\"C\")","v":0}]

{"sheet":"LSRW-1","index":14,"n_rows":69,"n_cols":33,"rows_kept":69,"merged":[[0,0,1,32],[2,0,2,32],[3,0,3,32],[4,0,4,2],[4,4,4,5],[4,6,4,14],[4,15,4,22],[4,23,4,32],[5,0,5,32],[6,0,8,0],[6,1,8,1],[6,2,8,2],[6,3,8,3],[6,4,8,4],[6,5,6,32],[7,5,7,10],[7,11,8,11],[7,12,7,17],[7,18,8,18],[7,19,7,24],[7,25,8,25],[7,26,7,31],[7,32,8,32]]}
[{"$f":"REPORTS!$D$7","v":0}]
[]
["lrr ,oa O;kid ewY;kadu dk;ZØe 2018&19"]
["fo|ky; esa cPpksa ds 'kSf{kd Lrj dh fLFkfr"]
["CLASS-",null,null,"1ST","SUBJECT-",null,{"$f":"REPORTS!C8","v":0},{"$nulls":8},"SUBJECT TEACHER-",{"$nulls":7},{"$f":"REPORTS!K8","v":0}]
["LEARNING OBJECTIVE WISE GRADING"]
["NO","SR NO","CLASS","STUDENT NAME","FATHER NAME","GRADING"]
[{"$nulls":5},"BASELINE",{"$nulls":5},"AG","SA-1",{"$nulls":5},"AG","SA-2",{"$nulls":5},"AG","SA-3",{"$nulls":5},"AG"]
[{"$nulls":5},"CL","L","S","R","W","FG",null,"CL","L","S","R","W","FG",null,"CL","L","S","R","W","FG",null,"CL","L","S","R","W","FG"]
[{"$f":"'PRF-1'!A8","v":0},{"$f":"'PRF-1'!G8","v":0},{"$f":"'PRF-1'!B8","v":0},{"$f":"'PRF-1'!D8","v":0},{"$f":"'PRF-1'!E8","v":0},{"$f":"'PRF-1'!I8","v":0},{"$nulls":6},{"$f":"'PRF-1'!K8","v":0},{"$nulls":6},{"$f":"'PRF-1'!M8","v":0},{"$nulls":6},{"$f":"'PRF-1'!O8","v":0}]
[{"$f":"'PRF-1'!A9","v":0},{"$f":"'PRF-1'!G9","v":0},{"$f":"'PRF-1'!B9","v":0},{"$f":"'PRF-1'!D9","v":0},{"$f":"'PRF-1'!E9","v":0},{"$f":"'PRF-1'!I9","v":0},{"$nulls":6},{"$f":"'PRF-1'!K9","v":0},{"$nulls":6},{"$f":"'PRF-1'!M9","v":0},{"$nulls":6},{"$f":"'PRF-1'!O9","v":0}]
[{"$f":"'PRF-1'!A10","v":0},{"$f":"'PRF-1'!G10","v":0},{"$f":"'PRF-1'!B10","v":0},{"$f":"'PRF-1'!D10","v":0},{"$f":"'PRF-1'!E10","v":0},{"$f":"'PRF-1'!I10","v":0},{"$nulls":6},{"$f":"'PRF-1'!K10","v":0},{"$nulls":6},{"$f":"'PRF-1'!M10","v":0},{"$nulls":6},{"$f":"'PRF-1'!O10","v":0}]
[{"$f":"'PRF-1'!A11","v":0},{"$f":"'PRF-1'!G11","v":0},{"$f":"'PRF-1'!B11","v":0},{"$f":"'PRF-1'!D11","v":0},{"$f":"'PRF-1'!E11","v":0},{"$f":"'PRF-1'!I11","v":0},{"$nulls":6},{"$f":"'PRF-1'!K11","v":0},{"$nulls":6},{"$f":"'PRF-1'!M11","v":0},{"$nulls":6},{"$f":"'PRF-1'!O11","v":0}]
[{"$f":"'PRF-1'!A12","v":0},{"$f":"'PRF-1'!G12","v":0},{"$f":"'PRF-1'!B12","v":0},{"$f":"'PRF-1'!D12","v":0},{"$f":"'PRF-1'!E12","v":0},{"$f":"'PRF-1'!I12","v":0},{"$nulls":6},{"$f":"'PRF-1'!K12","v":0},{"$nulls":6},{"$f":"'PRF-1'!M12","v":0},{"$nulls":6},{"$f":"'PRF-1'!O12","v":0}]
[{"$f":"'PRF-1'!A13","v":0},{"$f":"'PRF-1'!G13","v":0},{"$f":"'PRF-1'!B13","v":0},{"$f":"'PRF-1'!D13","v":0},{"$f":"'PRF-1'!E13","v":0},{"$f":"'PRF-1'!I13","v":0},{"$nulls":6},{"$f":"'PRF-1'!K13","v":0},{"$nulls":6},{"$f":"'PRF-1'!M13","v":0},{"$nulls":6},{"$f":"'PRF-1'!O13","v":0}]
[{"$f":"'PRF-1'!A14","v":0},{"$f":"'PRF-1'!G14","v":0},{"$f":"'PRF-1'!B14","v":0},{"$f":"'PRF-1'!D14","v":0},{"$f":"'PRF-1'!E14","v":0},{"$f":"'PRF-1'!I14","v":0},{"$nulls":6},{"$f":"'PRF-1'!K14","v":0},{"$nulls":6},{"$f":"'PRF-1'!M14","v":0},{"$nulls":6},{"$f":"'PRF-1'!O14","v":0}]
[{"$f":"'PRF-1'!A15","v":0},{"$f":"'PRF-1'!G15","v":0},{"$f":"'PRF-1'!B15","v":0},{"$f":"'PRF-1'!D15","v":0},{"$f":"'PRF-1'!E15","v":0},{"$f":"'PRF-1'!I15","v":0},{"$nulls":6},{"$f":"'PRF-1'!K15","v":0},{"$nulls":6},{"$f":"'PRF-1'!M15","v":0},{"$nulls":6},{"$f":"'PRF-1'!O15","v":0}]
[{"$f":"'PRF-1'!A16","v":0},{"$f":"'PRF-1'!G16","v":0},{"$f":"'PRF-1'!B16","v":0},{"$f":"'PRF-1'!D16","v":0},{"$f":"'PRF-1'!E16","v":0},{"$f":"'PRF-1'!I16","v":0},{"$nulls":6},{"$f":"'PRF-1'!K16","v":0},{"$nulls":6},{"$f":"'PRF-1'!M16","v":0},{"$nulls":6},{"$f":"'PRF-1'!O16","v":0}]
[{"$f":"'PRF-1'!A17","v":0},{"$f":"'PRF-1'!G17","v":0},{"$f":"'PRF-1'!B17","v":0},{"$f":"'PRF-1'!D17","v":0},{"$f":"'PRF-1'!E17","v":0},{"$f":"'PRF-1'!I17","v":0},{"$nulls":6},{"$f":"'PRF-1'!K17","v":0},{"$nulls":6},{"$f":"'PRF-1'!M17","v":0},{"$nulls":6},{"$f":"'PRF-1'!O17","v":0}]
[{"$f":"'PRF-1'!A18","v":0},{"$f":"'PRF-1'!G18","v":0},{"$f":"'PRF-1'!B18","v":0},{"$f":"'PRF-1'!D18","v":0},{"$f":"'PRF-1'!E18","v":0},{"$f":"'PRF-1'!I18","v":0},{"$nulls":6},{"$f":"'PRF-1'!K18","v":0},{"$nulls":6},{"$f":"'PRF-1'!M18","v":0},{"$nulls":6},{"$f":"'PRF-1'!O18","v":0}]
[{"$f":"'PRF-1'!A19","v":0},{"$f":"'PRF-1'!G19","v":0},{"$f":"'PRF-1'!B19","v":0},{"$f":"'PRF-1'!D19","v":0},{"$f":"'PRF-1'!E19","v":0},{"$f":"'PRF-1'!I19","v":0},{"$nulls":6},{"$f":"'PRF-1'!K19","v":0},{"$nulls":6},{"$f":"'PRF-1'!M19","v":0},{"$nulls":6},{"$f":"'PRF-1'!O19","v":0}]
[{"$f":"'PRF-1'!A20","v":0},{"$f":"'PRF-1'!G20","v":0},{"$f":"'PRF-1'!B20","v":0},{"$f":"'PRF-1'!D20","v":0},{"$f":"'PRF-1'!E20","v":0},{"$f":"'PRF-1'!I20","v":0},{"$nulls":6},{"$f":"'PRF-1'!K20","v":0},{"$nulls":6},{"$f":"'PRF-1'!M20","v":0},{"$nulls":6},{"$f":"'PRF-1'!O20","v":0}]
[{"$f":"'PRF-1'!A21","v":0},{"$f":"'PRF-1'!G21","v":0},{"$f":"'PRF-1'!B21","v":0},{"$f":"'PRF-1'!D21","v":0},{"$f":"'PRF-1'!E21","v":0},{"$f":"'PRF-1'!I21","v":0},{"$nulls":6},{"$f":"'PRF-1'!K21","v":0},{"$nulls":6},{"$f":"'PRF-1'!M21","v":0},{"$nulls":6},{"$f":"'PRF-1'!O21","v":0}]
[{"$f":"'PRF-1'!A22","v":0},{"$f":"'PRF-1'!G22","v":0},{"$f":"'PRF-1'!B22","v":0},{"$f":"'PRF-1'!D22","v":0},{"$f":"'PRF-1'!E22","v":0},{"$f":"'PRF-1'!I22","v":0},{"$nulls":6},{"$f":"'PRF-1'!K22","v":0},{"$nulls":6},{"$f":"'PRF-1'!M22","v":0},{"$nulls":6},{"$f":"'PRF-1'!O22","v":0}]
[{"$f":"'PRF-1'!A23","v":0},{"$f":"'PRF-1'!G23","v":0},{"$f":"'PRF-1'!B23","v":0},{"$f":"'PRF-1'!D23","v":0},{"$f":"'PRF-1'!E23","v":0},{"$f":"'PRF-1'!I23","v":0},{"$nulls":6},{"$f":"'PRF-1'!K23","v":0},{"$nulls":6},{"$f":"'PRF-1'!M23","v":0},{"$nulls":6},{"$f":"'PRF-1'!O23","v":0}]
[{"$f":"'PRF-1'!A24","v":0},{"$f":"'PRF-1'!G24","v":0},{"$f":"'PRF-1'!B24","v":0},{"$f":"'PRF-1'!D24","v":0},{"$f":"'PRF-1'!E24","v":0},{"$f":"'PRF-1'!I24","v":0},{"$nulls":6},{"$f":"'PRF-1'!K24","v":0},{"$nulls":6},{"$f":"'PRF-1'!M24","v":0},{"$nulls":6},{"$f":"'PRF-1'!O24","v":0}]
[{"$f":"'PRF-1'!A25","v":0},{"$f":"'PRF-1'!G25","v":0},{"$f":"'PRF-1'!B25","v":0},{"$f":"'PRF-1'!D25","v":0},{"$f":"'PRF-1'!E25","v":0},{"$f":"'PRF-1'!I25","v":0},{"$nulls":6},{"$f":"'PRF-1'!K25","v":0},{"$nulls":6},{"$f":"'PRF-1'!M25","v":0},{"$nulls":6},{"$f":"'PRF-1'!O25","v":0}]
[{"$f":"'PRF-1'!A26","v":0},{"$f":"'PRF-1'!G26","v":0},{"$f":"'PRF-1'!B26","v":0},{"$f":"'PRF-1'!D26","v":0},{"$f":"'PRF-1'!E26","v":0},{"$f":"'PRF-1'!I26","v":0},{"$nulls":6},{"$f":"'PRF-1'!K26","v":0},{"$nulls":6},{"$f":"'PRF-1'!M26","v":0},{"$nulls":6},{"$f":"'PRF-1'!O26","v":0}]
[{"$f":"'PRF-1'!A27","v":0},{"$f":"'PRF-1'!G27","v":0},{"$f":"'PRF-1'!B27","v":0},{"$f":"'PRF-1'!D27","v":0},{"$f":"'PRF-1'!E27","v":0},{"$f":"'PRF-1'!I27","v":0},{"$nulls":6},{"$f":"'PRF-1'!K27","v":0},{"$nulls":6},{"$f":"'PRF-1'!M27","v":0},{"$nulls":6},{"$f":"'PRF-1'!O27","v":0}]
[{"$f":"'PRF-1'!A28","v":0},{"$f":"'PRF-1'!G28","v":0},{"$f":"'PRF-1'!B28","v":0},{"$f":"'PRF-1'!D28","v":0},{"$f":"'PRF-1'!E28","v":0},{"$f":"'PRF-1'!I28","v":0},{"$nulls":6},{"$f":"'PRF-1'!K28","v":0},{"$nulls":6},{"$f":"'PRF-1'!M28","v":0},{"$nulls":6},{"$f":"'PRF-1'!O28","v":0}]
[{"$f":"'PRF-1'!A29","v":0},{"$f":"'PRF-1'!G29","v":0},{"$f":"'PRF-1'!B29","v":0},{"$f":"'PRF-1'!D29","v":0},{"$f":"'PRF-1'!E29","v":0},{"$f":"'PRF-1'!I29","v":0},{"$nulls":6},{"$f":"'PRF-1'!K29","v":0},{"$nulls":6},{"$f":"'PRF-1'!M29","v":0},{"$nulls":6},{"$f":"'PRF-1'!O29","v":0}]
[{"$f":"'PRF-1'!A30","v":0},{"$f":"'PRF-1'!G30","v":0},{"$f":"'PRF-1'!B30","v":0},{"$f":"'PRF-1'!D30","v":0},{"$f":"'PRF-1'!E30","v":0},{"$f":"'PRF-1'!I30","v":0},{"$nulls":6},{"$f":"'PRF-1'!K30","v":0},{"$nulls":6},{"$f":"'PRF-1'!M30","v":0},{"$nulls":6},{"$f":"'PRF-1'!O30","v":0}]
[{"$f":"'PRF-1'!A31","v":0},{"$f":"'PRF-1'!G31","v":0},{"$f":"'PRF-1'!B31","v":0},{"$f":"'PRF-1'!D31","v":0},{"$f":"'PRF-1'!E31","v":0},{"$f":"'PRF-1'!I31","v":0},{"$nulls":6},{"$f":"'PRF-1'!K31","v":0},{"$nulls":6},{"$f":"'PRF-1'!M31","v":0},{"$nulls":6},{"$f":"'PRF-1'!O31","v":0}]
[{"$f":"'PRF-1'!A32","v":0},{"$f":"'PRF-1'!G32","v":0},{"$f":"'PRF-1'!B32","v":0},{"$f":"'PRF-1'!D32","v":0},{"$f":"'PRF-1'!E32","v":0},{"$f":"'PRF-1'!I32","v":0},{"$nulls":6},{"$f":"'PRF-1'!K32","v":0},{"$nulls":6},{"$f":"'PRF-1'!M32","v":0},{"$nulls":6},{"$f":"'PRF-1'!O32","v":0}]
[{"$f":"'PRF-1'!A33","v":0},{"$f":"'PRF-1'!G33","v":0},{"$f":"'PRF-1'!B33","v":0},{"$f":"'PRF-1'!D33","v":0},{"$f":"'PRF-1'!E33","v":0},{"$f":"'PRF-1'!I33","v":0},{"$nulls":6},{"$f":"'PRF-1'!K33","v":0},{"$nulls":6},{"$f":"'PRF-1'!M33","v":0},{"$nulls":6},{"$f":"'PRF-1'!O33","v":0}]
[{"$f":"'PRF-1'!A34","v":0},{"$f":"'PRF-1'!G34","v":0},{"$f":"'PRF-1'!B34","v":0},{"$f":"'PRF-1'!D34","v":0},{"$f":"'PRF-1'!E34","v":0},{"$f":"'PRF-1'!I34","v":0},{"$nulls":6},{"$f":"'PRF-1'!K34","v":0},{"$nulls":6},{"$f":"'PRF-1'!M34","v":0},{"$nulls":6},{"$f":"'PRF-1'!O34","v":0}]
[{"$f":"'PRF-1'!A35","v":0},{"$f":"'PRF-1'!G35","v":0},{"$f":"'PRF-1'!B35","v":0},{"$f":"'PRF-1'!D35","v":0},{"$f":"'PRF-1'!E35","v":0},{"$f":"'PRF-1'!I35","v":0},{"$nulls":6},{"$f":"'PRF-1'!K35","v":0},{"$nulls":6},{"$f":"'PRF-1'!M35","v":0},{"$nulls":6},{"$f":"'PRF-1'!O35","v":0}]
[{"$f":"'PRF-1'!A36","v":0},{"$f":"'PRF-1'!G36","v":0},{"$f":"'PRF-1'!B36","v":0},{"$f":"'PRF-1'!D36","v":0},{"$f":"'PRF-1'!E36","v":0},{"$f":"'PRF-1'!I36","v":0},{"$nulls":6},{"$f":"'PRF-1'!K36","v":0},{"$nulls":6},{"$f":"'PRF-1'!M36","v":0},{"$nulls":6},{"$f":"'PRF-1'!O36","v":0}]
[{"$f":"'PRF-1'!A37","v":0},{"$f":"'PRF-1'!G37","v":0},{"$f":"'PRF-1'!B37","v":0},{"$f":"'PRF-1'!D37","v":0},{"$f":"'PRF-1'!E37","v":0},{"$f":"'PRF-1'!I37","v":0},{"$nulls":6},{"$f":"'PRF-1'!K37","v":0},{"$nulls":6},{"$f":"'PRF-1'!M37","v":0},{"$nulls":6},{"$f":"'PRF-1'!O37","v":0}]
[{"$f":"'PRF-1'!A38","v":0},{"$f":"'PRF-1'!G38","v":0},{"$f":"'PRF-1'!B38","v":0},{"$f":"'PRF-1'!D38","v":0},{"$f":"'PRF-1'!E38","v":0},{"$f":"'PRF-1'!I38","v":0},{"$nulls":6},{"$f":"'PRF-1'!K38","v":0},{"$nulls":6},{"$f":"'PRF-1'!M38","v":0},{"$nulls":6},{"$f":"'PRF-1'!O38","v":0}]
[{"$f":"'PRF-1'!A39","v":0},{"$f":"'PRF-1'!G39","v":0},{"$f":"'PRF-1'!B39","v":0},{"$f":"'PRF-1'!D39","v":0},{"$f":"'PRF-1'!E39","v":0},{"$f":"'PRF-1'!I39","v":0},{"$nulls":6},{"$f":"'PRF-1'!K39","v":0},{"$nulls":6},{"$f":"'PRF-1'!M39","v":0},{"$nulls":6},{"$f":"'PRF-1'!O39","v":0}]
[{"$f":"'PRF-1'!A40","v":0},{"$f":"'PRF-1'!G40","v":0},{"$f":"'PRF-1'!B40","v":0},{"$f":"'PRF-1'!D40","v":0},{"$f":"'PRF-1'!E40","v":0},{"$f":"'PRF-1'!I40","v":0},{"$nulls":6},{"$f":"'PRF-1'!K40","v":0},{"$nulls":6},{"$f":"'PRF-1'!M40","v":0},{"$nulls":6},{"$f":"'PRF-1'!O40","v":0}]
[{"$f":"'PRF-1'!A41","v":0},{"$f":"'PRF-1'!G41","v":0},{"$f":"'PRF-1'!B41","v":0},{"$f":"'PRF-1'!D41","v":0},{"$f":"'PRF-1'!E41","v":0},{"$f":"'PRF-1'!I41","v":0},{"$nulls":6},{"$f":"'PRF-1'!K41","v":0},{"$nulls":6},{"$f":"'PRF-1'!M41","v":0},{"$nulls":6},{"$f":"'PRF-1'!O41","v":0}]
[{"$f":"'PRF-1'!A42","v":0},{"$f":"'PRF-1'!G42","v":0},{"$f":"'PRF-1'!B42","v":0},{"$f":"'PRF-1'!D42","v":0},{"$f":"'PRF-1'!E42","v":0},{"$f":"'PRF-1'!I42","v":0},{"$nulls":6},{"$f":"'PRF-1'!K42","v":0},{"$nulls":6},{"$f":"'PRF-1'!M42","v":0},{"$nulls":6},{"$f":"'PRF-1'!O42","v":0}]
[{"$f":"'PRF-1'!A43","v":0},{"$f":"'PRF-1'!G43","v":0},{"$f":"'PRF-1'!B43","v":0},{"$f":"'PRF-1'!D43","v":0},{"$f":"'PRF-1'!E43","v":0},{"$f":"'PRF-1'!I43","v":0},{"$nulls":6},{"$f":"'PRF-1'!K43","v":0},{"$nulls":6},{"$f":"'PRF-1'!M43","v":0},{"$nulls":6},{"$f":"'PRF-1'!O43","v":0}]
[{"$f":"'PRF-1'!A44","v":0},{"$f":"'PRF-1'!G44","v":0},{"$f":"'PRF-1'!B44","v":0},{"$f":"'PRF-1'!D44","v":0},{"$f":"'PRF-1'!E44","v":0},{"$f":"'PRF-1'!I44","v":0},{"$nulls":6},{"$f":"'PRF-1'!K44","v":0},{"$nulls":6},{"$f":"'PRF-1'!M44","v":0},{"$nulls":6},{"$f":"'PRF-1'!O44","v":0}]
[{"$f":"'PRF-1'!A45","v":0},{"$f":"'PRF-1'!G45","v":0},{"$f":"'PRF-1'!B45","v":0},{"$f":"'PRF-1'!D45","v":0},{"$f":"'PRF-1'!E45","v":0},{"$f":"'PRF-1'!I45","v":0},{"$nulls":6},{"$f":"'PRF-1'!K45","v":0},{"$nulls":6},{"$f":"'PRF-1'!M45","v":0},{"$nulls":6},{"$f":"'PRF-1'!O45","v":0}]
[{"$f":"'PRF-1'!A46","v":0},{"$f":"'PRF-1'!G46","v":0},{"$f":"'PRF-1'!B46","v":0},{"$f":"'PRF-1'!D46","v":0},{"$f":"'PRF-1'!E46","v":0},{"$f":"'PRF-1'!I46","v":0},{"$nulls":6},{"$f":"'PRF-1'!K46","v":0},{"$nulls":6},{"$f":"'PRF-1'!M46","v":0},{"$nulls":6},{"$f":"'PRF-1'!O46","v":0}]
[{"$f":"'PRF-1'!A47","v":0},{"$f":"'PRF-1'!G47","v":0},{"$f":"'PRF-1'!B47","v":0},{"$f":"'PRF-1'!D47","v":0},{"$f":"'PRF-1'!E47","v":0},{"$f":"'PRF-1'!I47","v":0},{"$nulls":6},{"$f":"'PRF-1'!K47","v":0},{"$nulls":6},{"$f":"'PRF-1'!M47","v":0},{"$nulls":6},{"$f":"'PRF-1'!O47","v":0}]
[{"$f":"'PRF-1'!A48","v":0},{"$f":"'PRF-1'!G48","v":0},{"$f":"'PRF-1'!B48","v":0},{"$f":"'PRF-1'!D48","v":0},{"$f":"'PRF-1'!E48","v":0},{"$f":"'PRF-1'!I48","v":0},{"$nulls":6},{"$f":"'PRF-1'!K48","v":0},{"$nulls":6},{"$f":"'PRF-1'!M48","v":0},{"$nulls":6},{"$f":"'PRF-1'!O48","v":0}]
[{"$f":"'PRF-1'!A49","v":0},{"$f":"'PRF-1'!G49","v":0},{"$f":"'PRF-1'!B49","v":0},{"$f":"'PRF-1'!D49","v":0},{"$f":"'PRF-1'!E49","v":0},{"$f":"'PRF-1'!I49","v":0},{"$nulls":6},{"$f":"'PRF-1'!K49","v":0},{"$nulls":6},{"$f":"'PRF-1'!M49","v":0},{"$nulls":6},{"$f":"'PRF-1'!O49","v":0}]
[{"$f":"'PRF-1'!A50","v":0},{"$f":"'PRF-1'!G50","v":0},{"$f":"'PRF-1'!B50","v":0},{"$f":"'PRF-1'!D50","v":0},{"$f":"'PRF-1'!E50","v":0},{"$f":"'PRF-1'!I50","v":0},{"$nulls":6},{"$f":"'PRF-1'!K50","v":0},{"$nulls":6},{"$f":"'PRF-1'!M50","v":0},{"$nulls":6},{"$f":"'PRF-1'!O50","v":0}]
[{"$f":"'PRF-1'!A51","v":0},{"$f":"'PRF-1'!G51","v":0},{"$f":"'PRF-1'!B51","v":0},{"$f":"'PRF-1'!D51","v":0},{"$f":"'PRF-1'!E51","v":0},{"$f":"'PRF-1'!I51","v":0},{"$nulls":6},{"$f":"'PRF-1'!K51","v":0},{"$nulls":6},{"$f":"'PRF-1'!M51","v":0},{"$nulls":6},{"$f":"'PRF-1'!O51","v":0}]
[{"$f":"'PRF-1'!A52","v":0},{"$f":"'PRF-1'!G52","v":0},{"$f":"'PRF-1'!B52","v":0},{"$f":"'PRF-1'!D52","v":0},{"$f":"'PRF-1'!E52","v":0},{"$f":"'PRF-1'!I52","v":0},{"$nulls":6},{"$f":"'PRF-1'!K52","v":0},{"$nulls":6},{"$f":"'PRF-1'!M52","v":0},{"$nulls":6},{"$f":"'PRF-1'!O52","v":0}]
[{"$f":"'PRF-1'!A53","v":0},{"$f":"'PRF-1'!G53","v":0},{"$f":"'PRF-1'!B53","v":0},{"$f":"'PRF-1'!D53","v":0},{"$f":"'PRF-1'!E53","v":0},{"$f":"'PRF-1'!I53","v":0},{"$nulls":6},{"$f":"'PRF-1'!K53","v":0},{"$nulls":6},{"$f":"'PRF-1'!M53","v":0},{"$nulls":6},{"$f":"'PRF-1'!O53","v":0}]
[{"$f":"'PRF-1'!A54","v":0},{"$f":"'PRF-1'!G54","v":0},{"$f":"'PRF-1'!B54","v":0},{"$f":"'PRF-1'!D54","v":0},{"$f":"'PRF-1'!E54","v":0},{"$f":"'PRF-1'!I54","v":0},{"$nulls":6},{"$f":"'PRF-1'!K54","v":0},{"$nulls":6},{"$f":"'PRF-1'!M54","v":0},{"$nulls":6},{"$f":"'PRF-1'!O54","v":0}]
[{"$f":"'PRF-1'!A55","v":0},{"$f":"'PRF-1'!G55","v":0},{"$f":"'PRF-1'!B55","v":0},{"$f":"'PRF-1'!D55","v":0},{"$f":"'PRF-1'!E55","v":0},{"$f":"'PRF-1'!I55","v":0},{"$nulls":6},{"$f":"'PRF-1'!K55","v":0},{"$nulls":6},{"$f":"'PRF-1'!M55","v":0},{"$nulls":6},{"$f":"'PRF-1'!O55","v":0}]
[{"$f":"'PRF-1'!A56","v":0},{"$f":"'PRF-1'!G56","v":0},{"$f":"'PRF-1'!B56","v":0},{"$f":"'PRF-1'!D56","v":0},{"$f":"'PRF-1'!E56","v":0},{"$f":"'PRF-1'!I56","v":0},{"$nulls":6},{"$f":"'PRF-1'!K56","v":0},{"$nulls":6},{"$f":"'PRF-1'!M56","v":0},{"$nulls":6},{"$f":"'PRF-1'!O56","v":0}]
[{"$f":"'PRF-1'!A57","v":0},{"$f":"'PRF-1'!G57","v":0},{"$f":"'PRF-1'!B57","v":0},{"$f":"'PRF-1'!D57","v":0},{"$f":"'PRF-1'!E57","v":0},{"$f":"'PRF-1'!I57","v":0},{"$nulls":6},{"$f":"'PRF-1'!K57","v":0},{"$nulls":6},{"$f":"'PRF-1'!M57","v":0},{"$nulls":6},{"$f":"'PRF-1'!O57","v":0}]
[{"$f":"'PRF-1'!A58","v":0},{"$f":"'PRF-1'!G58","v":0},{"$f":"'PRF-1'!B58","v":0},{"$f":"'PRF-1'!D58","v":0},{"$f":"'PRF-1'!E58","v":0},{"$f":"'PRF-1'!I58","v":0},{"$nulls":6},{"$f":"'PRF-1'!K58","v":0},{"$nulls":6},{"$f":"'PRF-1'!M58","v":0},{"$nulls":6},{"$f":"'PRF-1'!O58","v":0}]
[{"$f":"'PRF-1'!A59","v":0},{"$f":"'PRF-1'!G59","v":0},{"$f":"'PRF-1'!B59","v":0},{"$f":"'PRF-1'!D59","v":0},{"$f":"'PRF-1'!E59","v":0},{"$f":"'PRF-1'!I59","v":0},{"$nulls":6},{"$f":"'PRF-1'!K59","v":0},{"$nulls":6},{"$f":"'PRF-1'!M59","v":0},{"$nulls":6},{"$f":"'PRF-1'!O59","v":0}]
[{"$f":"'PRF-1'!A60","v":0},{"$f":"'PRF-1'!G60","v":0},{"$f":"'PRF-1'!B60","v":0},{"$f":"'PRF-1'!D60","v":0},{"$f":"'PRF-1'!E60","v":0},{"$f":"'PRF-1'!I60","v":0},{"$nulls":6},{"$f":"'PRF-1'!K60","v":0},{"$nulls":6},{"$f":"'PRF-1'!M60","v":0},{"$nulls":6},{"$f":"'PRF-1'!O60","v":0}]
[{"$f":"'PRF-1'!A61","v":0},{"$f":"'PRF-1'!G61","v":0},{"$f":"'PRF-1'!B61","v":0},{"$f":"'PRF-1'!D61","v":0},{"$f":"'PRF-1'!E61","v":0},{"$f":"'PRF-1'!I61","v":0},{"$nulls":6},{"$f":"'PRF-1'!K61","v":0},{"$nulls":6},{"$f":"'PRF-1'!M61","v":0},{"$nulls":6},{"$f":"'PRF-1'!O61","v":0}]
[{"$f":"'PRF-1'!A62","v":0},{"$f":"'PRF-1'!G62","v":0},{"$f":"'PRF-1'!B62","v":0},{"$f":"'PRF-1'!D62","v":0},{"$f":"'PRF-1'!E62","v":0},{"$f":"'PRF-1'!I62","v":0},{"$nulls":6},{"$f":"'PRF-1'!K62","v":0},{"$nulls":6},{"$f":"'PRF-1'!M62","v":0},{"$nulls":6},{"$f":"'PRF-1'!O62","v":0}]
[{"$f":"'PRF-1'!A63","v":0},{"$f":"'PRF-1'!G63","v":0},{"$f":"'PRF-1'!B63","v":0},{"$f":"'PRF-1'!D63","v":0},{"$f":"'PRF-1'!E63","v":0},{"$f":"'PRF-1'!I63","v":0},{"$nulls":6},{"$f":"'PRF-1'!K63","v":0},{"$nulls":6},{"$f":"'PRF-1'!M63","v":0},{"$nulls":6},{"$f":"'PRF-1'!O63","v":0}]
[{"$f":"'PRF-1'!A64","v":0},{"$f":"'PRF-1'!G64","v":0},{"$f":"'PRF-1'!B64","v":0},{"$f":"'PRF-1'!D64","v":0},{"$f":"'PRF-1'!E64","v":0},{"$f":"'PRF-1'!I64","v":0},{"$nulls":6},{"$f":"'PRF-1'!K64","v":0},{"$nulls":6},{"$f":"'PRF-1'!M64","v":0},{"$nulls":6},{"$f":"'PRF-1'!O64","v":0}]
[{"$f":"'PRF-1'!A65","v":0},{"$f":"'PRF-1'!G65","v":0},{"$f":"'PRF-1'!B65","v":0},{"$f":"'PRF-1'!D65","v":0},{"$f":"'PRF-1'!E65","v":0},{"$f":"'PRF-1'!I65","v":0},{"$nulls":6},{"$f":"'PRF-1'!K65","v":0},{"$nulls":6},{"$f":"'PRF-1'!M65","v":0},{"$nulls":6},{"$f":"'PRF-1'!O65","v":0}]
[{"$f":"'PRF-1'!A66","v":0},{"$f":"'PRF-1'!G66","v":0},{"$f":"'PRF-1'!B66","v":0},{"$f":"'PRF-1'!D66","v":"शालापूर्व "},{"$f":"'PRF-1'!E66","v":0},{"$f":"'PRF-1'!I66","v":0},{"$nulls":6},{"$f":"'PRF-1'!K66","v":0},{"$nulls":6},{"$f":"'PRF-1'!M66","v":0},{"$nulls":6},{"$f":"'PRF-1'!O66","v":0}]
[{"$f":"'PRF-1'!A67","v":0},{"$f":"'PRF-1'!G67","v":0},{"$f":"'PRF-1'!B67","v":0},{"$f":"'PRF-1'!D67","v":1},{"$f":"'PRF-1'!E67","v":0},{"$f":"'PRF-1'!I67","v":0},{"$nulls":6},{"$f":"'PRF-1'!K67","v":0},{"$nulls":6},{"$f":"'PRF-1'!M67","v":0},{"$nulls":6},{"$f":"'PRF-1'!O67","v":0}]

{"sheet":"LSRW-2","index":15,"n_rows":69,"n_cols":33,"rows_kept":69,"merged":[[0,0,1,32],[2,0,2,32],[3,0,3,32],[4,0,4,2],[4,4,4,5],[4,6,4,14],[4,15,4,22],[4,23,4,32],[5,0,5,32],[6,0,8,0],[6,1,8,1],[6,2,8,2],[6,3,8,3],[6,4,8,4],[6,5,6,32],[7,5,7,10],[7,11,8,11],[7,12,7,17],[7,18,8,18],[7,19,7,24],[7,25,8,25],[7,26,7,31],[7,32,8,32]]}
[{"$f":"REPORTS!$D$7","v":0}]
[]
["lrr ,oa O;kid ewY;kadu dk;ZØe 2018&19"]
["fo|ky; esa cPpksa ds 'kSf{kd Lrj dh fLFkfr"]
["CLASS-",null,null,"2ND","SUBJECT-",null,{"$f":"REPORTS!C8","v":0},{"$nulls":8},"SUBJECT TEACHER-",{"$nulls":7},{"$f":"REPORTS!K8","v":0}]
["LEARNING OBJECTIVE WISE GRADING"]
["NO","SR NO","CLASS","STUDENT NAME","FATHER NAME","GRADING"]
[{"$nulls":5},"BASELINE",{"$nulls":5},"AG","SA-1",{"$nulls":5},"AG","SA-2",{"$nulls":5},"AG","SA-3",{"$nulls":5},"AG"]
[{"$nulls":5},"CL","L","S","R","W","FG",null,"CL","L","S","R","W","FG",null,"CL","L","S","R","W","FG",null,"CL","L","S","R","W","FG"]
[{"$f":"'PRF-2'!A8","v":0},{"$f":"'PRF-2'!G8","v":0},{"$f":"'PRF-2'!B8","v":0},{"$f":"'PRF-2'!D8","v":0},{"$f":"'PRF-2'!E8","v":0},{"$f":"'PRF-2'!I8","v":0},{"$nulls":6},{"$f":"'PRF-2'!K8","v":0},{"$nulls":6},{"$f":"'PRF-2'!M8","v":0},{"$nulls":6},{"$f":"'PRF-2'!O8","v":0}]
[{"$f":"'PRF-2'!A9","v":0},{"$f":"'PRF-2'!G9","v":0},{"$f":"'PRF-2'!B9","v":0},{"$f":"'PRF-2'!D9","v":0},{"$f":"'PRF-2'!E9","v":0},{"$f":"'PRF-2'!I9","v":0},{"$nulls":6},{"$f":"'PRF-2'!K9","v":0},{"$nulls":6},{"$f":"'PRF-2'!M9","v":0},{"$nulls":6},{"$f":"'PRF-2'!O9","v":0}]
[{"$f":"'PRF-2'!A10","v":0},{"$f":"'PRF-2'!G10","v":0},{"$f":"'PRF-2'!B10","v":0},{"$f":"'PRF-2'!D10","v":0},{"$f":"'PRF-2'!E10","v":0},{"$f":"'PRF-2'!I10","v":0},{"$nulls":6},{"$f":"'PRF-2'!K10","v":0},{"$nulls":6},{"$f":"'PRF-2'!M10","v":0},{"$nulls":6},{"$f":"'PRF-2'!O10","v":0}]
[{"$f":"'PRF-2'!A11","v":0},{"$f":"'PRF-2'!G11","v":0},{"$f":"'PRF-2'!B11","v":0},{"$f":"'PRF-2'!D11","v":0},{"$f":"'PRF-2'!E11","v":0},{"$f":"'PRF-2'!I11","v":0},{"$nulls":6},{"$f":"'PRF-2'!K11","v":0},{"$nulls":6},{"$f":"'PRF-2'!M11","v":0},{"$nulls":6},{"$f":"'PRF-2'!O11","v":0}]
[{"$f":"'PRF-2'!A12","v":0},{"$f":"'PRF-2'!G12","v":0},{"$f":"'PRF-2'!B12","v":0},{"$f":"'PRF-2'!D12","v":0},{"$f":"'PRF-2'!E12","v":0},{"$f":"'PRF-2'!I12","v":0},{"$nulls":6},{"$f":"'PRF-2'!K12","v":0},{"$nulls":6},{"$f":"'PRF-2'!M12","v":0},{"$nulls":6},{"$f":"'PRF-2'!O12","v":0}]
[{"$f":"'PRF-2'!A13","v":0},{"$f":"'PRF-2'!G13","v":0},{"$f":"'PRF-2'!B13","v":0},{"$f":"'PRF-2'!D13","v":0},{"$f":"'PRF-2'!E13","v":0},{"$f":"'PRF-2'!I13","v":0},{"$nulls":6},{"$f":"'PRF-2'!K13","v":0},{"$nulls":6},{"$f":"'PRF-2'!M13","v":0},{"$nulls":6},{"$f":"'PRF-2'!O13","v":0}]
[{"$f":"'PRF-2'!A14","v":0},{"$f":"'PRF-2'!G14","v":0},{"$f":"'PRF-2'!B14","v":0},{"$f":"'PRF-2'!D14","v":0},{"$f":"'PRF-2'!E14","v":0},{"$f":"'PRF-2'!I14","v":0},{"$nulls":6},{"$f":"'PRF-2'!K14","v":0},{"$nulls":6},{"$f":"'PRF-2'!M14","v":0},{"$nulls":6},{"$f":"'PRF-2'!O14","v":0}]
[{"$f":"'PRF-2'!A15","v":0},{"$f":"'PRF-2'!G15","v":0},{"$f":"'PRF-2'!B15","v":0},{"$f":"'PRF-2'!D15","v":0},{"$f":"'PRF-2'!E15","v":0},{"$f":"'PRF-2'!I15","v":0},{"$nulls":6},{"$f":"'PRF-2'!K15","v":0},{"$nulls":6},{"$f":"'PRF-2'!M15","v":0},{"$nulls":6},{"$f":"'PRF-2'!O15","v":0}]
[{"$f":"'PRF-2'!A16","v":0},{"$f":"'PRF-2'!G16","v":0},{"$f":"'PRF-2'!B16","v":0},{"$f":"'PRF-2'!D16","v":0},{"$f":"'PRF-2'!E16","v":0},{"$f":"'PRF-2'!I16","v":0},{"$nulls":6},{"$f":"'PRF-2'!K16","v":0},{"$nulls":6},{"$f":"'PRF-2'!M16","v":0},{"$nulls":6},{"$f":"'PRF-2'!O16","v":0}]
[{"$f":"'PRF-2'!A17","v":0},{"$f":"'PRF-2'!G17","v":0},{"$f":"'PRF-2'!B17","v":0},{"$f":"'PRF-2'!D17","v":0},{"$f":"'PRF-2'!E17","v":0},{"$f":"'PRF-2'!I17","v":0},{"$nulls":6},{"$f":"'PRF-2'!K17","v":0},{"$nulls":6},{"$f":"'PRF-2'!M17","v":0},{"$nulls":6},{"$f":"'PRF-2'!O17","v":0}]
[{"$f":"'PRF-2'!A18","v":0},{"$f":"'PRF-2'!G18","v":0},{"$f":"'PRF-2'!B18","v":0},{"$f":"'PRF-2'!D18","v":0},{"$f":"'PRF-2'!E18","v":0},{"$f":"'PRF-2'!I18","v":0},{"$nulls":6},{"$f":"'PRF-2'!K18","v":0},{"$nulls":6},{"$f":"'PRF-2'!M18","v":0},{"$nulls":6},{"$f":"'PRF-2'!O18","v":0}]
[{"$f":"'PRF-2'!A19","v":0},{"$f":"'PRF-2'!G19","v":0},{"$f":"'PRF-2'!B19","v":0},{"$f":"'PRF-2'!D19","v":0},{"$f":"'PRF-2'!E19","v":0},{"$f":"'PRF-2'!I19","v":0},{"$nulls":6},{"$f":"'PRF-2'!K19","v":0},{"$nulls":6},{"$f":"'PRF-2'!M19","v":0},{"$nulls":6},{"$f":"'PRF-2'!O19","v":0}]
[{"$f":"'PRF-2'!A20","v":0},{"$f":"'PRF-2'!G20","v":0},{"$f":"'PRF-2'!B20","v":0},{"$f":"'PRF-2'!D20","v":0},{"$f":"'PRF-2'!E20","v":0},{"$f":"'PRF-2'!I20","v":0},{"$nulls":6},{"$f":"'PRF-2'!K20","v":0},{"$nulls":6},{"$f":"'PRF-2'!M20","v":0},{"$nulls":6},{"$f":"'PRF-2'!O20","v":0}]
[{"$f":"'PRF-2'!A21","v":0},{"$f":"'PRF-2'!G21","v":0},{"$f":"'PRF-2'!B21","v":0},{"$f":"'PRF-2'!D21","v":0},{"$f":"'PRF-2'!E21","v":0},{"$f":"'PRF-2'!I21","v":0},{"$nulls":6},{"$f":"'PRF-2'!K21","v":0},{"$nulls":6},{"$f":"'PRF-2'!M21","v":0},{"$nulls":6},{"$f":"'PRF-2'!O21","v":0}]
[{"$f":"'PRF-2'!A22","v":0},{"$f":"'PRF-2'!G22","v":0},{"$f":"'PRF-2'!B22","v":0},{"$f":"'PRF-2'!D22","v":0},{"$f":"'PRF-2'!E22","v":0},{"$f":"'PRF-2'!I22","v":0},{"$nulls":6},{"$f":"'PRF-2'!K22","v":0},{"$nulls":6},{"$f":"'PRF-2'!M22","v":0},{"$nulls":6},{"$f":"'PRF-2'!O22","v":0}]
[{"$f":"'PRF-2'!A23","v":0},{"$f":"'PRF-2'!G23","v":0},{"$f":"'PRF-2'!B23","v":0},{"$f":"'PRF-2'!D23","v":0},{"$f":"'PRF-2'!E23","v":0},{"$f":"'PRF-2'!I23","v":0},{"$nulls":6},{"$f":"'PRF-2'!K23","v":0},{"$nulls":6},{"$f":"'PRF-2'!M23","v":0},{"$nulls":6},{"$f":"'PRF-2'!O23","v":0}]
[{"$f":"'PRF-2'!A24","v":0},{"$f":"'PRF-2'!G24","v":0},{"$f":"'PRF-2'!B24","v":0},{"$f":"'PRF-2'!D24","v":0},{"$f":"'PRF-2'!E24","v":0},{"$f":"'PRF-2'!I24","v":0},{"$nulls":6},{"$f":"'PRF-2'!K24","v":0},{"$nulls":6},{"$f":"'PRF-2'!M24","v":0},{"$nulls":6},{"$f":"'PRF-2'!O24","v":0}]
[{"$f":"'PRF-2'!A25","v":0},{"$f":"'PRF-2'!G25","v":0},{"$f":"'PRF-2'!B25","v":0},{"$f":"'PRF-2'!D25","v":0},{"$f":"'PRF-2'!E25","v":0},{"$f":"'PRF-2'!I25","v":0},{"$nulls":6},{"$f":"'PRF-2'!K25","v":0},{"$nulls":6},{"$f":"'PRF-2'!M25","v":0},{"$nulls":6},{"$f":"'PRF-2'!O25","v":0}]
[{"$f":"'PRF-2'!A26","v":0},{"$f":"'PRF-2'!G26","v":0},{"$f":"'PRF-2'!B26","v":0},{"$f":"'PRF-2'!D26","v":0},{"$f":"'PRF-2'!E26","v":0},{"$f":"'PRF-2'!I26","v":0},{"$nulls":6},{"$f":"'PRF-2'!K26","v":0},{"$nulls":6},{"$f":"'PRF-2'!M26","v":0},{"$nulls":6},{"$f":"'PRF-2'!O26","v":0}]
[{"$f":"'PRF-2'!A27","v":0},{"$f":"'PRF-2'!G27","v":0},{"$f":"'PRF-2'!B27","v":0},{"$f":"'PRF-2'!D27","v":0},{"$f":"'PRF-2'!E27","v":0},{"$f":"'PRF-2'!I27","v":0},{"$nulls":6},{"$f":"'PRF-2'!K27","v":0},{"$nulls":6},{"$f":"'PRF-2'!M27","v":0},{"$nulls":6},{"$f":"'PRF-2'!O27","v":0}]
[{"$f":"'PRF-2'!A28","v":0},{"$f":"'PRF-2'!G28","v":0},{"$f":"'PRF-2'!B28","v":0},{"$f":"'PRF-2'!D28","v":0},{"$f":"'PRF-2'!E28","v":0},{"$f":"'PRF-2'!I28","v":0},{"$nulls":6},{"$f":"'PRF-2'!K28","v":0},{"$nulls":6},{"$f":"'PRF-2'!M28","v":0},{"$nulls":6},{"$f":"'PRF-2'!O28","v":0}]
[{"$f":"'PRF-2'!A29","v":0},{"$f":"'PRF-2'!G29","v":0},{"$f":"'PRF-2'!B29","v":0},{"$f":"'PRF-2'!D29","v":0},{"$f":"'PRF-2'!E29","v":0},{"$f":"'PRF-2'!I29","v":0},{"$nulls":6},{"$f":"'PRF-2'!K29","v":0},{"$nulls":6},{"$f":"'PRF-2'!M29","v":0},{"$nulls":6},{"$f":"'PRF-2'!O29","v":0}]
[{"$f":"'PRF-2'!A30","v":0},{"$f":"'PRF-2'!G30","v":0},{"$f":"'PRF-2'!B30","v":0},{"$f":"'PRF-2'!D30","v":0},{"$f":"'PRF-2'!E30","v":0},{"$f":"'PRF-2'!I30","v":0},{"$nulls":6},{"$f":"'PRF-2'!K30","v":0},{"$nulls":6},{"$f":"'PRF-2'!M30","v":0},{"$nulls":6},{"$f":"'PRF-2'!O30","v":0}]
[{"$f":"'PRF-2'!A31","v":0},{"$f":"'PRF-2'!G31","v":0},{"$f":"'PRF-2'!B31","v":0},{"$f":"'PRF-2'!D31","v":0},{"$f":"'PRF-2'!E31","v":0},{"$f":"'PRF-2'!I31","v":0},{"$nulls":6},{"$f":"'PRF-2'!K31","v":0},{"$nulls":6},{"$f":"'PRF-2'!M31","v":0},{"$nulls":6},{"$f":"'PRF-2'!O31","v":0}]
[{"$f":"'PRF-2'!A32","v":0},{"$f":"'PRF-2'!G32","v":0},{"$f":"'PRF-2'!B32","v":0},{"$f":"'PRF-2'!D32","v":0},{"$f":"'PRF-2'!E32","v":0},{"$f":"'PRF-2'!I32","v":0},{"$nulls":6},{"$f":"'PRF-2'!K32","v":0},{"$nulls":6},{"$f":"'PRF-2'!M32","v":0},{"$nulls":6},{"$f":"'PRF-2'!O32","v":0}]
[{"$f":"'PRF-2'!A33","v":0},{"$f":"'PRF-2'!G33","v":0},{"$f":"'PRF-2'!B33","v":0},{"$f":"'PRF-2'!D33","v":0},{"$f":"'PRF-2'!E33","v":0},{"$f":"'PRF-2'!I33","v":0},{"$nulls":6},{"$f":"'PRF-2'!K33","v":0},{"$nulls":6},{"$f":"'PRF-2'!M33","v":0},{"$nulls":6},{"$f":"'PRF-2'!O33","v":0}]
[{"$f":"'PRF-2'!A34","v":0},{"$f":"'PRF-2'!G34","v":0},{"$f":"'PRF-2'!B34","v":0},{"$f":"'PRF-2'!D34","v":0},{"$f":"'PRF-2'!E34","v":0},{"$f":"'PRF-2'!I34","v":0},{"$nulls":6},{"$f":"'PRF-2'!K34","v":0},{"$nulls":6},{"$f":"'PRF-2'!M34","v":0},{"$nulls":6},{"$f":"'PRF-2'!O34","v":0}]
[{"$f":"'PRF-2'!A35","v":0},{"$f":"'PRF-2'!G35","v":0},{"$f":"'PRF-2'!B35","v":0},{"$f":"'PRF-2'!D35","v":0},{"$f":"'PRF-2'!E35","v":0},{"$f":"'PRF-2'!I35","v":0},{"$nulls":6},{"$f":"'PRF-2'!K35","v":0},{"$nulls":6},{"$f":"'PRF-2'!M35","v":0},{"$nulls":6},{"$f":"'PRF-2'!O35","v":0}]
[{"$f":"'PRF-2'!A36","v":0},{"$f":"'PRF-2'!G36","v":0},{"$f":"'PRF-2'!B36","v":0},{"$f":"'PRF-2'!D36","v":0},{"$f":"'PRF-2'!E36","v":0},{"$f":"'PRF-2'!I36","v":0},{"$nulls":6},{"$f":"'PRF-2'!K36","v":0},{"$nulls":6},{"$f":"'PRF-2'!M36","v":0},{"$nulls":6},{"$f":"'PRF-2'!O36","v":0}]
[{"$f":"'PRF-2'!A37","v":0},{"$f":"'PRF-2'!G37","v":0},{"$f":"'PRF-2'!B37","v":0},{"$f":"'PRF-2'!D37","v":0},{"$f":"'PRF-2'!E37","v":0},{"$f":"'PRF-2'!I37","v":0},{"$nulls":6},{"$f":"'PRF-2'!K37","v":0},{"$nulls":6},{"$f":"'PRF-2'!M37","v":0},{"$nulls":6},{"$f":"'PRF-2'!O37","v":0}]
[{"$f":"'PRF-2'!A38","v":0},{"$f":"'PRF-2'!G38","v":0},{"$f":"'PRF-2'!B38","v":0},{"$f":"'PRF-2'!D38","v":0},{"$f":"'PRF-2'!E38","v":0},{"$f":"'PRF-2'!I38","v":0},{"$nulls":6},{"$f":"'PRF-2'!K38","v":0},{"$nulls":6},{"$f":"'PRF-2'!M38","v":0},{"$nulls":6},{"$f":"'PRF-2'!O38","v":0}]
[{"$f":"'PRF-2'!A39","v":0},{"$f":"'PRF-2'!G39","v":0},{"$f":"'PRF-2'!B39","v":0},{"$f":"'PRF-2'!D39","v":0},{"$f":"'PRF-2'!E39","v":0},{"$f":"'PRF-2'!I39","v":0},{"$nulls":6},{"$f":"'PRF-2'!K39","v":0},{"$nulls":6},{"$f":"'PRF-2'!M39","v":0},{"$nulls":6},{"$f":"'PRF-2'!O39","v":0}]
[{"$f":"'PRF-2'!A40","v":0},{"$f":"'PRF-2'!G40","v":0},{"$f":"'PRF-2'!B40","v":0},{"$f":"'PRF-2'!D40","v":0},{"$f":"'PRF-2'!E40","v":0},{"$f":"'PRF-2'!I40","v":0},{"$nulls":6},{"$f":"'PRF-2'!K40","v":0},{"$nulls":6},{"$f":"'PRF-2'!M40","v":0},{"$nulls":6},{"$f":"'PRF-2'!O40","v":0}]
[{"$f":"'PRF-2'!A41","v":0},{"$f":"'PRF-2'!G41","v":0},{"$f":"'PRF-2'!B41","v":0},{"$f":"'PRF-2'!D41","v":0},{"$f":"'PRF-2'!E41","v":0},{"$f":"'PRF-2'!I41","v":0},{"$nulls":6},{"$f":"'PRF-2'!K41","v":0},{"$nulls":6},{"$f":"'PRF-2'!M41","v":0},{"$nulls":6},{"$f":"'PRF-2'!O41","v":0}]
[{"$f":"'PRF-2'!A42","v":0},{"$f":"'PRF-2'!G42","v":0},{"$f":"'PRF-2'!B42","v":0},{"$f":"'PRF-2'!D42","v":0},{"$f":"'PRF-2'!E42","v":0},{"$f":"'PRF-2'!I42","v":0},{"$nulls":6},{"$f":"'PRF-2'!K42","v":0},{"$nulls":6},{"$f":"'PRF-2'!M42","v":0},{"$nulls":6},{"$f":"'PRF-2'!O42","v":0}]
[{"$f":"'PRF-2'!A43","v":0},{"$f":"'PRF-2'!G43","v":0},{"$f":"'PRF-2'!B43","v":0},{"$f":"'PRF-2'!D43","v":0},{"$f":"'PRF-2'!E43","v":0},{"$f":"'PRF-2'!I43","v":0},{"$nulls":6},{"$f":"'PRF-2'!K43","v":0},{"$nulls":6},{"$f":"'PRF-2'!M43","v":0},{"$nulls":6},{"$f":"'PRF-2'!O43","v":0}]
[{"$f":"'PRF-2'!A44","v":0},{"$f":"'PRF-2'!G44","v":0},{"$f":"'PRF-2'!B44","v":0},{"$f":"'PRF-2'!D44","v":0},{"$f":"'PRF-2'!E44","v":0},{"$f":"'PRF-2'!I44","v":0},{"$nulls":6},{"$f":"'PRF-2'!K44","v":0},{"$nulls":6},{"$f":"'PRF-2'!M44","v":0},{"$nulls":6},{"$f":"'PRF-2'!O44","v":0}]
[{"$f":"'PRF-2'!A45","v":0},{"$f":"'PRF-2'!G45","v":0},{"$f":"'PRF-2'!B45","v":0},{"$f":"'PRF-2'!D45","v":0},{"$f":"'PRF-2'!E45","v":0},{"$f":"'PRF-2'!I45","v":0},{"$nulls":6},{"$f":"'PRF-2'!K45","v":0},{"$nulls":6},{"$f":"'PRF-2'!M45","v":0},{"$nulls":6},{"$f":"'PRF-2'!O45","v":0}]
[{"$f":"'PRF-2'!A46","v":0},{"$f":"'PRF-2'!G46","v":0},{"$f":"'PRF-2'!B46","v":0},{"$f":"'PRF-2'!D46","v":0},{"$f":"'PRF-2'!E46","v":0},{"$f":"'PRF-2'!I46","v":0},{"$nulls":6},{"$f":"'PRF-2'!K46","v":0},{"$nulls":6},{"$f":"'PRF-2'!M46","v":0},{"$nulls":6},{"$f":"'PRF-2'!O46","v":0}]
[{"$f":"'PRF-2'!A47","v":0},{"$f":"'PRF-2'!G47","v":0},{"$f":"'PRF-2'!B47","v":0},{"$f":"'PRF-2'!D47","v":0},{"$f":"'PRF-2'!E47","v":0},{"$f":"'PRF-2'!I47","v":0},{"$nulls":6},{"$f":"'PRF-2'!K47","v":0},{"$nulls":6},{"$f":"'PRF-2'!M47","v":0},{"$nulls":6},{"$f":"'PRF-2'!O47","v":0}]
[{"$f":"'PRF-2'!A48","v":0},{"$f":"'PRF-2'!G48","v":0},{"$f":"'PRF-2'!B48","v":0},{"$f":"'PRF-2'!D48","v":0},{"$f":"'PRF-2'!E48","v":0},{"$f":"'PRF-2'!I48","v":0},{"$nulls":6},{"$f":"'PRF-2'!K48","v":0},{"$nulls":6},{"$f":"'PRF-2'!M48","v":0},{"$nulls":6},{"$f":"'PRF-2'!O48","v":0}]
[{"$f":"'PRF-2'!A49","v":0},{"$f":"'PRF-2'!G49","v":0},{"$f":"'PRF-2'!B49","v":0},{"$f":"'PRF-2'!D49","v":0},{"$f":"'PRF-2'!E49","v":0},{"$f":"'PRF-2'!I49","v":0},{"$nulls":6},{"$f":"'PRF-2'!K49","v":0},{"$nulls":6},{"$f":"'PRF-2'!M49","v":0},{"$nulls":6},{"$f":"'PRF-2'!O49","v":0}]
[{"$f":"'PRF-2'!A50","v":0},{"$f":"'PRF-2'!G50","v":0},{"$f":"'PRF-2'!B50","v":0},{"$f":"'PRF-2'!D50","v":0},{"$f":"'PRF-2'!E50","v":0},{"$f":"'PRF-2'!I50","v":0},{"$nulls":6},{"$f":"'PRF-2'!K50","v":0},{"$nulls":6},{"$f":"'PRF-2'!M50","v":0},{"$nulls":6},{"$f":"'PRF-2'!O50","v":0}]
[{"$f":"'PRF-2'!A51","v":0},{"$f":"'PRF-2'!G51","v":0},{"$f":"'PRF-2'!B51","v":0},{"$f":"'PRF-2'!D51","v":0},{"$f":"'PRF-2'!E51","v":0},{"$f":"'PRF-2'!I51","v":0},{"$nulls":6},{"$f":"'PRF-2'!K51","v":0},{"$nulls":6},{"$f":"'PRF-2'!M51","v":0},{"$nulls":6},{"$f":"'PRF-2'!O51","v":0}]
[{"$f":"'PRF-2'!A52","v":0},{"$f":"'PRF-2'!G52","v":0},{"$f":"'PRF-2'!B52","v":0},{"$f":"'PRF-2'!D52","v":0},{"$f":"'PRF-2'!E52","v":0},{"$f":"'PRF-2'!I52","v":0},{"$nulls":6},{"$f":"'PRF-2'!K52","v":0},{"$nulls":6},{"$f":"'PRF-2'!M52","v":0},{"$nulls":6},{"$f":"'PRF-2'!O52","v":0}]
[{"$f":"'PRF-2'!A53","v":0},{"$f":"'PRF-2'!G53","v":0},{"$f":"'PRF-2'!B53","v":0},{"$f":"'PRF-2'!D53","v":0},{"$f":"'PRF-2'!E53","v":0},{"$f":"'PRF-2'!I53","v":0},{"$nulls":6},{"$f":"'PRF-2'!K53","v":0},{"$nulls":6},{"$f":"'PRF-2'!M53","v":0},{"$nulls":6},{"$f":"'PRF-2'!O53","v":0}]
[{"$f":"'PRF-2'!A54","v":0},{"$f":"'PRF-2'!G54","v":0},{"$f":"'PRF-2'!B54","v":0},{"$f":"'PRF-2'!D54","v":0},{"$f":"'PRF-2'!E54","v":0},{"$f":"'PRF-2'!I54","v":0},{"$nulls":6},{"$f":"'PRF-2'!K54","v":0},{"$nulls":6},{"$f":"'PRF-2'!M54","v":0},{"$nulls":6},{"$f":"'PRF-2'!O54","v":0}]
[{"$f":"'PRF-2'!A55","v":0},{"$f":"'PRF-2'!G55","v":0},{"$f":"'PRF-2'!B55","v":0},{"$f":"'PRF-2'!D55","v":0},{"$f":"'PRF-2'!E55","v":0},{"$f":"'PRF-2'!I55","v":0},{"$nulls":6},{"$f":"'PRF-2'!K55","v":0},{"$nulls":6},{"$f":"'PRF-2'!M55","v":0},{"$nulls":6},{"$f":"'PRF-2'!O55","v":0}]
[{"$f":"'PRF-2'!A56","v":0},{"$f":"'PRF-2'!G56","v":0},{"$f":"'PRF-2'!B56","v":0},{"$f":"'PRF-2'!D56","v":0},{"$f":"'PRF-2'!E56","v":0},{"$f":"'PRF-2'!I56","v":0},{"$nulls":6},{"$f":"'PRF-2'!K56","v":0},{"$nulls":6},{"$f":"'PRF-2'!M56","v":0},{"$nulls":6},{"$f":"'PRF-2'!O56","v":0}]
[{"$f":"'PRF-2'!A57","v":0},{"$f":"'PRF-2'!G57","v":0},{"$f":"'PRF-2'!B57","v":0},{"$f":"'PRF-2'!D57","v":0},{"$f":"'PRF-2'!E57","v":0},{"$f":"'PRF-2'!I57","v":0},{"$nulls":6},{"$f":"'PRF-2'!K57","v":0},{"$nulls":6},{"$f":"'PRF-2'!M57","v":0},{"$nulls":6},{"$f":"'PRF-2'!O57","v":0}]
[{"$f":"'PRF-2'!A58","v":0},{"$f":"'PRF-2'!G58","v":0},{"$f":"'PRF-2'!B58","v":0},{"$f":"'PRF-2'!D58","v":0},{"$f":"'PRF-2'!E58","v":0},{"$f":"'PRF-2'!I58","v":0},{"$nulls":6},{"$f":"'PRF-2'!K58","v":0},{"$nulls":6},{"$f":"'PRF-2'!M58","v":0},{"$nulls":6},{"$f":"'PRF-2'!O58","v":0}]
[{"$f":"'PRF-2'!A59","v":0},{"$f":"'PRF-2'!G59","v":0},{"$f":"'PRF-2'!B59","v":0},{"$f":"'PRF-2'!D59","v":0},{"$f":"'PRF-2'!E59","v":0},{"$f":"'PRF-2'!I59","v":0},{"$nulls":6},{"$f":"'PRF-2'!K59","v":0},{"$nulls":6},{"$f":"'PRF-2'!M59","v":0},{"$nulls":6},{"$f":"'PRF-2'!O59","v":0}]
[{"$f":"'PRF-2'!A60","v":0},{"$f":"'PRF-2'!G60","v":0},{"$f":"'PRF-2'!B60","v":0},{"$f":"'PRF-2'!D60","v":0},{"$f":"'PRF-2'!E60","v":0},{"$f":"'PRF-2'!I60","v":0},{"$nulls":6},{"$f":"'PRF-2'!K60","v":0},{"$nulls":6},{"$f":"'PRF-2'!M60","v":0},{"$nulls":6},{"$f":"'PRF-2'!O60","v":0}]
[{"$f":"'PRF-2'!A61","v":0},{"$f":"'PRF-2'!G61","v":0},{"$f":"'PRF-2'!B61","v":0},{"$f":"'PRF-2'!D61","v":0},{"$f":"'PRF-2'!E61","v":0},{"$f":"'PRF-2'!I61","v":0},{"$nulls":6},{"$f":"'PRF-2'!K61","v":0},{"$nulls":6},{"$f":"'PRF-2'!M61","v":0},{"$nulls":6},{"$f":"'PRF-2'!O61","v":0}]
[{"$f":"'PRF-2'!A62","v":0},{"$f":"'PRF-2'!G62","v":0},{"$f":"'PRF-2'!B62","v":0},{"$f":"'PRF-2'!D62","v":0},{"$f":"'PRF-2'!E62","v":0},{"$f":"'PRF-2'!I62","v":0},{"$nulls":6},{"$f":"'PRF-2'!K62","v":0},{"$nulls":6},{"$f":"'PRF-2'!M62","v":0},{"$nulls":6},{"$f":"'PRF-2'!O62","v":0}]
[{"$f":"'PRF-2'!A63","v":0},{"$f":"'PRF-2'!G63","v":0},{"$f":"'PRF-2'!B63","v":0},{"$f":"'PRF-2'!D63","v":0},{"$f":"'PRF-2'!E63","v":0},{"$f":"'PRF-2'!I63","v":0},{"$nulls":6},{"$f":"'PRF-2'!K63","v":0},{"$nulls":6},{"$f":"'PRF-2'!M63","v":0},{"$nulls":6},{"$f":"'PRF-2'!O63","v":0}]
[{"$f":"'PRF-2'!A64","v":0},{"$f":"'PRF-2'!G64","v":0},{"$f":"'PRF-2'!B64","v":0},{"$f":"'PRF-2'!D64","v":0},{"$f":"'PRF-2'!E64","v":0},{"$f":"'PRF-2'!I64","v":0},{"$nulls":6},{"$f":"'PRF-2'!K64","v":0},{"$nulls":6},{"$f":"'PRF-2'!M64","v":0},{"$nulls":6},{"$f":"'PRF-2'!O64","v":0}]
[{"$f":"'PRF-2'!A65","v":0},{"$f":"'PRF-2'!G65","v":0},{"$f":"'PRF-2'!B65","v":0},{"$f":"'PRF-2'!D65","v":0},{"$f":"'PRF-2'!E65","v":0},{"$f":"'PRF-2'!I65","v":0},{"$nulls":6},{"$f":"'PRF-2'!K65","v":0},{"$nulls":6},{"$f":"'PRF-2'!M65","v":0},{"$nulls":6},{"$f":"'PRF-2'!O65","v":0}]
[{"$f":"'PRF-2'!A66","v":0},{"$f":"'PRF-2'!G66","v":0},{"$f":"'PRF-2'!B66","v":0},{"$f":"'PRF-2'!D66","v":0},{"$f":"'PRF-2'!E66","v":0},{"$f":"'PRF-2'!I66","v":0},{"$nulls":6},{"$f":"'PRF-2'!K66","v":0},{"$nulls":6},{"$f":"'PRF-2'!M66","v":0},{"$nulls":6},{"$f":"'PRF-2'!O66","v":0}]
[{"$f":"'PRF-2'!A67","v":0},{"$f":"'PRF-2'!G67","v":0},{"$f":"'PRF-2'!B67","v":0},{"$f":"'PRF-2'!D67","v":0},{"$f":"'PRF-2'!E67","v":0},{"$f":"'PRF-2'!I67","v":0},{"$nulls":6},{"$f":"'PRF-2'!K67","v":0},{"$nulls":6},{"$f":"'PRF-2'!M67","v":0},{"$nulls":6},{"$f":"'PRF-2'!O67","v":0}]

{"sheet":"LSRW-3","index":16,"n_rows":69,"n_cols":33,"rows_kept":69,"merged":[[0,0,1,32],[2,0,2,32],[3,0,3,32],[4,0,4,2],[4,4,4,5],[4,6,4,14],[4,15,4,22],[4,23,4,32],[5,0,5,32],[6,0,8,0],[6,1,8,1],[6,2,8,2],[6,3,8,3],[6,4,8,4],[6,5,6,32],[7,5,7,10],[7,11,8,11],[7,12,7,17],[7,18,8,18],[7,19,7,24],[7,25,8,25],[7,26,7,31],[7,32,8,32]]}
[{"$f":"REPORTS!$D$7","v":0}]
[]
["lrr ,oa O;kid ewY;kadu dk;ZØe 2018&19"]
["fo|ky; esa cPpksa ds 'kSf{kd Lrj dh fLFkfr"]
["CLASS-",null,null,"3RD","SUBJECT-",null,{"$f":"REPORTS!C8","v":0},{"$nulls":8},"SUBJECT TEACHER-",{"$nulls":7},{"$f":"REPORTS!K8","v":0}]
["LEARNING OBJECTIVE WISE GRADING"]
["NO","SR NO","CLASS","STUDENT NAME","FATHER NAME","GRADING"]
[{"$nulls":5},"BASELINE",{"$nulls":5},"AG","SA-1",{"$nulls":5},"AG","SA-2",{"$nulls":5},"AG","SA-3",{"$nulls":5},"AG"]
[{"$nulls":5},"CL","L","S","R","W","FG",null,"CL","L","S","R","W","FG",null,"CL","L","S","R","W","FG",null,"CL","L","S","R","W","FG"]
[{"$f":"'PRF-3'!A8","v":0},{"$f":"'PRF-3'!G8","v":0},{"$f":"'PRF-3'!B8","v":0},{"$f":"'PRF-3'!D8","v":0},{"$f":"'PRF-3'!E8","v":0},{"$f":"'PRF-3'!I8","v":0},{"$nulls":6},{"$f":"'PRF-3'!K8","v":0},{"$nulls":6},{"$f":"'PRF-3'!M8","v":0},{"$nulls":6},{"$f":"'PRF-3'!O8","v":0}]
[{"$f":"'PRF-3'!A9","v":0},{"$f":"'PRF-3'!G9","v":0},{"$f":"'PRF-3'!B9","v":0},{"$f":"'PRF-3'!D9","v":0},{"$f":"'PRF-3'!E9","v":0},{"$f":"'PRF-3'!I9","v":0},{"$nulls":6},{"$f":"'PRF-3'!K9","v":0},{"$nulls":6},{"$f":"'PRF-3'!M9","v":0},{"$nulls":6},{"$f":"'PRF-3'!O9","v":0}]
[{"$f":"'PRF-3'!A10","v":0},{"$f":"'PRF-3'!G10","v":0},{"$f":"'PRF-3'!B10","v":0},{"$f":"'PRF-3'!D10","v":0},{"$f":"'PRF-3'!E10","v":0},{"$f":"'PRF-3'!I10","v":0},{"$nulls":6},{"$f":"'PRF-3'!K10","v":0},{"$nulls":6},{"$f":"'PRF-3'!M10","v":0},{"$nulls":6},{"$f":"'PRF-3'!O10","v":0}]
[{"$f":"'PRF-3'!A11","v":0},{"$f":"'PRF-3'!G11","v":0},{"$f":"'PRF-3'!B11","v":0},{"$f":"'PRF-3'!D11","v":0},{"$f":"'PRF-3'!E11","v":0},{"$f":"'PRF-3'!I11","v":0},{"$nulls":6},{"$f":"'PRF-3'!K11","v":0},{"$nulls":6},{"$f":"'PRF-3'!M11","v":0},{"$nulls":6},{"$f":"'PRF-3'!O11","v":0}]
[{"$f":"'PRF-3'!A12","v":0},{"$f":"'PRF-3'!G12","v":0},{"$f":"'PRF-3'!B12","v":0},{"$f":"'PRF-3'!D12","v":0},{"$f":"'PRF-3'!E12","v":0},{"$f":"'PRF-3'!I12","v":0},{"$nulls":6},{"$f":"'PRF-3'!K12","v":0},{"$nulls":6},{"$f":"'PRF-3'!M12","v":0},{"$nulls":6},{"$f":"'PRF-3'!O12","v":0}]
[{"$f":"'PRF-3'!A13","v":0},{"$f":"'PRF-3'!G13","v":0},{"$f":"'PRF-3'!B13","v":0},{"$f":"'PRF-3'!D13","v":0},{"$f":"'PRF-3'!E13","v":0},{"$f":"'PRF-3'!I13","v":0},{"$nulls":6},{"$f":"'PRF-3'!K13","v":0},{"$nulls":6},{"$f":"'PRF-3'!M13","v":0},{"$nulls":6},{"$f":"'PRF-3'!O13","v":0}]
[{"$f":"'PRF-3'!A14","v":0},{"$f":"'PRF-3'!G14","v":0},{"$f":"'PRF-3'!B14","v":0},{"$f":"'PRF-3'!D14","v":0},{"$f":"'PRF-3'!E14","v":0},{"$f":"'PRF-3'!I14","v":0},{"$nulls":6},{"$f":"'PRF-3'!K14","v":0},{"$nulls":6},{"$f":"'PRF-3'!M14","v":0},{"$nulls":6},{"$f":"'PRF-3'!O14","v":0}]
[{"$f":"'PRF-3'!A15","v":0},{"$f":"'PRF-3'!G15","v":0},{"$f":"'PRF-3'!B15","v":0},{"$f":"'PRF-3'!D15","v":0},{"$f":"'PRF-3'!E15","v":0},{"$f":"'PRF-3'!I15","v":0},{"$nulls":6},{"$f":"'PRF-3'!K15","v":0},{"$nulls":6},{"$f":"'PRF-3'!M15","v":0},{"$nulls":6},{"$f":"'PRF-3'!O15","v":0}]
[{"$f":"'PRF-3'!A16","v":0},{"$f":"'PRF-3'!G16","v":0},{"$f":"'PRF-3'!B16","v":0},{"$f":"'PRF-3'!D16","v":0},{"$f":"'PRF-3'!E16","v":0},{"$f":"'PRF-3'!I16","v":0},{"$nulls":6},{"$f":"'PRF-3'!K16","v":0},{"$nulls":6},{"$f":"'PRF-3'!M16","v":0},{"$nulls":6},{"$f":"'PRF-3'!O16","v":0}]
[{"$f":"'PRF-3'!A17","v":0},{"$f":"'PRF-3'!G17","v":0},{"$f":"'PRF-3'!B17","v":0},{"$f":"'PRF-3'!D17","v":0},{"$f":"'PRF-3'!E17","v":0},{"$f":"'PRF-3'!I17","v":0},{"$nulls":6},{"$f":"'PRF-3'!K17","v":0},{"$nulls":6},{"$f":"'PRF-3'!M17","v":0},{"$nulls":6},{"$f":"'PRF-3'!O17","v":0}]
[{"$f":"'PRF-3'!A18","v":0},{"$f":"'PRF-3'!G18","v":0},{"$f":"'PRF-3'!B18","v":0},{"$f":"'PRF-3'!D18","v":0},{"$f":"'PRF-3'!E18","v":0},{"$f":"'PRF-3'!I18","v":0},{"$nulls":6},{"$f":"'PRF-3'!K18","v":0},{"$nulls":6},{"$f":"'PRF-3'!M18","v":0},{"$nulls":6},{"$f":"'PRF-3'!O18","v":0}]
[{"$f":"'PRF-3'!A19","v":0},{"$f":"'PRF-3'!G19","v":0},{"$f":"'PRF-3'!B19","v":0},{"$f":"'PRF-3'!D19","v":0},{"$f":"'PRF-3'!E19","v":0},{"$f":"'PRF-3'!I19","v":0},{"$nulls":6},{"$f":"'PRF-3'!K19","v":0},{"$nulls":6},{"$f":"'PRF-3'!M19","v":0},{"$nulls":6},{"$f":"'PRF-3'!O19","v":0}]
[{"$f":"'PRF-3'!A20","v":0},{"$f":"'PRF-3'!G20","v":0},{"$f":"'PRF-3'!B20","v":0},{"$f":"'PRF-3'!D20","v":0},{"$f":"'PRF-3'!E20","v":0},{"$f":"'PRF-3'!I20","v":0},{"$nulls":6},{"$f":"'PRF-3'!K20","v":0},{"$nulls":6},{"$f":"'PRF-3'!M20","v":0},{"$nulls":6},{"$f":"'PRF-3'!O20","v":0}]
[{"$f":"'PRF-3'!A21","v":0},{"$f":"'PRF-3'!G21","v":0},{"$f":"'PRF-3'!B21","v":0},{"$f":"'PRF-3'!D21","v":0},{"$f":"'PRF-3'!E21","v":0},{"$f":"'PRF-3'!I21","v":0},{"$nulls":6},{"$f":"'PRF-3'!K21","v":0},{"$nulls":6},{"$f":"'PRF-3'!M21","v":0},{"$nulls":6},{"$f":"'PRF-3'!O21","v":0}]
[{"$f":"'PRF-3'!A22","v":0},{"$f":"'PRF-3'!G22","v":0},{"$f":"'PRF-3'!B22","v":0},{"$f":"'PRF-3'!D22","v":0},{"$f":"'PRF-3'!E22","v":0},{"$f":"'PRF-3'!I22","v":0},{"$nulls":6},{"$f":"'PRF-3'!K22","v":0},{"$nulls":6},{"$f":"'PRF-3'!M22","v":0},{"$nulls":6},{"$f":"'PRF-3'!O22","v":0}]
[{"$f":"'PRF-3'!A23","v":0},{"$f":"'PRF-3'!G23","v":0},{"$f":"'PRF-3'!B23","v":0},{"$f":"'PRF-3'!D23","v":0},{"$f":"'PRF-3'!E23","v":0},{"$f":"'PRF-3'!I23","v":0},{"$nulls":6},{"$f":"'PRF-3'!K23","v":0},{"$nulls":6},{"$f":"'PRF-3'!M23","v":0},{"$nulls":6},{"$f":"'PRF-3'!O23","v":0}]
[{"$f":"'PRF-3'!A24","v":0},{"$f":"'PRF-3'!G24","v":0},{"$f":"'PRF-3'!B24","v":0},{"$f":"'PRF-3'!D24","v":0},{"$f":"'PRF-3'!E24","v":0},{"$f":"'PRF-3'!I24","v":0},{"$nulls":6},{"$f":"'PRF-3'!K24","v":0},{"$nulls":6},{"$f":"'PRF-3'!M24","v":0},{"$nulls":6},{"$f":"'PRF-3'!O24","v":0}]
[{"$f":"'PRF-3'!A25","v":0},{"$f":"'PRF-3'!G25","v":0},{"$f":"'PRF-3'!B25","v":0},{"$f":"'PRF-3'!D25","v":0},{"$f":"'PRF-3'!E25","v":0},{"$f":"'PRF-3'!I25","v":0},{"$nulls":6},{"$f":"'PRF-3'!K25","v":0},{"$nulls":6},{"$f":"'PRF-3'!M25","v":0},{"$nulls":6},{"$f":"'PRF-3'!O25","v":0}]
[{"$f":"'PRF-3'!A26","v":0},{"$f":"'PRF-3'!G26","v":0},{"$f":"'PRF-3'!B26","v":0},{"$f":"'PRF-3'!D26","v":0},{"$f":"'PRF-3'!E26","v":0},{"$f":"'PRF-3'!I26","v":0},{"$nulls":6},{"$f":"'PRF-3'!K26","v":0},{"$nulls":6},{"$f":"'PRF-3'!M26","v":0},{"$nulls":6},{"$f":"'PRF-3'!O26","v":0}]
[{"$f":"'PRF-3'!A27","v":0},{"$f":"'PRF-3'!G27","v":0},{"$f":"'PRF-3'!B27","v":0},{"$f":"'PRF-3'!D27","v":0},{"$f":"'PRF-3'!E27","v":0},{"$f":"'PRF-3'!I27","v":0},{"$nulls":6},{"$f":"'PRF-3'!K27","v":0},{"$nulls":6},{"$f":"'PRF-3'!M27","v":0},{"$nulls":6},{"$f":"'PRF-3'!O27","v":0}]
[{"$f":"'PRF-3'!A28","v":0},{"$f":"'PRF-3'!G28","v":0},{"$f":"'PRF-3'!B28","v":0},{"$f":"'PRF-3'!D28","v":0},{"$f":"'PRF-3'!E28","v":0},{"$f":"'PRF-3'!I28","v":0},{"$nulls":6},{"$f":"'PRF-3'!K28","v":0},{"$nulls":6},{"$f":"'PRF-3'!M28","v":0},{"$nulls":6},{"$f":"'PRF-3'!O28","v":0}]
[{"$f":"'PRF-3'!A29","v":0},{"$f":"'PRF-3'!G29","v":0},{"$f":"'PRF-3'!B29","v":0},{"$f":"'PRF-3'!D29","v":0},{"$f":"'PRF-3'!E29","v":0},{"$f":"'PRF-3'!I29","v":0},{"$nulls":6},{"$f":"'PRF-3'!K29","v":0},{"$nulls":6},{"$f":"'PRF-3'!M29","v":0},{"$nulls":6},{"$f":"'PRF-3'!O29","v":0}]
[{"$f":"'PRF-3'!A30","v":0},{"$f":"'PRF-3'!G30","v":0},{"$f":"'PRF-3'!B30","v":0},{"$f":"'PRF-3'!D30","v":0},{"$f":"'PRF-3'!E30","v":0},{"$f":"'PRF-3'!I30","v":0},{"$nulls":6},{"$f":"'PRF-3'!K30","v":0},{"$nulls":6},{"$f":"'PRF-3'!M30","v":0},{"$nulls":6},{"$f":"'PRF-3'!O30","v":0}]
[{"$f":"'PRF-3'!A31","v":0},{"$f":"'PRF-3'!G31","v":0},{"$f":"'PRF-3'!B31","v":0},{"$f":"'PRF-3'!D31","v":0},{"$f":"'PRF-3'!E31","v":0},{"$f":"'PRF-3'!I31","v":0},{"$nulls":6},{"$f":"'PRF-3'!K31","v":0},{"$nulls":6},{"$f":"'PRF-3'!M31","v":0},{"$nulls":6},{"$f":"'PRF-3'!O31","v":0}]
[{"$f":"'PRF-3'!A32","v":0},{"$f":"'PRF-3'!G32","v":0},{"$f":"'PRF-3'!B32","v":0},{"$f":"'PRF-3'!D32","v":0},{"$f":"'PRF-3'!E32","v":0},{"$f":"'PRF-3'!I32","v":0},{"$nulls":6},{"$f":"'PRF-3'!K32","v":0},{"$nulls":6},{"$f":"'PRF-3'!M32","v":0},{"$nulls":6},{"$f":"'PRF-3'!O32","v":0}]
[{"$f":"'PRF-3'!A33","v":0},{"$f":"'PRF-3'!G33","v":0},{"$f":"'PRF-3'!B33","v":0},{"$f":"'PRF-3'!D33","v":0},{"$f":"'PRF-3'!E33","v":0},{"$f":"'PRF-3'!I33","v":0},{"$nulls":6},{"$f":"'PRF-3'!K33","v":0},{"$nulls":6},{"$f":"'PRF-3'!M33","v":0},{"$nulls":6},{"$f":"'PRF-3'!O33","v":0}]
[{"$f":"'PRF-3'!A34","v":0},{"$f":"'PRF-3'!G34","v":0},{"$f":"'PRF-3'!B34","v":0},{"$f":"'PRF-3'!D34","v":0},{"$f":"'PRF-3'!E34","v":0},{"$f":"'PRF-3'!I34","v":0},{"$nulls":6},{"$f":"'PRF-3'!K34","v":0},{"$nulls":6},{"$f":"'PRF-3'!M34","v":0},{"$nulls":6},{"$f":"'PRF-3'!O34","v":0}]
[{"$f":"'PRF-3'!A35","v":0},{"$f":"'PRF-3'!G35","v":0},{"$f":"'PRF-3'!B35","v":0},{"$f":"'PRF-3'!D35","v":0},{"$f":"'PRF-3'!E35","v":0},{"$f":"'PRF-3'!I35","v":0},{"$nulls":6},{"$f":"'PRF-3'!K35","v":0},{"$nulls":6},{"$f":"'PRF-3'!M35","v":0},{"$nulls":6},{"$f":"'PRF-3'!O35","v":0}]
[{"$f":"'PRF-3'!A36","v":0},{"$f":"'PRF-3'!G36","v":0},{"$f":"'PRF-3'!B36","v":0},{"$f":"'PRF-3'!D36","v":0},{"$f":"'PRF-3'!E36","v":0},{"$f":"'PRF-3'!I36","v":0},{"$nulls":6},{"$f":"'PRF-3'!K36","v":0},{"$nulls":6},{"$f":"'PRF-3'!M36","v":0},{"$nulls":6},{"$f":"'PRF-3'!O36","v":0}]
[{"$f":"'PRF-3'!A37","v":0},{"$f":"'PRF-3'!G37","v":0},{"$f":"'PRF-3'!B37","v":0},{"$f":"'PRF-3'!D37","v":0},{"$f":"'PRF-3'!E37","v":0},{"$f":"'PRF-3'!I37","v":0},{"$nulls":6},{"$f":"'PRF-3'!K37","v":0},{"$nulls":6},{"$f":"'PRF-3'!M37","v":0},{"$nulls":6},{"$f":"'PRF-3'!O37","v":0}]
[{"$f":"'PRF-3'!A38","v":0},{"$f":"'PRF-3'!G38","v":0},{"$f":"'PRF-3'!B38","v":0},{"$f":"'PRF-3'!D38","v":0},{"$f":"'PRF-3'!E38","v":0},{"$f":"'PRF-3'!I38","v":0},{"$nulls":6},{"$f":"'PRF-3'!K38","v":0},{"$nulls":6},{"$f":"'PRF-3'!M38","v":0},{"$nulls":6},{"$f":"'PRF-3'!O38","v":0}]
[{"$f":"'PRF-3'!A39","v":0},{"$f":"'PRF-3'!G39","v":0},{"$f":"'PRF-3'!B39","v":0},{"$f":"'PRF-3'!D39","v":0},{"$f":"'PRF-3'!E39","v":0},{"$f":"'PRF-3'!I39","v":0},{"$nulls":6},{"$f":"'PRF-3'!K39","v":0},{"$nulls":6},{"$f":"'PRF-3'!M39","v":0},{"$nulls":6},{"$f":"'PRF-3'!O39","v":0}]
[{"$f":"'PRF-3'!A40","v":0},{"$f":"'PRF-3'!G40","v":0},{"$f":"'PRF-3'!B40","v":0},{"$f":"'PRF-3'!D40","v":0},{"$f":"'PRF-3'!E40","v":0},{"$f":"'PRF-3'!I40","v":0},{"$nulls":6},{"$f":"'PRF-3'!K40","v":0},{"$nulls":6},{"$f":"'PRF-3'!M40","v":0},{"$nulls":6},{"$f":"'PRF-3'!O40","v":0}]
[{"$f":"'PRF-3'!A41","v":0},{"$f":"'PRF-3'!G41","v":0},{"$f":"'PRF-3'!B41","v":0},{"$f":"'PRF-3'!D41","v":0},{"$f":"'PRF-3'!E41","v":0},{"$f":"'PRF-3'!I41","v":0},{"$nulls":6},{"$f":"'PRF-3'!K41","v":0},{"$nulls":6},{"$f":"'PRF-3'!M41","v":0},{"$nulls":6},{"$f":"'PRF-3'!O41","v":0}]
[{"$f":"'PRF-3'!A42","v":0},{"$f":"'PRF-3'!G42","v":0},{"$f":"'PRF-3'!B42","v":0},{"$f":"'PRF-3'!D42","v":0},{"$f":"'PRF-3'!E42","v":0},{"$f":"'PRF-3'!I42","v":0},{"$nulls":6},{"$f":"'PRF-3'!K42","v":0},{"$nulls":6},{"$f":"'PRF-3'!M42","v":0},{"$nulls":6},{"$f":"'PRF-3'!O42","v":0}]
[{"$f":"'PRF-3'!A43","v":0},{"$f":"'PRF-3'!G43","v":0},{"$f":"'PRF-3'!B43","v":0},{"$f":"'PRF-3'!D43","v":0},{"$f":"'PRF-3'!E43","v":0},{"$f":"'PRF-3'!I43","v":0},{"$nulls":6},{"$f":"'PRF-3'!K43","v":0},{"$nulls":6},{"$f":"'PRF-3'!M43","v":0},{"$nulls":6},{"$f":"'PRF-3'!O43","v":0}]
[{"$f":"'PRF-3'!A44","v":0},{"$f":"'PRF-3'!G44","v":0},{"$f":"'PRF-3'!B44","v":0},{"$f":"'PRF-3'!D44","v":0},{"$f":"'PRF-3'!E44","v":0},{"$f":"'PRF-3'!I44","v":0},{"$nulls":6},{"$f":"'PRF-3'!K44","v":0},{"$nulls":6},{"$f":"'PRF-3'!M44","v":0},{"$nulls":6},{"$f":"'PRF-3'!O44","v":0}]
[{"$f":"'PRF-3'!A45","v":0},{"$f":"'PRF-3'!G45","v":0},{"$f":"'PRF-3'!B45","v":0},{"$f":"'PRF-3'!D45","v":0},{"$f":"'PRF-3'!E45","v":0},{"$f":"'PRF-3'!I45","v":0},{"$nulls":6},{"$f":"'PRF-3'!K45","v":0},{"$nulls":6},{"$f":"'PRF-3'!M45","v":0},{"$nulls":6},{"$f":"'PRF-3'!O45","v":0}]
[{"$f":"'PRF-3'!A46","v":0},{"$f":"'PRF-3'!G46","v":0},{"$f":"'PRF-3'!B46","v":0},{"$f":"'PRF-3'!D46","v":0},{"$f":"'PRF-3'!E46","v":0},{"$f":"'PRF-3'!I46","v":0},{"$nulls":6},{"$f":"'PRF-3'!K46","v":0},{"$nulls":6},{"$f":"'PRF-3'!M46","v":0},{"$nulls":6},{"$f":"'PRF-3'!O46","v":0}]
[{"$f":"'PRF-3'!A47","v":0},{"$f":"'PRF-3'!G47","v":0},{"$f":"'PRF-3'!B47","v":0},{"$f":"'PRF-3'!D47","v":0},{"$f":"'PRF-3'!E47","v":0},{"$f":"'PRF-3'!I47","v":0},{"$nulls":6},{"$f":"'PRF-3'!K47","v":0},{"$nulls":6},{"$f":"'PRF-3'!M47","v":0},{"$nulls":6},{"$f":"'PRF-3'!O47","v":0}]
[{"$f":"'PRF-3'!A48","v":0},{"$f":"'PRF-3'!G48","v":0},{"$f":"'PRF-3'!B48","v":0},{"$f":"'PRF-3'!D48","v":0},{"$f":"'PRF-3'!E48","v":0},{"$f":"'PRF-3'!I48","v":0},{"$nulls":6},{"$f":"'PRF-3'!K48","v":0},{"$nulls":6},{"$f":"'PRF-3'!M48","v":0},{"$nulls":6},{"$f":"'PRF-3'!O48","v":0}]
[{"$f":"'PRF-3'!A49","v":0},{"$f":"'PRF-3'!G49","v":0},{"$f":"'PRF-3'!B49","v":0},{"$f":"'PRF-3'!D49","v":0},{"$f":"'PRF-3'!E49","v":0},{"$f":"'PRF-3'!I49","v":0},{"$nulls":6},{"$f":"'PRF-3'!K49","v":0},{"$nulls":6},{"$f":"'PRF-3'!M49","v":0},{"$nulls":6},{"$f":"'PRF-3'!O49","v":0}]
[{"$f":"'PRF-3'!A50","v":0},{"$f":"'PRF-3'!G50","v":0},{"$f":"'PRF-3'!B50","v":0},{"$f":"'PRF-3'!D50","v":0},{"$f":"'PRF-3'!E50","v":0},{"$f":"'PRF-3'!I50","v":0},{"$nulls":6},{"$f":"'PRF-3'!K50","v":0},{"$nulls":6},{"$f":"'PRF-3'!M50","v":0},{"$nulls":6},{"$f":"'PRF-3'!O50","v":0}]
[{"$f":"'PRF-3'!A51","v":0},{"$f":"'PRF-3'!G51","v":0},{"$f":"'PRF-3'!B51","v":0},{"$f":"'PRF-3'!D51","v":0},{"$f":"'PRF-3'!E51","v":0},{"$f":"'PRF-3'!I51","v":0},{"$nulls":6},{"$f":"'PRF-3'!K51","v":0},{"$nulls":6},{"$f":"'PRF-3'!M51","v":0},{"$nulls":6},{"$f":"'PRF-3'!O51","v":0}]
[{"$f":"'PRF-3'!A52","v":0},{"$f":"'PRF-3'!G52","v":0},{"$f":"'PRF-3'!B52","v":0},{"$f":"'PRF-3'!D52","v":0},{"$f":"'PRF-3'!E52","v":0},{"$f":"'PRF-3'!I52","v":0},{"$nulls":6},{"$f":"'PRF-3'!K52","v":0},{"$nulls":6},{"$f":"'PRF-3'!M52","v":0},{"$nulls":6},{"$f":"'PRF-3'!O52","v":0}]
[{"$f":"'PRF-3'!A53","v":0},{"$f":"'PRF-3'!G53","v":0},{"$f":"'PRF-3'!B53","v":0},{"$f":"'PRF-3'!D53","v":0},{"$f":"'PRF-3'!E53","v":0},{"$f":"'PRF-3'!I53","v":0},{"$nulls":6},{"$f":"'PRF-3'!K53","v":0},{"$nulls":6},{"$f":"'PRF-3'!M53","v":0},{"$nulls":6},{"$f":"'PRF-3'!O53","v":0}]
[{"$f":"'PRF-3'!A54","v":0},{"$f":"'PRF-3'!G54","v":0},{"$f":"'PRF-3'!B54","v":0},{"$f":"'PRF-3'!D54","v":0},{"$f":"'PRF-3'!E54","v":0},{"$f":"'PRF-3'!I54","v":0},{"$nulls":6},{"$f":"'PRF-3'!K54","v":0},{"$nulls":6},{"$f":"'PRF-3'!M54","v":0},{"$nulls":6},{"$f":"'PRF-3'!O54","v":0}]
[{"$f":"'PRF-3'!A55","v":0},{"$f":"'PRF-3'!G55","v":0},{"$f":"'PRF-3'!B55","v":0},{"$f":"'PRF-3'!D55","v":0},{"$f":"'PRF-3'!E55","v":0},{"$f":"'PRF-3'!I55","v":0},{"$nulls":6},{"$f":"'PRF-3'!K55","v":0},{"$nulls":6},{"$f":"'PRF-3'!M55","v":0},{"$nulls":6},{"$f":"'PRF-3'!O55","v":0}]
[{"$f":"'PRF-3'!A56","v":0},{"$f":"'PRF-3'!G56","v":0},{"$f":"'PRF-3'!B56","v":0},{"$f":"'PRF-3'!D56","v":0},{"$f":"'PRF-3'!E56","v":0},{"$f":"'PRF-3'!I56","v":0},{"$nulls":6},{"$f":"'PRF-3'!K56","v":0},{"$nulls":6},{"$f":"'PRF-3'!M56","v":0},{"$nulls":6},{"$f":"'PRF-3'!O56","v":0}]
[{"$f":"'PRF-3'!A57","v":0},{"$f":"'PRF-3'!G57","v":0},{"$f":"'PRF-3'!B57","v":0},{"$f":"'PRF-3'!D57","v":0},{"$f":"'PRF-3'!E57","v":0},{"$f":"'PRF-3'!I57","v":0},{"$nulls":6},{"$f":"'PRF-3'!K57","v":0},{"$nulls":6},{"$f":"'PRF-3'!M57","v":0},{"$nulls":6},{"$f":"'PRF-3'!O57","v":0}]
[{"$f":"'PRF-3'!A58","v":0},{"$f":"'PRF-3'!G58","v":0},{"$f":"'PRF-3'!B58","v":0},{"$f":"'PRF-3'!D58","v":0},{"$f":"'PRF-3'!E58","v":0},{"$f":"'PRF-3'!I58","v":0},{"$nulls":6},{"$f":"'PRF-3'!K58","v":0},{"$nulls":6},{"$f":"'PRF-3'!M58","v":0},{"$nulls":6},{"$f":"'PRF-3'!O58","v":0}]
[{"$f":"'PRF-3'!A59","v":0},{"$f":"'PRF-3'!G59","v":0},{"$f":"'PRF-3'!B59","v":0},{"$f":"'PRF-3'!D59","v":0},{"$f":"'PRF-3'!E59","v":0},{"$f":"'PRF-3'!I59","v":0},{"$nulls":6},{"$f":"'PRF-3'!K59","v":0},{"$nulls":6},{"$f":"'PRF-3'!M59","v":0},{"$nulls":6},{"$f":"'PRF-3'!O59","v":0}]
[{"$f":"'PRF-3'!A60","v":0},{"$f":"'PRF-3'!G60","v":0},{"$f":"'PRF-3'!B60","v":0},{"$f":"'PRF-3'!D60","v":0},{"$f":"'PRF-3'!E60","v":0},{"$f":"'PRF-3'!I60","v":0},{"$nulls":6},{"$f":"'PRF-3'!K60","v":0},{"$nulls":6},{"$f":"'PRF-3'!M60","v":0},{"$nulls":6},{"$f":"'PRF-3'!O60","v":0}]
[{"$f":"'PRF-3'!A61","v":0},{"$f":"'PRF-3'!G61","v":0},{"$f":"'PRF-3'!B61","v":0},{"$f":"'PRF-3'!D61","v":0},{"$f":"'PRF-3'!E61","v":0},{"$f":"'PRF-3'!I61","v":0},{"$nulls":6},{"$f":"'PRF-3'!K61","v":0},{"$nulls":6},{"$f":"'PRF-3'!M61","v":0},{"$nulls":6},{"$f":"'PRF-3'!O61","v":0}]
[{"$f":"'PRF-3'!A62","v":0},{"$f":"'PRF-3'!G62","v":0},{"$f":"'PRF-3'!B62","v":0},{"$f":"'PRF-3'!D62","v":0},{"$f":"'PRF-3'!E62","v":0},{"$f":"'PRF-3'!I62","v":0},{"$nulls":6},{"$f":"'PRF-3'!K62","v":0},{"$nulls":6},{"$f":"'PRF-3'!M62","v":0},{"$nulls":6},{"$f":"'PRF-3'!O62","v":0}]
[{"$f":"'PRF-3'!A63","v":0},{"$f":"'PRF-3'!G63","v":0},{"$f":"'PRF-3'!B63","v":0},{"$f":"'PRF-3'!D63","v":0},{"$f":"'PRF-3'!E63","v":0},{"$f":"'PRF-3'!I63","v":0},{"$nulls":6},{"$f":"'PRF-3'!K63","v":0},{"$nulls":6},{"$f":"'PRF-3'!M63","v":0},{"$nulls":6},{"$f":"'PRF-3'!O63","v":0}]
[{"$f":"'PRF-3'!A64","v":0},{"$f":"'PRF-3'!G64","v":0},{"$f":"'PRF-3'!B64","v":0},{"$f":"'PRF-3'!D64","v":0},{"$f":"'PRF-3'!E64","v":0},{"$f":"'PRF-3'!I64","v":0},{"$nulls":6},{"$f":"'PRF-3'!K64","v":0},{"$nulls":6},{"$f":"'PRF-3'!M64","v":0},{"$nulls":6},{"$f":"'PRF-3'!O64","v":0}]
[{"$f":"'PRF-3'!A65","v":0},{"$f":"'PRF-3'!G65","v":0},{"$f":"'PRF-3'!B65","v":0},{"$f":"'PRF-3'!D65","v":0},{"$f":"'PRF-3'!E65","v":0},{"$f":"'PRF-3'!I65","v":0},{"$nulls":6},{"$f":"'PRF-3'!K65","v":0},{"$nulls":6},{"$f":"'PRF-3'!M65","v":0},{"$nulls":6},{"$f":"'PRF-3'!O65","v":0}]
[{"$f":"'PRF-3'!A66","v":0},{"$f":"'PRF-3'!G66","v":0},{"$f":"'PRF-3'!B66","v":0},{"$f":"'PRF-3'!D66","v":0},{"$f":"'PRF-3'!E66","v":0},{"$f":"'PRF-3'!I66","v":0},{"$nulls":6},{"$f":"'PRF-3'!K66","v":0},{"$nulls":6},{"$f":"'PRF-3'!M66","v":0},{"$nulls":6},{"$f":"'PRF-3'!O66","v":0}]
[{"$f":"'PRF-3'!A67","v":0},{"$f":"'PRF-3'!G67","v":0},{"$f":"'PRF-3'!B67","v":0},{"$f":"'PRF-3'!D67","v":0},{"$f":"'PRF-3'!E67","v":0},{"$f":"'PRF-3'!I67","v":0},{"$nulls":6},{"$f":"'PRF-3'!K67","v":0},{"$nulls":6},{"$f":"'PRF-3'!M67","v":0},{"$nulls":6},{"$f":"'PRF-3'!O67","v":0}]

{"sheet":"LSRW-4","index":17,"n_rows":69,"n_cols":33,"rows_kept":69,"merged":[[0,0,1,32],[2,0,2,32],[3,0,3,32],[4,0,4,2],[4,4,4,5],[4,6,4,14],[4,15,4,22],[4,23,4,32],[5,0,5,32],[6,0,8,0],[6,1,8,1],[6,2,8,2],[6,3,8,3],[6,4,8,4],[6,5,6,32],[7,5,7,10],[7,11,8,11],[7,12,7,17],[7,18,8,18],[7,19,7,24],[7,25,8,25],[7,26,7,31],[7,32,8,32]]}
[{"$f":"REPORTS!$D$7","v":0}]
[]
["lrr ,oa O;kid ewY;kadu dk;ZØe 2018&19"]
["fo|ky; esa cPpksa ds 'kSf{kd Lrj dh fLFkfr"]
["CLASS-",null,null,"4TH","SUBJECT-",null,{"$f":"REPORTS!C8","v":0},{"$nulls":8},"SUBJECT TEACHER-",{"$nulls":7},{"$f":"REPORTS!K8","v":0}]
["LEARNING OBJECTIVE WISE GRADING"]
["NO","SR NO","CLASS","STUDENT NAME","FATHER NAME","GRADING"]
[{"$nulls":5},"BASELINE",{"$nulls":5},"AG","SA-1",{"$nulls":5},"AG","SA-2",{"$nulls":5},"AG","SA-3",{"$nulls":5},"AG"]
[{"$nulls":5},"CL","L","S","R","W","FG",null,"CL","L","S","R","W","FG",null,"CL","L","S","R","W","FG",null,"CL","L","S","R","W","FG"]
[{"$f":"'PRF-4'!A8","v":0},{"$f":"'PRF-4'!G8","v":0},{"$f":"'PRF-4'!B8","v":0},{"$f":"'PRF-4'!D8","v":0},{"$f":"'PRF-4'!E8","v":0},{"$f":"'PRF-4'!I8","v":0},{"$nulls":6},{"$f":"'PRF-4'!K8","v":0},{"$nulls":6},{"$f":"'PRF-4'!M8","v":0},{"$nulls":6},{"$f":"'PRF-4'!O8","v":0}]
[{"$f":"'PRF-4'!A9","v":0},{"$f":"'PRF-4'!G9","v":0},{"$f":"'PRF-4'!B9","v":0},{"$f":"'PRF-4'!D9","v":0},{"$f":"'PRF-4'!E9","v":0},{"$f":"'PRF-4'!I9","v":0},{"$nulls":6},{"$f":"'PRF-4'!K9","v":0},{"$nulls":6},{"$f":"'PRF-4'!M9","v":0},{"$nulls":6},{"$f":"'PRF-4'!O9","v":0}]
[{"$f":"'PRF-4'!A10","v":0},{"$f":"'PRF-4'!G10","v":0},{"$f":"'PRF-4'!B10","v":0},{"$f":"'PRF-4'!D10","v":0},{"$f":"'PRF-4'!E10","v":0},{"$f":"'PRF-4'!I10","v":0},{"$nulls":6},{"$f":"'PRF-4'!K10","v":0},{"$nulls":6},{"$f":"'PRF-4'!M10","v":0},{"$nulls":6},{"$f":"'PRF-4'!O10","v":0}]
[{"$f":"'PRF-4'!A11","v":0},{"$f":"'PRF-4'!G11","v":0},{"$f":"'PRF-4'!B11","v":0},{"$f":"'PRF-4'!D11","v":0},{"$f":"'PRF-4'!E11","v":0},{"$f":"'PRF-4'!I11","v":0},{"$nulls":6},{"$f":"'PRF-4'!K11","v":0},{"$nulls":6},{"$f":"'PRF-4'!M11","v":0},{"$nulls":6},{"$f":"'PRF-4'!O11","v":0}]
[{"$f":"'PRF-4'!A12","v":0},{"$f":"'PRF-4'!G12","v":0},{"$f":"'PRF-4'!B12","v":0},{"$f":"'PRF-4'!D12","v":0},{"$f":"'PRF-4'!E12","v":0},{"$f":"'PRF-4'!I12","v":0},{"$nulls":6},{"$f":"'PRF-4'!K12","v":0},{"$nulls":6},{"$f":"'PRF-4'!M12","v":0},{"$nulls":6},{"$f":"'PRF-4'!O12","v":0}]
[{"$f":"'PRF-4'!A13","v":0},{"$f":"'PRF-4'!G13","v":0},{"$f":"'PRF-4'!B13","v":0},{"$f":"'PRF-4'!D13","v":0},{"$f":"'PRF-4'!E13","v":0},{"$f":"'PRF-4'!I13","v":0},{"$nulls":6},{"$f":"'PRF-4'!K13","v":0},{"$nulls":6},{"$f":"'PRF-4'!M13","v":0},{"$nulls":6},{"$f":"'PRF-4'!O13","v":0}]
[{"$f":"'PRF-4'!A14","v":0},{"$f":"'PRF-4'!G14","v":0},{"$f":"'PRF-4'!B14","v":0},{"$f":"'PRF-4'!D14","v":0},{"$f":"'PRF-4'!E14","v":0},{"$f":"'PRF-4'!I14","v":0},{"$nulls":6},{"$f":"'PRF-4'!K14","v":0},{"$nulls":6},{"$f":"'PRF-4'!M14","v":0},{"$nulls":6},{"$f":"'PRF-4'!O14","v":0}]
[{"$f":"'PRF-4'!A15","v":0},{"$f":"'PRF-4'!G15","v":0},{"$f":"'PRF-4'!B15","v":0},{"$f":"'PRF-4'!D15","v":0},{"$f":"'PRF-4'!E15","v":0},{"$f":"'PRF-4'!I15","v":0},{"$nulls":6},{"$f":"'PRF-4'!K15","v":0},{"$nulls":6},{"$f":"'PRF-4'!M15","v":0},{"$nulls":6},{"$f":"'PRF-4'!O15","v":0}]
[{"$f":"'PRF-4'!A16","v":0},{"$f":"'PRF-4'!G16","v":0},{"$f":"'PRF-4'!B16","v":0},{"$f":"'PRF-4'!D16","v":0},{"$f":"'PRF-4'!E16","v":0},{"$f":"'PRF-4'!I16","v":0},{"$nulls":6},{"$f":"'PRF-4'!K16","v":0},{"$nulls":6},{"$f":"'PRF-4'!M16","v":0},{"$nulls":6},{"$f":"'PRF-4'!O16","v":0}]
[{"$f":"'PRF-4'!A17","v":0},{"$f":"'PRF-4'!G17","v":0},{"$f":"'PRF-4'!B17","v":0},{"$f":"'PRF-4'!D17","v":0},{"$f":"'PRF-4'!E17","v":0},{"$f":"'PRF-4'!I17","v":0},{"$nulls":6},{"$f":"'PRF-4'!K17","v":0},{"$nulls":6},{"$f":"'PRF-4'!M17","v":0},{"$nulls":6},{"$f":"'PRF-4'!O17","v":0}]
[{"$f":"'PRF-4'!A18","v":0},{"$f":"'PRF-4'!G18","v":0},{"$f":"'PRF-4'!B18","v":0},{"$f":"'PRF-4'!D18","v":0},{"$f":"'PRF-4'!E18","v":0},{"$f":"'PRF-4'!I18","v":0},{"$nulls":6},{"$f":"'PRF-4'!K18","v":0},{"$nulls":6},{"$f":"'PRF-4'!M18","v":0},{"$nulls":6},{"$f":"'PRF-4'!O18","v":0}]
[{"$f":"'PRF-4'!A19","v":0},{"$f":"'PRF-4'!G19","v":0},{"$f":"'PRF-4'!B19","v":0},{"$f":"'PRF-4'!D19","v":0},{"$f":"'PRF-4'!E19","v":0},{"$f":"'PRF-4'!I19","v":0},{"$nulls":6},{"$f":"'PRF-4'!K19","v":0},{"$nulls":6},{"$f":"'PRF-4'!M19","v":0},{"$nulls":6},{"$f":"'PRF-4'!O19","v":0}]
[{"$f":"'PRF-4'!A20","v":0},{"$f":"'PRF-4'!G20","v":0},{"$f":"'PRF-4'!B20","v":0},{"$f":"'PRF-4'!D20","v":0},{"$f":"'PRF-4'!E20","v":0},{"$f":"'PRF-4'!I20","v":0},{"$nulls":6},{"$f":"'PRF-4'!K20","v":0},{"$nulls":6},{"$f":"'PRF-4'!M20","v":0},{"$nulls":6},{"$f":"'PRF-4'!O20","v":0}]
[{"$f":"'PRF-4'!A21","v":0},{"$f":"'PRF-4'!G21","v":0},{"$f":"'PRF-4'!B21","v":0},{"$f":"'PRF-4'!D21","v":0},{"$f":"'PRF-4'!E21","v":0},{"$f":"'PRF-4'!I21","v":0},{"$nulls":6},{"$f":"'PRF-4'!K21","v":0},{"$nulls":6},{"$f":"'PRF-4'!M21","v":0},{"$nulls":6},{"$f":"'PRF-4'!O21","v":0}]
[{"$f":"'PRF-4'!A22","v":0},{"$f":"'PRF-4'!G22","v":0},{"$f":"'PRF-4'!B22","v":0},{"$f":"'PRF-4'!D22","v":0},{"$f":"'PRF-4'!E22","v":0},{"$f":"'PRF-4'!I22","v":0},{"$nulls":6},{"$f":"'PRF-4'!K22","v":0},{"$nulls":6},{"$f":"'PRF-4'!M22","v":0},{"$nulls":6},{"$f":"'PRF-4'!O22","v":0}]
[{"$f":"'PRF-4'!A23","v":0},{"$f":"'PRF-4'!G23","v":0},{"$f":"'PRF-4'!B23","v":0},{"$f":"'PRF-4'!D23","v":0},{"$f":"'PRF-4'!E23","v":0},{"$f":"'PRF-4'!I23","v":0},{"$nulls":6},{"$f":"'PRF-4'!K23","v":0},{"$nulls":6},{"$f":"'PRF-4'!M23","v":0},{"$nulls":6},{"$f":"'PRF-4'!O23","v":0}]
[{"$f":"'PRF-4'!A24","v":0},{"$f":"'PRF-4'!G24","v":0},{"$f":"'PRF-4'!B24","v":0},{"$f":"'PRF-4'!D24","v":0},{"$f":"'PRF-4'!E24","v":0},{"$f":"'PRF-4'!I24","v":0},{"$nulls":6},{"$f":"'PRF-4'!K24","v":0},{"$nulls":6},{"$f":"'PRF-4'!M24","v":0},{"$nulls":6},{"$f":"'PRF-4'!O24","v":0}]
[{"$f":"'PRF-4'!A25","v":0},{"$f":"'PRF-4'!G25","v":0},{"$f":"'PRF-4'!B25","v":0},{"$f":"'PRF-4'!D25","v":0},{"$f":"'PRF-4'!E25","v":0},{"$f":"'PRF-4'!I25","v":0},{"$nulls":6},{"$f":"'PRF-4'!K25","v":0},{"$nulls":6},{"$f":"'PRF-4'!M25","v":0},{"$nulls":6},{"$f":"'PRF-4'!O25","v":0}]
[{"$f":"'PRF-4'!A26","v":0},{"$f":"'PRF-4'!G26","v":0},{"$f":"'PRF-4'!B26","v":0},{"$f":"'PRF-4'!D26","v":0},{"$f":"'PRF-4'!E26","v":0},{"$f":"'PRF-4'!I26","v":0},{"$nulls":6},{"$f":"'PRF-4'!K26","v":0},{"$nulls":6},{"$f":"'PRF-4'!M26","v":0},{"$nulls":6},{"$f":"'PRF-4'!O26","v":0}]
[{"$f":"'PRF-4'!A27","v":0},{"$f":"'PRF-4'!G27","v":0},{"$f":"'PRF-4'!B27","v":0},{"$f":"'PRF-4'!D27","v":0},{"$f":"'PRF-4'!E27","v":0},{"$f":"'PRF-4'!I27","v":0},{"$nulls":6},{"$f":"'PRF-4'!K27","v":0},{"$nulls":6},{"$f":"'PRF-4'!M27","v":0},{"$nulls":6},{"$f":"'PRF-4'!O27","v":0}]
[{"$f":"'PRF-4'!A28","v":0},{"$f":"'PRF-4'!G28","v":0},{"$f":"'PRF-4'!B28","v":0},{"$f":"'PRF-4'!D28","v":0},{"$f":"'PRF-4'!E28","v":0},{"$f":"'PRF-4'!I28","v":0},{"$nulls":6},{"$f":"'PRF-4'!K28","v":0},{"$nulls":6},{"$f":"'PRF-4'!M28","v":0},{"$nulls":6},{"$f":"'PRF-4'!O28","v":0}]
[{"$f":"'PRF-4'!A29","v":0},{"$f":"'PRF-4'!G29","v":0},{"$f":"'PRF-4'!B29","v":0},{"$f":"'PRF-4'!D29","v":0},{"$f":"'PRF-4'!E29","v":0},{"$f":"'PRF-4'!I29","v":0},{"$nulls":6},{"$f":"'PRF-4'!K29","v":0},{"$nulls":6},{"$f":"'PRF-4'!M29","v":0},{"$nulls":6},{"$f":"'PRF-4'!O29","v":0}]
[{"$f":"'PRF-4'!A30","v":0},{"$f":"'PRF-4'!G30","v":0},{"$f":"'PRF-4'!B30","v":0},{"$f":"'PRF-4'!D30","v":0},{"$f":"'PRF-4'!E30","v":0},{"$f":"'PRF-4'!I30","v":0},{"$nulls":6},{"$f":"'PRF-4'!K30","v":0},{"$nulls":6},{"$f":"'PRF-4'!M30","v":0},{"$nulls":6},{"$f":"'PRF-4'!O30","v":0}]
[{"$f":"'PRF-4'!A31","v":0},{"$f":"'PRF-4'!G31","v":0},{"$f":"'PRF-4'!B31","v":0},{"$f":"'PRF-4'!D31","v":0},{"$f":"'PRF-4'!E31","v":0},{"$f":"'PRF-4'!I31","v":0},{"$nulls":6},{"$f":"'PRF-4'!K31","v":0},{"$nulls":6},{"$f":"'PRF-4'!M31","v":0},{"$nulls":6},{"$f":"'PRF-4'!O31","v":0}]
[{"$f":"'PRF-4'!A32","v":0},{"$f":"'PRF-4'!G32","v":0},{"$f":"'PRF-4'!B32","v":0},{"$f":"'PRF-4'!D32","v":0},{"$f":"'PRF-4'!E32","v":0},{"$f":"'PRF-4'!I32","v":0},{"$nulls":6},{"$f":"'PRF-4'!K32","v":0},{"$nulls":6},{"$f":"'PRF-4'!M32","v":0},{"$nulls":6},{"$f":"'PRF-4'!O32","v":0}]
[{"$f":"'PRF-4'!A33","v":0},{"$f":"'PRF-4'!G33","v":0},{"$f":"'PRF-4'!B33","v":0},{"$f":"'PRF-4'!D33","v":0},{"$f":"'PRF-4'!E33","v":0},{"$f":"'PRF-4'!I33","v":0},{"$nulls":6},{"$f":"'PRF-4'!K33","v":0},{"$nulls":6},{"$f":"'PRF-4'!M33","v":0},{"$nulls":6},{"$f":"'PRF-4'!O33","v":0}]
[{"$f":"'PRF-4'!A34","v":0},{"$f":"'PRF-4'!G34","v":0},{"$f":"'PRF-4'!B34","v":0},{"$f":"'PRF-4'!D34","v":0},{"$f":"'PRF-4'!E34","v":0},{"$f":"'PRF-4'!I34","v":0},{"$nulls":6},{"$f":"'PRF-4'!K34","v":0},{"$nulls":6},{"$f":"'PRF-4'!M34","v":0},{"$nulls":6},{"$f":"'PRF-4'!O34","v":0}]
[{"$f":"'PRF-4'!A35","v":0},{"$f":"'PRF-4'!G35","v":0},{"$f":"'PRF-4'!B35","v":0},{"$f":"'PRF-4'!D35","v":0},{"$f":"'PRF-4'!E35","v":0},{"$f":"'PRF-4'!I35","v":0},{"$nulls":6},{"$f":"'PRF-4'!K35","v":0},{"$nulls":6},{"$f":"'PRF-4'!M35","v":0},{"$nulls":6},{"$f":"'PRF-4'!O35","v":0}]
[{"$f":"'PRF-4'!A36","v":0},{"$f":"'PRF-4'!G36","v":0},{"$f":"'PRF-4'!B36","v":0},{"$f":"'PRF-4'!D36","v":0},{"$f":"'PRF-4'!E36","v":0},{"$f":"'PRF-4'!I36","v":0},{"$nulls":6},{"$f":"'PRF-4'!K36","v":0},{"$nulls":6},{"$f":"'PRF-4'!M36","v":0},{"$nulls":6},{"$f":"'PRF-4'!O36","v":0}]
[{"$f":"'PRF-4'!A37","v":0},{"$f":"'PRF-4'!G37","v":0},{"$f":"'PRF-4'!B37","v":0},{"$f":"'PRF-4'!D37","v":0},{"$f":"'PRF-4'!E37","v":0},{"$f":"'PRF-4'!I37","v":0},{"$nulls":6},{"$f":"'PRF-4'!K37","v":0},{"$nulls":6},{"$f":"'PRF-4'!M37","v":0},{"$nulls":6},{"$f":"'PRF-4'!O37","v":0}]
[{"$f":"'PRF-4'!A38","v":0},{"$f":"'PRF-4'!G38","v":0},{"$f":"'PRF-4'!B38","v":0},{"$f":"'PRF-4'!D38","v":0},{"$f":"'PRF-4'!E38","v":0},{"$f":"'PRF-4'!I38","v":0},{"$nulls":6},{"$f":"'PRF-4'!K38","v":0},{"$nulls":6},{"$f":"'PRF-4'!M38","v":0},{"$nulls":6},{"$f":"'PRF-4'!O38","v":0}]
[{"$f":"'PRF-4'!A39","v":0},{"$f":"'PRF-4'!G39","v":0},{"$f":"'PRF-4'!B39","v":0},{"$f":"'PRF-4'!D39","v":0},{"$f":"'PRF-4'!E39","v":0},{"$f":"'PRF-4'!I39","v":0},{"$nulls":6},{"$f":"'PRF-4'!K39","v":0},{"$nulls":6},{"$f":"'PRF-4'!M39","v":0},{"$nulls":6},{"$f":"'PRF-4'!O39","v":0}]
[{"$f":"'PRF-4'!A40","v":0},{"$f":"'PRF-4'!G40","v":0},{"$f":"'PRF-4'!B40","v":0},{"$f":"'PRF-4'!D40","v":0},{"$f":"'PRF-4'!E40","v":0},{"$f":"'PRF-4'!I40","v":0},{"$nulls":6},{"$f":"'PRF-4'!K40","v":0},{"$nulls":6},{"$f":"'PRF-4'!M40","v":0},{"$nulls":6},{"$f":"'PRF-4'!O40","v":0}]
[{"$f":"'PRF-4'!A41","v":0},{"$f":"'PRF-4'!G41","v":0},{"$f":"'PRF-4'!B41","v":0},{"$f":"'PRF-4'!D41","v":0},{"$f":"'PRF-4'!E41","v":0},{"$f":"'PRF-4'!I41","v":0},{"$nulls":6},{"$f":"'PRF-4'!K41","v":0},{"$nulls":6},{"$f":"'PRF-4'!M41","v":0},{"$nulls":6},{"$f":"'PRF-4'!O41","v":0}]
[{"$f":"'PRF-4'!A42","v":0},{"$f":"'PRF-4'!G42","v":0},{"$f":"'PRF-4'!B42","v":0},{"$f":"'PRF-4'!D42","v":0},{"$f":"'PRF-4'!E42","v":0},{"$f":"'PRF-4'!I42","v":0},{"$nulls":6},{"$f":"'PRF-4'!K42","v":0},{"$nulls":6},{"$f":"'PRF-4'!M42","v":0},{"$nulls":6},{"$f":"'PRF-4'!O42","v":0}]
[{"$f":"'PRF-4'!A43","v":0},{"$f":"'PRF-4'!G43","v":0},{"$f":"'PRF-4'!B43","v":0},{"$f":"'PRF-4'!D43","v":0},{"$f":"'PRF-4'!E43","v":0},{"$f":"'PRF-4'!I43","v":0},{"$nulls":6},{"$f":"'PRF-4'!K43","v":0},{"$nulls":6},{"$f":"'PRF-4'!M43","v":0},{"$nulls":6},{"$f":"'PRF-4'!O43","v":0}]
[{"$f":"'PRF-4'!A44","v":0},{"$f":"'PRF-4'!G44","v":0},{"$f":"'PRF-4'!B44","v":0},{"$f":"'PRF-4'!D44","v":0},{"$f":"'PRF-4'!E44","v":0},{"$f":"'PRF-4'!I44","v":0},{"$nulls":6},{"$f":"'PRF-4'!K44","v":0},{"$nulls":6},{"$f":"'PRF-4'!M44","v":0},{"$nulls":6},{"$f":"'PRF-4'!O44","v":0}]
[{"$f":"'PRF-4'!A45","v":0},{"$f":"'PRF-4'!G45","v":0},{"$f":"'PRF-4'!B45","v":0},{"$f":"'PRF-4'!D45","v":0},{"$f":"'PRF-4'!E45","v":0},{"$f":"'PRF-4'!I45","v":0},{"$nulls":6},{"$f":"'PRF-4'!K45","v":0},{"$nulls":6},{"$f":"'PRF-4'!M45","v":0},{"$nulls":6},{"$f":"'PRF-4'!O45","v":0}]
[{"$f":"'PRF-4'!A46","v":0},{"$f":"'PRF-4'!G46","v":0},{"$f":"'PRF-4'!B46","v":0},{"$f":"'PRF-4'!D46","v":0},{"$f":"'PRF-4'!E46","v":0},{"$f":"'PRF-4'!I46","v":0},{"$nulls":6},{"$f":"'PRF-4'!K46","v":0},{"$nulls":6},{"$f":"'PRF-4'!M46","v":0},{"$nulls":6},{"$f":"'PRF-4'!O46","v":0}]
[{"$f":"'PRF-4'!A47","v":0},{"$f":"'PRF-4'!G47","v":0},{"$f":"'PRF-4'!B47","v":0},{"$f":"'PRF-4'!D47","v":0},{"$f":"'PRF-4'!E47","v":0},{"$f":"'PRF-4'!I47","v":0},{"$nulls":6},{"$f":"'PRF-4'!K47","v":0},{"$nulls":6},{"$f":"'PRF-4'!M47","v":0},{"$nulls":6},{"$f":"'PRF-4'!O47","v":0}]
[{"$f":"'PRF-4'!A48","v":0},{"$f":"'PRF-4'!G48","v":0},{"$f":"'PRF-4'!B48","v":0},{"$f":"'PRF-4'!D48","v":0},{"$f":"'PRF-4'!E48","v":0},{"$f":"'PRF-4'!I48","v":0},{"$nulls":6},{"$f":"'PRF-4'!K48","v":0},{"$nulls":6},{"$f":"'PRF-4'!M48","v":0},{"$nulls":6},{"$f":"'PRF-4'!O48","v":0}]
[{"$f":"'PRF-4'!A49","v":0},{"$f":"'PRF-4'!G49","v":0},{"$f":"'PRF-4'!B49","v":0},{"$f":"'PRF-4'!D49","v":0},{"$f":"'PRF-4'!E49","v":0},{"$f":"'PRF-4'!I49","v":0},{"$nulls":6},{"$f":"'PRF-4'!K49","v":0},{"$nulls":6},{"$f":"'PRF-4'!M49","v":0},{"$nulls":6},{"$f":"'PRF-4'!O49","v":0}]
[{"$f":"'PRF-4'!A50","v":0},{"$f":"'PRF-4'!G50","v":0},{"$f":"'PRF-4'!B50","v":0},{"$f":"'PRF-4'!D50","v":0},{"$f":"'PRF-4'!E50","v":0},{"$f":"'PRF-4'!I50","v":0},{"$nulls":6},{"$f":"'PRF-4'!K50","v":0},{"$nulls":6},{"$f":"'PRF-4'!M50","v":0},{"$nulls":6},{"$f":"'PRF-4'!O50","v":0}]
[{"$f":"'PRF-4'!A51","v":0},{"$f":"'PRF-4'!G51","v":0},{"$f":"'PRF-4'!B51","v":0},{"$f":"'PRF-4'!D51","v":0},{"$f":"'PRF-4'!E51","v":0},{"$f":"'PRF-4'!I51","v":0},{"$nulls":6},{"$f":"'PRF-4'!K51","v":0},{"$nulls":6},{"$f":"'PRF-4'!M51","v":0},{"$nulls":6},{"$f":"'PRF-4'!O51","v":0}]
[{"$f":"'PRF-4'!A52","v":0},{"$f":"'PRF-4'!G52","v":0},{"$f":"'PRF-4'!B52","v":0},{"$f":"'PRF-4'!D52","v":0},{"$f":"'PRF-4'!E52","v":0},{"$f":"'PRF-4'!I52","v":0},{"$nulls":6},{"$f":"'PRF-4'!K52","v":0},{"$nulls":6},{"$f":"'PRF-4'!M52","v":0},{"$nulls":6},{"$f":"'PRF-4'!O52","v":0}]
[{"$f":"'PRF-4'!A53","v":0},{"$f":"'PRF-4'!G53","v":0},{"$f":"'PRF-4'!B53","v":0},{"$f":"'PRF-4'!D53","v":0},{"$f":"'PRF-4'!E53","v":0},{"$f":"'PRF-4'!I53","v":0},{"$nulls":6},{"$f":"'PRF-4'!K53","v":0},{"$nulls":6},{"$f":"'PRF-4'!M53","v":0},{"$nulls":6},{"$f":"'PRF-4'!O53","v":0}]
[{"$f":"'PRF-4'!A54","v":0},{"$f":"'PRF-4'!G54","v":0},{"$f":"'PRF-4'!B54","v":0},{"$f":"'PRF-4'!D54","v":0},{"$f":"'PRF-4'!E54","v":0},{"$f":"'PRF-4'!I54","v":0},{"$nulls":6},{"$f":"'PRF-4'!K54","v":0},{"$nulls":6},{"$f":"'PRF-4'!M54","v":0},{"$nulls":6},{"$f":"'PRF-4'!O54","v":0}]
[{"$f":"'PRF-4'!A55","v":0},{"$f":"'PRF-4'!G55","v":0},{"$f":"'PRF-4'!B55","v":0},{"$f":"'PRF-4'!D55","v":0},{"$f":"'PRF-4'!E55","v":0},{"$f":"'PRF-4'!I55","v":0},{"$nulls":6},{"$f":"'PRF-4'!K55","v":0},{"$nulls":6},{"$f":"'PRF-4'!M55","v":0},{"$nulls":6},{"$f":"'PRF-4'!O55","v":0}]
[{"$f":"'PRF-4'!A56","v":0},{"$f":"'PRF-4'!G56","v":0},{"$f":"'PRF-4'!B56","v":0},{"$f":"'PRF-4'!D56","v":0},{"$f":"'PRF-4'!E56","v":0},{"$f":"'PRF-4'!I56","v":0},{"$nulls":6},{"$f":"'PRF-4'!K56","v":0},{"$nulls":6},{"$f":"'PRF-4'!M56","v":0},{"$nulls":6},{"$f":"'PRF-4'!O56","v":0}]
[{"$f":"'PRF-4'!A57","v":0},{"$f":"'PRF-4'!G57","v":0},{"$f":"'PRF-4'!B57","v":0},{"$f":"'PRF-4'!D57","v":0},{"$f":"'PRF-4'!E57","v":0},{"$f":"'PRF-4'!I57","v":0},{"$nulls":6},{"$f":"'PRF-4'!K57","v":0},{"$nulls":6},{"$f":"'PRF-4'!M57","v":0},{"$nulls":6},{"$f":"'PRF-4'!O57","v":0}]
[{"$f":"'PRF-4'!A58","v":0},{"$f":"'PRF-4'!G58","v":0},{"$f":"'PRF-4'!B58","v":0},{"$f":"'PRF-4'!D58","v":0},{"$f":"'PRF-4'!E58","v":0},{"$f":"'PRF-4'!I58","v":0},{"$nulls":6},{"$f":"'PRF-4'!K58","v":0},{"$nulls":6},{"$f":"'PRF-4'!M58","v":0},{"$nulls":6},{"$f":"'PRF-4'!O58","v":0}]
[{"$f":"'PRF-4'!A59","v":0},{"$f":"'PRF-4'!G59","v":0},{"$f":"'PRF-4'!B59","v":0},{"$f":"'PRF-4'!D59","v":0},{"$f":"'PRF-4'!E59","v":0},{"$f":"'PRF-4'!I59","v":0},{"$nulls":6},{"$f":"'PRF-4'!K59","v":0},{"$nulls":6},{"$f":"'PRF-4'!M59","v":0},{"$nulls":6},{"$f":"'PRF-4'!O59","v":0}]
[{"$f":"'PRF-4'!A60","v":0},{"$f":"'PRF-4'!G60","v":0},{"$f":"'PRF-4'!B60","v":0},{"$f":"'PRF-4'!D60","v":0},{"$f":"'PRF-4'!E60","v":0},{"$f":"'PRF-4'!I60","v":0},{"$nulls":6},{"$f":"'PRF-4'!K60","v":0},{"$nulls":6},{"$f":"'PRF-4'!M60","v":0},{"$nulls":6},{"$f":"'PRF-4'!O60","v":0}]
[{"$f":"'PRF-4'!A61","v":0},{"$f":"'PRF-4'!G61","v":0},{"$f":"'PRF-4'!B61","v":0},{"$f":"'PRF-4'!D61","v":0},{"$f":"'PRF-4'!E61","v":0},{"$f":"'PRF-4'!I61","v":0},{"$nulls":6},{"$f":"'PRF-4'!K61","v":0},{"$nulls":6},{"$f":"'PRF-4'!M61","v":0},{"$nulls":6},{"$f":"'PRF-4'!O61","v":0}]
[{"$f":"'PRF-4'!A62","v":0},{"$f":"'PRF-4'!G62","v":0},{"$f":"'PRF-4'!B62","v":0},{"$f":"'PRF-4'!D62","v":0},{"$f":"'PRF-4'!E62","v":0},{"$f":"'PRF-4'!I62","v":0},{"$nulls":6},{"$f":"'PRF-4'!K62","v":0},{"$nulls":6},{"$f":"'PRF-4'!M62","v":0},{"$nulls":6},{"$f":"'PRF-4'!O62","v":0}]
[{"$f":"'PRF-4'!A63","v":0},{"$f":"'PRF-4'!G63","v":0},{"$f":"'PRF-4'!B63","v":0},{"$f":"'PRF-4'!D63","v":0},{"$f":"'PRF-4'!E63","v":0},{"$f":"'PRF-4'!I63","v":0},{"$nulls":6},{"$f":"'PRF-4'!K63","v":0},{"$nulls":6},{"$f":"'PRF-4'!M63","v":0},{"$nulls":6},{"$f":"'PRF-4'!O63","v":0}]
[{"$f":"'PRF-4'!A64","v":0},{"$f":"'PRF-4'!G64","v":0},{"$f":"'PRF-4'!B64","v":0},{"$f":"'PRF-4'!D64","v":0},{"$f":"'PRF-4'!E64","v":0},{"$f":"'PRF-4'!I64","v":0},{"$nulls":6},{"$f":"'PRF-4'!K64","v":0},{"$nulls":6},{"$f":"'PRF-4'!M64","v":0},{"$nulls":6},{"$f":"'PRF-4'!O64","v":0}]
[{"$f":"'PRF-4'!A65","v":0},{"$f":"'PRF-4'!G65","v":0},{"$f":"'PRF-4'!B65","v":0},{"$f":"'PRF-4'!D65","v":0},{"$f":"'PRF-4'!E65","v":0},{"$f":"'PRF-4'!I65","v":0},{"$nulls":6},{"$f":"'PRF-4'!K65","v":0},{"$nulls":6},{"$f":"'PRF-4'!M65","v":0},{"$nulls":6},{"$f":"'PRF-4'!O65","v":0}]
[{"$f":"'PRF-4'!A66","v":0},{"$f":"'PRF-4'!G66","v":0},{"$f":"'PRF-4'!B66","v":0},{"$f":"'PRF-4'!D66","v":0},{"$f":"'PRF-4'!E66","v":0},{"$f":"'PRF-4'!I66","v":0},{"$nulls":6},{"$f":"'PRF-4'!K66","v":0},{"$nulls":6},{"$f":"'PRF-4'!M66","v":0},{"$nulls":6},{"$f":"'PRF-4'!O66","v":0}]
[{"$f":"'PRF-4'!A67","v":0},{"$f":"'PRF-4'!G67","v":0},{"$f":"'PRF-4'!B67","v":0},{"$f":"'PRF-4'!D67","v":0},{"$f":"'PRF-4'!E67","v":0},{"$f":"'PRF-4'!I67","v":0},{"$nulls":6},{"$f":"'PRF-4'!K67","v":0},{"$nulls":6},{"$f":"'PRF-4'!M67","v":0},{"$nulls":6},{"$f":"'PRF-4'!O67","v":0}]

{"sheet":"LSRW-5","index":18,"n_rows":69,"n_cols":33,"rows_kept":69,"merged":[[0,0,1,32],[2,0,2,32],[3,0,3,32],[4,0,4,2],[4,4,4,5],[4,6,4,14],[4,15,4,22],[4,23,4,32],[5,0,5,32],[6,0,8,0],[6,1,8,1],[6,2,8,2],[6,3,8,3],[6,4,8,4],[6,5,6,32],[7,5,7,10],[7,11,8,11],[7,12,7,17],[7,18,8,18],[7,19,7,24],[7,25,8,25],[7,26,7,31],[7,32,8,32]]}
[{"$f":"REPORTS!$D$7","v":0}]
[]
["lrr ,oa O;kid ewY;kadu dk;ZØe 2018&19"]
["fo|ky; esa cPpksa ds 'kSf{kd Lrj dh fLFkfr"]
["CLASS-",null,null,"5TH","SUBJECT-",null,{"$f":"REPORTS!C8","v":0},{"$nulls":8},"SUBJECT TEACHER-",{"$nulls":7},{"$f":"REPORTS!K8","v":0}]
["LEARNING OBJECTIVE WISE GRADING"]
["NO","SR NO","CLASS","STUDENT NAME","FATHER NAME","GRADING"]
[{"$nulls":5},"BASELINE",{"$nulls":5},"AG","SA-1",{"$nulls":5},"AG","SA-2",{"$nulls":5},"AG","SA-3",{"$nulls":5},"AG"]
[{"$nulls":5},"CL","L","S","R","W","FG",null,"CL","L","S","R","W","FG",null,"CL","L","S","R","W","FG",null,"CL","L","S","R","W","FG"]
[{"$f":"'PRF-5'!A8","v":1},{"$f":"'PRF-5'!G8","v":1015},{"$f":"'PRF-5'!B8","v":5},{"$f":"'PRF-5'!D8","v":"ARJUN KUMAR"},{"$f":"'PRF-5'!E8","v":"ASHUTOSH"},{"$f":"'PRF-5'!I8","v":4},"A","B","B","B","B","B",{"$f":"'PRF-5'!K8","v":4},"A","B","A","A","A","A",{"$f":"'PRF-5'!M8","v":5},"A","A","B","B","B","B",{"$f":"'PRF-5'!O8","v":5},"A","A","B","A","B","B"]
[{"$f":"'PRF-5'!A9","v":2},{"$f":"'PRF-5'!G9","v":1025},{"$f":"'PRF-5'!B9","v":5},{"$f":"'PRF-5'!D9","v":"MAHAK KUMARI"},{"$f":"'PRF-5'!E9","v":"VASANT KUMAR"},{"$f":"'PRF-5'!I9","v":5},"B","B","B","B","B","B",{"$f":"'PRF-5'!K9","v":5},"A","B","A","B","B","B",{"$f":"'PRF-5'!M9","v":5},"A","A","A","A","B","A",{"$f":"'PRF-5'!O9","v":5},"A","A","A","A","A","A"]
[{"$f":"'PRF-5'!A10","v":0},{"$f":"'PRF-5'!G10","v":0},{"$f":"'PRF-5'!B10","v":0},{"$f":"'PRF-5'!D10","v":0},{"$f":"'PRF-5'!E10","v":0},{"$f":"'PRF-5'!I10","v":0},{"$nulls":6},{"$f":"'PRF-5'!K10","v":0},{"$nulls":6},{"$f":"'PRF-5'!M10","v":0},{"$nulls":6},{"$f":"'PRF-5'!O10","v":0}]
[{"$f":"'PRF-5'!A11","v":0},{"$f":"'PRF-5'!G11","v":0},{"$f":"'PRF-5'!B11","v":0},{"$f":"'PRF-5'!D11","v":0},{"$f":"'PRF-5'!E11","v":0},{"$f":"'PRF-5'!I11","v":0},{"$nulls":6},{"$f":"'PRF-5'!K11","v":0},{"$nulls":6},{"$f":"'PRF-5'!M11","v":0},{"$nulls":6},{"$f":"'PRF-5'!O11","v":0}]
[{"$f":"'PRF-5'!A12","v":0},{"$f":"'PRF-5'!G12","v":0},{"$f":"'PRF-5'!B12","v":0},{"$f":"'PRF-5'!D12","v":0},{"$f":"'PRF-5'!E12","v":0},{"$f":"'PRF-5'!I12","v":0},{"$nulls":6},{"$f":"'PRF-5'!K12","v":0},{"$nulls":6},{"$f":"'PRF-5'!M12","v":0},{"$nulls":6},{"$f":"'PRF-5'!O12","v":0}]
[{"$f":"'PRF-5'!A13","v":0},{"$f":"'PRF-5'!G13","v":0},{"$f":"'PRF-5'!B13","v":0},{"$f":"'PRF-5'!D13","v":0},{"$f":"'PRF-5'!E13","v":0},{"$f":"'PRF-5'!I13","v":0},{"$nulls":6},{"$f":"'PRF-5'!K13","v":0},{"$nulls":6},{"$f":"'PRF-5'!M13","v":0},{"$nulls":6},{"$f":"'PRF-5'!O13","v":0}]
[{"$f":"'PRF-5'!A14","v":0},{"$f":"'PRF-5'!G14","v":0},{"$f":"'PRF-5'!B14","v":0},{"$f":"'PRF-5'!D14","v":0},{"$f":"'PRF-5'!E14","v":0},{"$f":"'PRF-5'!I14","v":0},{"$nulls":6},{"$f":"'PRF-5'!K14","v":0},{"$nulls":6},{"$f":"'PRF-5'!M14","v":0},{"$nulls":6},{"$f":"'PRF-5'!O14","v":0}]
[{"$f":"'PRF-5'!A15","v":0},{"$f":"'PRF-5'!G15","v":0},{"$f":"'PRF-5'!B15","v":0},{"$f":"'PRF-5'!D15","v":0},{"$f":"'PRF-5'!E15","v":0},{"$f":"'PRF-5'!I15","v":0},{"$nulls":6},{"$f":"'PRF-5'!K15","v":0},{"$nulls":6},{"$f":"'PRF-5'!M15","v":0},{"$nulls":6},{"$f":"'PRF-5'!O15","v":0}]
[{"$f":"'PRF-5'!A16","v":0},{"$f":"'PRF-5'!G16","v":0},{"$f":"'PRF-5'!B16","v":0},{"$f":"'PRF-5'!D16","v":0},{"$f":"'PRF-5'!E16","v":0},{"$f":"'PRF-5'!I16","v":0},{"$nulls":6},{"$f":"'PRF-5'!K16","v":0},{"$nulls":6},{"$f":"'PRF-5'!M16","v":0},{"$nulls":6},{"$f":"'PRF-5'!O16","v":0}]
[{"$f":"'PRF-5'!A17","v":0},{"$f":"'PRF-5'!G17","v":0},{"$f":"'PRF-5'!B17","v":0},{"$f":"'PRF-5'!D17","v":0},{"$f":"'PRF-5'!E17","v":0},{"$f":"'PRF-5'!I17","v":0},{"$nulls":6},{"$f":"'PRF-5'!K17","v":0},{"$nulls":6},{"$f":"'PRF-5'!M17","v":0},{"$nulls":6},{"$f":"'PRF-5'!O17","v":0}]
[{"$f":"'PRF-5'!A18","v":0},{"$f":"'PRF-5'!G18","v":0},{"$f":"'PRF-5'!B18","v":0},{"$f":"'PRF-5'!D18","v":0},{"$f":"'PRF-5'!E18","v":0},{"$f":"'PRF-5'!I18","v":0},{"$nulls":6},{"$f":"'PRF-5'!K18","v":0},{"$nulls":6},{"$f":"'PRF-5'!M18","v":0},{"$nulls":6},{"$f":"'PRF-5'!O18","v":0}]
[{"$f":"'PRF-5'!A19","v":0},{"$f":"'PRF-5'!G19","v":0},{"$f":"'PRF-5'!B19","v":0},{"$f":"'PRF-5'!D19","v":0},{"$f":"'PRF-5'!E19","v":0},{"$f":"'PRF-5'!I19","v":0},{"$nulls":6},{"$f":"'PRF-5'!K19","v":0},{"$nulls":6},{"$f":"'PRF-5'!M19","v":0},{"$nulls":6},{"$f":"'PRF-5'!O19","v":0}]
[{"$f":"'PRF-5'!A20","v":0},{"$f":"'PRF-5'!G20","v":0},{"$f":"'PRF-5'!B20","v":0},{"$f":"'PRF-5'!D20","v":0},{"$f":"'PRF-5'!E20","v":0},{"$f":"'PRF-5'!I20","v":0},{"$nulls":6},{"$f":"'PRF-5'!K20","v":0},{"$nulls":6},{"$f":"'PRF-5'!M20","v":0},{"$nulls":6},{"$f":"'PRF-5'!O20","v":0}]
[{"$f":"'PRF-5'!A21","v":0},{"$f":"'PRF-5'!G21","v":0},{"$f":"'PRF-5'!B21","v":0},{"$f":"'PRF-5'!D21","v":0},{"$f":"'PRF-5'!E21","v":0},{"$f":"'PRF-5'!I21","v":0},{"$nulls":6},{"$f":"'PRF-5'!K21","v":0},{"$nulls":6},{"$f":"'PRF-5'!M21","v":0},{"$nulls":6},{"$f":"'PRF-5'!O21","v":0}]
[{"$f":"'PRF-5'!A22","v":0},{"$f":"'PRF-5'!G22","v":0},{"$f":"'PRF-5'!B22","v":0},{"$f":"'PRF-5'!D22","v":0},{"$f":"'PRF-5'!E22","v":0},{"$f":"'PRF-5'!I22","v":0},{"$nulls":6},{"$f":"'PRF-5'!K22","v":0},{"$nulls":6},{"$f":"'PRF-5'!M22","v":0},{"$nulls":6},{"$f":"'PRF-5'!O22","v":0}]
[{"$f":"'PRF-5'!A23","v":0},{"$f":"'PRF-5'!G23","v":0},{"$f":"'PRF-5'!B23","v":0},{"$f":"'PRF-5'!D23","v":0},{"$f":"'PRF-5'!E23","v":0},{"$f":"'PRF-5'!I23","v":0},{"$nulls":6},{"$f":"'PRF-5'!K23","v":0},{"$nulls":6},{"$f":"'PRF-5'!M23","v":0},{"$nulls":6},{"$f":"'PRF-5'!O23","v":0}]
[{"$f":"'PRF-5'!A24","v":0},{"$f":"'PRF-5'!G24","v":0},{"$f":"'PRF-5'!B24","v":0},{"$f":"'PRF-5'!D24","v":0},{"$f":"'PRF-5'!E24","v":0},{"$f":"'PRF-5'!I24","v":0},{"$nulls":6},{"$f":"'PRF-5'!K24","v":0},{"$nulls":6},{"$f":"'PRF-5'!M24","v":0},{"$nulls":6},{"$f":"'PRF-5'!O24","v":0}]
[{"$f":"'PRF-5'!A25","v":0},{"$f":"'PRF-5'!G25","v":0},{"$f":"'PRF-5'!B25","v":0},{"$f":"'PRF-5'!D25","v":0},{"$f":"'PRF-5'!E25","v":0},{"$f":"'PRF-5'!I25","v":0},{"$nulls":6},{"$f":"'PRF-5'!K25","v":0},{"$nulls":6},{"$f":"'PRF-5'!M25","v":0},{"$nulls":6},{"$f":"'PRF-5'!O25","v":0}]
[{"$f":"'PRF-5'!A26","v":0},{"$f":"'PRF-5'!G26","v":0},{"$f":"'PRF-5'!B26","v":0},{"$f":"'PRF-5'!D26","v":0},{"$f":"'PRF-5'!E26","v":0},{"$f":"'PRF-5'!I26","v":0},{"$nulls":6},{"$f":"'PRF-5'!K26","v":0},{"$nulls":6},{"$f":"'PRF-5'!M26","v":0},{"$nulls":6},{"$f":"'PRF-5'!O26","v":0}]
[{"$f":"'PRF-5'!A27","v":0},{"$f":"'PRF-5'!G27","v":0},{"$f":"'PRF-5'!B27","v":0},{"$f":"'PRF-5'!D27","v":0},{"$f":"'PRF-5'!E27","v":0},{"$f":"'PRF-5'!I27","v":0},{"$nulls":6},{"$f":"'PRF-5'!K27","v":0},{"$nulls":6},{"$f":"'PRF-5'!M27","v":0},{"$nulls":6},{"$f":"'PRF-5'!O27","v":0}]
[{"$f":"'PRF-5'!A28","v":0},{"$f":"'PRF-5'!G28","v":0},{"$f":"'PRF-5'!B28","v":0},{"$f":"'PRF-5'!D28","v":0},{"$f":"'PRF-5'!E28","v":0},{"$f":"'PRF-5'!I28","v":0},{"$nulls":6},{"$f":"'PRF-5'!K28","v":0},{"$nulls":6},{"$f":"'PRF-5'!M28","v":0},{"$nulls":6},{"$f":"'PRF-5'!O28","v":0}]
[{"$f":"'PRF-5'!A29","v":0},{"$f":"'PRF-5'!G29","v":0},{"$f":"'PRF-5'!B29","v":0},{"$f":"'PRF-5'!D29","v":0},{"$f":"'PRF-5'!E29","v":0},{"$f":"'PRF-5'!I29","v":0},{"$nulls":6},{"$f":"'PRF-5'!K29","v":0},{"$nulls":6},{"$f":"'PRF-5'!M29","v":0},{"$nulls":6},{"$f":"'PRF-5'!O29","v":0}]
[{"$f":"'PRF-5'!A30","v":0},{"$f":"'PRF-5'!G30","v":0},{"$f":"'PRF-5'!B30","v":0},{"$f":"'PRF-5'!D30","v":0},{"$f":"'PRF-5'!E30","v":0},{"$f":"'PRF-5'!I30","v":0},{"$nulls":6},{"$f":"'PRF-5'!K30","v":0},{"$nulls":6},{"$f":"'PRF-5'!M30","v":0},{"$nulls":6},{"$f":"'PRF-5'!O30","v":0}]
[{"$f":"'PRF-5'!A31","v":0},{"$f":"'PRF-5'!G31","v":0},{"$f":"'PRF-5'!B31","v":0},{"$f":"'PRF-5'!D31","v":0},{"$f":"'PRF-5'!E31","v":0},{"$f":"'PRF-5'!I31","v":0},{"$nulls":6},{"$f":"'PRF-5'!K31","v":0},{"$nulls":6},{"$f":"'PRF-5'!M31","v":0},{"$nulls":6},{"$f":"'PRF-5'!O31","v":0}]
[{"$f":"'PRF-5'!A32","v":0},{"$f":"'PRF-5'!G32","v":0},{"$f":"'PRF-5'!B32","v":0},{"$f":"'PRF-5'!D32","v":0},{"$f":"'PRF-5'!E32","v":0},{"$f":"'PRF-5'!I32","v":0},{"$nulls":6},{"$f":"'PRF-5'!K32","v":0},{"$nulls":6},{"$f":"'PRF-5'!M32","v":0},{"$nulls":6},{"$f":"'PRF-5'!O32","v":0}]
[{"$f":"'PRF-5'!A33","v":0},{"$f":"'PRF-5'!G33","v":0},{"$f":"'PRF-5'!B33","v":0},{"$f":"'PRF-5'!D33","v":0},{"$f":"'PRF-5'!E33","v":0},{"$f":"'PRF-5'!I33","v":0},{"$nulls":6},{"$f":"'PRF-5'!K33","v":0},{"$nulls":6},{"$f":"'PRF-5'!M33","v":0},{"$nulls":6},{"$f":"'PRF-5'!O33","v":0}]
[{"$f":"'PRF-5'!A34","v":0},{"$f":"'PRF-5'!G34","v":0},{"$f":"'PRF-5'!B34","v":0},{"$f":"'PRF-5'!D34","v":0},{"$f":"'PRF-5'!E34","v":0},{"$f":"'PRF-5'!I34","v":0},{"$nulls":6},{"$f":"'PRF-5'!K34","v":0},{"$nulls":6},{"$f":"'PRF-5'!M34","v":0},{"$nulls":6},{"$f":"'PRF-5'!O34","v":0}]
[{"$f":"'PRF-5'!A35","v":0},{"$f":"'PRF-5'!G35","v":0},{"$f":"'PRF-5'!B35","v":0},{"$f":"'PRF-5'!D35","v":0},{"$f":"'PRF-5'!E35","v":0},{"$f":"'PRF-5'!I35","v":0},{"$nulls":6},{"$f":"'PRF-5'!K35","v":0},{"$nulls":6},{"$f":"'PRF-5'!M35","v":0},{"$nulls":6},{"$f":"'PRF-5'!O35","v":0}]
[{"$f":"'PRF-5'!A36","v":0},{"$f":"'PRF-5'!G36","v":0},{"$f":"'PRF-5'!B36","v":0},{"$f":"'PRF-5'!D36","v":0},{"$f":"'PRF-5'!E36","v":0},{"$f":"'PRF-5'!I36","v":0},{"$nulls":6},{"$f":"'PRF-5'!K36","v":0},{"$nulls":6},{"$f":"'PRF-5'!M36","v":0},{"$nulls":6},{"$f":"'PRF-5'!O36","v":0}]
[{"$f":"'PRF-5'!A37","v":0},{"$f":"'PRF-5'!G37","v":0},{"$f":"'PRF-5'!B37","v":0},{"$f":"'PRF-5'!D37","v":0},{"$f":"'PRF-5'!E37","v":0},{"$f":"'PRF-5'!I37","v":0},{"$nulls":6},{"$f":"'PRF-5'!K37","v":0},{"$nulls":6},{"$f":"'PRF-5'!M37","v":0},{"$nulls":6},{"$f":"'PRF-5'!O37","v":0}]
[{"$f":"'PRF-5'!A38","v":0},{"$f":"'PRF-5'!G38","v":0},{"$f":"'PRF-5'!B38","v":0},{"$f":"'PRF-5'!D38","v":0},{"$f":"'PRF-5'!E38","v":0},{"$f":"'PRF-5'!I38","v":0},{"$nulls":6},{"$f":"'PRF-5'!K38","v":0},{"$nulls":6},{"$f":"'PRF-5'!M38","v":0},{"$nulls":6},{"$f":"'PRF-5'!O38","v":0}]
[{"$f":"'PRF-5'!A39","v":0},{"$f":"'PRF-5'!G39","v":0},{"$f":"'PRF-5'!B39","v":0},{"$f":"'PRF-5'!D39","v":0},{"$f":"'PRF-5'!E39","v":0},{"$f":"'PRF-5'!I39","v":0},{"$nulls":6},{"$f":"'PRF-5'!K39","v":0},{"$nulls":6},{"$f":"'PRF-5'!M39","v":0},{"$nulls":6},{"$f":"'PRF-5'!O39","v":0}]
[{"$f":"'PRF-5'!A40","v":0},{"$f":"'PRF-5'!G40","v":0},{"$f":"'PRF-5'!B40","v":0},{"$f":"'PRF-5'!D40","v":0},{"$f":"'PRF-5'!E40","v":0},{"$f":"'PRF-5'!I40","v":0},{"$nulls":6},{"$f":"'PRF-5'!K40","v":0},{"$nulls":6},{"$f":"'PRF-5'!M40","v":0},{"$nulls":6},{"$f":"'PRF-5'!O40","v":0}]
[{"$f":"'PRF-5'!A41","v":0},{"$f":"'PRF-5'!G41","v":0},{"$f":"'PRF-5'!B41","v":0},{"$f":"'PRF-5'!D41","v":0},{"$f":"'PRF-5'!E41","v":0},{"$f":"'PRF-5'!I41","v":0},{"$nulls":6},{"$f":"'PRF-5'!K41","v":0},{"$nulls":6},{"$f":"'PRF-5'!M41","v":0},{"$nulls":6},{"$f":"'PRF-5'!O41","v":0}]
[{"$f":"'PRF-5'!A42","v":0},{"$f":"'PRF-5'!G42","v":0},{"$f":"'PRF-5'!B42","v":0},{"$f":"'PRF-5'!D42","v":0},{"$f":"'PRF-5'!E42","v":0},{"$f":"'PRF-5'!I42","v":0},{"$nulls":6},{"$f":"'PRF-5'!K42","v":0},{"$nulls":6},{"$f":"'PRF-5'!M42","v":0},{"$nulls":6},{"$f":"'PRF-5'!O42","v":0}]
[{"$f":"'PRF-5'!A43","v":0},{"$f":"'PRF-5'!G43","v":0},{"$f":"'PRF-5'!B43","v":0},{"$f":"'PRF-5'!D43","v":0},{"$f":"'PRF-5'!E43","v":0},{"$f":"'PRF-5'!I43","v":0},{"$nulls":6},{"$f":"'PRF-5'!K43","v":0},{"$nulls":6},{"$f":"'PRF-5'!M43","v":0},{"$nulls":6},{"$f":"'PRF-5'!O43","v":0}]
[{"$f":"'PRF-5'!A44","v":0},{"$f":"'PRF-5'!G44","v":0},{"$f":"'PRF-5'!B44","v":0},{"$f":"'PRF-5'!D44","v":0},{"$f":"'PRF-5'!E44","v":0},{"$f":"'PRF-5'!I44","v":0},{"$nulls":6},{"$f":"'PRF-5'!K44","v":0},{"$nulls":6},{"$f":"'PRF-5'!M44","v":0},{"$nulls":6},{"$f":"'PRF-5'!O44","v":0}]
[{"$f":"'PRF-5'!A45","v":0},{"$f":"'PRF-5'!G45","v":0},{"$f":"'PRF-5'!B45","v":0},{"$f":"'PRF-5'!D45","v":0},{"$f":"'PRF-5'!E45","v":0},{"$f":"'PRF-5'!I45","v":0},{"$nulls":6},{"$f":"'PRF-5'!K45","v":0},{"$nulls":6},{"$f":"'PRF-5'!M45","v":0},{"$nulls":6},{"$f":"'PRF-5'!O45","v":0}]
[{"$f":"'PRF-5'!A46","v":0},{"$f":"'PRF-5'!G46","v":0},{"$f":"'PRF-5'!B46","v":0},{"$f":"'PRF-5'!D46","v":0},{"$f":"'PRF-5'!E46","v":0},{"$f":"'PRF-5'!I46","v":0},{"$nulls":6},{"$f":"'PRF-5'!K46","v":0},{"$nulls":6},{"$f":"'PRF-5'!M46","v":0},{"$nulls":6},{"$f":"'PRF-5'!O46","v":0}]
[{"$f":"'PRF-5'!A47","v":0},{"$f":"'PRF-5'!G47","v":0},{"$f":"'PRF-5'!B47","v":0},{"$f":"'PRF-5'!D47","v":0},{"$f":"'PRF-5'!E47","v":0},{"$f":"'PRF-5'!I47","v":0},{"$nulls":6},{"$f":"'PRF-5'!K47","v":0},{"$nulls":6},{"$f":"'PRF-5'!M47","v":0},{"$nulls":6},{"$f":"'PRF-5'!O47","v":0}]
[{"$f":"'PRF-5'!A48","v":0},{"$f":"'PRF-5'!G48","v":0},{"$f":"'PRF-5'!B48","v":0},{"$f":"'PRF-5'!D48","v":0},{"$f":"'PRF-5'!E48","v":0},{"$f":"'PRF-5'!I48","v":0},{"$nulls":6},{"$f":"'PRF-5'!K48","v":0},{"$nulls":6},{"$f":"'PRF-5'!M48","v":0},{"$nulls":6},{"$f":"'PRF-5'!O48","v":0}]
[{"$f":"'PRF-5'!A49","v":0},{"$f":"'PRF-5'!G49","v":0},{"$f":"'PRF-5'!B49","v":0},{"$f":"'PRF-5'!D49","v":0},{"$f":"'PRF-5'!E49","v":0},{"$f":"'PRF-5'!I49","v":0},{"$nulls":6},{"$f":"'PRF-5'!K49","v":0},{"$nulls":6},{"$f":"'PRF-5'!M49","v":0},{"$nulls":6},{"$f":"'PRF-5'!O49","v":0}]
[{"$f":"'PRF-5'!A50","v":0},{"$f":"'PRF-5'!G50","v":0},{"$f":"'PRF-5'!B50","v":0},{"$f":"'PRF-5'!D50","v":0},{"$f":"'PRF-5'!E50","v":0},{"$f":"'PRF-5'!I50","v":0},{"$nulls":6},{"$f":"'PRF-5'!K50","v":0},{"$nulls":6},{"$f":"'PRF-5'!M50","v":0},{"$nulls":6},{"$f":"'PRF-5'!O50","v":0}]
[{"$f":"'PRF-5'!A51","v":0},{"$f":"'PRF-5'!G51","v":0},{"$f":"'PRF-5'!B51","v":0},{"$f":"'PRF-5'!D51","v":0},{"$f":"'PRF-5'!E51","v":0},{"$f":"'PRF-5'!I51","v":0},{"$nulls":6},{"$f":"'PRF-5'!K51","v":0},{"$nulls":6},{"$f":"'PRF-5'!M51","v":0},{"$nulls":6},{"$f":"'PRF-5'!O51","v":0}]
[{"$f":"'PRF-5'!A52","v":0},{"$f":"'PRF-5'!G52","v":0},{"$f":"'PRF-5'!B52","v":0},{"$f":"'PRF-5'!D52","v":0},{"$f":"'PRF-5'!E52","v":0},{"$f":"'PRF-5'!I52","v":0},{"$nulls":6},{"$f":"'PRF-5'!K52","v":0},{"$nulls":6},{"$f":"'PRF-5'!M52","v":0},{"$nulls":6},{"$f":"'PRF-5'!O52","v":0}]
[{"$f":"'PRF-5'!A53","v":0},{"$f":"'PRF-5'!G53","v":0},{"$f":"'PRF-5'!B53","v":0},{"$f":"'PRF-5'!D53","v":0},{"$f":"'PRF-5'!E53","v":0},{"$f":"'PRF-5'!I53","v":0},{"$nulls":6},{"$f":"'PRF-5'!K53","v":0},{"$nulls":6},{"$f":"'PRF-5'!M53","v":0},{"$nulls":6},{"$f":"'PRF-5'!O53","v":0}]
[{"$f":"'PRF-5'!A54","v":0},{"$f":"'PRF-5'!G54","v":0},{"$f":"'PRF-5'!B54","v":0},{"$f":"'PRF-5'!D54","v":0},{"$f":"'PRF-5'!E54","v":0},{"$f":"'PRF-5'!I54","v":0},{"$nulls":6},{"$f":"'PRF-5'!K54","v":0},{"$nulls":6},{"$f":"'PRF-5'!M54","v":0},{"$nulls":6},{"$f":"'PRF-5'!O54","v":0}]
[{"$f":"'PRF-5'!A55","v":0},{"$f":"'PRF-5'!G55","v":0},{"$f":"'PRF-5'!B55","v":0},{"$f":"'PRF-5'!D55","v":0},{"$f":"'PRF-5'!E55","v":0},{"$f":"'PRF-5'!I55","v":0},{"$nulls":6},{"$f":"'PRF-5'!K55","v":0},{"$nulls":6},{"$f":"'PRF-5'!M55","v":0},{"$nulls":6},{"$f":"'PRF-5'!O55","v":0}]
[{"$f":"'PRF-5'!A56","v":0},{"$f":"'PRF-5'!G56","v":0},{"$f":"'PRF-5'!B56","v":0},{"$f":"'PRF-5'!D56","v":0},{"$f":"'PRF-5'!E56","v":0},{"$f":"'PRF-5'!I56","v":0},{"$nulls":6},{"$f":"'PRF-5'!K56","v":0},{"$nulls":6},{"$f":"'PRF-5'!M56","v":0},{"$nulls":6},{"$f":"'PRF-5'!O56","v":0}]
[{"$f":"'PRF-5'!A57","v":0},{"$f":"'PRF-5'!G57","v":0},{"$f":"'PRF-5'!B57","v":0},{"$f":"'PRF-5'!D57","v":0},{"$f":"'PRF-5'!E57","v":0},{"$f":"'PRF-5'!I57","v":0},{"$nulls":6},{"$f":"'PRF-5'!K57","v":0},{"$nulls":6},{"$f":"'PRF-5'!M57","v":0},{"$nulls":6},{"$f":"'PRF-5'!O57","v":0}]
[{"$f":"'PRF-5'!A58","v":0},{"$f":"'PRF-5'!G58","v":0},{"$f":"'PRF-5'!B58","v":0},{"$f":"'PRF-5'!D58","v":0},{"$f":"'PRF-5'!E58","v":0},{"$f":"'PRF-5'!I58","v":0},{"$nulls":6},{"$f":"'PRF-5'!K58","v":0},{"$nulls":6},{"$f":"'PRF-5'!M58","v":0},{"$nulls":6},{"$f":"'PRF-5'!O58","v":0}]
[{"$f":"'PRF-5'!A59","v":0},{"$f":"'PRF-5'!G59","v":0},{"$f":"'PRF-5'!B59","v":0},{"$f":"'PRF-5'!D59","v":0},{"$f":"'PRF-5'!E59","v":0},{"$f":"'PRF-5'!I59","v":0},{"$nulls":6},{"$f":"'PRF-5'!K59","v":0},{"$nulls":6},{"$f":"'PRF-5'!M59","v":0},{"$nulls":6},{"$f":"'PRF-5'!O59","v":0}]
[{"$f":"'PRF-5'!A60","v":0},{"$f":"'PRF-5'!G60","v":0},{"$f":"'PRF-5'!B60","v":0},{"$f":"'PRF-5'!D60","v":0},{"$f":"'PRF-5'!E60","v":0},{"$f":"'PRF-5'!I60","v":0},{"$nulls":6},{"$f":"'PRF-5'!K60","v":0},{"$nulls":6},{"$f":"'PRF-5'!M60","v":0},{"$nulls":6},{"$f":"'PRF-5'!O60","v":0}]
[{"$f":"'PRF-5'!A61","v":0},{"$f":"'PRF-5'!G61","v":0},{"$f":"'PRF-5'!B61","v":0},{"$f":"'PRF-5'!D61","v":0},{"$f":"'PRF-5'!E61","v":0},{"$f":"'PRF-5'!I61","v":0},{"$nulls":6},{"$f":"'PRF-5'!K61","v":0},{"$nulls":6},{"$f":"'PRF-5'!M61","v":0},{"$nulls":6},{"$f":"'PRF-5'!O61","v":0}]
[{"$f":"'PRF-5'!A62","v":0},{"$f":"'PRF-5'!G62","v":0},{"$f":"'PRF-5'!B62","v":0},{"$f":"'PRF-5'!D62","v":0},{"$f":"'PRF-5'!E62","v":0},{"$f":"'PRF-5'!I62","v":0},{"$nulls":6},{"$f":"'PRF-5'!K62","v":0},{"$nulls":6},{"$f":"'PRF-5'!M62","v":0},{"$nulls":6},{"$f":"'PRF-5'!O62","v":0}]
[{"$f":"'PRF-5'!A63","v":0},{"$f":"'PRF-5'!G63","v":0},{"$f":"'PRF-5'!B63","v":0},{"$f":"'PRF-5'!D63","v":0},{"$f":"'PRF-5'!E63","v":0},{"$f":"'PRF-5'!I63","v":0},{"$nulls":6},{"$f":"'PRF-5'!K63","v":0},{"$nulls":6},{"$f":"'PRF-5'!M63","v":0},{"$nulls":6},{"$f":"'PRF-5'!O63","v":0}]
[{"$f":"'PRF-5'!A64","v":0},{"$f":"'PRF-5'!G64","v":0},{"$f":"'PRF-5'!B64","v":0},{"$f":"'PRF-5'!D64","v":0},{"$f":"'PRF-5'!E64","v":0},{"$f":"'PRF-5'!I64","v":0},{"$nulls":6},{"$f":"'PRF-5'!K64","v":0},{"$nulls":6},{"$f":"'PRF-5'!M64","v":0},{"$nulls":6},{"$f":"'PRF-5'!O64","v":0}]
[{"$f":"'PRF-5'!A65","v":0},{"$f":"'PRF-5'!G65","v":0},{"$f":"'PRF-5'!B65","v":0},{"$f":"'PRF-5'!D65","v":0},{"$f":"'PRF-5'!E65","v":0},{"$f":"'PRF-5'!I65","v":0},{"$nulls":6},{"$f":"'PRF-5'!K65","v":0},{"$nulls":6},{"$f":"'PRF-5'!M65","v":0},{"$nulls":6},{"$f":"'PRF-5'!O65","v":0}]
[{"$f":"'PRF-5'!A66","v":0},{"$f":"'PRF-5'!G66","v":0},{"$f":"'PRF-5'!B66","v":0},{"$f":"'PRF-5'!D66","v":0},{"$f":"'PRF-5'!E66","v":0},{"$f":"'PRF-5'!I66","v":0},{"$nulls":6},{"$f":"'PRF-5'!K66","v":0},{"$nulls":6},{"$f":"'PRF-5'!M66","v":0},{"$nulls":6},{"$f":"'PRF-5'!O66","v":0}]
[{"$f":"'PRF-5'!A67","v":0},{"$f":"'PRF-5'!G67","v":0},{"$f":"'PRF-5'!B67","v":0},{"$f":"'PRF-5'!D67","v":0},{"$f":"'PRF-5'!E67","v":0},{"$f":"'PRF-5'!I67","v":0},{"$nulls":6},{"$f":"'PRF-5'!K67","v":0},{"$nulls":6},{"$f":"'PRF-5'!M67","v":0},{"$nulls":6},{"$f":"'PRF-5'!O67","v":0}]

{"sheet":"PORTFOLIO","index":19,"n_rows":21,"n_cols":19,"rows_kept":21,"merged":[[0,4,1,15],[1,17,3,17],[1,18,3,19],[2,6,3,13],[4,8,4,11],[5,4,5,7],[5,8,5,12],[6,4,6,7],[6,8,6,12],[7,4,7,7],[7,8,7,12],[8,4,8,7],[8,8,8,12],[9,4,9,7],[9,8,9,12],[10,4,10,7],[10,8,10,12],[11,4,11,7],[11,8,11,9],[11,10,11,11],[13,4,13,15],[14,4,15,7],[14,8,14,9],[14,10,14,11],[14,12,14,13],[14,14,14,15],[16,4,16,7],[17,4,17,7],[18,4,18,7],[19,4,19,7],[20,4,20,7],[21,4,22,15]]}
[{"$nulls":4},{"$f":"REPORTS!D7","v":0}]
[{"$nulls":17},2,"FILL ATTENDANCE NO. OF THE STUDENT"]
[{"$nulls":6},"STUDENT-PORTFOLIO PAGE"]
[]
[{"$nulls":8},"SESSION 2018-19"]
[{"$nulls":4},"NAME OF THE STUDENT",{"$nulls":3},{"$f":"VLOOKUP(R2,'LSRW-5'!A10:AG68,4,0)","v":"MAHAK KUMARI"}]
[{"$nulls":4},"FATHER NAME",{"$nulls":3},{"$f":"VLOOKUP(R2,'LSRW-5'!A10:AG68,5,0)","v":"VASANT KUMAR"}]
[{"$nulls":4},"MOTHER NAME",{"$nulls":3},{"$f":"VLOOKUP(R2,'PRF-5'!A8:I67,6,0)","v":"SUNITA DEVI"}]
[{"$nulls":4},"CLASS",{"$nulls":3},"FIFTH"]
[{"$nulls":4},"DATE OF BIRTH",{"$nulls":3},{"$f":"VLOOKUP(R2,'PRF-5'!A8:H67,8,0)","v":"2007-08-05"}]
[{"$nulls":4},"SUBJECT",{"$nulls":3},"ENGLISH"]
[{"$nulls":4},"ATTENDANCE NUMBER",{"$nulls":3},{"$f":"VLOOKUP(R2,'LSRW-5'!A10:AG68,1,0)","v":2},null,"SR NO.",null,{"$f":"VLOOKUP(R2,'LSRW-5'!A10:AG68,2,0)","v":1025}]
[]
[{"$nulls":4},"GRADING"]
[{"$nulls":4},"LEARNING OBJECTIVES",{"$nulls":3},"BASELINE",null,"SA-1",null,"SA-2",null,"SA-3"]
[{"$nulls":8},"CL-LEVEL","GRADE","CL-LEVEL","GRADE","CL-LEVEL","GRADE","CL-LEVEL","GRADE"]
[{"$nulls":4},"LISTENING WITH UNDERSTANDING",{"$nulls":3},{"$f":"VLOOKUP(R2,'LSRW-5'!A10:AG68,3,0)","v":5},{"$f":"VLOOKUP(R2,'LSRW-5'!A10:AG68,7,0)","v":"B"},{"$f":"VLOOKUP(R2,'LSRW-5'!A10:AG68,3,0)","v":5},{"$f":"VLOOKUP(R2,'LSRW-5'!A10:AG68,14,0)","v":"A"},{"$f":"VLOOKUP(R2,'LSRW-5'!A10:AG68,3,0)","v":5},{"$f":"VLOOKUP(R2,'LSRW-5'!A10:AG68,21,0)","v":"A"},{"$f":"VLOOKUP(R2,'LSRW-5'!A10:AG68,3,0)","v":5},{"$f":"VLOOKUP(R2,'LSRW-5'!A10:AG68,28,0)","v":"A"}]
[{"$nulls":4},"SPEAKING WITH CONFIDENCE",{"$nulls":3},{"$f":"VLOOKUP(R2,'LSRW-5'!A10:AG68,3,0)","v":5},{"$f":"VLOOKUP(R2,'LSRW-5'!A10:AG68,8,0)","v":"B"},{"$f":"VLOOKUP(R2,'LSRW-5'!A10:AG68,3,0)","v":5},{"$f":"VLOOKUP(R2,'LSRW-5'!A10:AG68,15,0)","v":"B"},{"$f":"VLOOKUP(R2,'LSRW-5'!A10:AG68,3,0)","v":5},{"$f":"VLOOKUP(R2,'LSRW-5'!A10:AG68,22,0)","v":"A"},{"$f":"VLOOKUP(R2,'LSRW-5'!A10:AG68,3,0)","v":5},{"$f":"VLOOKUP(R2,'LSRW-5'!A10:AG68,29,0)","v":"A"}]
[{"$nulls":4},"READING WITH COMPREHENSION",{"$nulls":3},{"$f":"VLOOKUP(R2,'LSRW-5'!A10:AG68,6,0)","v":5},{"$f":"VLOOKUP(R2,'LSRW-5'!A10:AG68,9,0)","v":"B"},{"$f":"VLOOKUP(R2,'LSRW-5'!A10:AG68,13,0)","v":5},{"$f":"VLOOKUP(R2,'LSRW-5'!A10:AG68,16,0)","v":"A"},{"$f":"VLOOKUP(R2,'LSRW-5'!A10:AG68,20,0)","v":5},{"$f":"VLOOKUP(R2,'LSRW-5'!A10:AG68,23,0)","v":"A"},{"$f":"VLOOKUP(R2,'LSRW-5'!A10:AG68,27,0)","v":5},{"$f":"VLOOKUP(R2,'LSRW-5'!A10:AG68,30,0)","v":"A"}]
[{"$nulls":4},"WRITING",{"$nulls":3},{"$f":"VLOOKUP(R2,'LSRW-5'!A10:AG68,6,0)","v":5},{"$f":"VLOOKUP(R2,'LSRW-5'!A10:AG68,10,0)","v":"B"},{"$f":"VLOOKUP(R2,'LSRW-5'!A10:AG68,13,0)","v":5},{"$f":"VLOOKUP(R2,'LSRW-5'!A10:AG68,17,0)","v":"B"},{"$f":"VLOOKUP(R2,'LSRW-5'!A10:AG68,20,0)","v":5},{"$f":"VLOOKUP(R2,'LSRW-5'!A10:AG68,24,0)","v":"A"},{"$f":"VLOOKUP(R2,'LSRW-5'!A10:AG68,27,0)","v":5},{"$f":"VLOOKUP(R2,'LSRW-5'!A10:AG68,31,0)","v":"A"}]
[{"$nulls":4},"FUNCTIONAL GRAMMAR",{"$nulls":3},{"$f":"VLOOKUP(R2,'LSRW-5'!A10:AG68,6,0)","v":5},{"$f":"VLOOKUP(R2,'LSRW-5'!A10:AG68,11,0)","v":"B"},{"$f":"VLOOKUP(R2,'LSRW-5'!A10:AG68,13,0)","v":5},{"$f":"VLOOKUP(R2,'LSRW-5'!A10:AG68,18,0)","v":"B"},{"$f":"VLOOKUP(R2,'LSRW-5'!A10:AG68,20,0)","v":5},{"$f":"VLOOKUP(R2,'LSRW-5'!A10:AG68,25,0)","v":"B"},{"$f":"VLOOKUP(R2,'LSRW-5'!A10:AG68,27,0)","v":5},{"$f":"VLOOKUP(R2,'LSRW-5'!A10:AG68,32,0)","v":"A"}]