{"text_format":"3","workbook":"xlsx","n_sheets":20,"sheets":["Sheet2","REPORTS","PRF-5","PRF-4","PRF-3","PRF-2","PRF-1","A-BASE","A-SA1","A-SA2","A-SA3","B-SA1","B-SA2","B-SA3","LSRW-1","LSRW-2","LSRW-3","LSRW-4","LSRW-5","PORTFOLIO"],"not_rendered":{"images":6,"defined_names":18},"read":"whole","date_system":"1900"}

{"sheet":"Sheet2","index":0,"n_rows":21,"n_cols":12,"rows_kept":21,"merged":[[0,0,0,15],[1,0,19,0],[1,1,1,4],[1,15,19,15],[2,1,2,8],[3,1,3,8],[4,1,4,7],[6,1,12,14],[16,1,16,14],[17,1,17,3],[17,4,17,7],[17,8,17,10],[17,11,17,14],[18,1,18,3],[18,4,18,7],[18,8,18,10],[18,11,18,14],[19,1,19,3],[19,4,19,7],[19,8,19,10],[19,11,19,14],[20,0,24,15]]}
["HOW TO USE"]
[null,"In report section,"]
[null,"you will get access of Profile sheets (classwise)»"]
[null,"learning objectivewise Grading sheets (classwise)»"]
[null,"and Assessmentwise format A and B»"]
[]
[null,"First, update class profile and then classwise learning objective grading sheets clicking on direct access link from report section. Remember, you have to fill up only white Cells. Accordingly filled up data, format A and format B will be calculated automatically. Just click on them and print out.You can also print the class profile and learning objectivewise grading sheets of all classes."]
{"$rows_empty":9}
{"$rows_left_out":6}
{"sheet":"REPORTS","index":1,"n_rows":8,"n_cols":15,"rows_kept":8,"merged":[[0,0,1,20],[2,0,2,20],[3,0,3,20],[4,0,4,20],[5,0,5,20],[6,0,6,2],[6,3,6,13],[6,14,6,16],[6,17,6,20],[7,0,7,1],[7,2,7,5],[7,6,7,9],[7,10,7,20],[8,0,25,20]]}
["CONTINUOUS AND COMPREHENSIVE EVALUATION 2018-19"]
[]
["PROGRAMMER_HARISH JAIPAL MALI"]
["POSTING PLACE ADARSH GOVT SR SEC SCHOOL PANCHDEVAL PINDWARA"]
["CONTACT- 9828745480 harishjaipalmali@gmail.com"]
["FILL UP YOUR PROFILE"]
["SCHOOL NAME-",{"$nulls":13},"DISE CODE"]
["SUBJECT-",{"$nulls":5},"SUBJECT TEACHER NAME-"]
{"$rows_left_out":1}
{"sheet":"PRF-5","index":2,"n_rows":67,"n_cols":16,"rows_kept":67,"merged":[[0,0,1,15],[2,0,2,15],[3,0,3,15],[4,0,4,2],[4,4,4,5],[4,6,4,7],[4,8,4,10],[4,11,4,13],[5,0,6,0],[5,1,6,1],[5,2,6,2],[5,3,6,3],[5,4,6,4],[5,5,6,5],[5,6,6,6],[5,7,6,7],[5,8,5,9],[5,10,5,11],[5,12,5,13],[5,14,5,15]]}
[{"$f":"REPORTS!$D$7","v":0}]
[]
["lrr ,oa O;kid ewY;kadu dk;ZØe 2018&19"]
["fo|ky; esa cPpksa ds 'kSf{kd Lrj dh fLFkfr"]
["CLASS-",null,null,"5TH","SUBJECT-",null,{"$f":"REPORTS!C8","v":0},null,"SUBJECT TEACHER-",null,null,{"$f":"REPORTS!K8","v":0}]
["Ø0la0","d{kk","jksy uEcj","uke fo|kFkhZ","firk dk uke","ekrk dk uke","izos“kkad","tUe fnukad","vk/kkj js[kk ewY;kadu ",null,"SA-1",null,"SA-2",null,"SA-3"]
[{"$nulls":8},"d{kk Lrj","izkIr xzsM","d{kk Lrj","izkIr xzsM","d{kk Lrj","izkIr xzsM","d{kk Lrj","izkIr xzsM"]
[1,5,501,"ARJUN KUMAR","ASHUTOSH","VINITA DEVI",1015,"2007-03-12",4,{"$f":"'LSRW-5'!L10","v":"B"},4,{"$f":"'LSRW-5'!S10","v":"A"},5,{"$f":"'LSRW-5'!Z10","v":"B"},5,{"$f":"'LSRW-5'!AG10","v":"B"}]
{"$rows_left_out":60}
{"sheet":"PRF-4","index":3,"n_rows":67,"n_cols":16,"rows_kept":67,"merged":[[0,0,1,15],[2,0,2,15],[3,0,3,15],[4,0,4,2],[4,4,4,5],[4,6,4,7],[4,8,4,10],[4,11,4,13],[5,0,6,0],[5,1,6,1],[5,2,6,2],[5,3,6,3],[5,4,6,4],[5,5,6,5],[5,6,6,6],[5,7,6,7],[5,8,5,9],[5,10,5,11],[5,12,5,13],[5,14,5,15]]}
[{"$f":"REPORTS!D7","v":0},{"$nulls":4},{"$f":"REPORTS!$D$7","v":0}]
[]
["lrr ,oa O;kid ewY;kadu dk;ZØe 2018&19"]
["fo|ky; esa cPpksa ds 'kSf{kd Lrj dh fLFkfr"]
["CLASS-",null,null,"4TH","SUBJECT-",null,{"$f":"REPORTS!C8","v":0},null,"SUBJECT TEACHER-",null,null,{"$f":"REPORTS!K8","v":0}]
["Ø0la0","d{kk","jksy uEcj","uke fo|kFkhZ","firk dk uke","ekrk dk uke","izos“kkad","tUe fnukad","vk/kkj js[kk ewY;kadu ",null,"SA-1",null,"SA-2",null,"SA-3"]
[{"$nulls":8},"d{kk Lrj","izkIr xzsM","d{kk Lrj","izkIr xzsM","d{kk Lrj","izkIr xzsM","d{kk Lrj","izkIr xzsM"]
[{"$nulls":9},{"$f":"'LSRW-4'!L10","v":0},null,{"$f":"'LSRW-4'!S10","v":0},null,{"$f":"'LSRW-4'!Z10","v":0},null,{"$f":"'LSRW-4'!AG10","v":0}]
{"$rows_left_out":60}
{"sheet":"PRF-3","index":4,"n_rows":67,"n_cols":16,"rows_kept":67,"merged":[[0,0,1,15],[2,0,2,15],[3,0,3,15],[4,0,4,2],[4,4,4,5],[4,6,4,7],[4,8,4,10],[4,11,4,13],[5,0,6,0],[5,1,6,1],[5,2,6,2],[5,3,6,3],[5,4,6,4],[5,5,6,5],[5,6,6,6],[5,7,6,7],[5,8,5,9],[5,10,5,11],[5,12,5,13],[5,14,5,15]]}
[{"$f":"REPORTS!$D$7","v":0}]
[]
["lrr ,oa O;kid ewY;kadu dk;ZØe 2018&19"]
["fo|ky; esa cPpksa ds 'kSf{kd Lrj dh fLFkfr"]
["CLASS-",null,null,"3RD","SUBJECT-",null,{"$f":"REPORTS!C8","v":0},null,"SUBJECT TEACHER-",null,null,{"$f":"REPORTS!K8","v":0}]
["Ø0la0","d{kk","jksy uEcj","uke fo|kFkhZ","firk dk uke","ekrk dk uke","izos“kkad","tUe fnukad","vk/kkj js[kk ewY;kadu ",null,"SA-1",null,"SA-2",null,"SA-3"]
[{"$nulls":8},"d{kk Lrj","izkIr xzsM","d{kk Lrj","izkIr xzsM","d{kk Lrj","izkIr xzsM","d{kk Lrj","izkIr xzsM"]
[{"$nulls":9},{"$f":"'LSRW-3'!L10","v":0},null,{"$f":"'LSRW-3'!S10","v":0},null,{"$f":"'LSRW-3'!Z10","v":0},null,{"$f":"'LSRW-3'!AG10","v":0}]
{"$rows_left_out":60}
{"sheet":"PRF-2","index":5,"n_rows":67,"n_cols":16,"rows_kept":67,"merged":[[0,0,1,15],[2,0,2,15],[3,0,3,15],[4,0,4,2],[4,4,4,5],[4,6,4,7],[4,8,4,10],[4,11,4,13],[5,0,6,0],[5,1,6,1],[5,2,6,2],[5,3,6,3],[5,4,6,4],[5,5,6,5],[5,6,6,6],[5,7,6,7],[5,8,5,9],[5,10,5,11],[5,12,5,13],[5,14,5,15]]}
[{"$f":"REPORTS!$D$7","v":0}]
[]
["lrr ,oa O;kid ewY;kadu dk;ZØe 2018&19"]
["fo|ky; esa cPpksa ds 'kSf{kd Lrj dh fLFkfr"]
["CLASS-",null,null,"2ND","SUBJECT-",null,{"$f":"REPORTS!C8","v":0},null,"SUBJECT TEACHER-",null,null,{"$f":"REPORTS!K8","v":0}]
["Ø0la0","d{kk","jksy uEcj","uke fo|kFkhZ","firk dk uke","ekrk dk uke","izos“kkad","tUe fnukad","vk/kkj js[kk ewY;kadu ",null,"SA-1",null,"SA-2",null,"SA-3"]
[{"$nulls":8},"d{kk Lrj","izkIr xzsM","d{kk Lrj","izkIr xzsM","d{kk Lrj","izkIr xzsM","d{kk Lrj","izkIr xzsM"]
[{"$nulls":9},{"$f":"'LSRW-2'!L10","v":0},null,{"$f":"'LSRW-2'!S10","v":0},null,{"$f":"'LSRW-2'!Z10","v":0},null,{"$f":"'LSRW-2'!AG10","v":0}]
{"$rows_left_out":60}
{"sheet":"PRF-1","index":6,"n_rows":67,"n_cols":16,"rows_kept":67,"merged":[[0,0,1,15],[2,0,2,15],[3,0,3,15],[4,0,4,2],[4,4,4,5],[4,6,4,7],[4,8,4,10],[4,11,4,13],[5,0,6,0],[5,1,6,1],[5,2,6,2],[5,3,6,3],[5,4,6,4],[5,5,6,5],[5,6,6,6],[5,7,6,7],[5,8,5,9],[5,10,5,11],[5,12,5,13],[5,14,5,15]]}
[{"$f":"REPORTS!$D$7","v":0}]
[]
["lrr ,oa O;kid ewY;kadu dk;ZØe 2018&19"]
["fo|ky; esa cPpksa ds 'kSf{kd Lrj dh fLFkfr"]
["CLASS-",null,null,"1ST","SUBJECT-",null,{"$f":"REPORTS!C8","v":0},null,"SUBJECT TEACHER-",null,null,{"$f":"REPORTS!K8","v":0}]
["Ø0la0","d{kk","jksy uEcj","uke fo|kFkhZ","firk dk uke","ekrk dk uke","izos“kkad","tUe fnukad","vk/kkj js[kk ewY;kadu ",null,"SA-1",null,"SA-2",null,"SA-3"]
[{"$nulls":8},"d{kk Lrj","izkIr xzsM","d{kk Lrj","izkIr xzsM","d{kk Lrj","izkIr xzsM","d{kk Lrj","izkIr xzsM"]
[{"$nulls":9},{"$f":"'LSRW-1'!L10","v":0},null,{"$f":"'LSRW-1'!S10","v":0},null,{"$f":"'LSRW-1'!Z10","v":0},null,{"$f":"'LSRW-1'!AG10","v":0}]
{"$rows_left_out":60}
{"sheet":"A-BASE","index":7,"n_rows":13,"n_cols":24,"rows_kept":13,"merged":[[0,0,1,4],[0,5,1,23],[2,0,2,23],[3,0,3,23],[4,0,4,23],[5,0,5,3],[5,4,5,13],[5,14,5,19],[5,20,5,23],[6,0,6,3],[6,4,6,13],[6,14,6,19],[6,20,6,23],[7,0,7,23],[8,0,11,2],[8,3,8,5],[8,6,8,8],[8,9,8,12],[8,13,8,17],[8,18,8,23],[9,3,11,3],[9,4,9,5],[9,6,11,6],[9,7,9,8],[9,9,11,9],[9,10,9,12],[9,13,11,13],[9,14,9,17],[9,18,11,18],[9,19,9,23],[10,4,11,4],[10,5,11,5],[10,7,11,7],[10,8,11,8],[10,10,11,10],[10,11,11,11],[10,12,11,12],[10,14,11,14],[10,15,11,15],[10,16,11,16],[10,17,11,17],[10,19,11,19],[10,20,11,20],[10,21,11,21],[10,22,11,22],[10,23,11,23],[12,0,15,2],[12,3,15,3],[12,4,15,4],[12,5,15,5],[12,6,15,6],[12,7,15,7],[12,8,15,8],[12,9,15,9],[12,10,15,10],[12,11,15,11],[12,12,15,12],[12,13,15,13],[12,14,15,14],[12,15,15,15],[12,16,15,16],[12,17,15,17],[12,18,15,18],[12,19,15,19],[12,20,15,20],[12,21,15,21],[12,22,15,22],[12,23,15,23]]}
["fo|ky; dk uke %&",{"$nulls":4},{"$f":"REPORTS!$D$7","v":0}]
[]
["lrr ,oa O;kid ewY;kadu dk;ZØe 2018&19"]
["fo|ky; esa cPpksa ds 'kSf{kd Lrj dh fLFkfr"]
["izi= & ^v*"]
["fo|ky; dk uke %&",{"$nulls":3},{"$f":"REPORTS!$D$7","v":0},{"$nulls":9},"ewY;kadu&",{"$nulls":5},"BASELINE"]
["fo‘k;k/;kid dk uke&",{"$nulls":3},{"$f":"REPORTS!K8","v":0},{"$nulls":9},"fo|ky; dk MkbZl dksM %&",{"$nulls":5},{"$f":"REPORTS!R7","v":0}]
[]
{"$rows_left_out":6}
{"sheet":"A-SA1","index":8,"n_rows":13,"n_cols":24,"rows_kept":13,"merged":[[0,0,1,4],[0,5,1,23],[2,0,2,23],[3,0,3,23],[4,0,4,23],[5,0,5,3],[5,4,5,13],[5,14,5,19],[5,20,5,23],[6,0,6,3],[6,4,6,13],[6,14,6,19],[6,20,6,23],[7,0,7,23],[8,0,11,2],[8,3,8,5],[8,6,8,8],[8,9,8,12],[8,13,8,17],[8,18,8,23],[9,3,11,3],[9,4,9,5],[9,6,11,6],[9,7,9,8],[9,9,11,9],[9,10,9,12],[9,13,11,13],[9,14,9,17],[9,18,11,18],[9,19,9,23],[10,4,11,4],[10,5,11,5],[10,7,11,7],[10,8,11,8],[10,10,11,10],[10,11,11,11],[10,12,11,12],[10,14,11,14],[10,15,11,15],[10,16,11,16],[10,17,11,17],[10,19,11,19],[10,20,11,20],[10,21,11,21],[10,22,11,22],[10,23,11,23],[12,0,15,2],[12,3,15,3],[12,4,15,4],[12,5,15,5],[12,6,15,6],[12,7,15,7],[12,8,15,8],[12,9,15,9],[12,10,15,10],[12,11,15,11],[12,12,15,12],[12,13,15,13],[12,14,15,14],[12,15,15,15],[12,16,15,16],[12,17,15,17],[12,18,15,18],[12,19,15,19],[12,20,15,20],[12,21,15,21],[12,22,15,22],[12,23,15,23]]}
["fo|ky; dk uke %&",{"$nulls":4},{"$f":"REPORTS!$D$7","v":0}]
[]
["lrr ,oa O;kid ewY;kadu dk;ZØe 2018&19"]
["fo|ky; esa cPpksa ds 'kSf{kd Lrj dh fLFkfr"]
["izi= & ^v*"]
["fo|ky; dk uke %&",{"$nulls":3},{"$f":"REPORTS!$D$7","v":0},{"$nulls":9},"ewY;kadu&",{"$nulls":5},"SA-1"]
["fo‘k;k/;kid dk uke&",{"$nulls":3},{"$f":"REPORTS!K8","v":0},{"$nulls":9},"fo|ky; dk MkbZl dksM %&",{"$nulls":5},{"$f":"REPORTS!R7","v":0}]
[]
{"$rows_left_out":6}
{"sheet":"A-SA2","index":9,"n_rows":13,"n_cols":24,"rows_kept":13,"merged":[[0,0,1,4],[0,5,1,23],[2,0,2,23],[3,0,3,23],[4,0,4,23],[5,0,5,3],[5,4,5,13],[5,14,5,19],[5,20,5,23],[6,0,6,3],[6,4,6,13],[6,14,6,19],[6,20,6,23],[7,0,7,23],[8,0,11,2],[8,3,8,5],[8,6,8,8],[8,9,8,12],[8,13,8,17],[8,18,8,23],[9,3,11,3],[9,4,9,5],[9,6,11,6],[9,7,9,8],[9,9,11,9],[9,10,9,12],[9,13,11,13],[9,14,9,17],[9,18,11,18],[9,19,9,23],[10,4,11,4],[10,5,11,5],[10,7,11,7],[10,8,11,8],[10,10,11,10],[10,11,11,11],[10,12,11,12],[10,14,11,14],[10,15,11,15],[10,16,11,16],[10,17,11,17],[10,19,11,19],[10,20,11,20],[10,21,11,21],[10,22,11,22],[10,23,11,23],[12,0,15,2],[12,3,15,3],[12,4,15,4],[12,5,15,5],[12,6,15,6],[12,7,15,7],[12,8,15,8],[12,9,15,9],[12,10,15,10],[12,11,15,11],[12,12,15,12],[12,13,15,13],[12,14,15,14],[12,15,15,15],[12,16,15,16],[12,17,15,17],[12,18,15,18],[12,19,15,19],[12,20,15,20],[12,21,15,21],[12,22,15,22],[12,23,15,23]]}
["fo|ky; dk uke %&",{"$nulls":4},{"$f":"REPORTS!$D$7","v":0}]
[]
["lrr ,oa O;kid ewY;kadu dk;ZØe 2018&19"]
["fo|ky; esa cPpksa ds 'kSf{kd Lrj dh fLFkfr"]
["izi= & ^v*"]
["fo|ky; dk uke %&",{"$nulls":3},{"$f":"REPORTS!$D$7","v":0},{"$nulls":9},"ewY;kadu&",{"$nulls":5},"SA-2"]
["fo‘k;k/;kid dk uke&",{"$nulls":3},{"$f":"REPORTS!K8","v":0},{"$nulls":9},"fo|ky; dk MkbZl dksM %&",{"$nulls":5},{"$f":"REPORTS!R7","v":0}]
[]
{"$rows_left_out":6}
{"sheet":"A-SA3","index":10,"n_rows":13,"n_cols":24,"rows_kept":13,"merged":[[0,0,1,4],[0,5,1,23],[2,0,2,23],[3,0,3,23],[4,0,4,23],[5,0,5,3],[5,4,5,13],[5,14,5,19],[5,20,5,23],[6,0,6,3],[6,4,6,13],[6,14,6,19],[6,20,6,23],[7,0,7,23],[8,0,11,2],[8,3,8,5],[8,6,8,8],[8,9,8,12],[8,13,8,17],[8,18,8,23],[9,3,11,3],[9,4,9,5],[9,6,11,6],[9,7,9,8],[9,9,11,9],[9,10,9,12],[9,13,11,13],[9,14,9,17],[9,18,11,18],[9,19,9,23],[10,4,11,4],[10,5,11,5],[10,7,11,7],[10,8,11,8],[10,10,11,10],[10,11,11,11],[10,12,11,12],[10,14,11,14],[10,15,11,15],[10,16,11,16],[10,17,11,17],[10,19,11,19],[10,20,11,20],[10,21,11,21],[10,22,11,22],[10,23,11,23],[12,0,15,2],[12,3,15,3],[12,4,15,4],[12,5,15,5],[12,6,15,6],[12,7,15,7],[12,8,15,8],[12,9,15,9],[12,10,15,10],[12,11,15,11],[12,12,15,12],[12,13,15,13],[12,14,15,14],[12,15,15,15],[12,16,15,16],[12,17,15,17],[12,18,15,18],[12,19,15,19],[12,20,15,20],[12,21,15,21],[12,22,15,22],[12,23,15,23]]}
["fo|ky; dk uke %&",{"$nulls":4},{"$f":"REPORTS!$D$7","v":0}]
[]
["lrr ,oa O;kid ewY;kadu dk;ZØe 2018&19"]
["fo|ky; esa cPpksa ds 'kSf{kd Lrj dh fLFkfr"]
["izi= & ^v*"]
["fo|ky; dk uke %&",{"$nulls":3},{"$f":"REPORTS!$D$7","v":0},{"$nulls":9},"ewY;kadu&",{"$nulls":5},"SA-3"]
["fo‘k;k/;kid dk uke&",{"$nulls":3},{"$f":"REPORTS!K8","v":0},{"$nulls":9},"fo|ky; dk MkbZl dksM %&",{"$nulls":5},{"$f":"REPORTS!R7","v":0}]
[]
{"$rows_left_out":6}
{"sheet":"B-SA1","index":11,"n_rows":18,"n_cols":23,"rows_kept":18,"merged":[[0,0,1,4],[0,5,1,22],[2,0,2,22],[3,0,3,22],[4,0,4,22],[5,0,5,3],[5,4,5,12],[5,13,5,18],[5,19,5,22],[6,0,6,3],[6,4,6,7],[6,13,6,18],[6,19,6,22],[7,0,8,2],[7,3,8,7],[7,8,7,10],[7,11,7,13],[7,14,7,16],[7,17,7,19],[7,20,7,22],[9,0,18,2],[9,3,10,7],[9,8,10,8],[9,9,10,9],[9,10,10,10],[9,11,10,11],[9,12,10,12],[9,13,10,13],[9,14,10,14],[9,15,10,15],[9,16,10,16],[9,17,10,17],[9,18,10,18],[9,19,10,19],[9,20,10,20],[9,21,10,21],[9,22,10,22],[11,3,12,7],[11,8,12,8],[11,9,12,9],[11,10,12,10],[11,11,12,11],[11,12,12,12],[11,13,12,13],[11,14,12,14],[11,15,12,15],[11,16,12,16],[11,17,12,17],[11,18,12,18],[11,19,12,19],[11,20,12,20],[11,21,12,21],[11,22,12,22],[13,3,14,7],[13,8,14,8],[13,9,14,9],[13,10,14,10],[13,11,14,11],[13,12,14,12],[13,13,14,13],[13,14,14,14],[13,15,14,15],[13,16,14,16],[13,17,14,17],[13,18,14,18],[13,19,14,19],[13,20,14,20],[13,21,14,21],[13,22,14,22],[15,3,16,7],[15,8,16,8],[15,9,16,9],[15,10,16,10],[15,11,16,11],[15,12,16,12],[15,13,16,13],[15,14,16,14],[15,15,16,15],[15,16,16,16],[15,17,16,17],[15,18,16,18],[15,19,16,19],[15,20,16,20],[15,21,16,21],[15,22,16,22],[17,3,18,7],[17,8,18,8],[17,9,18,9],[17,10,18,10],[17,11,18,11],[17,12,18,12],[17,13,18,13],[17,14,18,14],[17,15,18,15],[17,16,18,16],[17,17,18,17],[17,18,18,18],[17,19,18,19],[17,20,18,20],[17,21,18,21],[17,22,18,22]]}
["fo|ky; dk uke %&",{"$nulls":4},{"$f":"REPORTS!$D$7","v":0}]
[]
["lrr ,oa O;kid ewY;kadu dk;ZØe 2018&19"]
["d{kkokj ,oa vf/kxe mÌs“;ksa ds vuqlkj d{kkLrj ds Nk«kksa dh xzsMhax"]
["izi= & ^c*"]
["fo‘k;k/;kid dk uke&",{"$nulls":3},{"$f":"REPORTS!K8","v":0},{"$nulls":8},"fnukad&",{"$nulls":5},"2018-11-22"]
["ekg dk uke&",{"$nulls":3},"MAY",{"$nulls":8},"ASSESSMENT-",{"$nulls":5},"SA-1"]
["SUBJECT",null,null,"LEARNING OBJECTIVES",{"$nulls":4},"CLASS-1",null,null,"CLASS-2",null,null,"CLASS-3",null,null,"CLASS-4",null,null,"CLASS-5"]
{"$rows_left_out":11}
{"sheet":"B-SA2","index":12,"n_rows":18,"n_cols":23,"rows_kept":18,"merged":[[0,0,1,4],[0,5,1,22],[2,0,2,22],[3,0,3,22],[4,0,4,22],[5,0,5,3],[5,4,5,12],[5,13,5,18],[5,19,5,22],[6,0,6,3],[6,4,6,7],[6,13,6,18],[6,19,6,22],[7,0,8,2],[7,3,8,7],[7,8,7,10],[7,11,7,13],[7,14,7,16],[7,17,7,19],[7,20,7,22],[9,0,18,2],[9,3,10,7],[9,8,10,8],[9,9,10,9],[9,10,10,10],[9,11,10,11],[9,12,10,12],[9,13,10,13],[9,14,10,14],[9,15,10,15],[9,16,10,16],[9,17,10,17],[9,18,10,18],[9,19,10,19],[9,20,10,20],[9,21,10,21],[9,22,10,22],[11,3,12,7],[11,8,12,8],[11,9,12,9],[11,10,12,10],[11,11,12,11],[11,12,12,12],[11,13,12,13],[11,14,12,14],[11,15,12,15],[11,16,12,16],[11,17,12,17],[11,18,12,18],[11,19,12,19],[11,20,12,20],[11,21,12,21],[11,22,12,22],[13,3,14,7],[13,8,14,8],[13,9,14,9],[13,10,14,10],[13,11,14,11],[13,12,14,12],[13,13,14,13],[13,14,14,14],[13,15,14,15],[13,16,14,16],[13,17,14,17],[13,18,14,18],[13,19,14,19],[13,20,14,20],[13,21,14,21],[13,22,14,22],[15,3,16,7],[15,8,16,8],[15,9,16,9],[15,10,16,10],[15,11,16,11],[15,12,16,12],[15,13,16,13],[15,14,16,14],[15,15,16,15],[15,16,16,16],[15,17,16,17],[15,18,16,18],[15,19,16,19],[15,20,16,20],[15,21,16,21],[15,22,16,22],[17,3,18,7],[17,8,18,8],[17,9,18,9],[17,10,18,10],[17,11,18,11],[17,12,18,12],[17,13,18,13],[17,14,18,14],[17,15,18,15],[17,16,18,16],[17,17,18,17],[17,18,18,18],[17,19,18,19],[17,20,18,20],[17,21,18,21],[17,22,18,22]]}
["fo|ky; dk uke %&",{"$nulls":4},{"$f":"REPORTS!$D$7","v":0}]
[]
["lrr ,oa O;kid ewY;kadu dk;ZØe 2018&19"]
["d{kkokj ,oa vf/kxe mÌs“;ksa ds vuqlkj d{kkLrj ds Nk«kksa dh xzsMhax"]
["izi= & ^c*"]
["fo‘k;k/;kid dk uke&",{"$nulls":3},{"$f":"REPORTS!K8","v":0},{"$nulls":8},"fnukad&",{"$nulls":5},"2018-02-12"]
["ekg dk uke&",{"$nulls":3},"JULY",{"$nulls":8},"ASSESSMENT-",{"$nulls":5},"SA-2"]
["SUBJECT",null,null,"LEARNING OBJECTIVES",{"$nulls":4},"CLASS-1",null,null,"CLASS-2",null,null,"CLASS-3",null,null,"CLASS-4",null,null,"CLASS-5"]
{"$rows_left_out":11}
{"sheet":"B-SA3","index":13,"n_rows":18,"n_cols":23,"rows_kept":18,"merged":[[0,0,1,4],[0,5,1,22],[2,0,2,22],[3,0,3,22],[4,0,4,22],[5,0,5,3],[5,4,5,12],[5,13,5,18],[5,19,5,22],[6,0,6,3],[6,4,6,7],[6,13,6,18],[6,19,6,22],[7,0,8,2],[7,3,8,7],[7,8,7,10],[7,11,7,13],[7,14,7,16],[7,17,7,19],[7,20,7,22],[9,0,18,2],[9,3,10,7],[9,8,10,8],[9,9,10,9],[9,10,10,10],[9,11,10,11],[9,12,10,12],[9,13,10,13],[9,14,10,14],[9,15,10,15],[9,16,10,16],[9,17,10,17],[9,18,10,18],[9,19,10,19],[9,20,10,20],[9,21,10,21],[9,22,10,22],[11,3,12,7],[11,8,12,8],[11,9,12,9],[11,10,12,10],[11,11,12,11],[11,12,12,12],[11,13,12,13],[11,14,12,14],[11,15,12,15],[11,16,12,16],[11,17,12,17],[11,18,12,18],[11,19,12,19],[11,20,12,20],[11,21,12,21],[11,22,12,22],[13,3,14,7],[13,8,14,8],[13,9,14,9],[13,10,14,10],[13,11,14,11],[13,12,14,12],[13,13,14,13],[13,14,14,14],[13,15,14,15],[13,16,14,16],[13,17,14,17],[13,18,14,18],[13,19,14,19],[13,20,14,20],[13,21,14,21],[13,22,14,22],[15,3,16,7],[15,8,16,8],[15,9,16,9],[15,10,16,10],[15,11,16,11],[15,12,16,12],[15,13,16,13],[15,14,16,14],[15,15,16,15],[15,16,16,16],[15,17,16,17],[15,18,16,18],[15,19,16,19],[15,20,16,20],[15,21,16,21],[15,22,16,22],[17,3,18,7],[17,8,18,8],[17,9,18,9],[17,10,18,10],[17,11,18,11],[17,12,18,12],[17,13,18,13],[17,14,18,14],[17,15,18,15],[17,16,18,16],[17,17,18,17],[17,18,18,18],[17,19,18,19],[17,20,18,20],[17,21,18,21],[17,22,18,22]]}
["fo|ky; dk uke %&",{"$nulls":4},{"$f":"REPORTS!$D$7","v":0}]
[]
["lrr ,oa O;kid ewY;kadu dk;ZØe 2018&19"]
["d{kkokj ,oa vf/kxe mÌs“;ksa ds vuqlkj d{kkLrj ds Nk«kksa dh xzsMhax"]
["izi= & ^c*"]
["fo‘k;k/;kid dk uke&",{"$nulls":3},{"$f":"REPORTS!K8","v":0},{"$nulls":8},"fnukad&",{"$nulls":5},"2018-02-02"]
["ekg dk uke&",{"$nulls":3},"JANUARY",{"$nulls":8},"ASSESSMENT-",{"$nulls":5},"SA-3"]
["SUBJECT",null,null,"LEARNING OBJECTIVES",{"$nulls":4},"CLASS-1",null,null,"CLASS-2",null,null,"CLASS-3",null,null,"CLASS-4",null,null,"CLASS-5"]
{"$rows_left_out":11}
{"sheet":"LSRW-1","index":14,"n_rows":69,"n_cols":33,"rows_kept":69,"merged":[[0,0,1,32],[2,0,2,32],[3,0,3,32],[4,0,4,2],[4,4,4,5],[4,6,4,14],[4,15,4,22],[4,23,4,32],[5,0,5,32],[6,0,8,0],[6,1,8,1],[6,2,8,2],[6,3,8,3],[6,4,8,4],[6,5,6,32],[7,5,7,10],[7,11,8,11],[7,12,7,17],[7,18,8,18],[7,19,7,24],[7,25,8,25],[7,26,7,31],[7,32,8,32]]}
[{"$f":"REPORTS!$D$7","v":0}]
[]
["lrr ,oa O;kid ewY;kadu dk;ZØe 2018&19"]
["fo|ky; esa cPpksa ds 'kSf{kd Lrj dh fLFkfr"]
["CLASS-",null,null,"1ST","SUBJECT-",null,{"$f":"REPORTS!C8","v":0},{"$nulls":8},"SUBJECT TEACHER-",{"$nulls":7},{"$f":"REPORTS!K8","v":0}]
["LEARNING OBJECTIVE WISE GRADING"]
["NO","SR NO","CLASS","STUDENT NAME","FATHER NAME","GRADING"]
[{"$nulls":5},"BASELINE",{"$nulls":5},"AG","SA-1",{"$nulls":5},"AG","SA-2",{"$nulls":5},"AG","SA-3",{"$nulls":5},"AG"]
{"$rows_left_out":62}
{"sheet":"LSRW-2","index":15,"n_rows":69,"n_cols":33,"rows_kept":69,"merged":[[0,0,1,32],[2,0,2,32],[3,0,3,32],[4,0,4,2],[4,4,4,5],[4,6,4,14],[4,15,4,22],[4,23,4,32],[5,0,5,32],[6,0,8,0],[6,1,8,1],[6,2,8,2],[6,3,8,3],[6,4,8,4],[6,5,6,32],[7,5,7,10],[7,11,8,11],[7,12,7,17],[7,18,8,18],[7,19,7,24],[7,25,8,25],[7,26,7,31],[7,32,8,32]]}
[{"$f":"REPORTS!$D$7","v":0}]
[]
["lrr ,oa O;kid ewY;kadu dk;ZØe 2018&19"]
["fo|ky; esa cPpksa ds 'kSf{kd Lrj dh fLFkfr"]
["CLASS-",null,null,"2ND","SUBJECT-",null,{"$f":"REPORTS!C8","v":0},{"$nulls":8},"SUBJECT TEACHER-",{"$nulls":7},{"$f":"REPORTS!K8","v":0}]
["LEARNING OBJECTIVE WISE GRADING"]
["NO","SR NO","CLASS","STUDENT NAME","FATHER NAME","GRADING"]
[{"$nulls":5},"BASELINE",{"$nulls":5},"AG","SA-1",{"$nulls":5},"AG","SA-2",{"$nulls":5},"AG","SA-3",{"$nulls":5},"AG"]
{"$rows_left_out":62}
{"sheet":"LSRW-3","index":16,"n_rows":69,"n_cols":33,"rows_kept":69,"merged":[[0,0,1,32],[2,0,2,32],[3,0,3,32],[4,0,4,2],[4,4,4,5],[4,6,4,14],[4,15,4,22],[4,23,4,32],[5,0,5,32],[6,0,8,0],[6,1,8,1],[6,2,8,2],[6,3,8,3],[6,4,8,4],[6,5,6,32],[7,5,7,10],[7,11,8,11],[7,12,7,17],[7,18,8,18],[7,19,7,24],[7,25,8,25],[7,26,7,31],[7,32,8,32]]}
[{"$f":"REPORTS!$D$7","v":0}]
[]
["lrr ,oa O;kid ewY;kadu dk;ZØe 2018&19"]
["fo|ky; esa cPpksa ds 'kSf{kd Lrj dh fLFkfr"]
["CLASS-",null,null,"3RD","SUBJECT-",null,{"$f":"REPORTS!C8","v":0},{"$nulls":8},"SUBJECT TEACHER-",{"$nulls":7},{"$f":"REPORTS!K8","v":0}]
["LEARNING OBJECTIVE WISE GRADING"]
["NO","SR NO","CLASS","STUDENT NAME","FATHER NAME","GRADING"]
[{"$nulls":5},"BASELINE",{"$nulls":5},"AG","SA-1",{"$nulls":5},"AG","SA-2",{"$nulls":5},"AG","SA-3",{"$nulls":5},"AG"]
{"$rows_left_out":62}
{"sheet":"LSRW-4","index":17,"n_rows":69,"n_cols":33,"rows_kept":69,"merged":[[0,0,1,32],[2,0,2,32],[3,0,3,32],[4,0,4,2],[4,4,4,5],[4,6,4,14],[4,15,4,22],[4,23,4,32],[5,0,5,32],[6,0,8,0],[6,1,8,1],[6,2,8,2],[6,3,8,3],[6,4,8,4],[6,5,6,32],[7,5,7,10],[7,11,8,11],[7,12,7,17],[7,18,8,18],[7,19,7,24],[7,25,8,25],[7,26,7,31],[7,32,8,32]]}
[{"$f":"REPORTS!$D$7","v":0}]
[]
["lrr ,oa O;kid ewY;kadu dk;ZØe 2018&19"]
["fo|ky; esa cPpksa ds 'kSf{kd Lrj dh fLFkfr"]
["CLASS-",null,null,"4TH","SUBJECT-",null,{"$f":"REPORTS!C8","v":0},{"$nulls":8},"SUBJECT TEACHER-",{"$nulls":7},{"$f":"REPORTS!K8","v":0}]
["LEARNING OBJECTIVE WISE GRADING"]
["NO","SR NO","CLASS","STUDENT NAME","FATHER NAME","GRADING"]
[{"$nulls":5},"BASELINE",{"$nulls":5},"AG","SA-1",{"$nulls":5},"AG","SA-2",{"$nulls":5},"AG","SA-3",{"$nulls":5},"AG"]
{"$rows_left_out":62}
{"sheet":"LSRW-5","index":18,"n_rows":69,"n_cols":33,"rows_kept":69,"merged":[[0,0,1,32],[2,0,2,32],[3,0,3,32],[4,0,4,2],[4,4,4,5],[4,6,4,14],[4,15,4,22],[4,23,4,32],[5,0,5,32],[6,0,8,0],[6,1,8,1],[6,2,8,2],[6,3,8,3],[6,4,8,4],[6,5,6,32],[7,5,7,10],[7,11,8,11],[7,12,7,17],[7,18,8,18],[7,19,7,24],[7,25,8,25],[7,26,7,31],[7,32,8,32]]}
[{"$f":"REPORTS!$D$7","v":0}]
[]
["lrr ,oa O;kid ewY;kadu dk;ZØe 2018&19"]
["fo|ky; esa cPpksa ds 'kSf{kd Lrj dh fLFkfr"]
["CLASS-",null,null,"5TH","SUBJECT-",null,{"$f":"REPORTS!C8","v":0},{"$nulls":8},"SUBJECT TEACHER-",{"$nulls":7},{"$f":"REPORTS!K8","v":0}]
["LEARNING OBJECTIVE WISE GRADING"]
["NO","SR NO","CLASS","STUDENT NAME","FATHER NAME","GRADING"]
[{"$nulls":5},"BASELINE",{"$nulls":5},"AG","SA-1",{"$nulls":5},"AG","SA-2",{"$nulls":5},"AG","SA-3",{"$nulls":5},"AG"]
{"$rows_left_out":62}
{"sheet":"PORTFOLIO","index":19,"n_rows":21,"n_cols":19,"rows_kept":21,"merged":[[0,4,1,15],[1,17,3,17],[1,18,3,19],[2,6,3,13],[4,8,4,11],[5,4,5,7],[5,8,5,12],[6,4,6,7],[6,8,6,12],[7,4,7,7],[7,8,7,12],[8,4,8,7],[8,8,8,12],[9,4,9,7],[9,8,9,12],[10,4,10,7],[10,8,10,12],[11,4,11,7],[11,8,11,9],[11,10,11,11],[13,4,13,15],[14,4,15,7],[14,8,14,9],[14,10,14,11],[14,12,14,13],[14,14,14,15],[16,4,16,7],[17,4,17,7],[18,4,18,7],[19,4,19,7],[20,4,20,7],[21,4,22,15]]}
[{"$nulls":4},{"$f":"REPORTS!D7","v":0}]
[{"$nulls":17},2,"FILL ATTENDANCE NO. OF THE STUDENT"]
[{"$nulls":6},"STUDENT-PORTFOLIO PAGE"]
[]
[{"$nulls":8},"SESSION 2018-19"]
[{"$nulls":4},"NAME OF THE STUDENT",{"$nulls":3},{"$f":"VLOOKUP(R2,'LSRW-5'!A10:AG68,4,0)","v":"MAHAK KUMARI"}]
[{"$nulls":4},"FATHER NAME",{"$nulls":3},{"$f":"VLOOKUP(R2,'LSRW-5'!A10:AG68,5,0)","v":"VASANT KUMAR"}]
[{"$nulls":4},"MOTHER NAME",{"$nulls":3},{"$f":"VLOOKUP(R2,'PRF-5'!A8:I67,6,0)","v":"SUNITA DEVI"}]
{"$rows_left_out":13}