{"text_format":"3","workbook":"xlsx","n_sheets":13,"sheets":["MASTER DATA","Dal & Khadhiyan master","Milk master","Att. Dairy","PS Balance Sheet","UPS balance Sheet","Praptra-1","UC Food","Milk Report","Dal Report","New UC Dak","Stock","Bill generate"],"not_rendered":{"images":4,"external_links":1,"defined_names":6,"comments":2},"read":"whole","date_system":"1900"}

{"sheet":"MASTER DATA","index":0,"n_rows":44,"n_cols":42,"rows_kept":44,"merged":[[0,1,0,16],[2,2,2,9],[3,2,3,3],[3,9,3,11],[4,2,4,3],[4,4,5,13],[4,14,5,16],[5,2,5,3],[5,21,5,23],[6,1,7,1],[6,2,7,3],[6,4,8,4],[6,5,6,15],[6,21,6,23],[7,5,7,6],[7,7,7,8],[7,9,7,10],[7,11,7,12],[7,13,7,15],[8,2,8,3],[9,2,9,3],[10,2,10,3],[11,2,11,3],[12,2,12,3],[13,2,13,3],[14,2,14,3],[15,2,15,3],[16,2,16,3],[17,2,17,3],[18,2,18,3],[19,2,19,3],[22,1,22,4],[22,5,22,12],[22,13,22,15],[23,5,23,6],[23,7,23,8],[23,9,23,10],[23,11,23,12],[23,13,24,13],[23,14,24,14],[23,15,24,15],[24,1,24,4],[25,1,25,2],[25,3,25,4],[26,1,26,2],[26,4,26,7],[26,8,26,9],[26,10,26,14],[27,4,27,5],[27,8,27,11],[29,2,29,3],[29,7,30,9],[31,4,31,7],[32,4,32,7],[34,1,34,16],[35,4,35,6],[35,7,35,11],[35,12,35,14],[35,15,35,16],[36,2,36,3],[36,4,36,6],[36,7,36,11],[36,12,36,14],[37,2,37,3],[37,4,37,6],[37,7,37,11],[37,12,37,14],[38,2,38,3],[38,4,38,6],[38,7,38,11],[38,12,38,14],[39,2,39,3],[39,4,39,6],[39,7,39,11],[39,12,39,14],[40,1,40,16]]}
[]
[]
[null,"fo|ky; dk uke","jktdh; vkn'kZ mPp ek/;fed fo|ky; bUnjokM+k ] ia-l-& jkuh ] ikyh"]
[null,"fo|ky; dk uke","jk-m-ek-fo- bUnjokM+k",null,"l=~ %&",2019,"&",20,"ekg %&",{"$f":"AC5","v":"tqykbZ&2019"}]
[null,"ftyk","ikyh",{"$nulls":11},"ije~ iwT; xq:nso oklqnso th egkjkt dks ueu",{"$nulls":13},{"$f":"IF(AND(C20=\"\"),\"\",IF(AND(C20=AE8),AF8,IF(AND(C20=AE9),AF9,IF(AND(C20=AE10),AF10,IF(AND(C20=AE11),AF11,IF(AND(C20=AE12),AF12,IF(AND(C20=AE13),AF13,IF(AND(C20=AE14),AF14,IF(AND(C20=AE15),AF15,IF(AND(C20=AE16),AF16,IF(AND(C20=AE17),AF17,IF(AND(C20=AE18),AF18,IF(AND(C20=AE19),AF19)))))))))))))","v":"tqykbZ&2019"}]
[null,"ikbZbZvks@uksMy Ldwy dk uke","jkmekfo ua- 02 jkuh",{"$nulls":18},"HEERALAL JAT"]
[null,"laLFkk iz/kku","feJhyky",null,"d{kk","dqy ukekadu"]
[{"$nulls":5},"SC",null,"ST",null,"OBC",null,"GEN",null,"TOTAL",{"$nulls":13},"tuojh ","January",{"$f":"H4","v":20},{"$f":"CONCATENATE(AC8,\"-\",AD8)","v":"January-20"},{"$f":"CONCATENATE(AB8,\"&\",AD8)","v":"tuojh &20"}]
[null,"iks\"kkgkj izHkkjh","vtqZuflag",null,null,"B","G","B","G","B","G","B","G","B","G","T",{"$nulls":11},"Qjojh","Febuary",{"$f":"AD8","v":20},{"$f":"CONCATENATE(AC9,\"-\",AD9)","v":"Febuary-20"},{"$f":"CONCATENATE(AB9,\"&\",AD9)","v":"Qjojh&20"}]
[null,"laLFkk iz/kku eks-u-",9929247227,null,"izFke",2,5,5,4,3,6,5,6,{"$f":"F10+H10+J10+L10","v":15},{"$f":"G10+I10+K10+M10","v":21},{"$f":"N10+O10","v":36},{"$nulls":11},"ekpZ","March",{"$f":"AD9","v":20},"March-20","ekpZ&20"]
[null,"iks\"kkgkj izHkkjh eks-u-",9929247228,null,"f}rh;",12,11,10,9,8,10,8,7,{"$f":"F11+H11+J11+L11","v":38},{"$f":"G11+I11+K11+M11","v":37},{"$f":"N11+O11","v":75},{"$nulls":11},"vizsy","April",{"$f":"F4","v":2019},"April-2019","vizsy&2019"]
[null,"DISE Code",8200303101,null,"r`rh;",8,9,2,8,23,20,11,4,44,41,85,{"$nulls":11},"ebZ","May",2019,"May-2019","ebZ&2019"]
[null,"M.D.M. Code",1009,null,"prqFkZ",8,9,7,6,7,8,9,5,31,28,59,{"$nulls":11},"twu","June",2019,"June-2019","twu&2019"]
[null,"xzke dk uke","bUnjokM+k",null,"iape~",3,6,9,4,3,2,1,6,16,18,34,{"$nulls":11},"tqykbZ","July",2019,"July-2019","tqykbZ&2019"]
[null,"xzke iapk;r dk uke","bUnjokM+k ",null,";ksx",{"$f":"SUM(F10:F14)","v":33},{"$f":"SUM(G10:G14)","v":40},33,31,44,46,34,28,144,145,289,{"$nulls":11},"vxLr","August",2019,"August-2019","vxLr&2019"]
[null,"CykWd@lfefr","jkuh",null,"\"k\"Ve~",4,5,6,7,8,9,8,9,{"$f":"F16+H16+J16+L16","v":26},{"$f":"G16+I16+K16+M16","v":30},{"$f":"N16+O16","v":56},{"$nulls":11},"flrEcj","September",2019,"September-2019","flrEcj&2019"]
[null,"school Type","Government",null,"lIre~",15,14,13,12,11,10,11,10,50,46,96,{"$nulls":11},"vDVqcj","October",2019,"October-2019","vDVqcj&2019"]
[null,"{ks=","Rural",null,"v\"Ve~",9,8,5,14,3,3,3,10,20,35,55,{"$nulls":11},"uoEcj","November",2019,"November-2019","uoEcj&2019"]
[null,"Block","RANI",null,";ksx",{"$f":"SUM(F16:F18)","v":28},{"$f":"SUM(G16:G18)","v":27},24,33,22,22,22,29,96,111,207,{"$nulls":11},"fnlEcj","December",2019,"December-2019","fnlEcj&2019"]
[null,"ekg","July-2019",null,"Ekgk;ksx",{"$f":"SUM(F15+F19)","v":61},{"$f":"SUM(G15+G19)","v":67},57,64,66,68,56,57,240,256,496]
[]
[]
[null,"fujh{k.k dk fooj.k la[;k",{"$nulls":3},"fdpu 'ksM dh fLFkfr",{"$nulls":7},"is;ty lqfo/kk ¼gs.MiEi½"]
[null,"tuizfrfuf/k }kjk ",null,"vf/kdkfj;ksa }kjk",null,"Mh-ih-bZ-ih- }kjk",null,",l-th-vkj-okbZ }kjk",null,"vkn'kZ jlksbZ?kj",null,",e-Mh-,e- ;kstuk }kjk",null,"pkyw","[kjkc","udkjk"]
[null," 'kkSpky; gS ;k ugh",{"$nulls":3},"iw.kZ","viw.kZ","iw.kZ","viw.kZ","iw.kZ","viw.kZ","iw.kZ","viw.kZ"]
[null,"Nk=",null,"Nk=k"]
[null,"vk;ksftr cSBd ,l-,elh- ¼fnuakd ½",null,"2019-01-22","[kk|kUu lqjf{kr j[kus ds crZu  la[;k",{"$nulls":3},5,null,"ekg ds vUr rd dqy [kkyh cksfj;kW dh la[;k",{"$nulls":4},10]
[null,"rjktq gS ;k ugh",null,null,"jsEi gS ugh",{"$nulls":3},"pkj fnokjh gS ;k ugh",{"$nulls":22},true,true,true,true,true,true,true,true,true,true,true]
[]
[null,null," dUotZu dh nj izfr Nk= ",{"$nulls":4},"çfr fo|kFkhZ nqX/k dh nj "]
[null,null,"nky lfgr nj","nky jfgr nj"]
[null,"çkFkfed d{kk,a ¼ 1 ls 5 ½",3.08,4.35,"çkFkfed d{kk,a ¼1 ls 5½ nj çfr fo|kFkhZ",{"$nulls":3},5.25,"¼#- esa ½",{"$nulls":15},30,69.25,{"$f":"Z32*AA32","v":2077.5},{"$nulls":3},false,true,false,true,false,false,true,false]
[null,"mPp çkFkfed d{kk,a ¼ 6 ls 8 ½",{"v":4.6,"d":"4.60"},6.51,"mPp çkFkfed d{kk,a ¼6 ls 8½ nj çfr fo|kFkhZ",{"$nulls":3},{"v":7,"d":"7.00"},"¼#- esa ½",{"$nulls":15},30,67.25,{"$f":"Z33*AA33","v":2017.5},{"$nulls":3},false,true,true,false,false,false,true,false]
[{"$nulls":25},10,118.25,1182.5,{"$nulls":3},false,false,false,false,false,false,false,false]
[{"$nulls":25},30,156.25,4687.5,{"$nulls":3},false,false,false,false,false,false,false,false]
[null,"S.No.","Name",null,"       Gender",null,null,"Category",{"$nulls":4},"Mode of Payment",null,null,"Amount Received During the Month",{"$nulls":9},30,212.5,6375]
[null,1,"Dhagalai Devi",{"$nulls":12},1320,{"$nulls":11},0]
[null,2,"Geeta Devi",{"$nulls":12},1320,{"$nulls":9},30,113.5,3405,{"$nulls":3},false,false,false,false,true,false,true,false,true,false,false]
[null,3,{"$nulls":25},{"$f":"SUM(AB32:AB36)-AB38","v":12935},{"$nulls":3},true,false,true,false,true,false]
[null,4,{"$nulls":31},true,true]
[]
[{"$nulls":31},true,false]
[{"$nulls":31},false,false]
[{"$nulls":31},false,true]

{"sheet":"Dal & Khadhiyan master","index":1,"n_rows":46,"n_cols":7,"rows_kept":46,"merged":[[0,0,0,1],[0,2,0,8],[1,0,1,7],[2,0,2,7],[3,0,5,0],[3,1,5,3],[3,4,5,5],[3,6,5,7],[6,0,7,0],[6,1,7,2],[6,4,6,5],[6,6,6,7],[7,4,7,5],[7,6,7,7],[8,0,10,0],[8,1,10,2],[8,4,8,5],[8,6,8,7],[9,4,9,5],[9,6,9,7],[10,4,10,5],[10,6,10,7],[11,0,12,0],[11,1,12,2],[11,4,11,5],[11,6,11,7],[12,4,12,5],[12,6,12,7],[13,0,15,0],[13,1,15,2],[13,4,13,5],[13,6,13,7],[14,4,14,5],[14,6,14,7],[15,4,15,5],[15,6,15,7],[16,0,17,0],[16,1,17,2],[16,4,16,5],[16,6,16,7],[17,4,17,5],[17,6,17,7],[18,0,20,0],[18,1,20,2],[18,4,18,5],[18,6,18,7],[19,4,19,5],[19,6,19,7],[20,4,20,5],[20,6,20,7],[21,0,22,0],[21,1,22,2],[21,4,21,5],[21,6,21,7],[22,4,22,5],[22,6,22,7],[23,0,25,0],[23,1,25,2],[23,4,23,5],[23,6,23,7],[24,4,24,5],[24,6,24,7],[25,4,25,5],[25,6,25,7],[26,0,27,0],[26,1,27,2],[26,4,26,5],[26,6,26,7],[27,4,27,5],[27,6,27,7],[28,0,30,0],[28,1,30,2],[28,4,28,5],[28,6,28,7],[29,4,29,5],[29,6,29,7],[30,4,30,5],[30,6,30,7],[31,0,32,0],[31,1,32,2],[31,4,31,5],[31,6,31,7],[32,4,32,5],[32,6,32,7],[33,0,35,0],[33,1,35,2],[33,4,33,5],[33,6,33,7],[34,4,34,5],[34,6,34,7],[35,4,35,5],[35,6,35,7],[36,0,40,0],[36,1,40,2],[36,4,36,5],[36,6,36,7],[37,4,37,5],[37,6,37,7],[38,4,38,5],[38,6,38,7],[39,4,39,5],[39,6,39,7],[40,4,40,5],[40,6,40,7],[41,0,45,0],[41,1,45,2],[41,4,41,5],[41,6,41,7],[42,4,42,5],[42,6,42,7],[43,4,43,5],[43,6,43,7],[44,4,44,5],[44,6,44,7],[45,4,45,5],[45,6,45,7]]}
["School NAME  :- ",null,{"$f":"'MASTER DATA'!C3","v":"jktdh; vkn'kZ mPp ek/;fed fo|ky; bUnjokM+k ] ia-l-& jkuh ] ikyh"}]
[]
[]
["Sr. No.","Detail",null,null,"Class 1 to 5",null,"Class 6 to 8"]
[]
[]
[1,"izkjfEHkd 'ks\"k [kk|kUu ¼fdyksaxzke esa½",null,"xsgqa",{"$f":"'PS Balance Sheet'!D6","v":{"v":250,"d":"250.000"}},null,{"$f":"'UPS balance Sheet'!D6","v":{"v":300,"d":"300.000"}}]
[{"$nulls":3},"pkoy",{"$f":"'PS Balance Sheet'!E6","v":{"v":150,"d":"150.000"}},null,{"$f":"'UPS balance Sheet'!E6","v":{"v":200,"d":"200.000"}}]
[2,"izkjfEHkd 'ks\"k nky ¼fdyksaxzke esa½",null,"ewax",{"$f":"'PS Balance Sheet'!F6","v":{"v":40,"d":"40.000"}},null,{"$f":"'UPS balance Sheet'!F6","v":{"v":60,"d":"60.000"}}]
[{"$nulls":3},"mMn",{"$f":"'PS Balance Sheet'!G6","v":{"v":20,"d":"20.000"}},null,{"$f":"'UPS balance Sheet'!G6","v":{"v":30,"d":"30.000"}}]
[{"$nulls":3},"puk",{"$f":"'PS Balance Sheet'!H6","v":{"v":20,"d":"20.000"}},null,{"$f":"'UPS balance Sheet'!H6","v":{"v":30,"d":"30.000"}}]
[3,"lIyk;j ls izkIr [kk|kUu ¼fdyksaxzke esa½",null,"xsgqa",{"$f":"'PS Balance Sheet'!I37","v":{"v":0,"d":"0.000"}},null,{"$f":"'UPS balance Sheet'!I37","v":{"v":0,"d":"0.000"}}]
[{"$nulls":3},"pkoy",{"$f":"'PS Balance Sheet'!J37","v":{"v":0,"d":"0.000"}},null,{"$f":"'UPS balance Sheet'!J37","v":{"v":0,"d":"0.000"}}]
[4,"lIyk;j ls izkIr nky ¼fdyksaxzke esa½",null,"ewax",{"$f":"'PS Balance Sheet'!K37","v":{"v":0,"d":"0.000"}},null,{"$f":"'UPS balance Sheet'!K37","v":{"v":0,"d":"0.000"}}]
[{"$nulls":3},"mMn",{"$f":"'PS Balance Sheet'!L37","v":{"v":0,"d":"0.000"}},null,{"$f":"'UPS balance Sheet'!L37","v":{"v":0,"d":"0.000"}}]
[{"$nulls":3},"puk",{"$f":"'PS Balance Sheet'!M37","v":{"v":0,"d":"0.000"}},null,{"$f":"'UPS balance Sheet'!M37","v":{"v":0,"d":"0.000"}}]
[5,"vU;= ls izkIr [kk|kUu ¼tulg;ksx@m/kkj½ ¼fdyksaxzke esa½",null,"xsgqa",{"$f":"'PS Balance Sheet'!N37+'PS Balance Sheet'!S37","v":{"v":0,"d":"0.000"}},null,{"$f":"'UPS balance Sheet'!N37+'UPS balance Sheet'!S37","v":{"v":0,"d":"0.000"}}]
[{"$nulls":3},"pkoy",{"$f":"'PS Balance Sheet'!O37+'PS Balance Sheet'!T37","v":{"v":0,"d":"0.000"}},null,{"$f":"'UPS balance Sheet'!O37+'UPS balance Sheet'!T37","v":{"v":0,"d":"0.000"}}]
[6,"vU;= ls izkIr nky ¼tulg;ksx@m/kkj½ ¼fdyksxzke esa½",null,"ewax",{"$f":"'PS Balance Sheet'!P37+'PS Balance Sheet'!U37","v":{"v":0,"d":"0.000"}},null,{"$f":"'UPS balance Sheet'!P37+'UPS balance Sheet'!U37","v":{"v":0,"d":"0.000"}}]
[{"$nulls":3},"mMn",{"$f":"'PS Balance Sheet'!Q37+'PS Balance Sheet'!V37","v":{"v":0,"d":"0.000"}},null,{"$f":"'UPS balance Sheet'!Q37+'UPS balance Sheet'!V37","v":{"v":0,"d":"0.000"}}]
[{"$nulls":3},"puk",{"$f":"'PS Balance Sheet'!R37+'PS Balance Sheet'!W37","v":{"v":0,"d":"0.000"}},null,{"$f":"'UPS balance Sheet'!R37+'UPS balance Sheet'!W37","v":{"v":0,"d":"0.000"}}]
[7,"miyC/k dqy [kk|kUu ¼1+3+5½ ¼fdyksxzke esa½",null,"xsgqa",{"$f":"E7+E12+E17","v":{"v":250,"d":"250.000"}},null,{"$f":"G7+G12+G17","v":{"v":300,"d":"300.000"}}]
[{"$nulls":3},"pkoy",{"$f":"E8+E13+E18","v":{"v":150,"d":"150.000"}},null,{"$f":"G8+G13+G18","v":{"v":200,"d":"200.000"}}]
[8,"miyC/k dqy nky ¼2+4+6½ ¼fdyksxzke esa½",null,"ewax",{"$f":"E9+E14+E19","v":{"v":40,"d":"40.000"}},null,{"$f":"G9+G14+G19","v":{"v":60,"d":"60.000"}}]
[{"$nulls":3},"mMn",{"v":20,"d":"20.000"},null,{"v":30,"d":"30.000"}]
[{"$nulls":3},"puk",{"$f":"E11+E16+E21","v":{"v":20,"d":"20.000"}},null,{"v":30,"d":"30.000"}]
[9,"Hkkstu cukus esa [kpZ [kk|kUu ¼fdyksxzke esa½",null,"xsgqa",{"$f":"'PS Balance Sheet'!AL37","v":{"v":31.099999999999998,"d":"31.100"}},null,{"$f":"'UPS balance Sheet'!AL37","v":{"v":48.45,"d":"48.450"}}]
[{"$nulls":3},"pkoy",{"$f":"'PS Balance Sheet'!AM37","v":{"v":8.9,"d":"8.900"}},null,{"$f":"'UPS balance Sheet'!AM37","v":{"v":13.95,"d":"13.950"}}]
[10,"Hkkstu cukus esa [kpZ nky ¼fdyksxzke esa½",null,"ewax",{"$f":"'PS Balance Sheet'!AN37","v":{"v":1.4,"d":"1.400"}},null,{"$f":"'UPS balance Sheet'!AN37","v":{"v":2.2199999999999998,"d":"2.220"}}]
[{"$nulls":3},"mMn",{"$f":"'PS Balance Sheet'!AO37","v":{"v":0.7,"d":"0.700"}},null,{"$f":"'UPS balance Sheet'!AO37","v":{"v":1.1099999999999999,"d":"1.110"}}]
[{"$nulls":3},"puk",{"$f":"'PS Balance Sheet'!AP37","v":{"v":0.7,"d":"0.700"}},null,{"$f":"'UPS balance Sheet'!AP37","v":{"v":1.1099999999999999,"d":"1.110"}}]
[11," 'ks\"k [kk|kUu ¼7-9½ ¼fdyksxzke esa½",null,"xsgqa",{"$f":"E22-E27","v":{"v":218.9,"d":"218.900"}},null,{"$f":"G22-G27","v":{"v":251.55,"d":"251.550"}}]
[{"$nulls":3},"pkoy",{"$f":"E23-E28","v":{"v":141.1,"d":"141.100"}},null,{"$f":"G23-G28","v":{"v":186.05,"d":"186.050"}}]
[12," 'ks\"k nky ¼8-10½ ¼fdyksxzke esa½",null,"ewax",{"v":38.6,"d":"38.600"},null,{"v":57.78,"d":"57.780"}]
[{"$nulls":3},"mMn",{"v":19.3,"d":"19.300"},null,{"v":28.89,"d":"28.890"}]
[{"$nulls":3},"puk",{"v":19.3,"d":"19.300"},null,{"v":28.89,"d":"28.890"}]
[13,"dqfdax dUotZu foÙkh; fLFkfr ¼:i;ksaa es½",null,"izkjfEHkd 'ks\"k",{"v":10000,"d":"10000.00"},null,{"v":15000,"d":"15000.00"}]
[{"$nulls":3},"bl ekg esa izkIRk jkf'k",{"v":15000,"d":"15000.00"},null,{"v":20000,"d":"20000.00"}]
[{"$nulls":3},"dqy jkf'k",{"$f":"E37+E38","v":{"v":25000,"d":"25000.00"}},null,{"$f":"G37+G38","v":{"v":35000,"d":"35000.00"}}]
[{"$nulls":3},"O;; jkf'k",{"$f":"'PS Balance Sheet'!AV37","v":{"v":1562.1999999999998,"d":"1562.20"}},null,{"$f":"'UPS balance Sheet'!AV37","v":2425.48}]
[{"$nulls":3},"'ks\"k jkf'k",{"$f":"E39-E40","v":{"v":23437.8,"d":"23437.80"}},null,{"$f":"G39-G40","v":32574.52}]
[14,"dqd&de&gsYij foÙkh; fLFkfr ¼:i;ksa esa½",null,"izkjfEHkd 'ks\"k",2000,null,2000]
[{"$nulls":3},"bl ekg esa izkIRk jkf'k",6000,null,6000]
[{"$nulls":3},"dqy jkf'k",{"$f":"E42+E43","v":8000},null,{"$f":"G42+G43","v":8000}]
[{"$nulls":3},"O;; jkf'k"]
[{"$nulls":3},"'ks\"k jkf'k",{"$f":"E44-E45","v":8000},null,{"$f":"G44-G45","v":8000}]

{"sheet":"Milk master","index":2,"n_rows":23,"n_cols":7,"rows_kept":23,"merged":[[0,0,0,1],[0,2,0,9],[1,0,1,8],[2,0,2,8],[3,0,5,0],[3,1,5,3],[3,4,5,5],[3,6,5,8],[6,0,12,0],[6,1,12,2],[6,4,6,5],[6,6,6,8],[7,4,7,5],[7,6,7,8],[8,4,8,5],[8,6,8,8],[9,4,9,5],[9,6,9,8],[10,4,10,5],[10,6,10,8],[11,4,11,5],[11,6,11,8],[12,4,12,5],[12,6,12,8],[13,0,14,0],[13,1,14,2],[13,4,13,5],[13,6,13,8],[14,4,14,5],[14,6,14,8],[15,0,17,0],[15,1,17,2],[15,3,15,4],[15,6,15,7],[16,3,16,4],[16,6,16,7],[17,3,17,4],[17,6,17,7],[18,0,19,0],[18,1,19,2],[18,4,18,8],[19,4,19,8],[20,0,22,0],[20,1,22,2],[20,4,20,8],[21,4,21,8],[22,4,22,8]]}
["School NAME  :- ",null,{"$f":"'MASTER DATA'!C3","v":"jktdh; vkn'kZ mPp ek/;fed fo|ky; bUnjokM+k ] ia-l-& jkuh ] ikyh"}]
[]
[]
["Sr. No.","Detail",null,null,"Class 1 to 5",null,"Class 6 to 8"]
[]
[]
[1,"vUuiw.kkZ nqX/k ;kstuk lEcfU/kr lwpuk",null,"nw/k ls ykHkkfUor la[;k",{"$f":"'PS Balance Sheet'!AK37","v":431},null,{"$f":"'UPS balance Sheet'!AK37","v":588}]
[{"$nulls":3},"nw/k dk mi;ksx yhVj esa",{"$f":"E7*E15","v":64.64999999999999},null,{"$f":"G7*G15","v":{"v":117.60000000000001,"d":"117.60"}}]
[{"$nulls":3},"izkj- 'ks\"k jkf'k",5000,null,7000]
[{"$nulls":3},"izkIr jkf'k",1500,null,2000]
[{"$nulls":3},"dqy jkf'k",{"$f":"E9+E10","v":6500},null,{"$f":"G9+G10","v":9000}]
[{"$nulls":3},"O;; jkf'k",{"$f":"'PS Balance Sheet'!AW37","v":2262.75},null,{"$f":"'UPS balance Sheet'!AW37","v":{"v":4116,"d":"4116.00"}}]
[{"$nulls":3},"'ks\"k jkf'k",{"$f":"E11-E12","v":4237.25},null,{"$f":"G11-G12","v":{"v":4884,"d":"4884.00"}}]
[2,"izfr Nk= nqX/k dh nj o ek=k",null,"nj",5.25,null,{"v":7,"d":"7.00"}]
[{"$nulls":3},"ek=k",{"v":0.15,"d":"0.150"},null,{"v":0.2,"d":"0.200"}]
[3,"fo|ky; ftues ;kstuk dk lapkyu fd;k tk jgk gS esa nw/k Ø; djus ds L=ksr ¼lEcfU/kr fodYi ij fDyd djsa½",null,"ljl Ms;jh ¼'kgjh {ks=½",null,null,"efgyk \nLo;a \nlgk;rk \nlewg"]
[{"$nulls":3},"iathd`r efgyk nw/k mRiknd lgdkjh l-\n",null,null,"vU; \nLo;a \nlgk;rk \nlewg"]
[{"$nulls":3},"vU; \niathd`r \nnw/k \nmRiknd \nlg0 \nlfefr",null,null,"vU; L=ksr"]
[4,"nw/k miyC/k djkus okyh laLFkk@lewg dk uke ,oa eksckbZy ua-",null,"uke","ljl Ms;jh bUnjokM+k"]
[{"$nulls":3},"eksckbZy uEcj",9922334455]
[5,"nw/k miyC/k djkus okyh laLFkk@lewg dks Hkqxrku dh xbZ jkf'k dk fooj.k",null,"Hkqxrku dh xbZ jkf'k",20000]
[{"$nulls":3},"pSd @ vkjVhth,l\nla[;k \n","RMGB123456"]
[{"$nulls":3},"fnukad","2019-02-03"]

{"sheet":"Att. Dairy","index":3,"n_rows":42,"n_cols":28,"rows_kept":42,"merged":[[0,1,0,13],[0,14,0,20],[1,0,4,0],[1,2,4,2],[1,4,1,7],[1,8,1,13],[1,14,1,20],[2,4,2,5],[2,6,2,7],[2,8,2,10],[2,11,2,13],[2,14,2,16],[2,17,2,19],[2,20,3,20],[2,21,2,23],[37,8,37,9],[37,11,37,12],[38,4,39,7],[38,8,39,9],[38,11,39,12],[41,4,42,7],[41,8,42,9],[41,11,42,12]]}
[null,"fo|ky; ds ykHkkfUor Nk=ksa dh fnukadokj lwpuk jftLV~zj",{"$nulls":12},{"$f":"CONCATENATE('MASTER DATA'!I4, 'MASTER DATA'!J4)","v":"ekg %&tqykbZ&2019"}]
["Ø- l-","frfFk",";fn ehuw ds vuqlkj [kk|kUu miyC/k u gks rks tks Hkh [kk|kUu miyC/k  gks] mls Mkmu fyLV esa ls lysDV djsaA vU;Fkk dkWye [kkyh j[ksaA","d{kk  F","[kk|kUu ls ykHkkfUor",{"$nulls":3},"nqX/k ls ykHkkfUor",{"$nulls":5},"fnukadokbZt dqy ukekadu"]
[null,"H",null,"ukekadu F","Class  1 to 5   TOTAL ",null,"Class  6  to  8   TOTAL ",null,"1 to 5",null,null,"6 to 8",null,null,"1 to 5",null,null,"6 to 8",null,null,"G. Total"]
[{"$nulls":4},"B","G","B","G","B","G","T","B","G","T","B","G","T","B","G","T"]
[{"$nulls":3},"okj  H",{"$f":"'MASTER DATA'!N15","v":144},{"$f":"'MASTER DATA'!O15","v":145},{"$f":"'MASTER DATA'!N19","v":96},{"$f":"'MASTER DATA'!O19","v":111},{"$f":"'MASTER DATA'!N15","v":144},{"$f":"'MASTER DATA'!O15","v":145},{"$f":"'MASTER DATA'!P15","v":289},{"$f":"'MASTER DATA'!N19","v":96},{"$f":"'MASTER DATA'!O19","v":111},{"$f":"'MASTER DATA'!P19","v":207},{"$f":"'MASTER DATA'!N15","v":144},{"$f":"'MASTER DATA'!O15","v":145},{"$f":"SUM(O5+P5)","v":289},{"$f":"'MASTER DATA'!N19","v":96},{"$f":"'MASTER DATA'!O19","v":111},{"$f":"SUM(R5+S5)","v":207},{"$f":"Q5+T5","v":496}]
[1,"2019-07-01","Wheat",{"$f":"IF(X6=1,\"Sunday\",IF(X6=2,\"Monday\",IF(X6=3,\"Tuesday\",IF(X6=4,\"Wednesday\",IF(X6=5,\"Thursday\",IF(X6=6,\"Friday\",IF(X6=7,\"Saturday\",\" \")))))))","v":"Monday"},25,26,27,28,20,20,{"$f":"IF(AND(I6=\"\",J6=\"\"),\"\",SUM(I6,J6))","v":40},30,30,{"$f":"IF(AND(L6=\"\",M6=\"\"),\"\",SUM(L6,M6))","v":60},{"$f":"IF(AND(E6=\"\",K6=\"\"),\"\",O$5)","v":144},{"$f":"IF(AND(E6=\"\",K6=\"\"),\"\",P$5)","v":145},{"$f":"IF(AND(E6=\"\",K6=\"\"),\"\",SUM(O6,P6))","v":289},{"$f":"IF(AND(G6=\"\",N6=\"\"),\"\",R$5)","v":96},{"$f":"IF(AND(G6=\"\",N6=\"\"),\"\",S$5)","v":111},{"$f":"IF(AND(G6=\"\",N6=\"\"),\"\",SUM(R6,S6))","v":207},{"$f":"IF(AND(Q6=\"\",T6=\"\"),\"\",SUM(Q6,T6))","v":496},{"$f":"E6+F6","v":51},{"$f":"G6+H6","v":55},{"$f":"IF(AND(B6=\"\"),\"\",SUM(Y6))","v":2},{"$f":"WEEKDAY(B6)","v":2}]
[2,"2019-07-02",null,{"$f":"IF(X7=1,\"Sunday\",IF(X7=2,\"Monday\",IF(X7=3,\"Tuesday\",IF(X7=4,\"Wednesday\",IF(X7=5,\"Thursday\",IF(X7=6,\"Friday\",IF(X7=7,\"Saturday\",\" \")))))))","v":"Tuesday"},{"$nulls":4},33,36,{"$f":"IF(AND(I7=\"\",J7=\"\"),\"\",SUM(I7,J7))","v":69},65,66,{"$f":"IF(AND(L7=\"\",M7=\"\"),\"\",SUM(L7,M7))","v":131},144,145,289,{"$f":"IF(AND(G7=\"\",N7=\"\"),\"\",R$5)","v":96},{"$f":"IF(AND(G7=\"\",N7=\"\"),\"\",S$5)","v":111},{"$f":"IF(AND(G7=\"\",N7=\"\"),\"\",SUM(R7,S7))","v":207},{"$f":"IF(AND(Q7=\"\",T7=\"\"),\"\",SUM(Q7,T7))","v":496},{"$f":"E7+F7","v":0},{"$f":"G7+H7","v":0},3,{"$f":"WEEKDAY(B7)","v":3}]
[3,"2019-07-03",null,{"$f":"IF(X8=1,\"Sunday\",IF(X8=2,\"Monday\",IF(X8=3,\"Tuesday\",IF(X8=4,\"Wednesday\",IF(X8=5,\"Thursday\",IF(X8=6,\"Friday\",IF(X8=7,\"Saturday\",\" \")))))))","v":"Wednesday"},{"$nulls":4},32,36,68,45,46,91,144,145,289,96,111,207,496,0,0,4,4]
[4,"2019-07-04",null,"Thursday",44,45,46,47,35,36,71,88,96,184,144,145,289,96,111,207,496,89,93,5,5,null,null,"Sunday"]
[5,"2019-07-05",null,"Friday",{"$nulls":4},88,95,183,60,62,122,144,145,289,96,111,207,496,0,0,6,6,null,null,"Monday"]
[6,"2019-07-06",null,{"$f":"IF(X11=1,\"Sunday\",IF(X11=2,\"Monday\",IF(X11=3,\"Tuesday\",IF(X11=4,\"Wednesday\",IF(X11=5,\"Thursday\",IF(X11=6,\"Friday\",IF(X11=7,\"Saturday\",\" \")))))))","v":"Saturday"},63,64,65,66,null,null,"",null,null,"",144,145,289,96,111,207,496,127,131,7,7,null,null,"Tuesday"]
[7,"2019-07-07",null,{"$f":"IF(X12=1,\"Sunday\",IF(X12=2,\"Monday\",IF(X12=3,\"Tuesday\",IF(X12=4,\"Wednesday\",IF(X12=5,\"Thursday\",IF(X12=6,\"Friday\",IF(X12=7,\"Saturday\",\" \")))))))","v":"Sunday"},{"$nulls":6},"",null,null,"","","","","","","","",0,0,1,1,null,null,"Wednesday"]
[8,"2019-07-08",null,"Monday",66,67,68,69,null,null,"",null,null,"",144,145,289,96,111,207,496,133,137,2,2,null,null,"Thursday"]
[9,"2019-07-09",null,"Tuesday",{"$nulls":6},"",null,null,"","","","","","","","",0,0,3,3,null,null,"Friday"]
[10,"2019-07-10",null,{"$f":"IF(X15=1,\"Sunday\",IF(X15=2,\"Monday\",IF(X15=3,\"Tuesday\",IF(X15=4,\"Wednesday\",IF(X15=5,\"Thursday\",IF(X15=6,\"Friday\",IF(X15=7,\"Saturday\",\" \")))))))","v":"Wednesday"},{"$nulls":6},"",null,null,"","","","","","","","",0,0,4,4,null,null,"Saturday"]
[11,"2019-07-11",null,"Thursday",{"$nulls":6},"",null,null,"","","","","","","","",0,0,5,5]
[12,"2019-07-12",null,"Friday",{"$nulls":6},"",null,null,"","","","","","","","",0,0,6,6]
[13,"2019-07-13",null,"Saturday",{"$nulls":6},"",null,null,"","","","","","","","",0,0,7,7]
[14,"2019-07-14",null,"Sunday",{"$nulls":6},"",null,null,"","","","","","","","",0,0,1,1]
[15,"2019-07-15",null,"Monday",{"$nulls":6},"",null,null,"","","","","","","","",0,0,2,2,null,null,"Wheat"]
[16,"2019-07-16",null,"Tuesday",{"$nulls":6},"",null,null,"","","","","","","","",0,0,3,3,null,null,"Rice"]
[17,"2019-07-17",null,"Wednesday",{"$nulls":6},"",null,null,"","","","","","","","",0,0,4,4]
[18,"2019-07-18",null,"Thursday",{"$nulls":6},"",null,null,"","","","","","","","",0,0,5,5]
[19,"2019-07-19",null,"Friday",{"$nulls":6},"",null,null,"","","","","","","","",0,0,6,6]
[20,"2019-07-20",null,"Saturday",{"$nulls":6},"",null,null,"","","","","","","","",0,0,7,7]
[21,"2019-07-21",null,"Sunday",{"$nulls":6},"",null,null,"","","","","","","","",0,0,1,1]
[22,"2019-07-22",null,"Monday",{"$nulls":6},"",null,null,"","","","","","","","",0,0,2,2]
[23,"2019-07-23",null,"Tuesday",{"$nulls":6},"",null,null,"","","","","","","","",0,0,3,3]
[24,"2019-07-24",null,"Wednesday",{"$nulls":6},"",null,null,"","","","","","","","",0,0,4,4]
[25,"2019-07-25",null,"Thursday",{"$nulls":6},"",null,null,"","","","","","","","",0,0,5,5]
[26,"2019-07-26",null,"Friday",{"$nulls":6},"",null,null,"","","","","","","","",0,0,6,6]
[27,"2019-07-27",null,"Saturday",{"$nulls":6},"",null,null,"","","","","","","","",0,0,7,7]
[28,"2019-07-28",null,"Sunday",{"$nulls":6},"",null,null,"","","","","","","","",0,0,1,1]
[29,"2019-07-29",null,"Monday",{"$nulls":6},"",null,null,"","","","","","","","",0,0,2,2]
[30,"2019-07-30",null,"Tuesday",{"$nulls":6},"",null,null,"","","","","","","","",0,0,3,3]
[31,"2019-07-31",null,{"$f":"IF(X36=1,\"Sunday\",IF(X36=2,\"Monday\",IF(X36=3,\"Tuesday\",IF(X36=4,\"Wednesday\",IF(X36=5,\"Thursday\",IF(X36=6,\"Friday\",IF(X36=7,\"Saturday\",\" \")))))))","v":"Wednesday"},{"$nulls":6},{"$f":"IF(AND(I36=\"\",J36=\"\"),\"\",SUM(I36,J36))","v":""},null,null,"","","","","","","","",0,0,4,4]
[{"$nulls":4},{"$f":"SUM(E6:E36)","v":198},{"$f":"SUM(F6:F36)","v":202},{"$f":"SUM(G6:G36)","v":206},{"$f":"SUM(H6:H36)","v":210},{"$f":"SUM(I6:I36)","v":208},223,431,288,300,588,1008,1015,2023,672,777,1449,3472]
[{"$nulls":8},"PS",null,null,"UPS"]
[{"$nulls":4},"[kk|kUu ls ykHkkfUor fnuksa dh la[;k &",{"$nulls":3},{"$f":"COUNTA(V6:V36)-COUNTIF(V6:V36,\"0\")-COUNTIF(V6:V36,\"blank\")-COUNTIF(V6:V36,\"\")","v":4},null,null,{"$f":"COUNTA(W6:W36)-COUNTIF(W6:W36,\"0\")-COUNTIF(W6:W36,\"blank\")-COUNTIF(W6:W36,\"\")","v":4}]
[]
[]
[{"$nulls":4},"nqX/k ls ykHkkfUor fnuksa dh la[;k &",{"$nulls":3},{"$f":"COUNTA(K6:K36)-COUNTIF(K6:K36,\"0\")-COUNTIF(K6:K36,\"blank\")-COUNTIF(K6:K36,\"\")","v":5},null,null,{"$f":"COUNTA(N6:N36)-COUNTIF(N6:N36,\"0\")-COUNTIF(N6:N36,\"blank\")-COUNTIF(N6:N36,\"\")","v":5}]

{"sheet":"PS Balance Sheet","index":4,"n_rows":48,"n_cols":150,"rows_kept":48,"merged":[[0,1,0,2],[0,3,0,6],[0,7,0,15],[0,20,0,23],[0,30,0,34],[1,1,3,1],[1,2,4,2],[1,3,3,7],[1,8,3,12],[1,13,2,17],[1,18,2,22],[1,23,3,27],[1,28,3,30],[1,31,3,33],[1,34,3,36],[1,37,3,41],[1,42,3,46],[1,47,4,47],[1,48,4,48],[1,49,4,49],[1,50,4,50],[1,124,3,124],[1,125,4,125],[1,126,3,128],[1,129,3,131],[1,132,3,134],[1,135,3,136],[1,137,3,138],[1,139,3,140],[1,141,3,143],[1,144,3,146],[1,147,4,147],[1,148,4,148],[1,149,4,149],[3,13,3,17],[3,18,3,22],[36,1,36,2],[36,3,36,4],[36,125,36,127],[42,37,42,38],[43,37,43,38],[44,37,44,38],[45,37,45,38]]}
[null,"loZçFke vVsusUl 'khV ij fnukad okys Column dh çfof\"B;ka iw.kZ djsa ",null,"Presented By:-",{"$nulls":3},"Mr. HeeraLaL Jat Sojat (PALI)   ",{"$nulls":12},{"$f":"CONCATENATE('MASTER DATA'!I4, 'MASTER DATA'!J4)","v":"ekg %&tqykbZ&2019"},{"$nulls":32},{"$f":"'MASTER DATA'!C32","v":3.08},{"$f":"'MASTER DATA'!D32","v":4.35},{"$f":"'MASTER DATA'!I32","v":5.25}]
[null,"fnukad","nky ds fy,  Yes/No","çkjfEHkd [kk|ku o  nky  dh  ek=k fdyks xzke esa ",{"$nulls":4},"forj.k drkZ ls çkIr [kk|ku fdyks xzke esa",{"$nulls":4},"vU;= lzksr ls m/kkj  fy;k@fn;k¼fdxzk½",{"$nulls":4},"vU; fo|ky; ls m/kkj fy;k@fn;k¼fdxzk½",{"$nulls":4},"dqy [kk|ku o  nky",{"$nulls":4},"  dqy ukekadu d{kk 1 ls 5",null,null,"dqy ykHkkfUor Nk=@Nk=k       d{kk 1 ls 5",null,null,"dqy nqX/k ls ykHkkfUor",null,null,"ekg esa mi;ksx fy;k x;k izfrfnu [kk|ku o nky",{"$nulls":4}," 'ks\"k [kk|ku o nky",{"$nulls":4},"ekg esa izfrfnu dUotZu ij O;; jkf'k","ekg esa izfrfnu nqX/k ij O;; jkf'k","ekg esa izfrfnu dqy O;; jkf'k","feuw ds vuqlkj Hkkstu",{"$nulls":73},"fnukad","nky ds fy,  Yes/ No","çkjfEHkd [kk|ku o  nky  dh  ek=k fdyks xzke esa ",null,null,"forj.k drkZ ls çkIr [kk|ku fdyks xzke esa",null,null,"dqy [kk|ku o  nky",null,null,"  dqy ukekadu d{kk 1 ls 5",null,"dqy ykHkkfUor Nk=@Nk=k       d{kk 1 ls 5",null,"dqy nqX/k ls ykHkkfUor",null,"ekg esa mi;ksx fy;k x;k izfrfnu [kk|ku o nky",null,null," 'ks\"k [kk|ku o nky",null,null,"ekg esa izfrfnu dUotZu ij O;; jkf'k","ekg esa izfrfnu nqX/k ij O;; jkf'k","feuw ds vuqlkj Hkkstu"]
[]
[{"$nulls":13},"m/kkj nsus ij¼&½fpUg yxk,",{"$nulls":4},"m/kkj nsus ij¼&½fpUg yxk,"]
["Sr.","MM-DDD-YYYY e.g.(01-Jan-1900) ",null,"xsagw","pkoy","ewax","mM+n","puk","xsagw","pkoy","ewax","mM+n","puk","xsagw","pkoy","ewax","mM+n","puk","xsagw","pkoy","ewax","mM+n","puk","xsagw","pkoy","ewax","mM+n","puk","Nk=","Nk=k","dqy","Nk=","Nk=k","dqy","Nk=","Nk=k","dqy","xsagw","pkoy","ewax","mM+n","puk","xsagw","pkoy","ewax","mM+n","puk",{"$nulls":11},"Wheat/Rice",{"$nulls":18},"Wheat/Rice","Wheat/Rice",{"$nulls":45},"MM-DD-YYYY e.g.(01-Jan-1900) ",null,"xsagw","pkoy","nky","xsagw","pkoy","nky","xsagw","pkoy","nky","Nk=","Nk=k","Nk=","Nk=k","Nk=","Nk=k","xsagw","pkoy","nky","xsagw","pkoy","ewax"]
[1,{"$f":"IF(AND('Att. Dairy'!B6=\"\"),\"\",'Att. Dairy'!B6)","v":"2019-07-01"},"YES",{"v":250,"d":"250.000"},{"v":150,"d":"150.000"},{"v":40,"d":"40.000"},{"v":20,"d":"20.000"},{"v":20,"d":"20.000"},{"$nulls":15},{"$f":"IF(AND(D6=\"\"),\"\",SUM(D6,I6,N6,S6))","v":{"v":250,"d":"250.000"}},{"$f":"IF(AND(E6=\"\"),\"\",SUM(E6,J6,O6,T6))","v":{"v":150,"d":"150.000"}},{"$f":"IF(AND(F6=\"\"),\"\",SUM(F6,K6,P6,U6))","v":{"v":40,"d":"40.000"}},{"$f":"IF(AND(G6=\"\"),\"\",SUM(G6,L6,Q6,V6))","v":{"v":20,"d":"20.000"}},{"$f":"IF(AND(H6=\"\"),\"\",SUM(H6,M6,R6,W6))","v":{"v":20,"d":"20.000"}},{"$f":"IF(AND('Att. Dairy'!O6=\"\"),\"\",'Att. Dairy'!O6)","v":144},{"$f":"IF(AND('Att. Dairy'!P6=\"\"),\"\",'Att. Dairy'!P6)","v":145},{"$f":"SUM(AC6,AD6)","v":289},{"$f":"IF(AND('Att. Dairy'!E6=\"\"),\"\",'Att. Dairy'!E6)","v":25},{"$f":"IF(AND('Att. Dairy'!F6=\"\"),\"\",'Att. Dairy'!F6)","v":26},{"$f":"SUM(AF6,AG6)","v":51},{"$f":"IF(AND('Att. Dairy'!I6=\"\"),\"\",'Att. Dairy'!I6)","v":20},{"$f":"IF(AND('Att. Dairy'!J6=\"\"),\"\",'Att. Dairy'!J6)","v":20},{"$f":"SUM(AI6,AJ6)","v":40},{"$f":"IF(AND(AH6=\"\"),\"0\",IF(AND(CA6=\"w\"),AH6*100/1000,\"0\"))","v":{"v":5.1,"d":"5.100"}},{"$f":"IF(AND(AH6=\"\"),\"0\",IF(AND(CA6=\"R\"),AH6*100/1000,\"0\"))","v":"0"},{"$f":"IF(AND(C6=\"YES\",AH6>0),AH6*0.01,0)","v":{"v":0.51,"d":"0.510"}},{"$f":"IF(AND(C6=\"YES\",AH6>0),AH6*0.005,0)","v":0.255},{"$f":"IF(AND(C6=\"YES\",AH6>0),AH6*0.005,0)","v":0.255},{"$f":"SUM(X6-AL6)","v":{"v":244.9,"d":"244.900"}},{"$f":"(Y6-AM6)","v":{"v":150,"d":"150.000"}},{"$f":"(Z6-AN6)","v":{"v":39.49,"d":"39.490"}},19.745,19.745,{"$f":"IF(AND('Att. Dairy'!B6=\"\"),\"\",IF(AND(AH6=\"\"),\"\",IF(AND(C6=\"YES\",AH6>0),AH6*$BB$1,AH6*$BC$1)))","v":157.08},{"$f":"IF(AND('Att. Dairy'!B6=\"\"),\"\",IF(AND(AK6=\"\"),\"\",AK6*$BD$1))","v":{"v":210,"d":"210.00"}},{"$f":"IF(AND('Att. Dairy'!B6=\"\"),\"\",IF(AND(AV6=\"\",AW6=\"\"),\"\",SUM(AV6,AW6)))","v":{"v":367.08000000000004,"d":"367.08"}},{"$f":"IF(AND('Att. Dairy'!B6=\"\"),\"\",IF(AND(AF6=\"\"),\"\",BI6))","v":"lCthjksVh"},{"$nulls":6},{"$f":"IF(AND('Att. Dairy'!C6=\"\"),\"\",'Att. Dairy'!C6)","v":"Wheat"},{"$f":"IF(AND(BF6=\"\"),\"\",IF(BF6=\"Rice\",\"R\",IF(BF6=\"Wheat\",\"W\")))","v":"W"},{"$f":"IF(AND('Att. Dairy'!D6=\"\"),\"\",'Att. Dairy'!D6)","v":"Monday"},{"$f":"IF(OR(BH6=0,BH6=\"\"),\"\",IF(BH6=\"tuesday\",\"nkypkoy\",IF(BH6=\"thursday\",\"f[kpM+h\",IF(OR(BH6=\"monday\",BH6=\"saturday\"),\"lCthjksVh\",IF(OR(BH6=\"wednesday\",BH6=\"friday\"),\"nkyjksVh\",\"vodk'k\")))))","v":"lCthjksVh"},null,{"$f":"IF(AND(C6=BM$10),AV6,0)","v":{"v":157.08,"d":"157"}},{"$nulls":14},{"$f":"IF(OR(BH6=0,BH6=\"\"),\"\",IF(BH6=\"tuesday\",\"R\",IF(BH6=\"thursday\",\"R\",IF(OR(BH6=\"monday\",BH6=\"saturday\"),\"W\",IF(OR(BH6=\"wednesday\",BH6=\"friday\"),\"W\")))))","v":"W"},{"$f":"IF(AND(BF6=\"\"),BZ6,BG6)","v":"W"},{"$nulls":45},{"$f":"IF(AND(B6=\"\"),\"\",B6)","v":"2019-07-01"},{"$f":"C6","v":"YES"},{"$f":"D6","v":{"v":250,"d":"250.00"}},{"$f":"E6","v":{"v":150,"d":"150.00"}},{"$f":"F6+G6+H6","v":{"v":80,"d":"80.00"}},{"$f":"I6","v":{"v":0,"d":"0.00"}},{"$f":"J6","v":{"v":0,"d":"0.00"}},{"$f":"K6+L6+M6","v":{"v":0,"d":"0.00"}},{"$f":"X6","v":{"v":250,"d":"250.00"}},{"$f":"Y6","v":{"v":150,"d":"150.00"}},{"$f":"Z6+AA6+AB6","v":{"v":80,"d":"80.00"}},{"$f":"AC6","v":144},{"$f":"AD6","v":145},{"$f":"AF6","v":25},{"$f":"AG6","v":26},{"$f":"AI6","v":20},{"$f":"AJ6","v":20},{"$f":"AL6","v":{"v":5.1,"d":"5.10"}},{"$f":"AM6","v":"0"},{"$f":"AN6+AO6+AP6","v":1.02},{"$f":"AQ6","v":{"v":244.9,"d":"244.90"}},{"$f":"AR6","v":{"v":150,"d":"150.00"}},{"$f":"AS6+AT6+AU6","v":78.98},{"$f":"AV6","v":157.08},{"$f":"AW6","v":{"v":210,"d":"210.00"}},{"$f":"AY6","v":"lCthjksVh"}]
[2,{"$f":"IF(AND('Att. Dairy'!B7=\"\"),\"\",'Att. Dairy'!B7)","v":"2019-07-02"},"YES",{"$f":"IF(AND(AQ6=\"\"),\"\",AQ6)","v":{"v":244.9,"d":"244.900"}},{"$f":"IF(AND(AR6=\"\"),\"\",AR6)","v":{"v":150,"d":"150.000"}},{"$f":"IF(AND(AS6=\"\"),\"\",AS6)","v":{"v":39.49,"d":"39.490"}},19.745,19.745,{"$nulls":15},{"$f":"IF(AND(D7=\"\"),\"\",SUM(D7,I7,N7,S7))","v":{"v":244.9,"d":"244.900"}},{"$f":"IF(AND(E7=\"\"),\"\",SUM(E7,J7,O7,T7))","v":{"v":150,"d":"150.000"}},{"$f":"IF(AND(F7=\"\"),\"\",SUM(F7,K7,P7,U7))","v":{"v":39.49,"d":"39.490"}},{"$f":"IF(AND(G7=\"\"),\"\",SUM(G7,L7,Q7,V7))","v":19.745},{"$f":"IF(AND(H7=\"\"),\"\",SUM(H7,M7,R7,W7))","v":19.745},{"$f":"IF(AND('Att. Dairy'!O7=\"\"),\"\",'Att. Dairy'!O7)","v":144},{"$f":"IF(AND('Att. Dairy'!P7=\"\"),\"\",'Att. Dairy'!P7)","v":145},{"$f":"SUM(AC7,AD7)","v":289},{"$f":"IF(AND('Att. Dairy'!E7=\"\"),\"\",'Att. Dairy'!E7)","v":""},{"$f":"IF(AND('Att. Dairy'!F7=\"\"),\"\",'Att. Dairy'!F7)","v":""},{"$f":"SUM(AF7,AG7)","v":0},{"$f":"IF(AND('Att. Dairy'!I7=\"\"),\"\",'Att. Dairy'!I7)","v":33},{"$f":"IF(AND('Att. Dairy'!J7=\"\"),\"\",'Att. Dairy'!J7)","v":36},{"$f":"SUM(AI7,AJ7)","v":69},{"$f":"IF(AND(AH7=\"\"),\"0\",IF(AND(CA7=\"w\"),AH7*100/1000,\"0\"))","v":"0"},{"$f":"IF(AND(AH7=\"\"),\"0\",IF(AND(CA7=\"R\"),AH7*100/1000,\"0\"))","v":{"v":0,"d":"0.000"}},{"$f":"IF(AND(C7=\"YES\",AH7>0),AH7*0.01,0)","v":{"v":0,"d":"0.000"}},{"$f":"IF(AND(C7=\"YES\",AH7>0),AH7*0.005,0)","v":{"v":0,"d":"0.000"}},{"$f":"IF(AND(C7=\"YES\",AH7>0),AH7*0.005,0)","v":{"v":0,"d":"0.000"}},{"$f":"SUM(X7-AL7)","v":{"v":244.9,"d":"244.900"}},{"$f":"(Y7-AM7)","v":{"v":150,"d":"150.000"}},{"$f":"(Z7-AN7)","v":{"v":39.49,"d":"39.490"}},{"$f":"(AA7-AO7)","v":19.745},{"$f":"(AB7-AP7)","v":19.745},{"$f":"IF(AND('Att. Dairy'!B7=\"\"),\"\",IF(AND(AH7=\"\"),\"\",IF(AND(C7=\"YES\",AH7>0),AH7*$BB$1,AH7*$BC$1)))","v":{"v":0,"d":"0.00"}},{"$f":"IF(AND('Att. Dairy'!B7=\"\"),\"\",IF(AND(AK7=\"\"),\"\",AK7*$BD$1))","v":362.25},{"$f":"IF(AND('Att. Dairy'!B7=\"\"),\"\",IF(AND(AV7=\"\",AW7=\"\"),\"\",SUM(AV7,AW7)))","v":362.25},{"$f":"IF(AND('Att. Dairy'!B7=\"\"),\"\",IF(AND(AF7=\"\"),\"\",BI7))","v":""},{"$nulls":6},{"$f":"IF(AND('Att. Dairy'!C7=\"\"),\"\",'Att. Dairy'!C7)","v":""},{"$f":"IF(AND(BF7=\"\"),\"\",IF(BF7=\"Rice\",\"R\",IF(BF7=\"Wheat\",\"W\")))","v":""},{"$f":"IF(AND('Att. Dairy'!D7=\"\"),\"\",'Att. Dairy'!D7)","v":"Tuesday"},{"$f":"IF(OR(BH7=0,BH7=\"\"),\"\",IF(BH7=\"tuesday\",\"nkypkoy\",IF(BH7=\"thursday\",\"f[kpM+h\",IF(OR(BH7=\"monday\",BH7=\"saturday\"),\"lCthjksVh\",IF(OR(BH7=\"wednesday\",BH7=\"friday\"),\"nkyjksVh\",\"vodk'k\")))))","v":"nkypkoy"},null,{"$f":"IF(AND(C7=BM$10),AV7,0)","v":0},{"$nulls":14},{"$f":"IF(OR(BH7=0,BH7=\"\"),\"\",IF(BH7=\"tuesday\",\"R\",IF(BH7=\"thursday\",\"R\",IF(OR(BH7=\"monday\",BH7=\"saturday\"),\"W\",IF(OR(BH7=\"wednesday\",BH7=\"friday\"),\"W\")))))","v":"R"},{"$f":"IF(AND(BF7=\"\"),BZ7,BG7)","v":"R"},{"$nulls":45},{"$f":"IF(AND(B7=\"\"),\"\",B7)","v":"2019-07-02"},{"$f":"C7","v":"YES"},{"$f":"D7","v":{"v":244.9,"d":"244.90"}},{"$f":"E7","v":{"v":150,"d":"150.00"}},{"$f":"F7+G7+H7","v":78.98},{"$f":"I7","v":{"v":0,"d":"0.00"}},{"$f":"J7","v":{"v":0,"d":"0.00"}},{"$f":"K7+L7+M7","v":{"v":0,"d":"0.00"}},{"$f":"X7","v":{"v":244.9,"d":"244.90"}},{"$f":"Y7","v":{"v":150,"d":"150.00"}},{"$f":"Z7+AA7+AB7","v":78.98},{"$f":"AC7","v":144},{"$f":"AD7","v":145},{"$f":"AF7","v":""},{"$f":"AG7","v":""},{"$f":"AI7","v":33},{"$f":"AJ7","v":36},{"$f":"AL7","v":"0"},{"$f":"AM7","v":{"v":0,"d":"0.00"}},{"$f":"AN7+AO7+AP7","v":{"v":0,"d":"0.00"}},{"$f":"AQ7","v":{"v":244.9,"d":"244.90"}},{"$f":"AR7","v":{"v":150,"d":"150.00"}},{"$f":"AS7+AT7+AU7","v":78.98},{"$f":"AV7","v":{"v":0,"d":"0.00"}},{"$f":"AW7","v":362.25},{"$f":"AY7","v":""}]
[3,{"$f":"IF(AND('Att. Dairy'!B8=\"\"),\"\",'Att. Dairy'!B8)","v":"2019-07-03"},"YES",{"$f":"IF(AND(AQ7=\"\"),\"\",AQ7)","v":{"v":244.9,"d":"244.900"}},{"$f":"IF(AND(AR7=\"\"),\"\",AR7)","v":{"v":150,"d":"150.000"}},{"$f":"IF(AND(AS7=\"\"),\"\",AS7)","v":{"v":39.49,"d":"39.490"}},{"$f":"IF(AND(AT7=\"\"),\"\",AT7)","v":19.745},{"$f":"IF(AND(AU7=\"\"),\"\",AU7)","v":19.745},{"$nulls":15},{"v":244.9,"d":"244.900"},{"v":150,"d":"150.000"},{"v":39.49,"d":"39.490"},19.745,19.745,{"$f":"IF(AND('Att. Dairy'!O8=\"\"),\"\",'Att. Dairy'!O8)","v":144},{"$f":"IF(AND('Att. Dairy'!P8=\"\"),\"\",'Att. Dairy'!P8)","v":145},289,{"$f":"IF(AND('Att. Dairy'!E8=\"\"),\"\",'Att. Dairy'!E8)","v":""},{"$f":"IF(AND('Att. Dairy'!F8=\"\"),\"\",'Att. Dairy'!F8)","v":""},0,{"$f":"IF(AND('Att. Dairy'!I8=\"\"),\"\",'Att. Dairy'!I8)","v":32},{"$f":"IF(AND('Att. Dairy'!J8=\"\"),\"\",'Att. Dairy'!J8)","v":36},68,{"v":0,"d":"0.000"},"0",{"v":0,"d":"0.000"},{"v":0,"d":"0.000"},{"v":0,"d":"0.000"},{"v":244.9,"d":"244.900"},{"v":150,"d":"150.000"},{"v":39.49,"d":"39.490"},19.745,19.745,{"$f":"IF(AND('Att. Dairy'!B8=\"\"),\"\",IF(AND(AH8=\"\"),\"\",IF(AND(C8=\"YES\",AH8>0),AH8*$BB$1,AH8*$BC$1)))","v":{"v":0,"d":"0.00"}},{"$f":"IF(AND('Att. Dairy'!B8=\"\"),\"\",IF(AND(AK8=\"\"),\"\",AK8*$BD$1))","v":{"v":357,"d":"357.00"}},{"$f":"IF(AND('Att. Dairy'!B8=\"\"),\"\",IF(AND(AV8=\"\",AW8=\"\"),\"\",SUM(AV8,AW8)))","v":{"v":357,"d":"357.00"}},{"$f":"IF(AND('Att. Dairy'!B8=\"\"),\"\",IF(AND(AF8=\"\"),\"\",BI8))","v":""},{"$nulls":6},{"$f":"IF(AND('Att. Dairy'!C8=\"\"),\"\",'Att. Dairy'!C8)","v":""},"",{"$f":"IF(AND('Att. Dairy'!D8=\"\"),\"\",'Att. Dairy'!D8)","v":"Wednesday"},"nkyjksVh",null,0,{"$nulls":14},"W","W",{"$nulls":45},"2019-07-03","YES",{"v":244.9,"d":"244.90"},{"v":150,"d":"150.00"},78.98,{"v":0,"d":"0.00"},{"v":0,"d":"0.00"},{"v":0,"d":"0.00"},{"v":244.9,"d":"244.90"},{"v":150,"d":"150.00"},78.98,144,145,"","",32,36,{"v":0,"d":"0.00"},"0",{"v":0,"d":"0.00"},{"v":244.9,"d":"244.90"},{"v":150,"d":"150.00"},78.98,{"v":0,"d":"0.00"},{"v":357,"d":"357.00"},""]
[4,{"$f":"IF(AND('Att. Dairy'!B9=\"\"),\"\",'Att. Dairy'!B9)","v":"2019-07-04"},"YES",{"v":244.9,"d":"244.900"},{"v":150,"d":"150.000"},{"v":39.49,"d":"39.490"},19.745,19.745,{"$nulls":15},{"v":244.9,"d":"244.900"},{"v":150,"d":"150.000"},{"v":39.49,"d":"39.490"},19.745,19.745,{"$f":"IF(AND('Att. Dairy'!O9=\"\"),\"\",'Att. Dairy'!O9)","v":144},{"$f":"IF(AND('Att. Dairy'!P9=\"\"),\"\",'Att. Dairy'!P9)","v":145},289,{"$f":"IF(AND('Att. Dairy'!E9=\"\"),\"\",'Att. Dairy'!E9)","v":44},{"$f":"IF(AND('Att. Dairy'!F9=\"\"),\"\",'Att. Dairy'!F9)","v":45},89,{"$f":"IF(AND('Att. Dairy'!I9=\"\"),\"\",'Att. Dairy'!I9)","v":35},{"$f":"IF(AND('Att. Dairy'!J9=\"\"),\"\",'Att. Dairy'!J9)","v":36},71,"0",{"v":8.9,"d":"8.900"},{"v":0.89,"d":"0.890"},0.445,0.445,{"v":244.9,"d":"244.900"},{"v":141.1,"d":"141.100"},{"v":38.6,"d":"38.600"},{"v":19.3,"d":"19.300"},{"v":19.3,"d":"19.300"},{"$f":"IF(AND('Att. Dairy'!B9=\"\"),\"\",IF(AND(AH9=\"\"),\"\",IF(AND(C9=\"YES\",AH9>0),AH9*$BB$1,AH9*$BC$1)))","v":274.12},{"$f":"IF(AND('Att. Dairy'!B9=\"\"),\"\",IF(AND(AK9=\"\"),\"\",AK9*$BD$1))","v":372.75},{"$f":"IF(AND('Att. Dairy'!B9=\"\"),\"\",IF(AND(AV9=\"\",AW9=\"\"),\"\",SUM(AV9,AW9)))","v":646.87},{"$f":"IF(AND('Att. Dairy'!B9=\"\"),\"\",IF(AND(AF9=\"\"),\"\",BI9))","v":"f[kpM+h"},{"$nulls":6},{"$f":"IF(AND('Att. Dairy'!C9=\"\"),\"\",'Att. Dairy'!C9)","v":""},"",{"$f":"IF(AND('Att. Dairy'!D9=\"\"),\"\",'Att. Dairy'!D9)","v":"Thursday"},"f[kpM+h",null,{"v":274.12,"d":"274"},{"$nulls":14},"R","R",{"$nulls":45},"2019-07-04","YES",{"v":244.9,"d":"244.90"},{"v":150,"d":"150.00"},78.98,{"v":0,"d":"0.00"},{"v":0,"d":"0.00"},{"v":0,"d":"0.00"},{"v":244.9,"d":"244.90"},{"v":150,"d":"150.00"},78.98,144,145,44,45,35,36,"0",{"v":8.9,"d":"8.90"},1.78,{"v":244.9,"d":"244.90"},{"v":141.1,"d":"141.10"},{"v":77.2,"d":"77.20"},274.12,372.75,"f[kpM+h"]
[5,{"$f":"IF(AND('Att. Dairy'!B10=\"\"),\"\",'Att. Dairy'!B10)","v":"2019-07-05"},"NO",{"v":244.9,"d":"244.900"},{"v":141.1,"d":"141.100"},{"v":38.6,"d":"38.600"},{"v":19.3,"d":"19.300"},{"v":19.3,"d":"19.300"},{"$nulls":15},{"v":244.9,"d":"244.900"},{"v":141.1,"d":"141.100"},{"v":38.6,"d":"38.600"},{"v":19.3,"d":"19.300"},{"v":19.3,"d":"19.300"},{"$f":"IF(AND('Att. Dairy'!O10=\"\"),\"\",'Att. Dairy'!O10)","v":144},{"$f":"IF(AND('Att. Dairy'!P10=\"\"),\"\",'Att. Dairy'!P10)","v":145},289,{"$f":"IF(AND('Att. Dairy'!E10=\"\"),\"\",'Att. Dairy'!E10)","v":""},{"$f":"IF(AND('Att. Dairy'!F10=\"\"),\"\",'Att. Dairy'!F10)","v":""},0,{"$f":"IF(AND('Att. Dairy'!I10=\"\"),\"\",'Att. Dairy'!I10)","v":88},{"$f":"IF(AND('Att. Dairy'!J10=\"\"),\"\",'Att. Dairy'!J10)","v":95},183,{"v":0,"d":"0.000"},"0",{"v":0,"d":"0.000"},{"v":0,"d":"0.000"},{"v":0,"d":"0.000"},{"v":244.9,"d":"244.900"},{"v":141.1,"d":"141.100"},{"v":38.6,"d":"38.600"},{"v":19.3,"d":"19.300"},{"v":19.3,"d":"19.300"},{"$f":"IF(AND('Att. Dairy'!B10=\"\"),\"\",IF(AND(AH10=\"\"),\"\",IF(AND(C10=\"YES\",AH10>0),AH10*$BB$1,AH10*$BC$1)))","v":{"v":0,"d":"0.00"}},{"$f":"IF(AND('Att. Dairy'!B10=\"\"),\"\",IF(AND(AK10=\"\"),\"\",AK10*$BD$1))","v":960.75},{"$f":"IF(AND('Att. Dairy'!B10=\"\"),\"\",IF(AND(AV10=\"\",AW10=\"\"),\"\",SUM(AV10,AW10)))","v":960.75},{"$f":"IF(AND('Att. Dairy'!B10=\"\"),\"\",IF(AND(AF10=\"\"),\"\",BI10))","v":""},{"$nulls":6},{"$f":"IF(AND('Att. Dairy'!C10=\"\"),\"\",'Att. Dairy'!C10)","v":""},"",{"$f":"IF(AND('Att. Dairy'!D10=\"\"),\"\",'Att. Dairy'!D10)","v":"Friday"},"nkyjksVh",null,0,null,"YES",{"$nulls":12},"W","W",{"$nulls":45},"2019-07-05","NO",{"v":244.9,"d":"244.90"},{"v":141.1,"d":"141.10"},{"v":77.2,"d":"77.20"},{"v":0,"d":"0.00"},{"v":0,"d":"0.00"},{"v":0,"d":"0.00"},{"v":244.9,"d":"244.90"},{"v":141.1,"d":"141.10"},{"v":77.2,"d":"77.20"},144,145,"","",88,95,{"v":0,"d":"0.00"},"0",{"v":0,"d":"0.00"},{"v":244.9,"d":"244.90"},{"v":141.1,"d":"141.10"},{"v":77.2,"d":"77.20"},{"v":0,"d":"0.00"},960.75,""]
[6,{"$f":"IF(AND('Att. Dairy'!B11=\"\"),\"\",'Att. Dairy'!B11)","v":"2019-07-06"},null,{"v":244.9,"d":"244.900"},{"v":141.1,"d":"141.100"},{"v":38.6,"d":"38.600"},{"v":19.3,"d":"19.300"},{"v":19.3,"d":"19.300"},{"$nulls":15},{"v":244.9,"d":"244.900"},{"v":141.1,"d":"141.100"},{"v":38.6,"d":"38.600"},{"v":19.3,"d":"19.300"},{"v":19.3,"d":"19.300"},{"$f":"IF(AND('Att. Dairy'!O11=\"\"),\"\",'Att. Dairy'!O11)","v":144},{"$f":"IF(AND('Att. Dairy'!P11=\"\"),\"\",'Att. Dairy'!P11)","v":145},289,{"$f":"IF(AND('Att. Dairy'!E11=\"\"),\"\",'Att. Dairy'!E11)","v":63},{"$f":"IF(AND('Att. Dairy'!F11=\"\"),\"\",'Att. Dairy'!F11)","v":64},127,{"$f":"IF(AND('Att. Dairy'!I11=\"\"),\"\",'Att. Dairy'!I11)","v":""},{"$f":"IF(AND('Att. Dairy'!J11=\"\"),\"\",'Att. Dairy'!J11)","v":""},0,{"v":12.7,"d":"12.700"},"0",{"v":0,"d":"0.000"},{"v":0,"d":"0.000"},{"v":0,"d":"0.000"},{"v":232.20000000000002,"d":"232.200"},{"v":141.1,"d":"141.100"},{"v":38.6,"d":"38.600"},{"v":19.3,"d":"19.300"},{"v":19.3,"d":"19.300"},{"$f":"IF(AND('Att. Dairy'!B11=\"\"),\"\",IF(AND(AH11=\"\"),\"\",IF(AND(C11=\"YES\",AH11>0),AH11*$BB$1,AH11*$BC$1)))","v":{"v":552.4499999999999,"d":"552.45"}},{"$f":"IF(AND('Att. Dairy'!B11=\"\"),\"\",IF(AND(AK11=\"\"),\"\",AK11*$BD$1))","v":{"v":0,"d":"0.00"}},{"$f":"IF(AND('Att. Dairy'!B11=\"\"),\"\",IF(AND(AV11=\"\",AW11=\"\"),\"\",SUM(AV11,AW11)))","v":{"v":552.4499999999999,"d":"552.45"}},{"$f":"IF(AND('Att. Dairy'!B11=\"\"),\"\",IF(AND(AF11=\"\"),\"\",BI11))","v":"lCthjksVh"},{"$nulls":6},{"$f":"IF(AND('Att. Dairy'!C11=\"\"),\"\",'Att. Dairy'!C11)","v":""},"",{"$f":"IF(AND('Att. Dairy'!D11=\"\"),\"\",'Att. Dairy'!D11)","v":"Saturday"},"lCthjksVh",null,0,null,"NO",{"$nulls":12},"W","W",{"$nulls":45},"2019-07-06",0,{"v":244.9,"d":"244.90"},{"v":141.1,"d":"141.10"},{"v":77.2,"d":"77.20"},{"v":0,"d":"0.00"},{"v":0,"d":"0.00"},{"v":0,"d":"0.00"},{"v":244.9,"d":"244.90"},{"v":141.1,"d":"141.10"},{"v":77.2,"d":"77.20"},144,145,63,64,"","",{"v":12.7,"d":"12.70"},"0",{"v":0,"d":"0.00"},{"v":232.20000000000002,"d":"232.20"},{"v":141.1,"d":"141.10"},{"v":77.2,"d":"77.20"},{"v":552.4499999999999,"d":"552.45"},{"v":0,"d":"0.00"},"lCthjksVh"]
[7,{"$f":"IF(AND('Att. Dairy'!B12=\"\"),\"\",'Att. Dairy'!B12)","v":"2019-07-07"},null,{"v":232.20000000000002,"d":"232.200"},{"v":141.1,"d":"141.100"},{"v":38.6,"d":"38.600"},{"v":19.3,"d":"19.300"},{"v":19.3,"d":"19.300"},{"$nulls":15},{"v":232.20000000000002,"d":"232.200"},{"v":141.1,"d":"141.100"},{"v":38.6,"d":"38.600"},{"v":19.3,"d":"19.300"},{"v":19.3,"d":"19.300"},{"$f":"IF(AND('Att. Dairy'!O12=\"\"),\"\",'Att. Dairy'!O12)","v":""},{"$f":"IF(AND('Att. Dairy'!P12=\"\"),\"\",'Att. Dairy'!P12)","v":""},0,{"$f":"IF(AND('Att. Dairy'!E12=\"\"),\"\",'Att. Dairy'!E12)","v":""},{"$f":"IF(AND('Att. Dairy'!F12=\"\"),\"\",'Att. Dairy'!F12)","v":""},0,{"$f":"IF(AND('Att. Dairy'!I12=\"\"),\"\",'Att. Dairy'!I12)","v":""},{"$f":"IF(AND('Att. Dairy'!J12=\"\"),\"\",'Att. Dairy'!J12)","v":""},0,"0","0",{"v":0,"d":"0.000"},{"v":0,"d":"0.000"},{"v":0,"d":"0.000"},{"v":232.20000000000002,"d":"232.200"},{"v":141.1,"d":"141.100"},{"v":38.6,"d":"38.600"},{"v":19.3,"d":"19.300"},{"v":19.3,"d":"19.300"},{"$f":"IF(AND('Att. Dairy'!B12=\"\"),\"\",IF(AND(AH12=\"\"),\"\",IF(AND(C12=\"YES\",AH12>0),AH12*$BB$1,AH12*$BC$1)))","v":{"v":0,"d":"0.00"}},{"$f":"IF(AND('Att. Dairy'!B12=\"\"),\"\",IF(AND(AK12=\"\"),\"\",AK12*$BD$1))","v":{"v":0,"d":"0.00"}},{"$f":"IF(AND('Att. Dairy'!B12=\"\"),\"\",IF(AND(AV12=\"\",AW12=\"\"),\"\",SUM(AV12,AW12)))","v":{"v":0,"d":"0.00"}},{"$f":"IF(AND('Att. Dairy'!B12=\"\"),\"\",IF(AND(AF12=\"\"),\"\",BI12))","v":""},{"$nulls":6},{"$f":"IF(AND('Att. Dairy'!C12=\"\"),\"\",'Att. Dairy'!C12)","v":""},"",{"$f":"IF(AND('Att. Dairy'!D12=\"\"),\"\",'Att. Dairy'!D12)","v":"Sunday"},"vodk'k",null,0,{"$nulls":14},false,false,{"$nulls":45},"2019-07-07",0,{"v":232.20000000000002,"d":"232.20"},{"v":141.1,"d":"141.10"},{"v":77.2,"d":"77.20"},{"v":0,"d":"0.00"},{"v":0,"d":"0.00"},{"v":0,"d":"0.00"},{"v":232.20000000000002,"d":"232.20"},{"v":141.1,"d":"141.10"},{"v":77.2,"d":"77.20"},"","","","","","","0","0",{"v":0,"d":"0.00"},{"v":232.20000000000002,"d":"232.20"},{"v":141.1,"d":"141.10"},{"v":77.2,"d":"77.20"},{"v":0,"d":"0.00"},{"v":0,"d":"0.00"},""]
[8,{"$f":"IF(AND('Att. Dairy'!B13=\"\"),\"\",'Att. Dairy'!B13)","v":"2019-07-08"},null,{"v":232.20000000000002,"d":"232.200"},{"v":141.1,"d":"141.100"},{"v":38.6,"d":"38.600"},{"v":19.3,"d":"19.300"},{"v":19.3,"d":"19.300"},{"$nulls":15},{"v":232.20000000000002,"d":"232.200"},{"v":141.1,"d":"141.100"},{"v":38.6,"d":"38.600"},{"v":19.3,"d":"19.300"},{"v":19.3,"d":"19.300"},{"$f":"IF(AND('Att. Dairy'!O13=\"\"),\"\",'Att. Dairy'!O13)","v":144},{"$f":"IF(AND('Att. Dairy'!P13=\"\"),\"\",'Att. Dairy'!P13)","v":145},289,{"$f":"IF(AND('Att. Dairy'!E13=\"\"),\"\",'Att. Dairy'!E13)","v":66},{"$f":"IF(AND('Att. Dairy'!F13=\"\"),\"\",'Att. Dairy'!F13)","v":67},133,{"$f":"IF(AND('Att. Dairy'!I13=\"\"),\"\",'Att. Dairy'!I13)","v":""},{"$f":"IF(AND('Att. Dairy'!J13=\"\"),\"\",'Att. Dairy'!J13)","v":""},0,{"v":13.3,"d":"13.300"},"0",{"v":0,"d":"0.000"},{"v":0,"d":"0.000"},{"v":0,"d":"0.000"},{"v":218.9,"d":"218.900"},{"v":141.1,"d":"141.100"},{"v":38.6,"d":"38.600"},{"v":19.3,"d":"19.300"},{"v":19.3,"d":"19.300"},{"$f":"IF(AND('Att. Dairy'!B13=\"\"),\"\",IF(AND(AH13=\"\"),\"\",IF(AND(C13=\"YES\",AH13>0),AH13*$BB$1,AH13*$BC$1)))","v":578.55},{"$f":"IF(AND('Att. Dairy'!B13=\"\"),\"\",IF(AND(AK13=\"\"),\"\",AK13*$BD$1))","v":{"v":0,"d":"0.00"}},{"$f":"IF(AND('Att. Dairy'!B13=\"\"),\"\",IF(AND(AV13=\"\",AW13=\"\"),\"\",SUM(AV13,AW13)))","v":578.55},{"$f":"IF(AND('Att. Dairy'!B13=\"\"),\"\",IF(AND(AF13=\"\"),\"\",BI13))","v":"lCthjksVh"},{"$nulls":6},{"$f":"IF(AND('Att. Dairy'!C13=\"\"),\"\",'Att. Dairy'!C13)","v":""},"",{"$f":"IF(AND('Att. Dairy'!D13=\"\"),\"\",'Att. Dairy'!D13)","v":"Monday"},"lCthjksVh",null,0,{"$nulls":14},"W","W",{"$nulls":45},"2019-07-08",0,{"v":232.20000000000002,"d":"232.20"},{"v":141.1,"d":"141.10"},{"v":77.2,"d":"77.20"},{"v":0,"d":"0.00"},{"v":0,"d":"0.00"},{"v":0,"d":"0.00"},{"v":232.20000000000002,"d":"232.20"},{"v":141.1,"d":"141.10"},{"v":77.2,"d":"77.20"},144,145,66,67,"","",{"v":13.3,"d":"13.30"},"0",{"v":0,"d":"0.00"},{"v":218.9,"d":"218.90"},{"v":141.1,"d":"141.10"},{"v":77.2,"d":"77.20"},578.55,{"v":0,"d":"0.00"},"lCthjksVh"]
[9,{"$f":"IF(AND('Att. Dairy'!B14=\"\"),\"\",'Att. Dairy'!B14)","v":"2019-07-09"},null,{"v":218.9,"d":"218.900"},{"v":141.1,"d":"141.100"},{"v":38.6,"d":"38.600"},{"v":19.3,"d":"19.300"},{"v":19.3,"d":"19.300"},{"$nulls":15},{"v":218.9,"d":"218.900"},{"v":141.1,"d":"141.100"},{"v":38.6,"d":"38.600"},{"v":19.3,"d":"19.300"},{"v":19.3,"d":"19.300"},{"$f":"IF(AND('Att. Dairy'!O14=\"\"),\"\",'Att. Dairy'!O14)","v":""},{"$f":"IF(AND('Att. Dairy'!P14=\"\"),\"\",'Att. Dairy'!P14)","v":""},0,{"$f":"IF(AND('Att. Dairy'!E14=\"\"),\"\",'Att. Dairy'!E14)","v":""},{"$f":"IF(AND('Att. Dairy'!F14=\"\"),\"\",'Att. Dairy'!F14)","v":""},0,{"$f":"IF(AND('Att. Dairy'!I14=\"\"),\"\",'Att. Dairy'!I14)","v":""},{"$f":"IF(AND('Att. Dairy'!J14=\"\"),\"\",'Att. Dairy'!J14)","v":""},0,"0",{"v":0,"d":"0.000"},{"v":0,"d":"0.000"},{"v":0,"d":"0.000"},{"v":0,"d":"0.000"},{"v":218.9,"d":"218.900"},{"v":141.1,"d":"141.100"},{"v":38.6,"d":"38.600"},{"v":19.3,"d":"19.300"},{"v":19.3,"d":"19.300"},{"$f":"IF(AND('Att. Dairy'!B14=\"\"),\"\",IF(AND(AH14=\"\"),\"\",IF(AND(C14=\"YES\",AH14>0),AH14*$BB$1,AH14*$BC$1)))","v":{"v":0,"d":"0.00"}},{"$f":"IF(AND('Att. Dairy'!B14=\"\"),\"\",IF(AND(AK14=\"\"),\"\",AK14*$BD$1))","v":{"v":0,"d":"0.00"}},{"$f":"IF(AND('Att. Dairy'!B14=\"\"),\"\",IF(AND(AV14=\"\",AW14=\"\"),\"\",SUM(AV14,AW14)))","v":{"v":0,"d":"0.00"}},{"$f":"IF(AND('Att. Dairy'!B14=\"\"),\"\",IF(AND(AF14=\"\"),\"\",BI14))","v":""},{"$nulls":6},{"$f":"IF(AND('Att. Dairy'!C14=\"\"),\"\",'Att. Dairy'!C14)","v":""},"",{"$f":"IF(AND('Att. Dairy'!D14=\"\"),\"\",'Att. Dairy'!D14)","v":"Tuesday"},"nkypkoy",null,0,{"$nulls":14},"R","R",{"$nulls":45},"2019-07-09",0,{"v":218.9,"d":"218.90"},{"v":141.1,"d":"141.10"},{"v":77.2,"d":"77.20"},{"v":0,"d":"0.00"},{"v":0,"d":"0.00"},{"v":0,"d":"0.00"},{"v":218.9,"d":"218.90"},{"v":141.1,"d":"141.10"},{"v":77.2,"d":"77.20"},"","","","","","","0",{"v":0,"d":"0.00"},{"v":0,"d":"0.00"},{"v":218.9,"d":"218.90"},{"v":141.1,"d":"141.10"},{"v":77.2,"d":"77.20"},{"v":0,"d":"0.00"},{"v":0,"d":"0.00"},""]
[10,{"$f":"IF(AND('Att. Dairy'!B15=\"\"),\"\",'Att. Dairy'!B15)","v":"2019-07-10"},null,{"v":218.9,"d":"218.900"},{"v":141.1,"d":"141.100"},{"v":38.6,"d":"38.600"},{"v":19.3,"d":"19.300"},{"v":19.3,"d":"19.300"},{"$nulls":15},{"$f":"IF(AND(D15=\"\"),\"\",SUM(D15,I15,N15,S15))","v":{"v":218.9,"d":"218.900"}},{"v":141.1,"d":"141.100"},{"v":38.6,"d":"38.600"},{"v":19.3,"d":"19.300"},{"v":19.3,"d":"19.300"},{"$f":"IF(AND('Att. Dairy'!O15=\"\"),\"\",'Att. Dairy'!O15)","v":""},{"$f":"IF(AND('Att. Dairy'!P15=\"\"),\"\",'Att. Dairy'!P15)","v":""},0,{"$f":"IF(AND('Att. Dairy'!E15=\"\"),\"\",'Att. Dairy'!E15)","v":""},{"$f":"IF(AND('Att. Dairy'!F15=\"\"),\"\",'Att. Dairy'!F15)","v":""},0,{"$f":"IF(AND('Att. Dairy'!I15=\"\"),\"\",'Att. Dairy'!I15)","v":""},{"$f":"IF(AND('Att. Dairy'!J15=\"\"),\"\",'Att. Dairy'!J15)","v":""},0,{"v":0,"d":"0.000"},"0",{"v":0,"d":"0.000"},{"v":0,"d":"0.000"},{"v":0,"d":"0.000"},{"v":218.9,"d":"218.900"},{"v":141.1,"d":"141.100"},{"v":38.6,"d":"38.600"},{"v":19.3,"d":"19.300"},{"v":19.3,"d":"19.300"},{"$f":"IF(AND('Att. Dairy'!B15=\"\"),\"\",IF(AND(AH15=\"\"),\"\",IF(AND(C15=\"YES\",AH15>0),AH15*$BB$1,AH15*$BC$1)))","v":{"v":0,"d":"0.00"}},{"$f":"IF(AND('Att. Dairy'!B15=\"\"),\"\",IF(AND(AK15=\"\"),\"\",AK15*$BD$1))","v":{"v":0,"d":"0.00"}},{"$f":"IF(AND('Att. Dairy'!B15=\"\"),\"\",IF(AND(AV15=\"\",AW15=\"\"),\"\",SUM(AV15,AW15)))","v":{"v":0,"d":"0.00"}},{"$f":"IF(AND('Att. Dairy'!B15=\"\"),\"\",IF(AND(AF15=\"\"),\"\",BI15))","v":""},{"$nulls":6},{"$f":"IF(AND('Att. Dairy'!C15=\"\"),\"\",'Att. Dairy'!C15)","v":""},"",{"$f":"IF(AND('Att. Dairy'!D15=\"\"),\"\",'Att. Dairy'!D15)","v":"Wednesday"},"nkyjksVh",null,0,{"$nulls":14},"W","W",{"$nulls":45},"2019-07-10",0,{"v":218.9,"d":"218.90"},{"v":141.1,"d":"141.10"},{"v":77.2,"d":"77.20"},{"v":0,"d":"0.00"},{"v":0,"d":"0.00"},{"v":0,"d":"0.00"},{"v":218.9,"d":"218.90"},{"v":141.1,"d":"141.10"},{"v":77.2,"d":"77.20"},"","","","","","",{"v":0,"d":"0.00"},"0",{"v":0,"d":"0.00"},{"v":218.9,"d":"218.90"},{"v":141.1,"d":"141.10"},{"v":77.2,"d":"77.20"},{"v":0,"d":"0.00"},{"v":0,"d":"0.00"},""]
[11,{"$f":"IF(AND('Att. Dairy'!B16=\"\"),\"\",'Att. Dairy'!B16)","v":"2019-07-11"},null,{"v":218.9,"d":"218.900"},{"v":141.1,"d":"141.100"},{"v":38.6,"d":"38.600"},{"v":19.3,"d":"19.300"},{"v":19.3,"d":"19.300"},{"$nulls":15},{"v":218.9,"d":"218.900"},{"v":141.1,"d":"141.100"},{"v":38.6,"d":"38.600"},{"v":19.3,"d":"19.300"},{"v":19.3,"d":"19.300"},{"$f":"IF(AND('Att. Dairy'!O16=\"\"),\"\",'Att. Dairy'!O16)","v":""},{"$f":"IF(AND('Att. Dairy'!P16=\"\"),\"\",'Att. Dairy'!P16)","v":""},0,{"$f":"IF(AND('Att. Dairy'!E16=\"\"),\"\",'Att. Dairy'!E16)","v":""},{"$f":"IF(AND('Att. Dairy'!F16=\"\"),\"\",'Att. Dairy'!F16)","v":""},0,{"$f":"IF(AND('Att. Dairy'!I16=\"\"),\"\",'Att. Dairy'!I16)","v":""},{"$f":"IF(AND('Att. Dairy'!J16=\"\"),\"\",'Att. Dairy'!J16)","v":""},0,"0",{"v":0,"d":"0.000"},{"v":0,"d":"0.000"},{"v":0,"d":"0.000"},{"v":0,"d":"0.000"},{"v":218.9,"d":"218.900"},{"v":141.1,"d":"141.100"},{"v":38.6,"d":"38.600"},{"v":19.3,"d":"19.300"},{"v":19.3,"d":"19.300"},{"$f":"IF(AND('Att. Dairy'!B16=\"\"),\"\",IF(AND(AH16=\"\"),\"\",IF(AND(C16=\"YES\",AH16>0),AH16*$BB$1,AH16*$BC$1)))","v":{"v":0,"d":"0.00"}},{"$f":"IF(AND('Att. Dairy'!B16=\"\"),\"\",IF(AND(AK16=\"\"),\"\",AK16*$BD$1))","v":{"v":0,"d":"0.00"}},{"$f":"IF(AND('Att. Dairy'!B16=\"\"),\"\",IF(AND(AV16=\"\",AW16=\"\"),\"\",SUM(AV16,AW16)))","v":{"v":0,"d":"0.00"}},{"$f":"IF(AND('Att. Dairy'!B16=\"\"),\"\",IF(AND(AF16=\"\"),\"\",BI16))","v":""},{"$nulls":6},{"$f":"IF(AND('Att. Dairy'!C16=\"\"),\"\",'Att. Dairy'!C16)","v":""},"",{"$f":"IF(AND('Att. Dairy'!D16=\"\"),\"\",'Att. Dairy'!D16)","v":"Thursday"},"f[kpM+h",null,0,{"$nulls":14},"R","R",{"$nulls":45},"2019-07-11",0,{"v":218.9,"d":"218.90"},{"v":141.1,"d":"141.10"},{"v":77.2,"d":"77.20"},{"v":0,"d":"0.00"},{"v":0,"d":"0.00"},{"v":0,"d":"0.00"},{"v":218.9,"d":"218.90"},{"v":141.1,"d":"141.10"},{"v":77.2,"d":"77.20"},"","","","","","","0",{"v":0,"d":"0.00"},{"v":0,"d":"0.00"},{"v":218.9,"d":"218.90"},{"v":141.1,"d":"141.10"},{"v":77.2,"d":"77.20"},{"v":0,"d":"0.00"},{"v":0,"d":"0.00"},""]
[12,{"$f":"IF(AND('Att. Dairy'!B17=\"\"),\"\",'Att. Dairy'!B17)","v":"2019-07-12"},null,{"v":218.9,"d":"218.900"},{"v":141.1,"d":"141.100"},{"v":38.6,"d":"38.600"},{"v":19.3,"d":"19.300"},{"v":19.3,"d":"19.300"},{"$nulls":15},{"v":218.9,"d":"218.900"},{"v":141.1,"d":"141.100"},{"v":38.6,"d":"38.600"},{"v":19.3,"d":"19.300"},{"v":19.3,"d":"19.300"},{"$f":"IF(AND('Att. Dairy'!O17=\"\"),\"\",'Att. Dairy'!O17)","v":""},{"$f":"IF(AND('Att. Dairy'!P17=\"\"),\"\",'Att. Dairy'!P17)","v":""},0,{"$f":"IF(AND('Att. Dairy'!E17=\"\"),\"\",'Att. Dairy'!E17)","v":""},{"$f":"IF(AND('Att. Dairy'!F17=\"\"),\"\",'Att. Dairy'!F17)","v":""},0,{"$f":"IF(AND('Att. Dairy'!I17=\"\"),\"\",'Att. Dairy'!I17)","v":""},{"$f":"IF(AND('Att. Dairy'!J17=\"\"),\"\",'Att. Dairy'!J17)","v":""},0,{"v":0,"d":"0.000"},"0",{"v":0,"d":"0.000"},{"v":0,"d":"0.000"},{"v":0,"d":"0.000"},{"v":218.9,"d":"218.900"},{"v":141.1,"d":"141.100"},{"v":38.6,"d":"38.600"},{"v":19.3,"d":"19.300"},{"v":19.3,"d":"19.300"},{"$f":"IF(AND('Att. Dairy'!B17=\"\"),\"\",IF(AND(AH17=\"\"),\"\",IF(AND(C17=\"YES\",AH17>0),AH17*$BB$1,AH17*$BC$1)))","v":{"v":0,"d":"0.00"}},{"$f":"IF(AND('Att. Dairy'!B17=\"\"),\"\",IF(AND(AK17=\"\"),\"\",AK17*$BD$1))","v":{"v":0,"d":"0.00"}},{"$f":"IF(AND('Att. Dairy'!B17=\"\"),\"\",IF(AND(AV17=\"\",AW17=\"\"),\"\",SUM(AV17,AW17)))","v":{"v":0,"d":"0.00"}},{"$f":"IF(AND('Att. Dairy'!B17=\"\"),\"\",IF(AND(AF17=\"\"),\"\",BI17))","v":""},{"$nulls":6},{"$f":"IF(AND('Att. Dairy'!C17=\"\"),\"\",'Att. Dairy'!C17)","v":""},"",{"$f":"IF(AND('Att. Dairy'!D17=\"\"),\"\",'Att. Dairy'!D17)","v":"Friday"},"nkyjksVh",null,0,{"$nulls":14},"W","W",{"$nulls":45},"2019-07-12",0,{"v":218.9,"d":"218.90"},{"v":141.1,"d":"141.10"},{"v":77.2,"d":"77.20"},{"v":0,"d":"0.00"},{"v":0,"d":"0.00"},{"v":0,"d":"0.00"},{"v":218.9,"d":"218.90"},{"v":141.1,"d":"141.10"},{"v":77.2,"d":"77.20"},"","","","","","",{"v":0,"d":"0.00"},"0",{"v":0,"d":"0.00"},{"v":218.9,"d":"218.90"},{"v":141.1,"d":"141.10"},{"v":77.2,"d":"77.20"},{"v":0,"d":"0.00"},{"v":0,"d":"0.00"},""]
[13,{"$f":"IF(AND('Att. Dairy'!B18=\"\"),\"\",'Att. Dairy'!B18)","v":"2019-07-13"},null,{"v":218.9,"d":"218.900"},{"v":141.1,"d":"141.100"},{"v":38.6,"d":"38.600"},{"v":19.3,"d":"19.300"},{"v":19.3,"d":"19.300"},{"$nulls":15},{"v":218.9,"d":"218.900"},{"v":141.1,"d":"141.100"},{"v":38.6,"d":"38.600"},{"v":19.3,"d":"19.300"},{"v":19.3,"d":"19.300"},{"$f":"IF(AND('Att. Dairy'!O18=\"\"),\"\",'Att. Dairy'!O18)","v":""},{"$f":"IF(AND('Att. Dairy'!P18=\"\"),\"\",'Att. Dairy'!P18)","v":""},0,{"$f":"IF(AND('Att. Dairy'!E18=\"\"),\"\",'Att. Dairy'!E18)","v":""},{"$f":"IF(AND('Att. Dairy'!F18=\"\"),\"\",'Att. Dairy'!F18)","v":""},0,{"$f":"IF(AND('Att. Dairy'!I18=\"\"),\"\",'Att. Dairy'!I18)","v":""},{"$f":"IF(AND('Att. Dairy'!J18=\"\"),\"\",'Att. Dairy'!J18)","v":""},0,{"v":0,"d":"0.000"},"0",{"v":0,"d":"0.000"},{"v":0,"d":"0.000"},{"v":0,"d":"0.000"},{"v":218.9,"d":"218.900"},{"v":141.1,"d":"141.100"},{"v":38.6,"d":"38.600"},{"v":19.3,"d":"19.300"},{"v":19.3,"d":"19.300"},{"$f":"IF(AND('Att. Dairy'!B18=\"\"),\"\",IF(AND(AH18=\"\"),\"\",IF(AND(C18=\"YES\",AH18>0),AH18*$BB$1,AH18*$BC$1)))","v":{"v":0,"d":"0.00"}},{"$f":"IF(AND('Att. Dairy'!B18=\"\"),\"\",IF(AND(AK18=\"\"),\"\",AK18*$BD$1))","v":{"v":0,"d":"0.00"}},{"$f":"IF(AND('Att. Dairy'!B18=\"\"),\"\",IF(AND(AV18=\"\",AW18=\"\"),\"\",SUM(AV18,AW18)))","v":{"v":0,"d":"0.00"}},{"$f":"IF(AND('Att. Dairy'!B18=\"\"),\"\",IF(AND(AF18=\"\"),\"\",BI18))","v":""},{"$nulls":6},{"$f":"IF(AND('Att. Dairy'!C18=\"\"),\"\",'Att. Dairy'!C18)","v":""},"",{"$f":"IF(AND('Att. Dairy'!D18=\"\"),\"\",'Att. Dairy'!D18)","v":"Saturday"},"lCthjksVh",null,0,{"$nulls":14},"W","W",{"$nulls":45},"2019-07-13",0,{"v":218.9,"d":"218.90"},{"v":141.1,"d":"141.10"},{"v":77.2,"d":"77.20"},{"v":0,"d":"0.00"},{"v":0,"d":"0.00"},{"v":0,"d":"0.00"},{"v":218.9,"d":"218.90"},{"v":141.1,"d":"141.10"},{"v":77.2,"d":"77.20"},"","","","","","",{"v":0,"d":"0.00"},"0",{"v":0,"d":"0.00"},{"v":218.9,"d":"218.90"},{"v":141.1,"d":"141.10"},{"v":77.2,"d":"77.20"},{"v":0,"d":"0.00"},{"v":0,"d":"0.00"},""]
[14,{"$f":"IF(AND('Att. Dairy'!B19=\"\"),\"\",'Att. Dairy'!B19)","v":"2019-07-14"},null,{"v":218.9,"d":"218.900"},{"v":141.1,"d":"141.100"},{"v":38.6,"d":"38.600"},{"v":19.3,"d":"19.300"},{"v":19.3,"d":"19.300"},{"$nulls":15},{"v":218.9,"d":"218.900"},{"v":141.1,"d":"141.100"},{"v":38.6,"d":"38.600"},{"v":19.3,"d":"19.300"},{"v":19.3,"d":"19.300"},{"$f":"IF(AND('Att. Dairy'!O19=\"\"),\"\",'Att. Dairy'!O19)","v":""},{"$f":"IF(AND('Att. Dairy'!P19=\"\"),\"\",'Att. Dairy'!P19)","v":""},0,{"$f":"IF(AND('Att. Dairy'!E19=\"\"),\"\",'Att. Dairy'!E19)","v":""},{"$f":"IF(AND('Att. Dairy'!F19=\"\"),\"\",'Att. Dairy'!F19)","v":""},0,{"$f":"IF(AND('Att. Dairy'!I19=\"\"),\"\",'Att. Dairy'!I19)","v":""},{"$f":"IF(AND('Att. Dairy'!J19=\"\"),\"\",'Att. Dairy'!J19)","v":""},0,"0","0",{"v":0,"d":"0.000"},{"v":0,"d":"0.000"},{"v":0,"d":"0.000"},{"v":218.9,"d":"218.900"},{"v":141.1,"d":"141.100"},{"v":38.6,"d":"38.600"},{"v":19.3,"d":"19.300"},{"v":19.3,"d":"19.300"},{"$f":"IF(AND('Att. Dairy'!B19=\"\"),\"\",IF(AND(AH19=\"\"),\"\",IF(AND(C19=\"YES\",AH19>0),AH19*$BB$1,AH19*$BC$1)))","v":{"v":0,"d":"0.00"}},{"$f":"IF(AND('Att. Dairy'!B19=\"\"),\"\",IF(AND(AK19=\"\"),\"\",AK19*$BD$1))","v":{"v":0,"d":"0.00"}},{"$f":"IF(AND('Att. Dairy'!B19=\"\"),\"\",IF(AND(AV19=\"\",AW19=\"\"),\"\",SUM(AV19,AW19)))","v":{"v":0,"d":"0.00"}},{"$f":"IF(AND('Att. Dairy'!B19=\"\"),\"\",IF(AND(AF19=\"\"),\"\",BI19))","v":""},{"$nulls":6},{"$f":"IF(AND('Att. Dairy'!C19=\"\"),\"\",'Att. Dairy'!C19)","v":""},"",{"$f":"IF(AND('Att. Dairy'!D19=\"\"),\"\",'Att. Dairy'!D19)","v":"Sunday"},"vodk'k",null,0,{"$nulls":14},false,false,{"$nulls":45},"2019-07-14",0,{"v":218.9,"d":"218.90"},{"v":141.1,"d":"141.10"},{"v":77.2,"d":"77.20"},{"v":0,"d":"0.00"},{"v":0,"d":"0.00"},{"v":0,"d":"0.00"},{"v":218.9,"d":"218.90"},{"v":141.1,"d":"141.10"},{"v":77.2,"d":"77.20"},"","","","","","","0","0",{"v":0,"d":"0.00"},{"v":218.9,"d":"218.90"},{"v":141.1,"d":"141.10"},{"v":77.2,"d":"77.20"},{"v":0,"d":"0.00"},{"v":0,"d":"0.00"},""]
[15,{"$f":"IF(AND('Att. Dairy'!B20=\"\"),\"\",'Att. Dairy'!B20)","v":"2019-07-15"},null,{"v":218.9,"d":"218.900"},{"v":141.1,"d":"141.100"},{"v":38.6,"d":"38.600"},{"v":19.3,"d":"19.300"},{"v":19.3,"d":"19.300"},{"$nulls":15},{"v":218.9,"d":"218.900"},{"v":141.1,"d":"141.100"},{"v":38.6,"d":"38.600"},{"v":19.3,"d":"19.300"},{"v":19.3,"d":"19.300"},{"$f":"IF(AND('Att. Dairy'!O20=\"\"),\"\",'Att. Dairy'!O20)","v":""},{"$f":"IF(AND('Att. Dairy'!P20=\"\"),\"\",'Att. Dairy'!P20)","v":""},0,{"$f":"IF(AND('Att. Dairy'!E20=\"\"),\"\",'Att. Dairy'!E20)","v":""},{"$f":"IF(AND('Att. Dairy'!F20=\"\"),\"\",'Att. Dairy'!F20)","v":""},0,{"$f":"IF(AND('Att. Dairy'!I20=\"\"),\"\",'Att. Dairy'!I20)","v":""},{"$f":"IF(AND('Att. Dairy'!J20=\"\"),\"\",'Att. Dairy'!J20)","v":""},0,{"v":0,"d":"0.000"},"0",{"v":0,"d":"0.000"},{"v":0,"d":"0.000"},{"v":0,"d":"0.000"},{"v":218.9,"d":"218.900"},{"v":141.1,"d":"141.100"},{"v":38.6,"d":"38.600"},{"v":19.3,"d":"19.300"},{"v":19.3,"d":"19.300"},{"$f":"IF(AND('Att. Dairy'!B20=\"\"),\"\",IF(AND(AH20=\"\"),\"\",IF(AND(C20=\"YES\",AH20>0),AH20*$BB$1,AH20*$BC$1)))","v":{"v":0,"d":"0.00"}},{"$f":"IF(AND('Att. Dairy'!B20=\"\"),\"\",IF(AND(AK20=\"\"),\"\",AK20*$BD$1))","v":{"v":0,"d":"0.00"}},{"$f":"IF(AND('Att. Dairy'!B20=\"\"),\"\",IF(AND(AV20=\"\",AW20=\"\"),\"\",SUM(AV20,AW20)))","v":{"v":0,"d":"0.00"}},{"$f":"IF(AND('Att. Dairy'!B20=\"\"),\"\",IF(AND(AF20=\"\"),\"\",BI20))","v":""},{"$nulls":6},{"$f":"IF(AND('Att. Dairy'!C20=\"\"),\"\",'Att. Dairy'!C20)","v":""},"",{"$f":"IF(AND('Att. Dairy'!D20=\"\"),\"\",'Att. Dairy'!D20)","v":"Monday"},"lCthjksVh",null,0,{"$nulls":14},"W","W",{"$nulls":45},"2019-07-15",0,{"v":218.9,"d":"218.90"},{"v":141.1,"d":"141.10"},{"v":77.2,"d":"77.20"},{"v":0,"d":"0.00"},{"v":0,"d":"0.00"},{"v":0,"d":"0.00"},{"v":218.9,"d":"218.90"},{"v":141.1,"d":"141.10"},{"v":77.2,"d":"77.20"},"","","","","","",{"v":0,"d":"0.00"},"0",{"v":0,"d":"0.00"},{"v":218.9,"d":"218.90"},{"v":141.1,"d":"141.10"},{"v":77.2,"d":"77.20"},{"v":0,"d":"0.00"},{"v":0,"d":"0.00"},""]
[16,{"$f":"IF(AND('Att. Dairy'!B21=\"\"),\"\",'Att. Dairy'!B21)","v":"2019-07-16"},null,{"v":218.9,"d":"218.900"},{"v":141.1,"d":"141.100"},{"v":38.6,"d":"38.600"},{"v":19.3,"d":"19.300"},{"v":19.3,"d":"19.300"},{"$nulls":15},{"v":218.9,"d":"218.900"},{"v":141.1,"d":"141.100"},{"v":38.6,"d":"38.600"},{"v":19.3,"d":"19.300"},{"v":19.3,"d":"19.300"},{"$f":"IF(AND('Att. Dairy'!O21=\"\"),\"\",'Att. Dairy'!O21)","v":""},{"$f":"IF(AND('Att. Dairy'!P21=\"\"),\"\",'Att. Dairy'!P21)","v":""},0,{"$f":"IF(AND('Att. Dairy'!E21=\"\"),\"\",'Att. Dairy'!E21)","v":""},{"$f":"IF(AND('Att. Dairy'!F21=\"\"),\"\",'Att. Dairy'!F21)","v":""},0,{"$f":"IF(AND('Att. Dairy'!I21=\"\"),\"\",'Att. Dairy'!I21)","v":""},{"$f":"IF(AND('Att. Dairy'!J21=\"\"),\"\",'Att. Dairy'!J21)","v":""},0,"0",{"v":0,"d":"0.000"},{"v":0,"d":"0.000"},{"v":0,"d":"0.000"},{"v":0,"d":"0.000"},{"v":218.9,"d":"218.900"},{"v":141.1,"d":"141.100"},{"v":38.6,"d":"38.600"},{"v":19.3,"d":"19.300"},{"v":19.3,"d":"19.300"},{"$f":"IF(AND('Att. Dairy'!B21=\"\"),\"\",IF(AND(AH21=\"\"),\"\",IF(AND(C21=\"YES\",AH21>0),AH21*$BB$1,AH21*$BC$1)))","v":{"v":0,"d":"0.00"}},{"$f":"IF(AND('Att. Dairy'!B21=\"\"),\"\",IF(AND(AK21=\"\"),\"\",AK21*$BD$1))","v":{"v":0,"d":"0.00"}},{"$f":"IF(AND('Att. Dairy'!B21=\"\"),\"\",IF(AND(AV21=\"\",AW21=\"\"),\"\",SUM(AV21,AW21)))","v":{"v":0,"d":"0.00"}},{"$f":"IF(AND('Att. Dairy'!B21=\"\"),\"\",IF(AND(AF21=\"\"),\"\",BI21))","v":""},{"$nulls":6},{"$f":"IF(AND('Att. Dairy'!C21=\"\"),\"\",'Att. Dairy'!C21)","v":""},"",{"$f":"IF(AND('Att. Dairy'!D21=\"\"),\"\",'Att. Dairy'!D21)","v":"Tuesday"},"nkypkoy",null,0,{"$nulls":14},"R","R",{"$nulls":45},"2019-07-16",0,{"v":218.9,"d":"218.90"},{"v":141.1,"d":"141.10"},{"v":77.2,"d":"77.20"},{"v":0,"d":"0.00"},{"v":0,"d":"0.00"},{"v":0,"d":"0.00"},{"v":218.9,"d":"218.90"},{"v":141.1,"d":"141.10"},{"v":77.2,"d":"77.20"},"","","","","","","0",{"v":0,"d":"0.00"},{"v":0,"d":"0.00"},{"v":218.9,"d":"218.90"},{"v":141.1,"d":"141.10"},{"v":77.2,"d":"77.20"},{"v":0,"d":"0.00"},{"v":0,"d":"0.00"},""]
[17,{"$f":"IF(AND('Att. Dairy'!B22=\"\"),\"\",'Att. Dairy'!B22)","v":"2019-07-17"},null,{"v":218.9,"d":"218.900"},{"v":141.1,"d":"141.100"},{"v":38.6,"d":"38.600"},{"v":19.3,"d":"19.300"},{"v":19.3,"d":"19.300"},{"$nulls":15},{"v":218.9,"d":"218.900"},{"v":141.1,"d":"141.100"},{"v":38.6,"d":"38.600"},{"v":19.3,"d":"19.300"},{"v":19.3,"d":"19.300"},{"$f":"IF(AND('Att. Dairy'!O22=\"\"),\"\",'Att. Dairy'!O22)","v":""},{"$f":"IF(AND('Att. Dairy'!P22=\"\"),\"\",'Att. Dairy'!P22)","v":""},0,{"$f":"IF(AND('Att. Dairy'!E22=\"\"),\"\",'Att. Dairy'!E22)","v":""},{"$f":"IF(AND('Att. Dairy'!F22=\"\"),\"\",'Att. Dairy'!F22)","v":""},0,{"$f":"IF(AND('Att. Dairy'!I22=\"\"),\"\",'Att. Dairy'!I22)","v":""},{"$f":"IF(AND('Att. Dairy'!J22=\"\"),\"\",'Att. Dairy'!J22)","v":""},0,{"v":0,"d":"0.000"},"0",{"v":0,"d":"0.000"},{"v":0,"d":"0.000"},{"v":0,"d":"0.000"},{"v":218.9,"d":"218.900"},{"v":141.1,"d":"141.100"},{"v":38.6,"d":"38.600"},{"v":19.3,"d":"19.300"},{"v":19.3,"d":"19.300"},{"$f":"IF(AND('Att. Dairy'!B22=\"\"),\"\",IF(AND(AH22=\"\"),\"\",IF(AND(C22=\"YES\",AH22>0),AH22*$BB$1,AH22*$BC$1)))","v":{"v":0,"d":"0.00"}},{"$f":"IF(AND('Att. Dairy'!B22=\"\"),\"\",IF(AND(AK22=\"\"),\"\",AK22*$BD$1))","v":{"v":0,"d":"0.00"}},{"$f":"IF(AND('Att. Dairy'!B22=\"\"),\"\",IF(AND(AV22=\"\",AW22=\"\"),\"\",SUM(AV22,AW22)))","v":{"v":0,"d":"0.00"}},{"$f":"IF(AND('Att. Dairy'!B22=\"\"),\"\",IF(AND(AF22=\"\"),\"\",BI22))","v":""},{"$nulls":6},{"$f":"IF(AND('Att. Dairy'!C22=\"\"),\"\",'Att. Dairy'!C22)","v":""},"",{"$f":"IF(AND('Att. Dairy'!D22=\"\"),\"\",'Att. Dairy'!D22)","v":"Wednesday"},"nkyjksVh",null,0,{"$nulls":14},"W","W",{"$nulls":45},"2019-07-17",0,{"v":218.9,"d":"218.90"},{"v":141.1,"d":"141.10"},{"v":77.2,"d":"77.20"},{"v":0,"d":"0.00"},{"v":0,"d":"0.00"},{"v":0,"d":"0.00"},{"v":218.9,"d":"218.90"},{"v":141.1,"d":"141.10"},{"v":77.2,"d":"77.20"},"","","","","","",{"v":0,"d":"0.00"},"0",{"v":0,"d":"0.00"},{"v":218.9,"d":"218.90"},{"v":141.1,"d":"141.10"},{"v":77.2,"d":"77.20"},{"v":0,"d":"0.00"},{"v":0,"d":"0.00"},""]
[18,{"$f":"IF(AND('Att. Dairy'!B23=\"\"),\"\",'Att. Dairy'!B23)","v":"2019-07-18"},null,{"v":218.9,"d":"218.900"},{"v":141.1,"d":"141.100"},{"v":38.6,"d":"38.600"},{"v":19.3,"d":"19.300"},{"v":19.3,"d":"19.300"},{"$nulls":15},{"v":218.9,"d":"218.900"},{"v":141.1,"d":"141.100"},{"v":38.6,"d":"38.600"},{"v":19.3,"d":"19.300"},{"v":19.3,"d":"19.300"},{"$f":"IF(AND('Att. Dairy'!O23=\"\"),\"\",'Att. Dairy'!O23)","v":""},{"$f":"IF(AND('Att. Dairy'!P23=\"\"),\"\",'Att. Dairy'!P23)","v":""},0,{"$f":"IF(AND('Att. Dairy'!E23=\"\"),\"\",'Att. Dairy'!E23)","v":""},{"$f":"IF(AND('Att. Dairy'!F23=\"\"),\"\",'Att. Dairy'!F23)","v":""},0,{"$f":"IF(AND('Att. Dairy'!I23=\"\"),\"\",'Att. Dairy'!I23)","v":""},{"$f":"IF(AND('Att. Dairy'!J23=\"\"),\"\",'Att. Dairy'!J23)","v":""},0,"0",{"v":0,"d":"0.000"},{"v":0,"d":"0.000"},{"v":0,"d":"0.000"},{"v":0,"d":"0.000"},{"v":218.9,"d":"218.900"},{"v":141.1,"d":"141.100"},{"v":38.6,"d":"38.600"},{"v":19.3,"d":"19.300"},{"v":19.3,"d":"19.300"},{"$f":"IF(AND('Att. Dairy'!B23=\"\"),\"\",IF(AND(AH23=\"\"),\"\",IF(AND(C23=\"YES\",AH23>0),AH23*$BB$1,AH23*$BC$1)))","v":{"v":0,"d":"0.00"}},{"$f":"IF(AND('Att. Dairy'!B23=\"\"),\"\",IF(AND(AK23=\"\"),\"\",AK23*$BD$1))","v":{"v":0,"d":"0.00"}},{"$f":"IF(AND('Att. Dairy'!B23=\"\"),\"\",IF(AND(AV23=\"\",AW23=\"\"),\"\",SUM(AV23,AW23)))","v":{"v":0,"d":"0.00"}},{"$f":"IF(AND('Att. Dairy'!B23=\"\"),\"\",IF(AND(AF23=\"\"),\"\",BI23))","v":""},{"$nulls":6},{"$f":"IF(AND('Att. Dairy'!C23=\"\"),\"\",'Att. Dairy'!C23)","v":""},"",{"$f":"IF(AND('Att. Dairy'!D23=\"\"),\"\",'Att. Dairy'!D23)","v":"Thursday"},"f[kpM+h",null,0,{"$nulls":14},"R","R",{"$nulls":45},"2019-07-18",0,{"v":218.9,"d":"218.90"},{"v":141.1,"d":"141.10"},{"v":77.2,"d":"77.20"},{"v":0,"d":"0.00"},{"v":0,"d":"0.00"},{"v":0,"d":"0.00"},{"v":218.9,"d":"218.90"},{"v":141.1,"d":"141.10"},{"v":77.2,"d":"77.20"},"","","","","","","0",{"v":0,"d":"0.00"},{"v":0,"d":"0.00"},{"v":218.9,"d":"218.90"},{"v":141.1,"d":"141.10"},{"v":77.2,"d":"77.20"},{"v":0,"d":"0.00"},{"v":0,"d":"0.00"},""]
[19,{"$f":"IF(AND('Att. Dairy'!B24=\"\"),\"\",'Att. Dairy'!B24)","v":"2019-07-19"},null,{"v":218.9,"d":"218.900"},{"v":141.1,"d":"141.100"},{"v":38.6,"d":"38.600"},{"v":19.3,"d":"19.300"},{"v":19.3,"d":"19.300"},{"$nulls":15},{"v":218.9,"d":"218.900"},{"v":141.1,"d":"141.100"},{"v":38.6,"d":"38.600"},{"v":19.3,"d":"19.300"},{"v":19.3,"d":"19.300"},{"$f":"IF(AND('Att. Dairy'!O24=\"\"),\"\",'Att. Dairy'!O24)","v":""},{"$f":"IF(AND('Att. Dairy'!P24=\"\"),\"\",'Att. Dairy'!P24)","v":""},0,{"$f":"IF(AND('Att. Dairy'!E24=\"\"),\"\",'Att. Dairy'!E24)","v":""},{"$f":"IF(AND('Att. Dairy'!F24=\"\"),\"\",'Att. Dairy'!F24)","v":""},0,{"$f":"IF(AND('Att. Dairy'!I24=\"\"),\"\",'Att. Dairy'!I24)","v":""},{"$f":"IF(AND('Att. Dairy'!J24=\"\"),\"\",'Att. Dairy'!J24)","v":""},0,{"v":0,"d":"0.000"},"0",{"v":0,"d":"0.000"},{"v":0,"d":"0.000"},{"v":0,"d":"0.000"},{"v":218.9,"d":"218.900"},{"v":141.1,"d":"141.100"},{"v":38.6,"d":"38.600"},{"v":19.3,"d":"19.300"},{"v":19.3,"d":"19.300"},{"$f":"IF(AND('Att. Dairy'!B24=\"\"),\"\",IF(AND(AH24=\"\"),\"\",IF(AND(C24=\"YES\",AH24>0),AH24*$BB$1,AH24*$BC$1)))","v":{"v":0,"d":"0.00"}},{"$f":"IF(AND('Att. Dairy'!B24=\"\"),\"\",IF(AND(AK24=\"\"),\"\",AK24*$BD$1))","v":{"v":0,"d":"0.00"}},{"$f":"IF(AND('Att. Dairy'!B24=\"\"),\"\",IF(AND(AV24=\"\",AW24=\"\"),\"\",SUM(AV24,AW24)))","v":{"v":0,"d":"0.00"}},{"$f":"IF(AND('Att. Dairy'!B24=\"\"),\"\",IF(AND(AF24=\"\"),\"\",BI24))","v":""},{"$nulls":6},{"$f":"IF(AND('Att. Dairy'!C24=\"\"),\"\",'Att. Dairy'!C24)","v":""},"",{"$f":"IF(AND('Att. Dairy'!D24=\"\"),\"\",'Att. Dairy'!D24)","v":"Friday"},"nkyjksVh",null,0,{"$nulls":14},"W","W",{"$nulls":45},"2019-07-19",0,{"v":218.9,"d":"218.90"},{"v":141.1,"d":"141.10"},{"v":77.2,"d":"77.20"},{"v":0,"d":"0.00"},{"v":0,"d":"0.00"},{"v":0,"d":"0.00"},{"v":218.9,"d":"218.90"},{"v":141.1,"d":"141.10"},{"v":77.2,"d":"77.20"},"","","","","","",{"v":0,"d":"0.00"},"0",{"v":0,"d":"0.00"},{"v":218.9,"d":"218.90"},{"v":141.1,"d":"141.10"},{"v":77.2,"d":"77.20"},{"v":0,"d":"0.00"},{"v":0,"d":"0.00"},""]
[20,{"$f":"IF(AND('Att. Dairy'!B25=\"\"),\"\",'Att. Dairy'!B25)","v":"2019-07-20"},null,{"v":218.9,"d":"218.900"},{"v":141.1,"d":"141.100"},{"v":38.6,"d":"38.600"},{"v":19.3,"d":"19.300"},{"v":19.3,"d":"19.300"},{"$nulls":15},{"v":218.9,"d":"218.900"},{"v":141.1,"d":"141.100"},{"v":38.6,"d":"38.600"},{"v":19.3,"d":"19.300"},{"v":19.3,"d":"19.300"},{"$f":"IF(AND('Att. Dairy'!O25=\"\"),\"\",'Att. Dairy'!O25)","v":""},{"$f":"IF(AND('Att. Dairy'!P25=\"\"),\"\",'Att. Dairy'!P25)","v":""},0,{"$f":"IF(AND('Att. Dairy'!E25=\"\"),\"\",'Att. Dairy'!E25)","v":""},{"$f":"IF(AND('Att. Dairy'!F25=\"\"),\"\",'Att. Dairy'!F25)","v":""},0,{"$f":"IF(AND('Att. Dairy'!I25=\"\"),\"\",'Att. Dairy'!I25)","v":""},{"$f":"IF(AND('Att. Dairy'!J25=\"\"),\"\",'Att. Dairy'!J25)","v":""},0,{"v":0,"d":"0.000"},"0",{"v":0,"d":"0.000"},{"v":0,"d":"0.000"},{"v":0,"d":"0.000"},{"v":218.9,"d":"218.900"},{"v":141.1,"d":"141.100"},{"v":38.6,"d":"38.600"},{"v":19.3,"d":"19.300"},{"v":19.3,"d":"19.300"},{"$f":"IF(AND('Att. Dairy'!B25=\"\"),\"\",IF(AND(AH25=\"\"),\"\",IF(AND(C25=\"YES\",AH25>0),AH25*$BB$1,AH25*$BC$1)))","v":{"v":0,"d":"0.00"}},{"$f":"IF(AND('Att. Dairy'!B25=\"\"),\"\",IF(AND(AK25=\"\"),\"\",AK25*$BD$1))","v":{"v":0,"d":"0.00"}},{"$f":"IF(AND('Att. Dairy'!B25=\"\"),\"\",IF(AND(AV25=\"\",AW25=\"\"),\"\",SUM(AV25,AW25)))","v":{"v":0,"d":"0.00"}},{"$f":"IF(AND('Att. Dairy'!B25=\"\"),\"\",IF(AND(AF25=\"\"),\"\",BI25))","v":""},{"$nulls":6},{"$f":"IF(AND('Att. Dairy'!C25=\"\"),\"\",'Att. Dairy'!C25)","v":""},"",{"$f":"IF(AND('Att. Dairy'!D25=\"\"),\"\",'Att. Dairy'!D25)","v":"Saturday"},"lCthjksVh",null,0,{"$nulls":14},"W","W",{"$nulls":45},"2019-07-20",0,{"v":218.9,"d":"218.90"},{"v":141.1,"d":"141.10"},{"v":77.2,"d":"77.20"},{"v":0,"d":"0.00"},{"v":0,"d":"0.00"},{"v":0,"d":"0.00"},{"v":218.9,"d":"218.90"},{"v":141.1,"d":"141.10"},{"v":77.2,"d":"77.20"},"","","","","","",{"v":0,"d":"0.00"},"0",{"v":0,"d":"0.00"},{"v":218.9,"d":"218.90"},{"v":141.1,"d":"141.10"},{"v":77.2,"d":"77.20"},{"v":0,"d":"0.00"},{"v":0,"d":"0.00"},""]
[21,{"$f":"IF(AND('Att. Dairy'!B26=\"\"),\"\",'Att. Dairy'!B26)","v":"2019-07-21"},null,{"v":218.9,"d":"218.900"},{"v":141.1,"d":"141.100"},{"v":38.6,"d":"38.600"},{"v":19.3,"d":"19.300"},{"v":19.3,"d":"19.300"},{"$nulls":15},{"v":218.9,"d":"218.900"},{"v":141.1,"d":"141.100"},{"v":38.6,"d":"38.600"},{"v":19.3,"d":"19.300"},{"v":19.3,"d":"19.300"},{"$f":"IF(AND('Att. Dairy'!O26=\"\"),\"\",'Att. Dairy'!O26)","v":""},{"$f":"IF(AND('Att. Dairy'!P26=\"\"),\"\",'Att. Dairy'!P26)","v":""},0,{"$f":"IF(AND('Att. Dairy'!E26=\"\"),\"\",'Att. Dairy'!E26)","v":""},{"$f":"IF(AND('Att. Dairy'!F26=\"\"),\"\",'Att. Dairy'!F26)","v":""},0,{"$f":"IF(AND('Att. Dairy'!I26=\"\"),\"\",'Att. Dairy'!I26)","v":""},{"$f":"IF(AND('Att. Dairy'!J26=\"\"),\"\",'Att. Dairy'!J26)","v":""},0,"0","0",{"v":0,"d":"0.000"},{"v":0,"d":"0.000"},{"v":0,"d":"0.000"},{"v":218.9,"d":"218.900"},{"v":141.1,"d":"141.100"},{"v":38.6,"d":"38.600"},{"v":19.3,"d":"19.300"},{"v":19.3,"d":"19.300"},{"$f":"IF(AND('Att. Dairy'!B26=\"\"),\"\",IF(AND(AH26=\"\"),\"\",IF(AND(C26=\"YES\",AH26>0),AH26*$BB$1,AH26*$BC$1)))","v":{"v":0,"d":"0.00"}},{"$f":"IF(AND('Att. Dairy'!B26=\"\"),\"\",IF(AND(AK26=\"\"),\"\",AK26*$BD$1))","v":{"v":0,"d":"0.00"}},{"$f":"IF(AND('Att. Dairy'!B26=\"\"),\"\",IF(AND(AV26=\"\",AW26=\"\"),\"\",SUM(AV26,AW26)))","v":{"v":0,"d":"0.00"}},{"$f":"IF(AND('Att. Dairy'!B26=\"\"),\"\",IF(AND(AF26=\"\"),\"\",BI26))","v":""},{"$nulls":6},{"$f":"IF(AND('Att. Dairy'!C26=\"\"),\"\",'Att. Dairy'!C26)","v":""},"",{"$f":"IF(AND('Att. Dairy'!D26=\"\"),\"\",'Att. Dairy'!D26)","v":"Sunday"},"vodk'k",null,0,{"$nulls":14},false,false,{"$nulls":45},"2019-07-21",0,{"v":218.9,"d":"218.90"},{"v":141.1,"d":"141.10"},{"v":77.2,"d":"77.20"},{"v":0,"d":"0.00"},{"v":0,"d":"0.00"},{"v":0,"d":"0.00"},{"v":218.9,"d":"218.90"},{"v":141.1,"d":"141.10"},{"v":77.2,"d":"77.20"},"","","","","","","0","0",{"v":0,"d":"0.00"},{"v":218.9,"d":"218.90"},{"v":141.1,"d":"141.10"},{"v":77.2,"d":"77.20"},{"v":0,"d":"0.00"},{"v":0,"d":"0.00"},""]
[22,{"$f":"IF(AND('Att. Dairy'!B27=\"\"),\"\",'Att. Dairy'!B27)","v":"2019-07-22"},null,{"v":218.9,"d":"218.900"},{"v":141.1,"d":"141.100"},{"v":38.6,"d":"38.600"},{"v":19.3,"d":"19.300"},{"v":19.3,"d":"19.300"},{"$nulls":15},{"v":218.9,"d":"218.900"},{"v":141.1,"d":"141.100"},{"v":38.6,"d":"38.600"},{"v":19.3,"d":"19.300"},{"v":19.3,"d":"19.300"},{"$f":"IF(AND('Att. Dairy'!O27=\"\"),\"\",'Att. Dairy'!O27)","v":""},{"$f":"IF(AND('Att. Dairy'!P27=\"\"),\"\",'Att. Dairy'!P27)","v":""},0,{"$f":"IF(AND('Att. Dairy'!E27=\"\"),\"\",'Att. Dairy'!E27)","v":""},{"$f":"IF(AND('Att. Dairy'!F27=\"\"),\"\",'Att. Dairy'!F27)","v":""},0,{"$f":"IF(AND('Att. Dairy'!I27=\"\"),\"\",'Att. Dairy'!I27)","v":""},{"$f":"IF(AND('Att. Dairy'!J27=\"\"),\"\",'Att. Dairy'!J27)","v":""},0,{"v":0,"d":"0.000"},"0",{"v":0,"d":"0.000"},{"v":0,"d":"0.000"},{"v":0,"d":"0.000"},{"v":218.9,"d":"218.900"},{"v":141.1,"d":"141.100"},{"v":38.6,"d":"38.600"},{"v":19.3,"d":"19.300"},{"v":19.3,"d":"19.300"},{"$f":"IF(AND('Att. Dairy'!B27=\"\"),\"\",IF(AND(AH27=\"\"),\"\",IF(AND(C27=\"YES\",AH27>0),AH27*$BB$1,AH27*$BC$1)))","v":{"v":0,"d":"0.00"}},{"$f":"IF(AND('Att. Dairy'!B27=\"\"),\"\",IF(AND(AK27=\"\"),\"\",AK27*$BD$1))","v":{"v":0,"d":"0.00"}},{"$f":"IF(AND('Att. Dairy'!B27=\"\"),\"\",IF(AND(AV27=\"\",AW27=\"\"),\"\",SUM(AV27,AW27)))","v":{"v":0,"d":"0.00"}},{"$f":"IF(AND('Att. Dairy'!B27=\"\"),\"\",IF(AND(AF27=\"\"),\"\",BI27))","v":""},{"$nulls":6},{"$f":"IF(AND('Att. Dairy'!C27=\"\"),\"\",'Att. Dairy'!C27)","v":""},"",{"$f":"IF(AND('Att. Dairy'!D27=\"\"),\"\",'Att. Dairy'!D27)","v":"Monday"},"lCthjksVh",null,0,{"$nulls":14},"W","W",{"$nulls":45},"2019-07-22",0,{"v":218.9,"d":"218.90"},{"v":141.1,"d":"141.10"},{"v":77.2,"d":"77.20"},{"v":0,"d":"0.00"},{"v":0,"d":"0.00"},{"v":0,"d":"0.00"},{"v":218.9,"d":"218.90"},{"v":141.1,"d":"141.10"},{"v":77.2,"d":"77.20"},"","","","","","",{"v":0,"d":"0.00"},"0",{"v":0,"d":"0.00"},{"v":218.9,"d":"218.90"},{"v":141.1,"d":"141.10"},{"v":77.2,"d":"77.20"},{"v":0,"d":"0.00"},{"v":0,"d":"0.00"},""]
[23,{"$f":"IF(AND('Att. Dairy'!B28=\"\"),\"\",'Att. Dairy'!B28)","v":"2019-07-23"},null,{"$f":"IF(AND(AQ27=\"\"),\"\",AQ27)","v":{"v":218.9,"d":"218.900"}},{"$f":"IF(AND(AR27=\"\"),\"\",AR27)","v":{"v":141.1,"d":"141.100"}},{"v":38.6,"d":"38.600"},{"v":19.3,"d":"19.300"},{"v":19.3,"d":"19.300"},{"$nulls":15},{"v":218.9,"d":"218.900"},{"v":141.1,"d":"141.100"},{"v":38.6,"d":"38.600"},{"v":19.3,"d":"19.300"},{"v":19.3,"d":"19.300"},{"$f":"IF(AND('Att. Dairy'!O28=\"\"),\"\",'Att. Dairy'!O28)","v":""},{"$f":"IF(AND('Att. Dairy'!P28=\"\"),\"\",'Att. Dairy'!P28)","v":""},0,{"$f":"IF(AND('Att. Dairy'!E28=\"\"),\"\",'Att. Dairy'!E28)","v":""},{"$f":"IF(AND('Att. Dairy'!F28=\"\"),\"\",'Att. Dairy'!F28)","v":""},0,{"$f":"IF(AND('Att. Dairy'!I28=\"\"),\"\",'Att. Dairy'!I28)","v":""},{"$f":"IF(AND('Att. Dairy'!J28=\"\"),\"\",'Att. Dairy'!J28)","v":""},0,"0",{"v":0,"d":"0.000"},{"v":0,"d":"0.000"},{"v":0,"d":"0.000"},{"v":0,"d":"0.000"},{"v":218.9,"d":"218.900"},{"v":141.1,"d":"141.100"},{"v":38.6,"d":"38.600"},{"v":19.3,"d":"19.300"},{"v":19.3,"d":"19.300"},{"$f":"IF(AND('Att. Dairy'!B28=\"\"),\"\",IF(AND(AH28=\"\"),\"\",IF(AND(C28=\"YES\",AH28>0),AH28*$BB$1,AH28*$BC$1)))","v":{"v":0,"d":"0.00"}},{"$f":"IF(AND('Att. Dairy'!B28=\"\"),\"\",IF(AND(AK28=\"\"),\"\",AK28*$BD$1))","v":{"v":0,"d":"0.00"}},{"$f":"IF(AND('Att. Dairy'!B28=\"\"),\"\",IF(AND(AV28=\"\",AW28=\"\"),\"\",SUM(AV28,AW28)))","v":{"v":0,"d":"0.00"}},{"$f":"IF(AND('Att. Dairy'!B28=\"\"),\"\",IF(AND(AF28=\"\"),\"\",BI28))","v":""},{"$nulls":6},{"$f":"IF(AND('Att. Dairy'!C28=\"\"),\"\",'Att. Dairy'!C28)","v":""},"",{"$f":"IF(AND('Att. Dairy'!D28=\"\"),\"\",'Att. Dairy'!D28)","v":"Tuesday"},"nkypkoy",null,0,{"$nulls":14},"R","R",{"$nulls":45},"2019-07-23",0,{"v":218.9,"d":"218.90"},{"v":141.1,"d":"141.10"},{"v":77.2,"d":"77.20"},{"v":0,"d":"0.00"},{"v":0,"d":"0.00"},{"v":0,"d":"0.00"},{"v":218.9,"d":"218.90"},{"v":141.1,"d":"141.10"},{"v":77.2,"d":"77.20"},"","","","","","","0",{"v":0,"d":"0.00"},{"v":0,"d":"0.00"},{"v":218.9,"d":"218.90"},{"v":141.1,"d":"141.10"},{"v":77.2,"d":"77.20"},{"v":0,"d":"0.00"},{"v":0,"d":"0.00"},""]
[24,{"$f":"IF(AND('Att. Dairy'!B29=\"\"),\"\",'Att. Dairy'!B29)","v":"2019-07-24"},null,{"v":218.9,"d":"218.900"},{"v":141.1,"d":"141.100"},{"v":38.6,"d":"38.600"},{"v":19.3,"d":"19.300"},{"v":19.3,"d":"19.300"},{"$nulls":15},{"v":218.9,"d":"218.900"},{"v":141.1,"d":"141.100"},{"v":38.6,"d":"38.600"},{"v":19.3,"d":"19.300"},{"v":19.3,"d":"19.300"},{"$f":"IF(AND('Att. Dairy'!O29=\"\"),\"\",'Att. Dairy'!O29)","v":""},{"$f":"IF(AND('Att. Dairy'!P29=\"\"),\"\",'Att. Dairy'!P29)","v":""},0,{"$f":"IF(AND('Att. Dairy'!E29=\"\"),\"\",'Att. Dairy'!E29)","v":""},{"$f":"IF(AND('Att. Dairy'!F29=\"\"),\"\",'Att. Dairy'!F29)","v":""},0,{"$f":"IF(AND('Att. Dairy'!I29=\"\"),\"\",'Att. Dairy'!I29)","v":""},{"$f":"IF(AND('Att. Dairy'!J29=\"\"),\"\",'Att. Dairy'!J29)","v":""},0,{"v":0,"d":"0.000"},"0",{"v":0,"d":"0.000"},{"v":0,"d":"0.000"},{"v":0,"d":"0.000"},{"v":218.9,"d":"218.900"},{"v":141.1,"d":"141.100"},{"v":38.6,"d":"38.600"},{"v":19.3,"d":"19.300"},{"v":19.3,"d":"19.300"},{"$f":"IF(AND('Att. Dairy'!B29=\"\"),\"\",IF(AND(AH29=\"\"),\"\",IF(AND(C29=\"YES\",AH29>0),AH29*$BB$1,AH29*$BC$1)))","v":{"v":0,"d":"0.00"}},{"$f":"IF(AND('Att. Dairy'!B29=\"\"),\"\",IF(AND(AK29=\"\"),\"\",AK29*$BD$1))","v":{"v":0,"d":"0.00"}},{"$f":"IF(AND('Att. Dairy'!B29=\"\"),\"\",IF(AND(AV29=\"\",AW29=\"\"),\"\",SUM(AV29,AW29)))","v":{"v":0,"d":"0.00"}},{"$f":"IF(AND('Att. Dairy'!B29=\"\"),\"\",IF(AND(AF29=\"\"),\"\",BI29))","v":""},{"$nulls":6},{"$f":"IF(AND('Att. Dairy'!C29=\"\"),\"\",'Att. Dairy'!C29)","v":""},"",{"$f":"IF(AND('Att. Dairy'!D29=\"\"),\"\",'Att. Dairy'!D29)","v":"Wednesday"},"nkyjksVh",null,0,{"$nulls":14},"W","W",{"$nulls":45},"2019-07-24",0,{"v":218.9,"d":"218.90"},{"v":141.1,"d":"141.10"},{"v":77.2,"d":"77.20"},{"v":0,"d":"0.00"},{"v":0,"d":"0.00"},{"v":0,"d":"0.00"},{"v":218.9,"d":"218.90"},{"v":141.1,"d":"141.10"},{"v":77.2,"d":"77.20"},"","","","","","",{"v":0,"d":"0.00"},"0",{"v":0,"d":"0.00"},{"v":218.9,"d":"218.90"},{"v":141.1,"d":"141.10"},{"v":77.2,"d":"77.20"},{"v":0,"d":"0.00"},{"v":0,"d":"0.00"},""]
[25,{"$f":"IF(AND('Att. Dairy'!B30=\"\"),\"\",'Att. Dairy'!B30)","v":"2019-07-25"},null,{"v":218.9,"d":"218.900"},{"v":141.1,"d":"141.100"},{"v":38.6,"d":"38.600"},{"v":19.3,"d":"19.300"},{"v":19.3,"d":"19.300"},{"$nulls":15},{"v":218.9,"d":"218.900"},{"v":141.1,"d":"141.100"},{"v":38.6,"d":"38.600"},{"v":19.3,"d":"19.300"},{"v":19.3,"d":"19.300"},{"$f":"IF(AND('Att. Dairy'!O30=\"\"),\"\",'Att. Dairy'!O30)","v":""},{"$f":"IF(AND('Att. Dairy'!P30=\"\"),\"\",'Att. Dairy'!P30)","v":""},0,{"$f":"IF(AND('Att. Dairy'!E30=\"\"),\"\",'Att. Dairy'!E30)","v":""},{"$f":"IF(AND('Att. Dairy'!F30=\"\"),\"\",'Att. Dairy'!F30)","v":""},0,{"$f":"IF(AND('Att. Dairy'!I30=\"\"),\"\",'Att. Dairy'!I30)","v":""},{"$f":"IF(AND('Att. Dairy'!J30=\"\"),\"\",'Att. Dairy'!J30)","v":""},0,"0",{"v":0,"d":"0.000"},{"v":0,"d":"0.000"},{"v":0,"d":"0.000"},{"v":0,"d":"0.000"},{"v":218.9,"d":"218.900"},{"v":141.1,"d":"141.100"},{"v":38.6,"d":"38.600"},{"v":19.3,"d":"19.300"},{"v":19.3,"d":"19.300"},{"$f":"IF(AND('Att. Dairy'!B30=\"\"),\"\",IF(AND(AH30=\"\"),\"\",IF(AND(C30=\"YES\",AH30>0),AH30*$BB$1,AH30*$BC$1)))","v":{"v":0,"d":"0.00"}},{"$f":"IF(AND('Att. Dairy'!B30=\"\"),\"\",IF(AND(AK30=\"\"),\"\",AK30*$BD$1))","v":{"v":0,"d":"0.00"}},{"$f":"IF(AND('Att. Dairy'!B30=\"\"),\"\",IF(AND(AV30=\"\",AW30=\"\"),\"\",SUM(AV30,AW30)))","v":{"v":0,"d":"0.00"}},{"$f":"IF(AND('Att. Dairy'!B30=\"\"),\"\",IF(AND(AF30=\"\"),\"\",BI30))","v":""},{"$nulls":6},{"$f":"IF(AND('Att. Dairy'!C30=\"\"),\"\",'Att. Dairy'!C30)","v":""},"",{"$f":"IF(AND('Att. Dairy'!D30=\"\"),\"\",'Att. Dairy'!D30)","v":"Thursday"},"f[kpM+h",null,0,{"$nulls":14},"R","R",{"$nulls":45},"2019-07-25",0,{"v":218.9,"d":"218.90"},{"v":141.1,"d":"141.10"},{"v":77.2,"d":"77.20"},{"v":0,"d":"0.00"},{"v":0,"d":"0.00"},{"v":0,"d":"0.00"},{"v":218.9,"d":"218.90"},{"v":141.1,"d":"141.10"},{"v":77.2,"d":"77.20"},"","","","","","","0",{"v":0,"d":"0.00"},{"v":0,"d":"0.00"},{"v":218.9,"d":"218.90"},{"v":141.1,"d":"141.10"},{"v":77.2,"d":"77.20"},{"v":0,"d":"0.00"},{"v":0,"d":"0.00"},""]
[26,{"$f":"IF(AND('Att. Dairy'!B31=\"\"),\"\",'Att. Dairy'!B31)","v":"2019-07-26"},null,{"v":218.9,"d":"218.900"},{"v":141.1,"d":"141.100"},{"v":38.6,"d":"38.600"},{"v":19.3,"d":"19.300"},{"v":19.3,"d":"19.300"},{"$nulls":15},{"v":218.9,"d":"218.900"},{"v":141.1,"d":"141.100"},{"v":38.6,"d":"38.600"},{"v":19.3,"d":"19.300"},{"v":19.3,"d":"19.300"},{"$f":"IF(AND('Att. Dairy'!O31=\"\"),\"\",'Att. Dairy'!O31)","v":""},{"$f":"IF(AND('Att. Dairy'!P31=\"\"),\"\",'Att. Dairy'!P31)","v":""},0,{"$f":"IF(AND('Att. Dairy'!E31=\"\"),\"\",'Att. Dairy'!E31)","v":""},{"$f":"IF(AND('Att. Dairy'!F31=\"\"),\"\",'Att. Dairy'!F31)","v":""},0,{"$f":"IF(AND('Att. Dairy'!I31=\"\"),\"\",'Att. Dairy'!I31)","v":""},{"$f":"IF(AND('Att. Dairy'!J31=\"\"),\"\",'Att. Dairy'!J31)","v":""},0,{"v":0,"d":"0.000"},"0",{"v":0,"d":"0.000"},{"v":0,"d":"0.000"},{"v":0,"d":"0.000"},{"v":218.9,"d":"218.900"},{"v":141.1,"d":"141.100"},{"v":38.6,"d":"38.600"},{"v":19.3,"d":"19.300"},{"v":19.3,"d":"19.300"},{"$f":"IF(AND('Att. Dairy'!B31=\"\"),\"\",IF(AND(AH31=\"\"),\"\",IF(AND(C31=\"YES\",AH31>0),AH31*$BB$1,AH31*$BC$1)))","v":{"v":0,"d":"0.00"}},{"$f":"IF(AND('Att. Dairy'!B31=\"\"),\"\",IF(AND(AK31=\"\"),\"\",AK31*$BD$1))","v":{"v":0,"d":"0.00"}},{"$f":"IF(AND('Att. Dairy'!B31=\"\"),\"\",IF(AND(AV31=\"\",AW31=\"\"),\"\",SUM(AV31,AW31)))","v":{"v":0,"d":"0.00"}},{"$f":"IF(AND('Att. Dairy'!B31=\"\"),\"\",IF(AND(AF31=\"\"),\"\",BI31))","v":""},{"$nulls":6},{"$f":"IF(AND('Att. Dairy'!C31=\"\"),\"\",'Att. Dairy'!C31)","v":""},"",{"$f":"IF(AND('Att. Dairy'!D31=\"\"),\"\",'Att. Dairy'!D31)","v":"Friday"},"nkyjksVh",null,0,{"$nulls":14},"W","W",{"$nulls":45},"2019-07-26",0,{"v":218.9,"d":"218.90"},{"v":141.1,"d":"141.10"},{"v":77.2,"d":"77.20"},{"v":0,"d":"0.00"},{"v":0,"d":"0.00"},{"v":0,"d":"0.00"},{"v":218.9,"d":"218.90"},{"v":141.1,"d":"141.10"},{"v":77.2,"d":"77.20"},"","","","","","",{"v":0,"d":"0.00"},"0",{"v":0,"d":"0.00"},{"v":218.9,"d":"218.90"},{"v":141.1,"d":"141.10"},{"v":77.2,"d":"77.20"},{"v":0,"d":"0.00"},{"v":0,"d":"0.00"},""]
[27,{"$f":"IF(AND('Att. Dairy'!B32=\"\"),\"\",'Att. Dairy'!B32)","v":"2019-07-27"},null,{"v":218.9,"d":"218.900"},{"v":141.1,"d":"141.100"},{"v":38.6,"d":"38.600"},{"v":19.3,"d":"19.300"},{"v":19.3,"d":"19.300"},{"$nulls":15},{"v":218.9,"d":"218.900"},{"v":141.1,"d":"141.100"},{"v":38.6,"d":"38.600"},{"v":19.3,"d":"19.300"},{"v":19.3,"d":"19.300"},{"$f":"IF(AND('Att. Dairy'!O32=\"\"),\"\",'Att. Dairy'!O32)","v":""},{"$f":"IF(AND('Att. Dairy'!P32=\"\"),\"\",'Att. Dairy'!P32)","v":""},0,{"$f":"IF(AND('Att. Dairy'!E32=\"\"),\"\",'Att. Dairy'!E32)","v":""},{"$f":"IF(AND('Att. Dairy'!F32=\"\"),\"\",'Att. Dairy'!F32)","v":""},0,{"$f":"IF(AND('Att. Dairy'!I32=\"\"),\"\",'Att. Dairy'!I32)","v":""},{"$f":"IF(AND('Att. Dairy'!J32=\"\"),\"\",'Att. Dairy'!J32)","v":""},0,{"v":0,"d":"0.000"},"0",{"v":0,"d":"0.000"},{"v":0,"d":"0.000"},{"v":0,"d":"0.000"},{"v":218.9,"d":"218.900"},{"v":141.1,"d":"141.100"},{"v":38.6,"d":"38.600"},{"v":19.3,"d":"19.300"},{"v":19.3,"d":"19.300"},{"$f":"IF(AND('Att. Dairy'!B32=\"\"),\"\",IF(AND(AH32=\"\"),\"\",IF(AND(C32=\"YES\",AH32>0),AH32*$BB$1,AH32*$BC$1)))","v":{"v":0,"d":"0.00"}},{"$f":"IF(AND('Att. Dairy'!B32=\"\"),\"\",IF(AND(AK32=\"\"),\"\",AK32*$BD$1))","v":{"v":0,"d":"0.00"}},{"$f":"IF(AND('Att. Dairy'!B32=\"\"),\"\",IF(AND(AV32=\"\",AW32=\"\"),\"\",SUM(AV32,AW32)))","v":{"v":0,"d":"0.00"}},{"$f":"IF(AND('Att. Dairy'!B32=\"\"),\"\",IF(AND(AF32=\"\"),\"\",BI32))","v":""},{"$nulls":6},{"$f":"IF(AND('Att. Dairy'!C32=\"\"),\"\",'Att. Dairy'!C32)","v":""},"",{"$f":"IF(AND('Att. Dairy'!D32=\"\"),\"\",'Att. Dairy'!D32)","v":"Saturday"},"lCthjksVh",null,0,{"$nulls":14},"W","W",{"$nulls":45},"2019-07-27",0,{"v":218.9,"d":"218.90"},{"v":141.1,"d":"141.10"},{"v":77.2,"d":"77.20"},{"v":0,"d":"0.00"},{"v":0,"d":"0.00"},{"v":0,"d":"0.00"},{"v":218.9,"d":"218.90"},{"v":141.1,"d":"141.10"},{"v":77.2,"d":"77.20"},"","","","","","",{"v":0,"d":"0.00"},"0",{"v":0,"d":"0.00"},{"v":218.9,"d":"218.90"},{"v":141.1,"d":"141.10"},{"v":77.2,"d":"77.20"},{"v":0,"d":"0.00"},{"v":0,"d":"0.00"},""]
[28,{"$f":"IF(AND('Att. Dairy'!B33=\"\"),\"\",'Att. Dairy'!B33)","v":"2019-07-28"},null,{"v":218.9,"d":"218.900"},{"v":141.1,"d":"141.100"},{"v":38.6,"d":"38.600"},{"v":19.3,"d":"19.300"},{"v":19.3,"d":"19.300"},{"$nulls":15},{"v":218.9,"d":"218.900"},{"v":141.1,"d":"141.100"},{"v":38.6,"d":"38.600"},{"v":19.3,"d":"19.300"},{"v":19.3,"d":"19.300"},{"$f":"IF(AND('Att. Dairy'!O33=\"\"),\"\",'Att. Dairy'!O33)","v":""},{"$f":"IF(AND('Att. Dairy'!P33=\"\"),\"\",'Att. Dairy'!P33)","v":""},0,{"$f":"IF(AND('Att. Dairy'!E33=\"\"),\"\",'Att. Dairy'!E33)","v":""},{"$f":"IF(AND('Att. Dairy'!F33=\"\"),\"\",'Att. Dairy'!F33)","v":""},0,{"$f":"IF(AND('Att. Dairy'!I33=\"\"),\"\",'Att. Dairy'!I33)","v":""},{"$f":"IF(AND('Att. Dairy'!J33=\"\"),\"\",'Att. Dairy'!J33)","v":""},0,"0","0",{"v":0,"d":"0.000"},{"v":0,"d":"0.000"},{"v":0,"d":"0.000"},{"v":218.9,"d":"218.900"},{"v":141.1,"d":"141.100"},{"v":38.6,"d":"38.600"},{"v":19.3,"d":"19.300"},{"v":19.3,"d":"19.300"},{"$f":"IF(AND('Att. Dairy'!B33=\"\"),\"\",IF(AND(AH33=\"\"),\"\",IF(AND(C33=\"YES\",AH33>0),AH33*$BB$1,AH33*$BC$1)))","v":{"v":0,"d":"0.00"}},{"$f":"IF(AND('Att. Dairy'!B33=\"\"),\"\",IF(AND(AK33=\"\"),\"\",AK33*$BD$1))","v":{"v":0,"d":"0.00"}},{"$f":"IF(AND('Att. Dairy'!B33=\"\"),\"\",IF(AND(AV33=\"\",AW33=\"\"),\"\",SUM(AV33,AW33)))","v":{"v":0,"d":"0.00"}},{"$f":"IF(AND('Att. Dairy'!B33=\"\"),\"\",IF(AND(AF33=\"\"),\"\",BI33))","v":""},{"$nulls":6},{"$f":"IF(AND('Att. Dairy'!C33=\"\"),\"\",'Att. Dairy'!C33)","v":""},"",{"$f":"IF(AND('Att. Dairy'!D33=\"\"),\"\",'Att. Dairy'!D33)","v":"Sunday"},"vodk'k",null,0,{"$nulls":14},false,false,{"$nulls":45},"2019-07-28",0,{"v":218.9,"d":"218.90"},{"v":141.1,"d":"141.10"},{"v":77.2,"d":"77.20"},{"v":0,"d":"0.00"},{"v":0,"d":"0.00"},{"v":0,"d":"0.00"},{"v":218.9,"d":"218.90"},{"v":141.1,"d":"141.10"},{"v":77.2,"d":"77.20"},"","","","","","","0","0",{"v":0,"d":"0.00"},{"v":218.9,"d":"218.90"},{"v":141.1,"d":"141.10"},{"v":77.2,"d":"77.20"},{"v":0,"d":"0.00"},{"v":0,"d":"0.00"},""]
[29,{"$f":"IF(AND('Att. Dairy'!B34=\"\"),\"\",'Att. Dairy'!B34)","v":"2019-07-29"},null,{"v":218.9,"d":"218.900"},{"v":141.1,"d":"141.100"},{"v":38.6,"d":"38.600"},{"v":19.3,"d":"19.300"},{"v":19.3,"d":"19.300"},{"$nulls":15},{"v":218.9,"d":"218.900"},{"v":141.1,"d":"141.100"},{"v":38.6,"d":"38.600"},{"v":19.3,"d":"19.300"},{"v":19.3,"d":"19.300"},{"$f":"IF(AND('Att. Dairy'!O34=\"\"),\"\",'Att. Dairy'!O34)","v":""},{"$f":"IF(AND('Att. Dairy'!P34=\"\"),\"\",'Att. Dairy'!P34)","v":""},0,{"$f":"IF(AND('Att. Dairy'!E34=\"\"),\"\",'Att. Dairy'!E34)","v":""},{"$f":"IF(AND('Att. Dairy'!F34=\"\"),\"\",'Att. Dairy'!F34)","v":""},0,{"$f":"IF(AND('Att. Dairy'!I34=\"\"),\"\",'Att. Dairy'!I34)","v":""},{"$f":"IF(AND('Att. Dairy'!J34=\"\"),\"\",'Att. Dairy'!J34)","v":""},0,{"v":0,"d":"0.000"},"0",{"v":0,"d":"0.000"},{"v":0,"d":"0.000"},{"v":0,"d":"0.000"},{"v":218.9,"d":"218.900"},{"v":141.1,"d":"141.100"},{"v":38.6,"d":"38.600"},{"v":19.3,"d":"19.300"},{"v":19.3,"d":"19.300"},{"$f":"IF(AND('Att. Dairy'!B34=\"\"),\"\",IF(AND(AH34=\"\"),\"\",IF(AND(C34=\"YES\",AH34>0),AH34*$BB$1,AH34*$BC$1)))","v":{"v":0,"d":"0.00"}},{"$f":"IF(AND('Att. Dairy'!B34=\"\"),\"\",IF(AND(AK34=\"\"),\"\",AK34*$BD$1))","v":{"v":0,"d":"0.00"}},{"$f":"IF(AND('Att. Dairy'!B34=\"\"),\"\",IF(AND(AV34=\"\",AW34=\"\"),\"\",SUM(AV34,AW34)))","v":{"v":0,"d":"0.00"}},{"$f":"IF(AND('Att. Dairy'!B34=\"\"),\"\",IF(AND(AF34=\"\"),\"\",BI34))","v":""},{"$nulls":6},{"$f":"IF(AND('Att. Dairy'!C34=\"\"),\"\",'Att. Dairy'!C34)","v":""},"",{"$f":"IF(AND('Att. Dairy'!D34=\"\"),\"\",'Att. Dairy'!D34)","v":"Monday"},"lCthjksVh",null,0,{"$nulls":14},"W","W",{"$nulls":45},"2019-07-29",0,{"v":218.9,"d":"218.90"},{"v":141.1,"d":"141.10"},{"v":77.2,"d":"77.20"},{"v":0,"d":"0.00"},{"v":0,"d":"0.00"},{"v":0,"d":"0.00"},{"v":218.9,"d":"218.90"},{"v":141.1,"d":"141.10"},{"v":77.2,"d":"77.20"},"","","","","","",{"v":0,"d":"0.00"},"0",{"v":0,"d":"0.00"},{"v":218.9,"d":"218.90"},{"v":141.1,"d":"141.10"},{"v":77.2,"d":"77.20"},{"v":0,"d":"0.00"},{"v":0,"d":"0.00"},""]
[30,{"$f":"IF(AND('Att. Dairy'!B35=\"\"),\"\",'Att. Dairy'!B35)","v":"2019-07-30"},null,{"v":218.9,"d":"218.900"},{"v":141.1,"d":"141.100"},{"v":38.6,"d":"38.600"},{"v":19.3,"d":"19.300"},{"v":19.3,"d":"19.300"},{"$nulls":15},{"v":218.9,"d":"218.900"},{"v":141.1,"d":"141.100"},{"v":38.6,"d":"38.600"},{"v":19.3,"d":"19.300"},{"v":19.3,"d":"19.300"},{"$f":"IF(AND('Att. Dairy'!O35=\"\"),\"\",'Att. Dairy'!O35)","v":""},{"$f":"IF(AND('Att. Dairy'!P35=\"\"),\"\",'Att. Dairy'!P35)","v":""},0,{"$f":"IF(AND('Att. Dairy'!E35=\"\"),\"\",'Att. Dairy'!E35)","v":""},{"$f":"IF(AND('Att. Dairy'!F35=\"\"),\"\",'Att. Dairy'!F35)","v":""},0,{"$f":"IF(AND('Att. Dairy'!I35=\"\"),\"\",'Att. Dairy'!I35)","v":""},{"$f":"IF(AND('Att. Dairy'!J35=\"\"),\"\",'Att. Dairy'!J35)","v":""},0,"0",{"v":0,"d":"0.000"},{"v":0,"d":"0.000"},{"v":0,"d":"0.000"},{"v":0,"d":"0.000"},{"v":218.9,"d":"218.900"},{"v":141.1,"d":"141.100"},{"v":38.6,"d":"38.600"},{"v":19.3,"d":"19.300"},{"v":19.3,"d":"19.300"},{"$f":"IF(AND('Att. Dairy'!B35=\"\"),\"\",IF(AND(AH35=\"\"),\"\",IF(AND(C35=\"YES\",AH35>0),AH35*$BB$1,AH35*$BC$1)))","v":{"v":0,"d":"0.00"}},{"$f":"IF(AND('Att. Dairy'!B35=\"\"),\"\",IF(AND(AK35=\"\"),\"\",AK35*$BD$1))","v":{"v":0,"d":"0.00"}},{"$f":"IF(AND('Att. Dairy'!B35=\"\"),\"\",IF(AND(AV35=\"\",AW35=\"\"),\"\",SUM(AV35,AW35)))","v":{"v":0,"d":"0.00"}},{"$f":"IF(AND('Att. Dairy'!B35=\"\"),\"\",IF(AND(AF35=\"\"),\"\",BI35))","v":""},{"$nulls":6},{"$f":"IF(AND('Att. Dairy'!C35=\"\"),\"\",'Att. Dairy'!C35)","v":""},"",{"$f":"IF(AND('Att. Dairy'!D35=\"\"),\"\",'Att. Dairy'!D35)","v":"Tuesday"},"nkypkoy",null,0,{"$nulls":14},"R","R",{"$nulls":45},"2019-07-30",0,{"v":218.9,"d":"218.90"},{"v":141.1,"d":"141.10"},{"v":77.2,"d":"77.20"},{"v":0,"d":"0.00"},{"v":0,"d":"0.00"},{"v":0,"d":"0.00"},{"v":218.9,"d":"218.90"},{"v":141.1,"d":"141.10"},{"v":77.2,"d":"77.20"},"","","","","","","0",{"v":0,"d":"0.00"},{"v":0,"d":"0.00"},{"v":218.9,"d":"218.90"},{"v":141.1,"d":"141.10"},{"v":77.2,"d":"77.20"},{"v":0,"d":"0.00"},{"v":0,"d":"0.00"},""]
[31,{"$f":"IF(AND('Att. Dairy'!B36=\"\"),\"\",'Att. Dairy'!B36)","v":"2019-07-31"},null,{"v":218.9,"d":"218.900"},{"v":141.1,"d":"141.100"},{"v":38.6,"d":"38.600"},{"v":19.3,"d":"19.300"},{"v":19.3,"d":"19.300"},{"$nulls":15},{"v":218.9,"d":"218.900"},{"v":141.1,"d":"141.100"},{"v":38.6,"d":"38.600"},{"v":19.3,"d":"19.300"},{"v":19.3,"d":"19.300"},{"$f":"IF(AND('Att. Dairy'!O36=\"\"),\"\",'Att. Dairy'!O36)","v":""},{"$f":"IF(AND('Att. Dairy'!P36=\"\"),\"\",'Att. Dairy'!P36)","v":""},0,{"$f":"IF(AND('Att. Dairy'!E36=\"\"),\"\",'Att. Dairy'!E36)","v":""},{"$f":"IF(AND('Att. Dairy'!F36=\"\"),\"\",'Att. Dairy'!F36)","v":""},0,{"$f":"IF(AND('Att. Dairy'!I36=\"\"),\"\",'Att. Dairy'!I36)","v":""},{"$f":"IF(AND('Att. Dairy'!J36=\"\"),\"\",'Att. Dairy'!J36)","v":""},0,{"v":0,"d":"0.000"},"0",{"v":0,"d":"0.000"},{"v":0,"d":"0.000"},{"v":0,"d":"0.000"},{"v":218.9,"d":"218.900"},{"v":141.1,"d":"141.100"},{"v":38.6,"d":"38.600"},{"v":19.3,"d":"19.300"},{"v":19.3,"d":"19.300"},{"$f":"IF(AND('Att. Dairy'!B36=\"\"),\"\",IF(AND(AH36=\"\"),\"\",IF(AND(C36=\"YES\",AH36>0),AH36*$BB$1,AH36*$BC$1)))","v":{"v":0,"d":"0.00"}},{"$f":"IF(AND('Att. Dairy'!B36=\"\"),\"\",IF(AND(AK36=\"\"),\"\",AK36*$BD$1))","v":{"v":0,"d":"0.00"}},{"$f":"IF(AND('Att. Dairy'!B36=\"\"),\"\",IF(AND(AV36=\"\",AW36=\"\"),\"\",SUM(AV36,AW36)))","v":{"v":0,"d":"0.00"}},{"$f":"IF(AND('Att. Dairy'!B36=\"\"),\"\",IF(AND(AF36=\"\"),\"\",BI36))","v":""},{"$nulls":6},{"$f":"IF(AND('Att. Dairy'!C36=\"\"),\"\",'Att. Dairy'!C36)","v":""},"",{"$f":"IF(AND('Att. Dairy'!D36=\"\"),\"\",'Att. Dairy'!D36)","v":"Wednesday"},"nkyjksVh",null,0,{"$nulls":14},"W","W",{"$nulls":45},"2019-07-31",0,{"v":218.9,"d":"218.90"},{"v":141.1,"d":"141.10"},{"v":77.2,"d":"77.20"},{"v":0,"d":"0.00"},{"v":0,"d":"0.00"},{"v":0,"d":"0.00"},{"v":218.9,"d":"218.90"},{"v":141.1,"d":"141.10"},{"v":77.2,"d":"77.20"},"","","","","","",{"v":0,"d":"0.00"},"0",{"v":0,"d":"0.00"},{"v":218.9,"d":"218.90"},{"v":141.1,"d":"141.10"},{"v":77.2,"d":"77.20"},{"v":0,"d":"0.00"},{"v":0,"d":"0.00"},""]
[{"$nulls":3},"dqy",{"$nulls":4},{"$f":"SUM(I6:I36)","v":{"v":0,"d":"0.000"}},{"$f":"SUM(J6:J36)","v":{"v":0,"d":"0.000"}},{"$f":"SUM(K6:K36)","v":{"v":0,"d":"0.000"}},{"v":0,"d":"0.000"},{"v":0,"d":"0.000"},{"$f":"SUM(N6:N36)","v":{"v":0,"d":"0.000"}},{"$f":"SUM(O6:O36)","v":{"v":0,"d":"0.000"}},{"v":0,"d":"0.000"},{"v":0,"d":"0.000"},{"v":0,"d":"0.000"},{"v":0,"d":"0.000"},{"v":0,"d":"0.000"},{"v":0,"d":"0.000"},{"v":0,"d":"0.000"},{"v":0,"d":"0.000"},{"$nulls":5},{"$f":"SUM(AC6:AC36)","v":1008},{"$f":"SUM(AD6:AD36)","v":1015},2023,198,202,400,208,223,{"$f":"SUM(AK6:AK36)","v":431},{"$f":"SUM(AL6:AL36)","v":{"v":31.099999999999998,"d":"31.100"}},{"$f":"SUM(AM6:AM36)","v":{"v":8.9,"d":"8.900"}},{"$f":"SUM(AN6:AN36)","v":{"v":1.4,"d":"1.400"}},{"$f":"SUM(AO6:AO36)","v":{"v":0.7,"d":"0.700"}},{"v":0.7,"d":"0.700"},{"$nulls":5},{"$f":"SUM(AV6:AV36)","v":{"v":1562.1999999999998,"d":"1562.20"}},{"$f":"SUM(AW6:AW36)","v":2262.75},{"$f":"SUM(AX6:AX36)","v":3824.95},{"$nulls":7},{"$f":"IF(AND('Att. Dairy'!C37=\"\"),\"\",'Att. Dairy'!C37)","v":""},"",{"$f":"IF(AND('Att. Dairy'!D37=\"\"),\"\",'Att. Dairy'!D37)","v":""},null,null,{"$f":"SUM(BK6:BK36)","v":{"v":431.20000000000005,"d":"431"}},{"$nulls":14},"","",{"$nulls":46},"dqy",{"$nulls":3},{"$f":"SUM(DZ6:DZ36)","v":{"v":0,"d":"0.00"}},{"$f":"SUM(EA6:EA36)","v":{"v":0,"d":"0.00"}},{"v":0,"d":"0.00"},{"$nulls":3},{"$f":"SUM(EF6:EF36)","v":1008},{"$f":"SUM(EG6:EG36)","v":1015},198,202,208,223,{"$f":"SUM(EL6:EL36)","v":{"v":31.099999999999998,"d":"31.10"}},{"$f":"SUM(EM6:EM36)","v":{"v":8.9,"d":"8.90"}},{"$f":"SUM(EN6:EN36)","v":{"v":2.8,"d":"2.80"}},{"$nulls":3},{"$f":"SUM(ER6:ER36)","v":{"v":1562.1999999999998,"d":"1562.20"}},{"$f":"SUM(ES6:ES36)","v":2262.75}]
[{"$nulls":36},31,null,{"$f":"AL37+AM37","v":{"v":40,"d":"40.000"}},{"$nulls":8},{"$f":"SUM(C6:C36)","v":{"v":0,"d":"0.00"}},{"$nulls":9},{"$f":"IF(AND('Att. Dairy'!C38=\"\"),\"\",'Att. Dairy'!C38)","v":""},"",{"$nulls":17},{"v":0,"d":"0.000"},"",""]
[{"$nulls":18},{"$f":"N37+S37","v":{"v":0,"d":"0.000"}},{"$f":"O37+T37","v":{"v":0,"d":"0.000"}},{"$nulls":16},0,{"$nulls":10},{"$f":"#REF!","v":{"$error":"#REF!"}},{"$nulls":9},{"$f":"IF(AND('Att. Dairy'!C39=\"\"),\"\",'Att. Dairy'!C39)","v":""},"",{"$nulls":17},0,"",""]
[{"$nulls":18},{"v":0,"d":"0.000"},{"v":0,"d":"0.000"},{"$nulls":27},{"$f":"SUM(AV39-AV37+AV38)","v":{"$error":"#REF!"}},{"$nulls":9},{"$f":"IF(AND('Att. Dairy'!C40=\"\"),\"\",'Att. Dairy'!C40)","v":""},"",{"$nulls":17},{"v":0,"d":"0.00"},"",""]
[{"$nulls":57},{"$f":"IF(AND('Att. Dairy'!C41=\"\"),\"\",'Att. Dairy'!C41)","v":""},"",{"$nulls":18},"",""]
[{"$nulls":57},{"$f":"IF(AND('Att. Dairy'!C42=\"\"),\"\",'Att. Dairy'!C42)","v":""},"",{"$nulls":18},"",""]
[{"$nulls":37},"ekg esa çkIr dqy jkf'k",{"$nulls":19},{"$f":"IF(AND('Att. Dairy'!C43=\"\"),\"\",'Att. Dairy'!C43)","v":""},"",{"$nulls":18},"",""]
[{"$nulls":37},"ekg esa O;; dqy jkf'k",{"$nulls":19},{"$f":"IF(AND('Att. Dairy'!C44=\"\"),\"\",'Att. Dairy'!C44)","v":""},"",{"$nulls":18},"",{"$f":"IF(AND(BW44=\"\"),BZ44,BX44)","v":""}]
[{"$nulls":37},"ekg esa 'ks\"k jkf'k",{"$nulls":19},{"$f":"IF(AND('Att. Dairy'!C45=\"\"),\"\",'Att. Dairy'!C45)","v":""}]
[{"$nulls":37},"ekg esa ykHkfUor fo|kFkhZ",{"$nulls":19},{"$f":"IF(AND('Att. Dairy'!C46=\"\"),\"\",'Att. Dairy'!C46)","v":""}]
[{"$nulls":57},{"$f":"IF(AND('Att. Dairy'!C47=\"\"),\"\",'Att. Dairy'!C47)","v":""}]
[{"$nulls":57},{"$f":"IF(AND('Att. Dairy'!C48=\"\"),\"\",'Att. Dairy'!C48)","v":""}]

{"sheet":"UPS balance Sheet","index":5,"n_rows":46,"n_cols":150,"rows_kept":46,"merged":[[0,1,0,2],[0,3,0,6],[0,7,0,15],[0,20,0,23],[0,30,0,34],[1,1,3,1],[1,2,4,2],[1,3,3,7],[1,8,3,12],[1,13,2,17],[1,18,2,22],[1,23,3,27],[1,28,3,30],[1,31,3,33],[1,34,3,36],[1,37,3,41],[1,42,3,46],[1,47,4,47],[1,48,4,48],[1,49,4,49],[1,50,4,50],[1,124,3,124],[1,125,4,125],[1,126,3,128],[1,129,3,131],[1,132,3,134],[1,135,3,136],[1,137,3,138],[1,139,3,140],[1,141,3,143],[1,144,3,146],[1,147,4,147],[1,148,4,148],[1,149,4,149],[3,13,3,17],[3,18,3,22],[36,1,36,2],[36,3,36,4],[36,125,36,127],[42,37,42,38],[43,37,43,38],[44,37,44,38],[45,37,45,38]]}
[null,"loZçFke vVsusUl 'khV ij fnukad okys Column dh çfof\"B;ka iw.kZ djsa ",null,"Presented By:-",{"$nulls":3},"Mr. HeeraLaL Jat Sojat (PALI)   ",{"$nulls":12},{"$f":"CONCATENATE('MASTER DATA'!I4, 'MASTER DATA'!J4)","v":"ekg %&tqykbZ&2019"},{"$nulls":32},{"$f":"'MASTER DATA'!C33","v":{"v":4.6,"d":"4.60"}},{"$f":"'MASTER DATA'!D33","v":6.51},{"$f":"'MASTER DATA'!I33","v":{"v":7,"d":"7.00"}}]
[null,"fnukad","nky ds fy,  Yes/No","çkjfEHkd [kk|ku o  nky  dh  ek=k fdyks xzke esa ",{"$nulls":4},"forj.k drkZ ls çkIr [kk|ku fdyks xzke esa",{"$nulls":4},"vU;= lzksr ls m/kkj  fy;k@fn;k¼fdxzk½",{"$nulls":4},"vU; fo|ky; ls m/kkj fy;k@fn;k¼fdxzk½",{"$nulls":4},"dqy [kk|ku o  nky",{"$nulls":4},"  dqy ukekadu d{kk 6 ls 8",null,null,"dqy ykHkkfUor Nk=@Nk=k       d{kk 6 ls 8",null,null,"dqy nqX/k ls ykHkkfUor",null,null,"ekg esa mi;ksx fy;k x;k izfrfnu [kk|ku o nky",{"$nulls":4}," 'ks\"k [kk|ku o nky",{"$nulls":4},"ekg esa izfrfnu dUotZu ij O;; jkf'k","ekg esa izfrfnu nqX/k ij O;; jkf'k","ekg esa izfrfnu dqy O;; jkf'k","feuw ds vuqlkj Hkkstu",{"$nulls":73},"fnukad","nky ds fy,  Yes/ No","çkjfEHkd [kk|ku o  nky  dh  ek=k fdyks xzke esa ",null,null,"forj.k drkZ ls çkIr [kk|ku fdyks xzke esa",null,null,"dqy [kk|ku o  nky",null,null,"  dqy ukekadu d{kk 1 ls 5",null,"dqy ykHkkfUor Nk=@Nk=k       d{kk 1 ls 5",null,"dqy nqX/k ls ykHkkfUor",null,"ekg esa mi;ksx fy;k x;k izfrfnu [kk|ku o nky",null,null," 'ks\"k [kk|ku o nky",null,null,"ekg esa izfrfnu dUotZu ij O;; jkf'k","ekg esa izfrfnu nqX/k ij O;; jkf'k","feuw ds vuqlkj Hkkstu"]
[]
[{"$nulls":13},"m/kkj nsus ij¼&½fpUg yxk,",{"$nulls":4},"m/kkj nsus ij¼&½fpUg yxk,"]
["Sr.","MM-DDD-YYYY e.g.(01-Jan-1900) ",null,"xsagw","pkoy","ewax","mM+n","puk","xsagw","pkoy","ewax","mM+n","puk","xsagw","pkoy","ewax","mM+n","puk","xsagw","pkoy","ewax","mM+n","puk","xsagw","pkoy","ewax","mM+n","puk","Nk=","Nk=k","dqy","Nk=","Nk=k","dqy","Nk=","Nk=k","dqy","xsagw","pkoy","ewax","mM+n","puk","xsagw","pkoy","ewax","mM+n","puk",{"$nulls":11},"Wheat/Rice",{"$nulls":18},"Wheat/Rice","Wheat/Rice",{"$nulls":45},"MM-DD-YYYY e.g.(01-Jan-1900) ",null,"xsagw","pkoy","nky","xsagw","pkoy","nky","xsagw","pkoy","nky","Nk=","Nk=k","Nk=","Nk=k","Nk=","Nk=k","xsagw","pkoy","nky","xsagw","pkoy","ewax"]
[1,{"$f":"IF(AND('Att. Dairy'!B6=\"\"),\"\",'Att. Dairy'!B6)","v":"2019-07-01"},"YES",{"v":300,"d":"300.000"},{"v":200,"d":"200.000"},{"v":60,"d":"60.000"},{"v":30,"d":"30.000"},{"v":30,"d":"30.000"},{"$nulls":15},{"$f":"IF(AND(D6=\"\"),\"\",SUM(D6,I6,N6,S6))","v":{"v":300,"d":"300.000"}},{"$f":"IF(AND(E6=\"\"),\"\",SUM(E6,J6,O6,T6))","v":{"v":200,"d":"200.000"}},{"$f":"IF(AND(F6=\"\"),\"\",SUM(F6,K6,P6,U6))","v":{"v":60,"d":"60.000"}},{"$f":"IF(AND(G6=\"\"),\"\",SUM(G6,L6,Q6,V6))","v":{"v":30,"d":"30.000"}},{"$f":"IF(AND(H6=\"\"),\"\",SUM(H6,M6,R6,W6))","v":{"v":30,"d":"30.000"}},{"$f":"IF(AND('Att. Dairy'!R6=\"\"),\"\",'Att. Dairy'!R6)","v":96},{"$f":"IF(AND('Att. Dairy'!S6=\"\"),\"\",'Att. Dairy'!S6)","v":111},{"$f":"SUM(AC6,AD6)","v":207},{"$f":"IF(AND('Att. Dairy'!G6=\"\"),\"\",'Att. Dairy'!G6)","v":27},{"$f":"IF(AND('Att. Dairy'!H6=\"\"),\"\",'Att. Dairy'!H6)","v":28},{"$f":"SUM(AF6,AG6)","v":55},{"$f":"IF(AND('Att. Dairy'!L6=\"\"),\"\",'Att. Dairy'!L6)","v":30},{"$f":"IF(AND('Att. Dairy'!M6=\"\"),\"\",'Att. Dairy'!M6)","v":30},{"$f":"SUM(AI6,AJ6)","v":60},{"$f":"IF(AND(AH6=\"\"),\"0\",IF(AND(CA6=\"w\"),AH6*150/1000,\"0\"))","v":{"v":8.25,"d":"8.250"}},{"$f":"IF(AND(AH6=\"\"),\"0\",IF(AND(CA6=\"R\"),AH6*150/1000,\"0\"))","v":"0"},{"$f":"IF(AND(C6=\"YES\",AH6>0),AH6*0.015,0)","v":0.825},{"$f":"IF(AND(C6=\"YES\",AH6>0),AH6*0.0075,0)","v":{"v":0.4125,"d":"0.413"}},{"$f":"IF(AND(C6=\"YES\",AH6>0),AH6*0.0075,0)","v":{"v":0.4125,"d":"0.413"}},{"$f":"SUM(X6-AL6)","v":{"v":291.75,"d":"291.750"}},{"$f":"(Y6-AM6)","v":{"v":200,"d":"200.000"}},{"$f":"(Z6-AN6)","v":59.175},{"v":29.5875,"d":"29.588"},{"v":29.5875,"d":"29.588"},{"$f":"IF(AND('Att. Dairy'!B6=\"\"),\"\",IF(AND(AH6=\"\"),\"\",IF(AND(C6=\"YES\",AH6>0),AH6*$BB$1,AH6*$BC$1)))","v":{"v":252.99999999999997,"d":"253.00"}},{"$f":"IF(AND('Att. Dairy'!B6=\"\"),\"\",IF(AND(AK6=\"\"),\"\",AK6*$BD$1))","v":{"v":420,"d":"420.00"}},{"$f":"IF(AND('Att. Dairy'!B6=\"\"),\"\",IF(AND(AV6=\"\",AW6=\"\"),\"\",SUM(AV6,AW6)))","v":{"v":673,"d":"673.00"}},{"$f":"IF(AND('Att. Dairy'!B6=\"\"),\"\",IF(AND(AF6=\"\"),\"\",BI6))","v":"lCthjksVh"},{"$nulls":6},{"$f":"IF(AND('Att. Dairy'!C6=\"\"),\"\",'Att. Dairy'!C6)","v":"Wheat"},{"$f":"IF(AND(BF6=\"\"),\"\",IF(BF6=\"Rice\",\"R\",IF(BF6=\"Wheat\",\"W\")))","v":"W"},{"$f":"IF(AND('Att. Dairy'!D6=\"\"),\"\",'Att. Dairy'!D6)","v":"Monday"},{"$f":"IF(OR(BH6=0,BH6=\"\"),\"\",IF(BH6=\"tuesday\",\"nkypkoy\",IF(BH6=\"thursday\",\"f[kpM+h\",IF(OR(BH6=\"monday\",BH6=\"saturday\"),\"lCthjksVh\",IF(OR(BH6=\"wednesday\",BH6=\"friday\"),\"nkyjksVh\",\"vodk'k\")))))","v":"lCthjksVh"},{"$f":"IF(AND(C6=BM$10),AV6,0)","v":252.99999999999997},{"$nulls":15},{"$f":"IF(OR(BH6=0,BH6=\"\"),\"\",IF(BH6=\"tuesday\",\"R\",IF(BH6=\"thursday\",\"R\",IF(OR(BH6=\"monday\",BH6=\"saturday\"),\"W\",IF(OR(BH6=\"wednesday\",BH6=\"friday\"),\"W\")))))","v":"W"},{"$f":"IF(AND(BF6=\"\"),BZ6,BG6)","v":"W"},{"$nulls":45},{"$f":"IF(AND(B6=\"\"),\"\",B6)","v":"2019-07-01"},{"$f":"C6","v":"YES"},{"$f":"D6","v":{"v":300,"d":"300.00"}},{"$f":"E6","v":{"v":200,"d":"200.00"}},{"$f":"F6+G6+H6","v":{"v":120,"d":"120.00"}},{"$f":"I6","v":{"v":0,"d":"0.00"}},{"$f":"J6","v":{"v":0,"d":"0.00"}},{"$f":"K6+L6+M6","v":{"v":0,"d":"0.00"}},{"$f":"X6","v":{"v":300,"d":"300.00"}},{"$f":"Y6","v":{"v":200,"d":"200.00"}},{"$f":"Z6+AA6+AB6","v":{"v":120,"d":"120.00"}},{"$f":"AC6","v":96},{"$f":"AD6","v":111},{"$f":"AF6","v":27},{"$f":"AG6","v":28},{"$f":"AI6","v":30},{"$f":"AJ6","v":30},{"$f":"AL6","v":8.25},{"$f":"AM6","v":"0"},{"$f":"AN6+AO6+AP6","v":1.65},{"$f":"AQ6","v":291.75},{"$f":"AR6","v":{"v":200,"d":"200.00"}},{"$f":"AS6+AT6+AU6","v":118.35},{"$f":"AV6","v":{"v":252.99999999999997,"d":"253.00"}},{"$f":"AW6","v":{"v":420,"d":"420.00"}},{"$f":"AY6","v":"lCthjksVh"}]
[2,{"$f":"IF(AND('Att. Dairy'!B7=\"\"),\"\",'Att. Dairy'!B7)","v":"2019-07-02"},"YES",{"$f":"IF(AND(AQ6=\"\"),\"\",AQ6)","v":{"v":291.75,"d":"291.750"}},{"$f":"IF(AND(AR6=\"\"),\"\",AR6)","v":{"v":200,"d":"200.000"}},{"$f":"IF(AND(AS6=\"\"),\"\",AS6)","v":59.175},{"v":29.5875,"d":"29.588"},{"v":29.5875,"d":"29.588"},{"$nulls":15},{"$f":"IF(AND(D7=\"\"),\"\",SUM(D7,I7,N7,S7))","v":{"v":291.75,"d":"291.750"}},{"v":200,"d":"200.000"},59.175,{"v":29.5875,"d":"29.588"},{"v":29.5875,"d":"29.588"},{"$f":"IF(AND('Att. Dairy'!R7=\"\"),\"\",'Att. Dairy'!R7)","v":96},{"$f":"IF(AND('Att. Dairy'!S7=\"\"),\"\",'Att. Dairy'!S7)","v":111},{"$f":"SUM(AC7,AD7)","v":207},{"$f":"IF(AND('Att. Dairy'!G7=\"\"),\"\",'Att. Dairy'!G7)","v":""},{"$f":"IF(AND('Att. Dairy'!H7=\"\"),\"\",'Att. Dairy'!H7)","v":""},{"$f":"SUM(AF7,AG7)","v":0},{"$f":"IF(AND('Att. Dairy'!L7=\"\"),\"\",'Att. Dairy'!L7)","v":65},{"$f":"IF(AND('Att. Dairy'!M7=\"\"),\"\",'Att. Dairy'!M7)","v":66},{"$f":"SUM(AI7,AJ7)","v":131},{"$f":"IF(AND(AH7=\"\"),\"0\",IF(AND(CA7=\"w\"),AH7*150/1000,\"0\"))","v":"0"},{"$f":"IF(AND(AH7=\"\"),\"0\",IF(AND(CA7=\"R\"),AH7*150/1000,\"0\"))","v":{"v":0,"d":"0.000"}},{"$f":"IF(AND(C7=\"YES\",AH7>0),AH7*0.015,0)","v":{"v":0,"d":"0.000"}},{"$f":"IF(AND(C7=\"YES\",AH7>0),AH7*0.0075,0)","v":{"v":0,"d":"0.000"}},{"$f":"IF(AND(C7=\"YES\",AH7>0),AH7*0.0075,0)","v":{"v":0,"d":"0.000"}},{"v":291.75,"d":"291.750"},{"$f":"(Y7-AM7)","v":{"v":200,"d":"200.000"}},59.175,{"v":29.5875,"d":"29.588"},{"v":29.5875,"d":"29.588"},{"$f":"IF(AND('Att. Dairy'!B7=\"\"),\"\",IF(AND(AH7=\"\"),\"\",IF(AND(C7=\"YES\",AH7>0),AH7*$BB$1,AH7*$BC$1)))","v":{"v":0,"d":"0.00"}},{"$f":"IF(AND('Att. Dairy'!B7=\"\"),\"\",IF(AND(AK7=\"\"),\"\",AK7*$BD$1))","v":{"v":917,"d":"917.00"}},{"$f":"IF(AND('Att. Dairy'!B7=\"\"),\"\",IF(AND(AV7=\"\",AW7=\"\"),\"\",SUM(AV7,AW7)))","v":{"v":917,"d":"917.00"}},{"$f":"IF(AND('Att. Dairy'!B7=\"\"),\"\",IF(AND(AF7=\"\"),\"\",BI7))","v":""},{"$nulls":6},{"$f":"IF(AND('Att. Dairy'!C7=\"\"),\"\",'Att. Dairy'!C7)","v":""},{"$f":"IF(AND(BF7=\"\"),\"\",IF(BF7=\"Rice\",\"R\",IF(BF7=\"Wheat\",\"W\")))","v":""},{"$f":"IF(AND('Att. Dairy'!D7=\"\"),\"\",'Att. Dairy'!D7)","v":"Tuesday"},{"$f":"IF(OR(BH7=0,BH7=\"\"),\"\",IF(BH7=\"tuesday\",\"nkypkoy\",IF(BH7=\"thursday\",\"f[kpM+h\",IF(OR(BH7=\"monday\",BH7=\"saturday\"),\"lCthjksVh\",IF(OR(BH7=\"wednesday\",BH7=\"friday\"),\"nkyjksVh\",\"vodk'k\")))))","v":"nkypkoy"},{"$f":"IF(AND(C7=BM$10),AV7,0)","v":0},{"$nulls":15},{"$f":"IF(OR(BH7=0,BH7=\"\"),\"\",IF(BH7=\"tuesday\",\"R\",IF(BH7=\"thursday\",\"R\",IF(OR(BH7=\"monday\",BH7=\"saturday\"),\"W\",IF(OR(BH7=\"wednesday\",BH7=\"friday\"),\"W\")))))","v":"R"},{"$f":"IF(AND(BF7=\"\"),BZ7,BG7)","v":"R"},{"$nulls":45},{"$f":"IF(AND(B7=\"\"),\"\",B7)","v":"2019-07-02"},{"$f":"C7","v":"YES"},291.75,{"v":200,"d":"200.00"},{"$f":"F7+G7+H7","v":118.35},{"$f":"I7","v":{"v":0,"d":"0.00"}},{"v":0,"d":"0.00"},{"$f":"K7+L7+M7","v":{"v":0,"d":"0.00"}},{"$f":"X7","v":291.75},{"v":200,"d":"200.00"},{"$f":"Z7+AA7+AB7","v":118.35},{"$f":"AC7","v":96},111,{"$f":"AF7","v":""},"",{"$f":"AI7","v":65},66,{"$f":"AL7","v":"0"},{"v":0,"d":"0.00"},{"$f":"AN7+AO7+AP7","v":{"v":0,"d":"0.00"}},{"$f":"AQ7","v":291.75},{"v":200,"d":"200.00"},{"$f":"AS7+AT7+AU7","v":118.35},{"$f":"AV7","v":{"v":0,"d":"0.00"}},{"v":917,"d":"917.00"},{"$f":"AY7","v":""}]
[3,{"$f":"IF(AND('Att. Dairy'!B8=\"\"),\"\",'Att. Dairy'!B8)","v":"2019-07-03"},"YES",{"$f":"IF(AND(AQ7=\"\"),\"\",AQ7)","v":{"v":291.75,"d":"291.750"}},{"v":200,"d":"200.000"},59.175,{"v":29.5875,"d":"29.588"},{"v":29.5875,"d":"29.588"},{"$nulls":15},{"v":291.75,"d":"291.750"},{"v":200,"d":"200.000"},59.175,{"v":29.5875,"d":"29.588"},{"v":29.5875,"d":"29.588"},{"$f":"IF(AND('Att. Dairy'!R8=\"\"),\"\",'Att. Dairy'!R8)","v":96},{"$f":"IF(AND('Att. Dairy'!S8=\"\"),\"\",'Att. Dairy'!S8)","v":111},207,{"$f":"IF(AND('Att. Dairy'!G8=\"\"),\"\",'Att. Dairy'!G8)","v":""},{"$f":"IF(AND('Att. Dairy'!H8=\"\"),\"\",'Att. Dairy'!H8)","v":""},0,{"$f":"IF(AND('Att. Dairy'!L8=\"\"),\"\",'Att. Dairy'!L8)","v":45},{"$f":"IF(AND('Att. Dairy'!M8=\"\"),\"\",'Att. Dairy'!M8)","v":46},91,{"v":0,"d":"0.000"},"0",{"v":0,"d":"0.000"},{"v":0,"d":"0.000"},{"v":0,"d":"0.000"},{"v":291.75,"d":"291.750"},{"v":200,"d":"200.000"},{"$f":"(Z8-AN8)","v":59.175},{"$f":"(AA8-AO8)","v":{"v":29.5875,"d":"29.588"}},{"v":29.5875,"d":"29.588"},{"$f":"IF(AND('Att. Dairy'!B8=\"\"),\"\",IF(AND(AH8=\"\"),\"\",IF(AND(C8=\"YES\",AH8>0),AH8*$BB$1,AH8*$BC$1)))","v":{"v":0,"d":"0.00"}},{"$f":"IF(AND('Att. Dairy'!B8=\"\"),\"\",IF(AND(AK8=\"\"),\"\",AK8*$BD$1))","v":{"v":637,"d":"637.00"}},{"$f":"IF(AND('Att. Dairy'!B8=\"\"),\"\",IF(AND(AV8=\"\",AW8=\"\"),\"\",SUM(AV8,AW8)))","v":{"v":637,"d":"637.00"}},{"$f":"IF(AND('Att. Dairy'!B8=\"\"),\"\",IF(AND(AF8=\"\"),\"\",BI8))","v":""},{"$nulls":6},{"$f":"IF(AND('Att. Dairy'!C8=\"\"),\"\",'Att. Dairy'!C8)","v":""},"",{"$f":"IF(AND('Att. Dairy'!D8=\"\"),\"\",'Att. Dairy'!D8)","v":"Wednesday"},"nkyjksVh",0,{"$nulls":15},"W","W",{"$nulls":45},"2019-07-03","YES",291.75,{"v":200,"d":"200.00"},118.35,{"v":0,"d":"0.00"},{"v":0,"d":"0.00"},{"v":0,"d":"0.00"},291.75,{"v":200,"d":"200.00"},118.35,96,111,"","",45,46,{"v":0,"d":"0.00"},"0",{"v":0,"d":"0.00"},291.75,{"v":200,"d":"200.00"},118.35,{"v":0,"d":"0.00"},{"v":637,"d":"637.00"},""]
[4,{"$f":"IF(AND('Att. Dairy'!B9=\"\"),\"\",'Att. Dairy'!B9)","v":"2019-07-04"},"YES",{"v":291.75,"d":"291.750"},{"v":200,"d":"200.000"},59.175,{"v":29.5875,"d":"29.588"},{"v":29.5875,"d":"29.588"},{"$nulls":15},{"v":291.75,"d":"291.750"},{"v":200,"d":"200.000"},59.175,{"v":29.5875,"d":"29.588"},{"v":29.5875,"d":"29.588"},{"$f":"IF(AND('Att. Dairy'!R9=\"\"),\"\",'Att. Dairy'!R9)","v":96},{"$f":"IF(AND('Att. Dairy'!S9=\"\"),\"\",'Att. Dairy'!S9)","v":111},207,{"$f":"IF(AND('Att. Dairy'!G9=\"\"),\"\",'Att. Dairy'!G9)","v":46},{"$f":"IF(AND('Att. Dairy'!H9=\"\"),\"\",'Att. Dairy'!H9)","v":47},93,{"$f":"IF(AND('Att. Dairy'!L9=\"\"),\"\",'Att. Dairy'!L9)","v":88},{"$f":"IF(AND('Att. Dairy'!M9=\"\"),\"\",'Att. Dairy'!M9)","v":96},184,"0",{"v":13.95,"d":"13.950"},1.395,{"v":0.6975,"d":"0.698"},{"v":0.6975,"d":"0.698"},{"v":291.75,"d":"291.750"},{"v":186.05,"d":"186.050"},{"v":57.779999999999994,"d":"57.780"},{"v":28.889999999999997,"d":"28.890"},{"v":28.889999999999997,"d":"28.890"},{"$f":"IF(AND('Att. Dairy'!B9=\"\"),\"\",IF(AND(AH9=\"\"),\"\",IF(AND(C9=\"YES\",AH9>0),AH9*$BB$1,AH9*$BC$1)))","v":{"v":427.79999999999995,"d":"427.80"}},{"$f":"IF(AND('Att. Dairy'!B9=\"\"),\"\",IF(AND(AK9=\"\"),\"\",AK9*$BD$1))","v":{"v":1288,"d":"1288.00"}},{"$f":"IF(AND('Att. Dairy'!B9=\"\"),\"\",IF(AND(AV9=\"\",AW9=\"\"),\"\",SUM(AV9,AW9)))","v":{"v":1715.8,"d":"1715.80"}},{"$f":"IF(AND('Att. Dairy'!B9=\"\"),\"\",IF(AND(AF9=\"\"),\"\",BI9))","v":"f[kpM+h"},{"$nulls":6},{"$f":"IF(AND('Att. Dairy'!C9=\"\"),\"\",'Att. Dairy'!C9)","v":""},"",{"$f":"IF(AND('Att. Dairy'!D9=\"\"),\"\",'Att. Dairy'!D9)","v":"Thursday"},"f[kpM+h",427.79999999999995,{"$nulls":15},"R","R",{"$nulls":45},"2019-07-04","YES",291.75,{"v":200,"d":"200.00"},118.35,{"v":0,"d":"0.00"},{"v":0,"d":"0.00"},{"v":0,"d":"0.00"},291.75,{"v":200,"d":"200.00"},118.35,96,111,46,47,88,96,"0",13.95,2.79,291.75,186.05,{"v":115.55999999999999,"d":"115.56"},{"v":427.79999999999995,"d":"427.80"},{"v":1288,"d":"1288.00"},"f[kpM+h"]
[5,{"$f":"IF(AND('Att. Dairy'!B10=\"\"),\"\",'Att. Dairy'!B10)","v":"2019-07-05"},"NO",{"v":291.75,"d":"291.750"},{"v":186.05,"d":"186.050"},{"v":57.779999999999994,"d":"57.780"},{"v":28.889999999999997,"d":"28.890"},{"v":28.889999999999997,"d":"28.890"},{"$nulls":15},{"v":291.75,"d":"291.750"},{"v":186.05,"d":"186.050"},{"v":57.779999999999994,"d":"57.780"},{"v":28.889999999999997,"d":"28.890"},{"v":28.889999999999997,"d":"28.890"},{"$f":"IF(AND('Att. Dairy'!R10=\"\"),\"\",'Att. Dairy'!R10)","v":96},{"$f":"IF(AND('Att. Dairy'!S10=\"\"),\"\",'Att. Dairy'!S10)","v":111},207,{"$f":"IF(AND('Att. Dairy'!G10=\"\"),\"\",'Att. Dairy'!G10)","v":""},{"$f":"IF(AND('Att. Dairy'!H10=\"\"),\"\",'Att. Dairy'!H10)","v":""},0,{"$f":"IF(AND('Att. Dairy'!L10=\"\"),\"\",'Att. Dairy'!L10)","v":60},{"$f":"IF(AND('Att. Dairy'!M10=\"\"),\"\",'Att. Dairy'!M10)","v":62},122,{"v":0,"d":"0.000"},"0",{"v":0,"d":"0.000"},{"v":0,"d":"0.000"},{"v":0,"d":"0.000"},{"v":291.75,"d":"291.750"},{"v":186.05,"d":"186.050"},{"v":57.779999999999994,"d":"57.780"},{"v":28.889999999999997,"d":"28.890"},{"v":28.889999999999997,"d":"28.890"},{"$f":"IF(AND('Att. Dairy'!B10=\"\"),\"\",IF(AND(AH10=\"\"),\"\",IF(AND(C10=\"YES\",AH10>0),AH10*$BB$1,AH10*$BC$1)))","v":{"v":0,"d":"0.00"}},{"$f":"IF(AND('Att. Dairy'!B10=\"\"),\"\",IF(AND(AK10=\"\"),\"\",AK10*$BD$1))","v":{"v":854,"d":"854.00"}},{"$f":"IF(AND('Att. Dairy'!B10=\"\"),\"\",IF(AND(AV10=\"\",AW10=\"\"),\"\",SUM(AV10,AW10)))","v":{"v":854,"d":"854.00"}},{"$f":"IF(AND('Att. Dairy'!B10=\"\"),\"\",IF(AND(AF10=\"\"),\"\",BI10))","v":""},{"$nulls":6},{"$f":"IF(AND('Att. Dairy'!C10=\"\"),\"\",'Att. Dairy'!C10)","v":""},"",{"$f":"IF(AND('Att. Dairy'!D10=\"\"),\"\",'Att. Dairy'!D10)","v":"Friday"},"nkyjksVh",0,null,null,"YES",{"$nulls":12},"W","W",{"$nulls":45},"2019-07-05","NO",291.75,186.05,{"v":115.55999999999999,"d":"115.56"},{"v":0,"d":"0.00"},{"v":0,"d":"0.00"},{"v":0,"d":"0.00"},291.75,186.05,{"v":115.55999999999999,"d":"115.56"},96,111,"","",60,62,{"v":0,"d":"0.00"},"0",{"v":0,"d":"0.00"},291.75,186.05,{"v":115.55999999999999,"d":"115.56"},{"v":0,"d":"0.00"},{"v":854,"d":"854.00"},""]
[6,{"$f":"IF(AND('Att. Dairy'!B11=\"\"),\"\",'Att. Dairy'!B11)","v":"2019-07-06"},null,{"v":291.75,"d":"291.750"},{"v":186.05,"d":"186.050"},{"v":57.779999999999994,"d":"57.780"},{"v":28.889999999999997,"d":"28.890"},{"v":28.889999999999997,"d":"28.890"},{"$nulls":15},{"v":291.75,"d":"291.750"},{"v":186.05,"d":"186.050"},{"v":57.779999999999994,"d":"57.780"},{"v":28.889999999999997,"d":"28.890"},{"v":28.889999999999997,"d":"28.890"},{"$f":"IF(AND('Att. Dairy'!R11=\"\"),\"\",'Att. Dairy'!R11)","v":96},{"$f":"IF(AND('Att. Dairy'!S11=\"\"),\"\",'Att. Dairy'!S11)","v":111},207,{"$f":"IF(AND('Att. Dairy'!G11=\"\"),\"\",'Att. Dairy'!G11)","v":65},{"$f":"IF(AND('Att. Dairy'!H11=\"\"),\"\",'Att. Dairy'!H11)","v":66},131,{"$f":"IF(AND('Att. Dairy'!L11=\"\"),\"\",'Att. Dairy'!L11)","v":""},{"$f":"IF(AND('Att. Dairy'!M11=\"\"),\"\",'Att. Dairy'!M11)","v":""},0,{"v":19.65,"d":"19.650"},"0",{"v":0,"d":"0.000"},{"v":0,"d":"0.000"},{"v":0,"d":"0.000"},{"v":272.1,"d":"272.100"},{"v":186.05,"d":"186.050"},{"v":57.779999999999994,"d":"57.780"},{"v":28.889999999999997,"d":"28.890"},{"v":28.889999999999997,"d":"28.890"},{"$f":"IF(AND('Att. Dairy'!B11=\"\"),\"\",IF(AND(AH11=\"\"),\"\",IF(AND(C11=\"YES\",AH11>0),AH11*$BB$1,AH11*$BC$1)))","v":852.81},{"$f":"IF(AND('Att. Dairy'!B11=\"\"),\"\",IF(AND(AK11=\"\"),\"\",AK11*$BD$1))","v":{"v":0,"d":"0.00"}},{"$f":"IF(AND('Att. Dairy'!B11=\"\"),\"\",IF(AND(AV11=\"\",AW11=\"\"),\"\",SUM(AV11,AW11)))","v":852.81},{"$f":"IF(AND('Att. Dairy'!B11=\"\"),\"\",IF(AND(AF11=\"\"),\"\",BI11))","v":"lCthjksVh"},{"$nulls":6},{"$f":"IF(AND('Att. Dairy'!C11=\"\"),\"\",'Att. Dairy'!C11)","v":""},"",{"$f":"IF(AND('Att. Dairy'!D11=\"\"),\"\",'Att. Dairy'!D11)","v":"Saturday"},"lCthjksVh",0,null,null,"NO",{"$nulls":12},"W","W",{"$nulls":45},"2019-07-06",0,291.75,186.05,{"v":115.55999999999999,"d":"115.56"},{"v":0,"d":"0.00"},{"v":0,"d":"0.00"},{"v":0,"d":"0.00"},291.75,186.05,{"v":115.55999999999999,"d":"115.56"},96,111,65,66,"","",19.65,"0",{"v":0,"d":"0.00"},{"v":272.1,"d":"272.10"},186.05,{"v":115.55999999999999,"d":"115.56"},852.81,{"v":0,"d":"0.00"},"lCthjksVh"]
[7,{"$f":"IF(AND('Att. Dairy'!B12=\"\"),\"\",'Att. Dairy'!B12)","v":"2019-07-07"},null,{"v":272.1,"d":"272.100"},{"v":186.05,"d":"186.050"},{"v":57.779999999999994,"d":"57.780"},{"v":28.889999999999997,"d":"28.890"},{"v":28.889999999999997,"d":"28.890"},{"$nulls":15},{"v":272.1,"d":"272.100"},{"v":186.05,"d":"186.050"},{"v":57.779999999999994,"d":"57.780"},{"v":28.889999999999997,"d":"28.890"},{"v":28.889999999999997,"d":"28.890"},{"$f":"IF(AND('Att. Dairy'!R12=\"\"),\"\",'Att. Dairy'!R12)","v":""},{"$f":"IF(AND('Att. Dairy'!S12=\"\"),\"\",'Att. Dairy'!S12)","v":""},0,{"$f":"IF(AND('Att. Dairy'!G12=\"\"),\"\",'Att. Dairy'!G12)","v":""},{"$f":"IF(AND('Att. Dairy'!H12=\"\"),\"\",'Att. Dairy'!H12)","v":""},0,{"$f":"IF(AND('Att. Dairy'!L12=\"\"),\"\",'Att. Dairy'!L12)","v":""},{"$f":"IF(AND('Att. Dairy'!M12=\"\"),\"\",'Att. Dairy'!M12)","v":""},0,"0","0",{"v":0,"d":"0.000"},{"v":0,"d":"0.000"},{"v":0,"d":"0.000"},{"v":272.1,"d":"272.100"},{"v":186.05,"d":"186.050"},{"v":57.779999999999994,"d":"57.780"},{"v":28.889999999999997,"d":"28.890"},{"v":28.889999999999997,"d":"28.890"},{"$f":"IF(AND('Att. Dairy'!B12=\"\"),\"\",IF(AND(AH12=\"\"),\"\",IF(AND(C12=\"YES\",AH12>0),AH12*$BB$1,AH12*$BC$1)))","v":{"v":0,"d":"0.00"}},{"$f":"IF(AND('Att. Dairy'!B12=\"\"),\"\",IF(AND(AK12=\"\"),\"\",AK12*$BD$1))","v":{"v":0,"d":"0.00"}},{"$f":"IF(AND('Att. Dairy'!B12=\"\"),\"\",IF(AND(AV12=\"\",AW12=\"\"),\"\",SUM(AV12,AW12)))","v":{"v":0,"d":"0.00"}},{"$f":"IF(AND('Att. Dairy'!B12=\"\"),\"\",IF(AND(AF12=\"\"),\"\",BI12))","v":""},{"$nulls":6},{"$f":"IF(AND('Att. Dairy'!C12=\"\"),\"\",'Att. Dairy'!C12)","v":""},"",{"$f":"IF(AND('Att. Dairy'!D12=\"\"),\"\",'Att. Dairy'!D12)","v":"Sunday"},"vodk'k",0,{"$nulls":15},false,false,{"$nulls":45},"2019-07-07",0,{"v":272.1,"d":"272.10"},186.05,{"v":115.55999999999999,"d":"115.56"},{"v":0,"d":"0.00"},{"v":0,"d":"0.00"},{"v":0,"d":"0.00"},{"v":272.1,"d":"272.10"},186.05,{"v":115.55999999999999,"d":"115.56"},"","","","","","","0","0",{"v":0,"d":"0.00"},{"v":272.1,"d":"272.10"},186.05,{"v":115.55999999999999,"d":"115.56"},{"v":0,"d":"0.00"},{"v":0,"d":"0.00"},""]
[8,{"$f":"IF(AND('Att. Dairy'!B13=\"\"),\"\",'Att. Dairy'!B13)","v":"2019-07-08"},null,{"v":272.1,"d":"272.100"},{"v":186.05,"d":"186.050"},{"v":57.779999999999994,"d":"57.780"},{"v":28.889999999999997,"d":"28.890"},{"v":28.889999999999997,"d":"28.890"},{"$nulls":15},{"v":272.1,"d":"272.100"},{"v":186.05,"d":"186.050"},{"v":57.779999999999994,"d":"57.780"},{"v":28.889999999999997,"d":"28.890"},{"v":28.889999999999997,"d":"28.890"},{"$f":"IF(AND('Att. Dairy'!R13=\"\"),\"\",'Att. Dairy'!R13)","v":96},{"$f":"IF(AND('Att. Dairy'!S13=\"\"),\"\",'Att. Dairy'!S13)","v":111},207,{"$f":"IF(AND('Att. Dairy'!G13=\"\"),\"\",'Att. Dairy'!G13)","v":68},{"$f":"IF(AND('Att. Dairy'!H13=\"\"),\"\",'Att. Dairy'!H13)","v":69},137,{"$f":"IF(AND('Att. Dairy'!L13=\"\"),\"\",'Att. Dairy'!L13)","v":""},{"$f":"IF(AND('Att. Dairy'!M13=\"\"),\"\",'Att. Dairy'!M13)","v":""},0,{"v":20.55,"d":"20.550"},"0",{"v":0,"d":"0.000"},{"v":0,"d":"0.000"},{"v":0,"d":"0.000"},{"v":251.55,"d":"251.550"},{"v":186.05,"d":"186.050"},{"v":57.779999999999994,"d":"57.780"},{"v":28.889999999999997,"d":"28.890"},{"v":28.889999999999997,"d":"28.890"},{"$f":"IF(AND('Att. Dairy'!B13=\"\"),\"\",IF(AND(AH13=\"\"),\"\",IF(AND(C13=\"YES\",AH13>0),AH13*$BB$1,AH13*$BC$1)))","v":891.87},{"$f":"IF(AND('Att. Dairy'!B13=\"\"),\"\",IF(AND(AK13=\"\"),\"\",AK13*$BD$1))","v":{"v":0,"d":"0.00"}},{"$f":"IF(AND('Att. Dairy'!B13=\"\"),\"\",IF(AND(AV13=\"\",AW13=\"\"),\"\",SUM(AV13,AW13)))","v":891.87},{"$f":"IF(AND('Att. Dairy'!B13=\"\"),\"\",IF(AND(AF13=\"\"),\"\",BI13))","v":"lCthjksVh"},{"$nulls":6},{"$f":"IF(AND('Att. Dairy'!C13=\"\"),\"\",'Att. Dairy'!C13)","v":""},"",{"$f":"IF(AND('Att. Dairy'!D13=\"\"),\"\",'Att. Dairy'!D13)","v":"Monday"},"lCthjksVh",0,{"$nulls":15},"W","W",{"$nulls":45},"2019-07-08",0,{"v":272.1,"d":"272.10"},186.05,{"v":115.55999999999999,"d":"115.56"},{"v":0,"d":"0.00"},{"v":0,"d":"0.00"},{"v":0,"d":"0.00"},{"v":272.1,"d":"272.10"},186.05,{"v":115.55999999999999,"d":"115.56"},96,111,68,69,"","",20.55,"0",{"v":0,"d":"0.00"},251.55,186.05,{"v":115.55999999999999,"d":"115.56"},891.87,{"v":0,"d":"0.00"},"lCthjksVh"]
[9,{"$f":"IF(AND('Att. Dairy'!B14=\"\"),\"\",'Att. Dairy'!B14)","v":"2019-07-09"},null,{"v":251.55,"d":"251.550"},{"v":186.05,"d":"186.050"},{"v":57.779999999999994,"d":"57.780"},{"v":28.889999999999997,"d":"28.890"},{"v":28.889999999999997,"d":"28.890"},{"$nulls":15},{"v":251.55,"d":"251.550"},{"v":186.05,"d":"186.050"},{"v":57.779999999999994,"d":"57.780"},{"v":28.889999999999997,"d":"28.890"},{"v":28.889999999999997,"d":"28.890"},{"$f":"IF(AND('Att. Dairy'!R14=\"\"),\"\",'Att. Dairy'!R14)","v":""},{"$f":"IF(AND('Att. Dairy'!S14=\"\"),\"\",'Att. Dairy'!S14)","v":""},0,{"$f":"IF(AND('Att. Dairy'!G14=\"\"),\"\",'Att. Dairy'!G14)","v":""},{"$f":"IF(AND('Att. Dairy'!H14=\"\"),\"\",'Att. Dairy'!H14)","v":""},0,{"$f":"IF(AND('Att. Dairy'!L14=\"\"),\"\",'Att. Dairy'!L14)","v":""},{"$f":"IF(AND('Att. Dairy'!M14=\"\"),\"\",'Att. Dairy'!M14)","v":""},0,"0",{"v":0,"d":"0.000"},{"v":0,"d":"0.000"},{"v":0,"d":"0.000"},{"v":0,"d":"0.000"},{"v":251.55,"d":"251.550"},{"v":186.05,"d":"186.050"},{"v":57.779999999999994,"d":"57.780"},{"v":28.889999999999997,"d":"28.890"},{"v":28.889999999999997,"d":"28.890"},{"$f":"IF(AND('Att. Dairy'!B14=\"\"),\"\",IF(AND(AH14=\"\"),\"\",IF(AND(C14=\"YES\",AH14>0),AH14*$BB$1,AH14*$BC$1)))","v":{"v":0,"d":"0.00"}},{"$f":"IF(AND('Att. Dairy'!B14=\"\"),\"\",IF(AND(AK14=\"\"),\"\",AK14*$BD$1))","v":{"v":0,"d":"0.00"}},{"$f":"IF(AND('Att. Dairy'!B14=\"\"),\"\",IF(AND(AV14=\"\",AW14=\"\"),\"\",SUM(AV14,AW14)))","v":{"v":0,"d":"0.00"}},{"$f":"IF(AND('Att. Dairy'!B14=\"\"),\"\",IF(AND(AF14=\"\"),\"\",BI14))","v":""},{"$nulls":6},{"$f":"IF(AND('Att. Dairy'!C14=\"\"),\"\",'Att. Dairy'!C14)","v":""},"",{"$f":"IF(AND('Att. Dairy'!D14=\"\"),\"\",'Att. Dairy'!D14)","v":"Tuesday"},"nkypkoy",0,{"$nulls":15},"R","R",{"$nulls":45},"2019-07-09",0,251.55,186.05,{"v":115.55999999999999,"d":"115.56"},{"v":0,"d":"0.00"},{"v":0,"d":"0.00"},{"v":0,"d":"0.00"},251.55,186.05,{"v":115.55999999999999,"d":"115.56"},"","","","","","","0",{"v":0,"d":"0.00"},{"v":0,"d":"0.00"},251.55,186.05,{"v":115.55999999999999,"d":"115.56"},{"v":0,"d":"0.00"},{"v":0,"d":"0.00"},""]
[10,{"$f":"IF(AND('Att. Dairy'!B15=\"\"),\"\",'Att. Dairy'!B15)","v":"2019-07-10"},null,{"v":251.55,"d":"251.550"},{"v":186.05,"d":"186.050"},{"v":57.779999999999994,"d":"57.780"},{"v":28.889999999999997,"d":"28.890"},{"v":28.889999999999997,"d":"28.890"},{"$nulls":15},{"$f":"IF(AND(D15=\"\"),\"\",SUM(D15,I15,N15,S15))","v":{"v":251.55,"d":"251.550"}},{"v":186.05,"d":"186.050"},{"v":57.779999999999994,"d":"57.780"},{"v":28.889999999999997,"d":"28.890"},{"v":28.889999999999997,"d":"28.890"},{"$f":"IF(AND('Att. Dairy'!R15=\"\"),\"\",'Att. Dairy'!R15)","v":""},{"$f":"IF(AND('Att. Dairy'!S15=\"\"),\"\",'Att. Dairy'!S15)","v":""},0,{"$f":"IF(AND('Att. Dairy'!G15=\"\"),\"\",'Att. Dairy'!G15)","v":""},{"$f":"IF(AND('Att. Dairy'!H15=\"\"),\"\",'Att. Dairy'!H15)","v":""},0,{"$f":"IF(AND('Att. Dairy'!L15=\"\"),\"\",'Att. Dairy'!L15)","v":""},{"$f":"IF(AND('Att. Dairy'!M15=\"\"),\"\",'Att. Dairy'!M15)","v":""},0,{"v":0,"d":"0.000"},"0",{"v":0,"d":"0.000"},{"v":0,"d":"0.000"},{"v":0,"d":"0.000"},{"v":251.55,"d":"251.550"},{"v":186.05,"d":"186.050"},{"v":57.779999999999994,"d":"57.780"},{"v":28.889999999999997,"d":"28.890"},{"v":28.889999999999997,"d":"28.890"},{"$f":"IF(AND('Att. Dairy'!B15=\"\"),\"\",IF(AND(AH15=\"\"),\"\",IF(AND(C15=\"YES\",AH15>0),AH15*$BB$1,AH15*$BC$1)))","v":{"v":0,"d":"0.00"}},{"$f":"IF(AND('Att. Dairy'!B15=\"\"),\"\",IF(AND(AK15=\"\"),\"\",AK15*$BD$1))","v":{"v":0,"d":"0.00"}},{"$f":"IF(AND('Att. Dairy'!B15=\"\"),\"\",IF(AND(AV15=\"\",AW15=\"\"),\"\",SUM(AV15,AW15)))","v":{"v":0,"d":"0.00"}},{"$f":"IF(AND('Att. Dairy'!B15=\"\"),\"\",IF(AND(AF15=\"\"),\"\",BI15))","v":""},{"$nulls":6},{"$f":"IF(AND('Att. Dairy'!C15=\"\"),\"\",'Att. Dairy'!C15)","v":""},"",{"$f":"IF(AND('Att. Dairy'!D15=\"\"),\"\",'Att. Dairy'!D15)","v":"Wednesday"},"nkyjksVh",0,{"$nulls":15},"W","W",{"$nulls":45},"2019-07-10",0,251.55,186.05,{"v":115.55999999999999,"d":"115.56"},{"v":0,"d":"0.00"},{"v":0,"d":"0.00"},{"v":0,"d":"0.00"},251.55,186.05,{"v":115.55999999999999,"d":"115.56"},"","","","","","",{"v":0,"d":"0.00"},"0",{"v":0,"d":"0.00"},251.55,186.05,{"v":115.55999999999999,"d":"115.56"},{"v":0,"d":"0.00"},{"v":0,"d":"0.00"},""]
[11,{"$f":"IF(AND('Att. Dairy'!B16=\"\"),\"\",'Att. Dairy'!B16)","v":"2019-07-11"},null,{"v":251.55,"d":"251.550"},{"v":186.05,"d":"186.050"},{"v":57.779999999999994,"d":"57.780"},{"v":28.889999999999997,"d":"28.890"},{"v":28.889999999999997,"d":"28.890"},{"$nulls":15},{"v":251.55,"d":"251.550"},{"v":186.05,"d":"186.050"},{"v":57.779999999999994,"d":"57.780"},{"v":28.889999999999997,"d":"28.890"},{"v":28.889999999999997,"d":"28.890"},{"$f":"IF(AND('Att. Dairy'!R16=\"\"),\"\",'Att. Dairy'!R16)","v":""},{"$f":"IF(AND('Att. Dairy'!S16=\"\"),\"\",'Att. Dairy'!S16)","v":""},0,{"$f":"IF(AND('Att. Dairy'!G16=\"\"),\"\",'Att. Dairy'!G16)","v":""},{"$f":"IF(AND('Att. Dairy'!H16=\"\"),\"\",'Att. Dairy'!H16)","v":""},0,{"$f":"IF(AND('Att. Dairy'!L16=\"\"),\"\",'Att. Dairy'!L16)","v":""},{"$f":"IF(AND('Att. Dairy'!M16=\"\"),\"\",'Att. Dairy'!M16)","v":""},0,"0",{"v":0,"d":"0.000"},{"v":0,"d":"0.000"},{"v":0,"d":"0.000"},{"v":0,"d":"0.000"},{"v":251.55,"d":"251.550"},{"v":186.05,"d":"186.050"},{"v":57.779999999999994,"d":"57.780"},{"v":28.889999999999997,"d":"28.890"},{"v":28.889999999999997,"d":"28.890"},{"$f":"IF(AND('Att. Dairy'!B16=\"\"),\"\",IF(AND(AH16=\"\"),\"\",IF(AND(C16=\"YES\",AH16>0),AH16*$BB$1,AH16*$BC$1)))","v":{"v":0,"d":"0.00"}},{"$f":"IF(AND('Att. Dairy'!B16=\"\"),\"\",IF(AND(AK16=\"\"),\"\",AK16*$BD$1))","v":{"v":0,"d":"0.00"}},{"$f":"IF(AND('Att. Dairy'!B16=\"\"),\"\",IF(AND(AV16=\"\",AW16=\"\"),\"\",SUM(AV16,AW16)))","v":{"v":0,"d":"0.00"}},{"$f":"IF(AND('Att. Dairy'!B16=\"\"),\"\",IF(AND(AF16=\"\"),\"\",BI16))","v":""},{"$nulls":6},{"$f":"IF(AND('Att. Dairy'!C16=\"\"),\"\",'Att. Dairy'!C16)","v":""},"",{"$f":"IF(AND('Att. Dairy'!D16=\"\"),\"\",'Att. Dairy'!D16)","v":"Thursday"},"f[kpM+h",0,{"$nulls":15},"R","R",{"$nulls":45},"2019-07-11",0,251.55,186.05,{"v":115.55999999999999,"d":"115.56"},{"v":0,"d":"0.00"},{"v":0,"d":"0.00"},{"v":0,"d":"0.00"},251.55,186.05,{"v":115.55999999999999,"d":"115.56"},"","","","","","","0",{"v":0,"d":"0.00"},{"v":0,"d":"0.00"},251.55,186.05,{"v":115.55999999999999,"d":"115.56"},{"v":0,"d":"0.00"},{"v":0,"d":"0.00"},""]
[12,{"$f":"IF(AND('Att. Dairy'!B17=\"\"),\"\",'Att. Dairy'!B17)","v":"2019-07-12"},null,{"v":251.55,"d":"251.550"},{"v":186.05,"d":"186.050"},{"v":57.779999999999994,"d":"57.780"},{"v":28.889999999999997,"d":"28.890"},{"v":28.889999999999997,"d":"28.890"},{"$nulls":15},{"v":251.55,"d":"251.550"},{"v":186.05,"d":"186.050"},{"v":57.779999999999994,"d":"57.780"},{"v":28.889999999999997,"d":"28.890"},{"v":28.889999999999997,"d":"28.890"},{"$f":"IF(AND('Att. Dairy'!R17=\"\"),\"\",'Att. Dairy'!R17)","v":""},{"$f":"IF(AND('Att. Dairy'!S17=\"\"),\"\",'Att. Dairy'!S17)","v":""},0,{"$f":"IF(AND('Att. Dairy'!G17=\"\"),\"\",'Att. Dairy'!G17)","v":""},{"$f":"IF(AND('Att. Dairy'!H17=\"\"),\"\",'Att. Dairy'!H17)","v":""},0,{"$f":"IF(AND('Att. Dairy'!L17=\"\"),\"\",'Att. Dairy'!L17)","v":""},{"$f":"IF(AND('Att. Dairy'!M17=\"\"),\"\",'Att. Dairy'!M17)","v":""},0,{"v":0,"d":"0.000"},"0",{"v":0,"d":"0.000"},{"v":0,"d":"0.000"},{"v":0,"d":"0.000"},{"v":251.55,"d":"251.550"},{"v":186.05,"d":"186.050"},{"v":57.779999999999994,"d":"57.780"},{"v":28.889999999999997,"d":"28.890"},{"v":28.889999999999997,"d":"28.890"},{"$f":"IF(AND('Att. Dairy'!B17=\"\"),\"\",IF(AND(AH17=\"\"),\"\",IF(AND(C17=\"YES\",AH17>0),AH17*$BB$1,AH17*$BC$1)))","v":{"v":0,"d":"0.00"}},{"$f":"IF(AND('Att. Dairy'!B17=\"\"),\"\",IF(AND(AK17=\"\"),\"\",AK17*$BD$1))","v":{"v":0,"d":"0.00"}},{"$f":"IF(AND('Att. Dairy'!B17=\"\"),\"\",IF(AND(AV17=\"\",AW17=\"\"),\"\",SUM(AV17,AW17)))","v":{"v":0,"d":"0.00"}},{"$f":"IF(AND('Att. Dairy'!B17=\"\"),\"\",IF(AND(AF17=\"\"),\"\",BI17))","v":""},{"$nulls":6},{"$f":"IF(AND('Att. Dairy'!C17=\"\"),\"\",'Att. Dairy'!C17)","v":""},"",{"$f":"IF(AND('Att. Dairy'!D17=\"\"),\"\",'Att. Dairy'!D17)","v":"Friday"},"nkyjksVh",0,{"$nulls":15},"W","W",{"$nulls":45},"2019-07-12",0,251.55,186.05,{"v":115.55999999999999,"d":"115.56"},{"v":0,"d":"0.00"},{"v":0,"d":"0.00"},{"v":0,"d":"0.00"},251.55,186.05,{"v":115.55999999999999,"d":"115.56"},"","","","","","",{"v":0,"d":"0.00"},"0",{"v":0,"d":"0.00"},251.55,186.05,{"v":115.55999999999999,"d":"115.56"},{"v":0,"d":"0.00"},{"v":0,"d":"0.00"},""]
[13,{"$f":"IF(AND('Att. Dairy'!B18=\"\"),\"\",'Att. Dairy'!B18)","v":"2019-07-13"},null,{"v":251.55,"d":"251.550"},{"v":186.05,"d":"186.050"},{"v":57.779999999999994,"d":"57.780"},{"v":28.889999999999997,"d":"28.890"},{"v":28.889999999999997,"d":"28.890"},{"$nulls":15},{"v":251.55,"d":"251.550"},{"v":186.05,"d":"186.050"},{"v":57.779999999999994,"d":"57.780"},{"v":28.889999999999997,"d":"28.890"},{"v":28.889999999999997,"d":"28.890"},{"$f":"IF(AND('Att. Dairy'!R18=\"\"),\"\",'Att. Dairy'!R18)","v":""},{"$f":"IF(AND('Att. Dairy'!S18=\"\"),\"\",'Att. Dairy'!S18)","v":""},0,{"$f":"IF(AND('Att. Dairy'!G18=\"\"),\"\",'Att. Dairy'!G18)","v":""},{"$f":"IF(AND('Att. Dairy'!H18=\"\"),\"\",'Att. Dairy'!H18)","v":""},0,{"$f":"IF(AND('Att. Dairy'!L18=\"\"),\"\",'Att. Dairy'!L18)","v":""},{"$f":"IF(AND('Att. Dairy'!M18=\"\"),\"\",'Att. Dairy'!M18)","v":""},0,{"v":0,"d":"0.000"},"0",{"v":0,"d":"0.000"},{"v":0,"d":"0.000"},{"v":0,"d":"0.000"},{"v":251.55,"d":"251.550"},{"v":186.05,"d":"186.050"},{"v":57.779999999999994,"d":"57.780"},{"v":28.889999999999997,"d":"28.890"},{"v":28.889999999999997,"d":"28.890"},{"$f":"IF(AND('Att. Dairy'!B18=\"\"),\"\",IF(AND(AH18=\"\"),\"\",IF(AND(C18=\"YES\",AH18>0),AH18*$BB$1,AH18*$BC$1)))","v":{"v":0,"d":"0.00"}},{"$f":"IF(AND('Att. Dairy'!B18=\"\"),\"\",IF(AND(AK18=\"\"),\"\",AK18*$BD$1))","v":{"v":0,"d":"0.00"}},{"$f":"IF(AND('Att. Dairy'!B18=\"\"),\"\",IF(AND(AV18=\"\",AW18=\"\"),\"\",SUM(AV18,AW18)))","v":{"v":0,"d":"0.00"}},{"$f":"IF(AND('Att. Dairy'!B18=\"\"),\"\",IF(AND(AF18=\"\"),\"\",BI18))","v":""},{"$nulls":6},{"$f":"IF(AND('Att. Dairy'!C18=\"\"),\"\",'Att. Dairy'!C18)","v":""},"",{"$f":"IF(AND('Att. Dairy'!D18=\"\"),\"\",'Att. Dairy'!D18)","v":"Saturday"},"lCthjksVh",0,{"$nulls":15},"W","W",{"$nulls":45},"2019-07-13",0,251.55,186.05,{"v":115.55999999999999,"d":"115.56"},{"v":0,"d":"0.00"},{"v":0,"d":"0.00"},{"v":0,"d":"0.00"},251.55,186.05,{"v":115.55999999999999,"d":"115.56"},"","","","","","",{"v":0,"d":"0.00"},"0",{"v":0,"d":"0.00"},251.55,186.05,{"v":115.55999999999999,"d":"115.56"},{"v":0,"d":"0.00"},{"v":0,"d":"0.00"},""]
[14,{"$f":"IF(AND('Att. Dairy'!B19=\"\"),\"\",'Att. Dairy'!B19)","v":"2019-07-14"},null,{"v":251.55,"d":"251.550"},{"v":186.05,"d":"186.050"},{"v":57.779999999999994,"d":"57.780"},{"v":28.889999999999997,"d":"28.890"},{"v":28.889999999999997,"d":"28.890"},{"$nulls":15},{"v":251.55,"d":"251.550"},{"v":186.05,"d":"186.050"},{"v":57.779999999999994,"d":"57.780"},{"v":28.889999999999997,"d":"28.890"},{"v":28.889999999999997,"d":"28.890"},{"$f":"IF(AND('Att. Dairy'!R19=\"\"),\"\",'Att. Dairy'!R19)","v":""},{"$f":"IF(AND('Att. Dairy'!S19=\"\"),\"\",'Att. Dairy'!S19)","v":""},0,{"$f":"IF(AND('Att. Dairy'!G19=\"\"),\"\",'Att. Dairy'!G19)","v":""},{"$f":"IF(AND('Att. Dairy'!H19=\"\"),\"\",'Att. Dairy'!H19)","v":""},0,{"$f":"IF(AND('Att. Dairy'!L19=\"\"),\"\",'Att. Dairy'!L19)","v":""},{"$f":"IF(AND('Att. Dairy'!M19=\"\"),\"\",'Att. Dairy'!M19)","v":""},0,"0","0",{"v":0,"d":"0.000"},{"v":0,"d":"0.000"},{"v":0,"d":"0.000"},{"v":251.55,"d":"251.550"},{"v":186.05,"d":"186.050"},{"v":57.779999999999994,"d":"57.780"},{"v":28.889999999999997,"d":"28.890"},{"v":28.889999999999997,"d":"28.890"},{"$f":"IF(AND('Att. Dairy'!B19=\"\"),\"\",IF(AND(AH19=\"\"),\"\",IF(AND(C19=\"YES\",AH19>0),AH19*$BB$1,AH19*$BC$1)))","v":{"v":0,"d":"0.00"}},{"$f":"IF(AND('Att. Dairy'!B19=\"\"),\"\",IF(AND(AK19=\"\"),\"\",AK19*$BD$1))","v":{"v":0,"d":"0.00"}},{"$f":"IF(AND('Att. Dairy'!B19=\"\"),\"\",IF(AND(AV19=\"\",AW19=\"\"),\"\",SUM(AV19,AW19)))","v":{"v":0,"d":"0.00"}},{"$f":"IF(AND('Att. Dairy'!B19=\"\"),\"\",IF(AND(AF19=\"\"),\"\",BI19))","v":""},{"$nulls":6},{"$f":"IF(AND('Att. Dairy'!C19=\"\"),\"\",'Att. Dairy'!C19)","v":""},"",{"$f":"IF(AND('Att. Dairy'!D19=\"\"),\"\",'Att. Dairy'!D19)","v":"Sunday"},"vodk'k",0,{"$nulls":15},false,false,{"$nulls":45},"2019-07-14",0,251.55,186.05,{"v":115.55999999999999,"d":"115.56"},{"v":0,"d":"0.00"},{"v":0,"d":"0.00"},{"v":0,"d":"0.00"},251.55,186.05,{"v":115.55999999999999,"d":"115.56"},"","","","","","","0","0",{"v":0,"d":"0.00"},251.55,186.05,{"v":115.55999999999999,"d":"115.56"},{"v":0,"d":"0.00"},{"v":0,"d":"0.00"},""]
[15,{"$f":"IF(AND('Att. Dairy'!B20=\"\"),\"\",'Att. Dairy'!B20)","v":"2019-07-15"},null,{"v":251.55,"d":"251.550"},{"v":186.05,"d":"186.050"},{"v":57.779999999999994,"d":"57.780"},{"v":28.889999999999997,"d":"28.890"},{"v":28.889999999999997,"d":"28.890"},{"$nulls":15},{"v":251.55,"d":"251.550"},{"v":186.05,"d":"186.050"},{"v":57.779999999999994,"d":"57.780"},{"v":28.889999999999997,"d":"28.890"},{"v":28.889999999999997,"d":"28.890"},{"$f":"IF(AND('Att. Dairy'!R20=\"\"),\"\",'Att. Dairy'!R20)","v":""},{"$f":"IF(AND('Att. Dairy'!S20=\"\"),\"\",'Att. Dairy'!S20)","v":""},0,{"$f":"IF(AND('Att. Dairy'!G20=\"\"),\"\",'Att. Dairy'!G20)","v":""},{"$f":"IF(AND('Att. Dairy'!H20=\"\"),\"\",'Att. Dairy'!H20)","v":""},0,{"$f":"IF(AND('Att. Dairy'!L20=\"\"),\"\",'Att. Dairy'!L20)","v":""},{"$f":"IF(AND('Att. Dairy'!M20=\"\"),\"\",'Att. Dairy'!M20)","v":""},0,{"v":0,"d":"0.000"},"0",{"v":0,"d":"0.000"},{"v":0,"d":"0.000"},{"v":0,"d":"0.000"},{"v":251.55,"d":"251.550"},{"v":186.05,"d":"186.050"},{"v":57.779999999999994,"d":"57.780"},{"v":28.889999999999997,"d":"28.890"},{"v":28.889999999999997,"d":"28.890"},{"$f":"IF(AND('Att. Dairy'!B20=\"\"),\"\",IF(AND(AH20=\"\"),\"\",IF(AND(C20=\"YES\",AH20>0),AH20*$BB$1,AH20*$BC$1)))","v":{"v":0,"d":"0.00"}},{"$f":"IF(AND('Att. Dairy'!B20=\"\"),\"\",IF(AND(AK20=\"\"),\"\",AK20*$BD$1))","v":{"v":0,"d":"0.00"}},{"$f":"IF(AND('Att. Dairy'!B20=\"\"),\"\",IF(AND(AV20=\"\",AW20=\"\"),\"\",SUM(AV20,AW20)))","v":{"v":0,"d":"0.00"}},{"$f":"IF(AND('Att. Dairy'!B20=\"\"),\"\",IF(AND(AF20=\"\"),\"\",BI20))","v":""},{"$nulls":6},{"$f":"IF(AND('Att. Dairy'!C20=\"\"),\"\",'Att. Dairy'!C20)","v":""},"",{"$f":"IF(AND('Att. Dairy'!D20=\"\"),\"\",'Att. Dairy'!D20)","v":"Monday"},"lCthjksVh",0,{"$nulls":15},"W","W",{"$nulls":45},"2019-07-15",0,251.55,186.05,{"v":115.55999999999999,"d":"115.56"},{"v":0,"d":"0.00"},{"v":0,"d":"0.00"},{"v":0,"d":"0.00"},251.55,186.05,{"v":115.55999999999999,"d":"115.56"},"","","","","","",{"v":0,"d":"0.00"},"0",{"v":0,"d":"0.00"},251.55,186.05,{"v":115.55999999999999,"d":"115.56"},{"v":0,"d":"0.00"},{"v":0,"d":"0.00"},""]
[16,{"$f":"IF(AND('Att. Dairy'!B21=\"\"),\"\",'Att. Dairy'!B21)","v":"2019-07-16"},null,{"v":251.55,"d":"251.550"},{"v":186.05,"d":"186.050"},{"v":57.779999999999994,"d":"57.780"},{"v":28.889999999999997,"d":"28.890"},{"v":28.889999999999997,"d":"28.890"},{"$nulls":15},{"v":251.55,"d":"251.550"},{"v":186.05,"d":"186.050"},{"v":57.779999999999994,"d":"57.780"},{"v":28.889999999999997,"d":"28.890"},{"v":28.889999999999997,"d":"28.890"},{"$f":"IF(AND('Att. Dairy'!R21=\"\"),\"\",'Att. Dairy'!R21)","v":""},{"$f":"IF(AND('Att. Dairy'!S21=\"\"),\"\",'Att. Dairy'!S21)","v":""},0,{"$f":"IF(AND('Att. Dairy'!G21=\"\"),\"\",'Att. Dairy'!G21)","v":""},{"$f":"IF(AND('Att. Dairy'!H21=\"\"),\"\",'Att. Dairy'!H21)","v":""},0,{"$f":"IF(AND('Att. Dairy'!L21=\"\"),\"\",'Att. Dairy'!L21)","v":""},{"$f":"IF(AND('Att. Dairy'!M21=\"\"),\"\",'Att. Dairy'!M21)","v":""},0,"0",{"v":0,"d":"0.000"},{"v":0,"d":"0.000"},{"v":0,"d":"0.000"},{"v":0,"d":"0.000"},{"v":251.55,"d":"251.550"},{"v":186.05,"d":"186.050"},{"v":57.779999999999994,"d":"57.780"},{"v":28.889999999999997,"d":"28.890"},{"v":28.889999999999997,"d":"28.890"},{"$f":"IF(AND('Att. Dairy'!B21=\"\"),\"\",IF(AND(AH21=\"\"),\"\",IF(AND(C21=\"YES\",AH21>0),AH21*$BB$1,AH21*$BC$1)))","v":{"v":0,"d":"0.00"}},{"$f":"IF(AND('Att. Dairy'!B21=\"\"),\"\",IF(AND(AK21=\"\"),\"\",AK21*$BD$1))","v":{"v":0,"d":"0.00"}},{"$f":"IF(AND('Att. Dairy'!B21=\"\"),\"\",IF(AND(AV21=\"\",AW21=\"\"),\"\",SUM(AV21,AW21)))","v":{"v":0,"d":"0.00"}},{"$f":"IF(AND('Att. Dairy'!B21=\"\"),\"\",IF(AND(AF21=\"\"),\"\",BI21))","v":""},{"$nulls":6},{"$f":"IF(AND('Att. Dairy'!C21=\"\"),\"\",'Att. Dairy'!C21)","v":""},"",{"$f":"IF(AND('Att. Dairy'!D21=\"\"),\"\",'Att. Dairy'!D21)","v":"Tuesday"},"nkypkoy",0,{"$nulls":15},"R","R",{"$nulls":45},"2019-07-16",0,251.55,186.05,{"v":115.55999999999999,"d":"115.56"},{"v":0,"d":"0.00"},{"v":0,"d":"0.00"},{"v":0,"d":"0.00"},251.55,186.05,{"v":115.55999999999999,"d":"115.56"},"","","","","","","0",{"v":0,"d":"0.00"},{"v":0,"d":"0.00"},251.55,186.05,{"v":115.55999999999999,"d":"115.56"},{"v":0,"d":"0.00"},{"v":0,"d":"0.00"},""]
[17,{"$f":"IF(AND('Att. Dairy'!B22=\"\"),\"\",'Att. Dairy'!B22)","v":"2019-07-17"},null,{"v":251.55,"d":"251.550"},{"v":186.05,"d":"186.050"},{"v":57.779999999999994,"d":"57.780"},{"v":28.889999999999997,"d":"28.890"},{"v":28.889999999999997,"d":"28.890"},{"$nulls":15},{"v":251.55,"d":"251.550"},{"v":186.05,"d":"186.050"},{"v":57.779999999999994,"d":"57.780"},{"v":28.889999999999997,"d":"28.890"},{"v":28.889999999999997,"d":"28.890"},{"$f":"IF(AND('Att. Dairy'!R22=\"\"),\"\",'Att. Dairy'!R22)","v":""},{"$f":"IF(AND('Att. Dairy'!S22=\"\"),\"\",'Att. Dairy'!S22)","v":""},0,{"$f":"IF(AND('Att. Dairy'!G22=\"\"),\"\",'Att. Dairy'!G22)","v":""},{"$f":"IF(AND('Att. Dairy'!H22=\"\"),\"\",'Att. Dairy'!H22)","v":""},0,{"$f":"IF(AND('Att. Dairy'!L22=\"\"),\"\",'Att. Dairy'!L22)","v":""},{"$f":"IF(AND('Att. Dairy'!M22=\"\"),\"\",'Att. Dairy'!M22)","v":""},0,{"v":0,"d":"0.000"},"0",{"v":0,"d":"0.000"},{"v":0,"d":"0.000"},{"v":0,"d":"0.000"},{"v":251.55,"d":"251.550"},{"v":186.05,"d":"186.050"},{"v":57.779999999999994,"d":"57.780"},{"v":28.889999999999997,"d":"28.890"},{"v":28.889999999999997,"d":"28.890"},{"$f":"IF(AND('Att. Dairy'!B22=\"\"),\"\",IF(AND(AH22=\"\"),\"\",IF(AND(C22=\"YES\",AH22>0),AH22*$BB$1,AH22*$BC$1)))","v":{"v":0,"d":"0.00"}},{"$f":"IF(AND('Att. Dairy'!B22=\"\"),\"\",IF(AND(AK22=\"\"),\"\",AK22*$BD$1))","v":{"v":0,"d":"0.00"}},{"$f":"IF(AND('Att. Dairy'!B22=\"\"),\"\",IF(AND(AV22=\"\",AW22=\"\"),\"\",SUM(AV22,AW22)))","v":{"v":0,"d":"0.00"}},{"$f":"IF(AND('Att. Dairy'!B22=\"\"),\"\",IF(AND(AF22=\"\"),\"\",BI22))","v":""},{"$nulls":6},{"$f":"IF(AND('Att. Dairy'!C22=\"\"),\"\",'Att. Dairy'!C22)","v":""},"",{"$f":"IF(AND('Att. Dairy'!D22=\"\"),\"\",'Att. Dairy'!D22)","v":"Wednesday"},"nkyjksVh",0,{"$nulls":15},"W","W",{"$nulls":45},"2019-07-17",0,251.55,186.05,{"v":115.55999999999999,"d":"115.56"},{"v":0,"d":"0.00"},{"v":0,"d":"0.00"},{"v":0,"d":"0.00"},251.55,186.05,{"v":115.55999999999999,"d":"115.56"},"","","","","","",{"v":0,"d":"0.00"},"0",{"v":0,"d":"0.00"},251.55,186.05,{"v":115.55999999999999,"d":"115.56"},{"v":0,"d":"0.00"},{"v":0,"d":"0.00"},""]
[18,{"$f":"IF(AND('Att. Dairy'!B23=\"\"),\"\",'Att. Dairy'!B23)","v":"2019-07-18"},null,{"v":251.55,"d":"251.550"},{"v":186.05,"d":"186.050"},{"v":57.779999999999994,"d":"57.780"},{"v":28.889999999999997,"d":"28.890"},{"v":28.889999999999997,"d":"28.890"},{"$nulls":15},{"v":251.55,"d":"251.550"},{"v":186.05,"d":"186.050"},{"v":57.779999999999994,"d":"57.780"},{"v":28.889999999999997,"d":"28.890"},{"v":28.889999999999997,"d":"28.890"},{"$f":"IF(AND('Att. Dairy'!R23=\"\"),\"\",'Att. Dairy'!R23)","v":""},{"$f":"IF(AND('Att. Dairy'!S23=\"\"),\"\",'Att. Dairy'!S23)","v":""},0,{"$f":"IF(AND('Att. Dairy'!G23=\"\"),\"\",'Att. Dairy'!G23)","v":""},{"$f":"IF(AND('Att. Dairy'!H23=\"\"),\"\",'Att. Dairy'!H23)","v":""},0,{"$f":"IF(AND('Att. Dairy'!L23=\"\"),\"\",'Att. Dairy'!L23)","v":""},{"$f":"IF(AND('Att. Dairy'!M23=\"\"),\"\",'Att. Dairy'!M23)","v":""},0,"0",{"v":0,"d":"0.000"},{"v":0,"d":"0.000"},{"v":0,"d":"0.000"},{"v":0,"d":"0.000"},{"v":251.55,"d":"251.550"},{"v":186.05,"d":"186.050"},{"v":57.779999999999994,"d":"57.780"},{"v":28.889999999999997,"d":"28.890"},{"v":28.889999999999997,"d":"28.890"},{"$f":"IF(AND('Att. Dairy'!B23=\"\"),\"\",IF(AND(AH23=\"\"),\"\",IF(AND(C23=\"YES\",AH23>0),AH23*$BB$1,AH23*$BC$1)))","v":{"v":0,"d":"0.00"}},{"$f":"IF(AND('Att. Dairy'!B23=\"\"),\"\",IF(AND(AK23=\"\"),\"\",AK23*$BD$1))","v":{"v":0,"d":"0.00"}},{"$f":"IF(AND('Att. Dairy'!B23=\"\"),\"\",IF(AND(AV23=\"\",AW23=\"\"),\"\",SUM(AV23,AW23)))","v":{"v":0,"d":"0.00"}},{"$f":"IF(AND('Att. Dairy'!B23=\"\"),\"\",IF(AND(AF23=\"\"),\"\",BI23))","v":""},{"$nulls":6},{"$f":"IF(AND('Att. Dairy'!C23=\"\"),\"\",'Att. Dairy'!C23)","v":""},"",{"$f":"IF(AND('Att. Dairy'!D23=\"\"),\"\",'Att. Dairy'!D23)","v":"Thursday"},"f[kpM+h",0,{"$nulls":15},"R","R",{"$nulls":45},"2019-07-18",0,251.55,186.05,{"v":115.55999999999999,"d":"115.56"},{"v":0,"d":"0.00"},{"v":0,"d":"0.00"},{"v":0,"d":"0.00"},251.55,186.05,{"v":115.55999999999999,"d":"115.56"},"","","","","","","0",{"v":0,"d":"0.00"},{"v":0,"d":"0.00"},251.55,186.05,{"v":115.55999999999999,"d":"115.56"},{"v":0,"d":"0.00"},{"v":0,"d":"0.00"},""]
[19,{"$f":"IF(AND('Att. Dairy'!B24=\"\"),\"\",'Att. Dairy'!B24)","v":"2019-07-19"},null,{"v":251.55,"d":"251.550"},{"v":186.05,"d":"186.050"},{"v":57.779999999999994,"d":"57.780"},{"v":28.889999999999997,"d":"28.890"},{"v":28.889999999999997,"d":"28.890"},{"$nulls":15},{"v":251.55,"d":"251.550"},{"v":186.05,"d":"186.050"},{"v":57.779999999999994,"d":"57.780"},{"v":28.889999999999997,"d":"28.890"},{"v":28.889999999999997,"d":"28.890"},{"$f":"IF(AND('Att. Dairy'!R24=\"\"),\"\",'Att. Dairy'!R24)","v":""},{"$f":"IF(AND('Att. Dairy'!S24=\"\"),\"\",'Att. Dairy'!S24)","v":""},0,{"$f":"IF(AND('Att. Dairy'!G24=\"\"),\"\",'Att. Dairy'!G24)","v":""},{"$f":"IF(AND('Att. Dairy'!H24=\"\"),\"\",'Att. Dairy'!H24)","v":""},0,{"$f":"IF(AND('Att. Dairy'!L24=\"\"),\"\",'Att. Dairy'!L24)","v":""},{"$f":"IF(AND('Att. Dairy'!M24=\"\"),\"\",'Att. Dairy'!M24)","v":""},0,{"v":0,"d":"0.000"},"0",{"v":0,"d":"0.000"},{"v":0,"d":"0.000"},{"v":0,"d":"0.000"},{"v":251.55,"d":"251.550"},{"v":186.05,"d":"186.050"},{"v":57.779999999999994,"d":"57.780"},{"v":28.889999999999997,"d":"28.890"},{"v":28.889999999999997,"d":"28.890"},{"$f":"IF(AND('Att. Dairy'!B24=\"\"),\"\",IF(AND(AH24=\"\"),\"\",IF(AND(C24=\"YES\",AH24>0),AH24*$BB$1,AH24*$BC$1)))","v":{"v":0,"d":"0.00"}},{"$f":"IF(AND('Att. Dairy'!B24=\"\"),\"\",IF(AND(AK24=\"\"),\"\",AK24*$BD$1))","v":{"v":0,"d":"0.00"}},{"$f":"IF(AND('Att. Dairy'!B24=\"\"),\"\",IF(AND(AV24=\"\",AW24=\"\"),\"\",SUM(AV24,AW24)))","v":{"v":0,"d":"0.00"}},{"$f":"IF(AND('Att. Dairy'!B24=\"\"),\"\",IF(AND(AF24=\"\"),\"\",BI24))","v":""},{"$nulls":6},{"$f":"IF(AND('Att. Dairy'!C24=\"\"),\"\",'Att. Dairy'!C24)","v":""},"",{"$f":"IF(AND('Att. Dairy'!D24=\"\"),\"\",'Att. Dairy'!D24)","v":"Friday"},"nkyjksVh",0,{"$nulls":15},"W","W",{"$nulls":45},"2019-07-19",0,251.55,186.05,{"v":115.55999999999999,"d":"115.56"},{"v":0,"d":"0.00"},{"v":0,"d":"0.00"},{"v":0,"d":"0.00"},251.55,186.05,{"v":115.55999999999999,"d":"115.56"},"","","","","","",{"v":0,"d":"0.00"},"0",{"v":0,"d":"0.00"},251.55,186.05,{"v":115.55999999999999,"d":"115.56"},{"v":0,"d":"0.00"},{"v":0,"d":"0.00"},""]
[20,{"$f":"IF(AND('Att. Dairy'!B25=\"\"),\"\",'Att. Dairy'!B25)","v":"2019-07-20"},null,{"v":251.55,"d":"251.550"},{"v":186.05,"d":"186.050"},{"v":57.779999999999994,"d":"57.780"},{"v":28.889999999999997,"d":"28.890"},{"v":28.889999999999997,"d":"28.890"},{"$nulls":15},{"v":251.55,"d":"251.550"},{"v":186.05,"d":"186.050"},{"v":57.779999999999994,"d":"57.780"},{"v":28.889999999999997,"d":"28.890"},{"v":28.889999999999997,"d":"28.890"},{"$f":"IF(AND('Att. Dairy'!R25=\"\"),\"\",'Att. Dairy'!R25)","v":""},{"$f":"IF(AND('Att. Dairy'!S25=\"\"),\"\",'Att. Dairy'!S25)","v":""},0,{"$f":"IF(AND('Att. Dairy'!G25=\"\"),\"\",'Att. Dairy'!G25)","v":""},{"$f":"IF(AND('Att. Dairy'!H25=\"\"),\"\",'Att. Dairy'!H25)","v":""},0,{"$f":"IF(AND('Att. Dairy'!L25=\"\"),\"\",'Att. Dairy'!L25)","v":""},{"$f":"IF(AND('Att. Dairy'!M25=\"\"),\"\",'Att. Dairy'!M25)","v":""},0,{"v":0,"d":"0.000"},"0",{"v":0,"d":"0.000"},{"v":0,"d":"0.000"},{"v":0,"d":"0.000"},{"v":251.55,"d":"251.550"},{"v":186.05,"d":"186.050"},{"v":57.779999999999994,"d":"57.780"},{"v":28.889999999999997,"d":"28.890"},{"v":28.889999999999997,"d":"28.890"},{"$f":"IF(AND('Att. Dairy'!B25=\"\"),\"\",IF(AND(AH25=\"\"),\"\",IF(AND(C25=\"YES\",AH25>0),AH25*$BB$1,AH25*$BC$1)))","v":{"v":0,"d":"0.00"}},{"$f":"IF(AND('Att. Dairy'!B25=\"\"),\"\",IF(AND(AK25=\"\"),\"\",AK25*$BD$1))","v":{"v":0,"d":"0.00"}},{"$f":"IF(AND('Att. Dairy'!B25=\"\"),\"\",IF(AND(AV25=\"\",AW25=\"\"),\"\",SUM(AV25,AW25)))","v":{"v":0,"d":"0.00"}},{"$f":"IF(AND('Att. Dairy'!B25=\"\"),\"\",IF(AND(AF25=\"\"),\"\",BI25))","v":""},{"$nulls":6},{"$f":"IF(AND('Att. Dairy'!C25=\"\"),\"\",'Att. Dairy'!C25)","v":""},"",{"$f":"IF(AND('Att. Dairy'!D25=\"\"),\"\",'Att. Dairy'!D25)","v":"Saturday"},"lCthjksVh",0,{"$nulls":15},"W","W",{"$nulls":45},"2019-07-20",0,251.55,186.05,{"v":115.55999999999999,"d":"115.56"},{"v":0,"d":"0.00"},{"v":0,"d":"0.00"},{"v":0,"d":"0.00"},251.55,186.05,{"v":115.55999999999999,"d":"115.56"},"","","","","","",{"v":0,"d":"0.00"},"0",{"v":0,"d":"0.00"},251.55,186.05,{"v":115.55999999999999,"d":"115.56"},{"v":0,"d":"0.00"},{"v":0,"d":"0.00"},""]
[21,{"$f":"IF(AND('Att. Dairy'!B26=\"\"),\"\",'Att. Dairy'!B26)","v":"2019-07-21"},null,{"v":251.55,"d":"251.550"},{"v":186.05,"d":"186.050"},{"v":57.779999999999994,"d":"57.780"},{"v":28.889999999999997,"d":"28.890"},{"v":28.889999999999997,"d":"28.890"},{"$nulls":15},{"v":251.55,"d":"251.550"},{"v":186.05,"d":"186.050"},{"v":57.779999999999994,"d":"57.780"},{"v":28.889999999999997,"d":"28.890"},{"v":28.889999999999997,"d":"28.890"},{"$f":"IF(AND('Att. Dairy'!R26=\"\"),\"\",'Att. Dairy'!R26)","v":""},{"$f":"IF(AND('Att. Dairy'!S26=\"\"),\"\",'Att. Dairy'!S26)","v":""},0,{"$f":"IF(AND('Att. Dairy'!G26=\"\"),\"\",'Att. Dairy'!G26)","v":""},{"$f":"IF(AND('Att. Dairy'!H26=\"\"),\"\",'Att. Dairy'!H26)","v":""},0,{"$f":"IF(AND('Att. Dairy'!L26=\"\"),\"\",'Att. Dairy'!L26)","v":""},{"$f":"IF(AND('Att. Dairy'!M26=\"\"),\"\",'Att. Dairy'!M26)","v":""},0,"0","0",{"v":0,"d":"0.000"},{"v":0,"d":"0.000"},{"v":0,"d":"0.000"},{"v":251.55,"d":"251.550"},{"v":186.05,"d":"186.050"},{"v":57.779999999999994,"d":"57.780"},{"v":28.889999999999997,"d":"28.890"},{"v":28.889999999999997,"d":"28.890"},{"$f":"IF(AND('Att. Dairy'!B26=\"\"),\"\",IF(AND(AH26=\"\"),\"\",IF(AND(C26=\"YES\",AH26>0),AH26*$BB$1,AH26*$BC$1)))","v":{"v":0,"d":"0.00"}},{"$f":"IF(AND('Att. Dairy'!B26=\"\"),\"\",IF(AND(AK26=\"\"),\"\",AK26*$BD$1))","v":{"v":0,"d":"0.00"}},{"$f":"IF(AND('Att. Dairy'!B26=\"\"),\"\",IF(AND(AV26=\"\",AW26=\"\"),\"\",SUM(AV26,AW26)))","v":{"v":0,"d":"0.00"}},{"$f":"IF(AND('Att. Dairy'!B26=\"\"),\"\",IF(AND(AF26=\"\"),\"\",BI26))","v":""},{"$nulls":6},{"$f":"IF(AND('Att. Dairy'!C26=\"\"),\"\",'Att. Dairy'!C26)","v":""},"",{"$f":"IF(AND('Att. Dairy'!D26=\"\"),\"\",'Att. Dairy'!D26)","v":"Sunday"},"vodk'k",0,{"$nulls":15},false,false,{"$nulls":45},"2019-07-21",0,251.55,186.05,{"v":115.55999999999999,"d":"115.56"},{"v":0,"d":"0.00"},{"v":0,"d":"0.00"},{"v":0,"d":"0.00"},251.55,186.05,{"v":115.55999999999999,"d":"115.56"},"","","","","","","0","0",{"v":0,"d":"0.00"},251.55,186.05,{"v":115.55999999999999,"d":"115.56"},{"v":0,"d":"0.00"},{"v":0,"d":"0.00"},""]
[22,{"$f":"IF(AND('Att. Dairy'!B27=\"\"),\"\",'Att. Dairy'!B27)","v":"2019-07-22"},null,{"v":251.55,"d":"251.550"},{"v":186.05,"d":"186.050"},{"v":57.779999999999994,"d":"57.780"},{"v":28.889999999999997,"d":"28.890"},{"v":28.889999999999997,"d":"28.890"},{"$nulls":15},{"v":251.55,"d":"251.550"},{"v":186.05,"d":"186.050"},{"v":57.779999999999994,"d":"57.780"},{"v":28.889999999999997,"d":"28.890"},{"v":28.889999999999997,"d":"28.890"},{"$f":"IF(AND('Att. Dairy'!R27=\"\"),\"\",'Att. Dairy'!R27)","v":""},{"$f":"IF(AND('Att. Dairy'!S27=\"\"),\"\",'Att. Dairy'!S27)","v":""},0,{"$f":"IF(AND('Att. Dairy'!G27=\"\"),\"\",'Att. Dairy'!G27)","v":""},{"$f":"IF(AND('Att. Dairy'!H27=\"\"),\"\",'Att. Dairy'!H27)","v":""},0,{"$f":"IF(AND('Att. Dairy'!L27=\"\"),\"\",'Att. Dairy'!L27)","v":""},{"$f":"IF(AND('Att. Dairy'!M27=\"\"),\"\",'Att. Dairy'!M27)","v":""},0,{"v":0,"d":"0.000"},"0",{"v":0,"d":"0.000"},{"v":0,"d":"0.000"},{"v":0,"d":"0.000"},{"v":251.55,"d":"251.550"},{"v":186.05,"d":"186.050"},{"v":57.779999999999994,"d":"57.780"},{"v":28.889999999999997,"d":"28.890"},{"v":28.889999999999997,"d":"28.890"},{"$f":"IF(AND('Att. Dairy'!B27=\"\"),\"\",IF(AND(AH27=\"\"),\"\",IF(AND(C27=\"YES\",AH27>0),AH27*$BB$1,AH27*$BC$1)))","v":{"v":0,"d":"0.00"}},{"$f":"IF(AND('Att. Dairy'!B27=\"\"),\"\",IF(AND(AK27=\"\"),\"\",AK27*$BD$1))","v":{"v":0,"d":"0.00"}},{"$f":"IF(AND('Att. Dairy'!B27=\"\"),\"\",IF(AND(AV27=\"\",AW27=\"\"),\"\",SUM(AV27,AW27)))","v":{"v":0,"d":"0.00"}},{"$f":"IF(AND('Att. Dairy'!B27=\"\"),\"\",IF(AND(AF27=\"\"),\"\",BI27))","v":""},{"$nulls":6},{"$f":"IF(AND('Att. Dairy'!C27=\"\"),\"\",'Att. Dairy'!C27)","v":""},"",{"$f":"IF(AND('Att. Dairy'!D27=\"\"),\"\",'Att. Dairy'!D27)","v":"Monday"},"lCthjksVh",0,{"$nulls":15},"W","W",{"$nulls":45},"2019-07-22",0,251.55,186.05,{"v":115.55999999999999,"d":"115.56"},{"v":0,"d":"0.00"},{"v":0,"d":"0.00"},{"v":0,"d":"0.00"},251.55,186.05,{"v":115.55999999999999,"d":"115.56"},"","","","","","",{"v":0,"d":"0.00"},"0",{"v":0,"d":"0.00"},251.55,186.05,{"v":115.55999999999999,"d":"115.56"},{"v":0,"d":"0.00"},{"v":0,"d":"0.00"},""]
[23,{"$f":"IF(AND('Att. Dairy'!B28=\"\"),\"\",'Att. Dairy'!B28)","v":"2019-07-23"},null,{"$f":"IF(AND(AQ27=\"\"),\"\",AQ27)","v":{"v":251.55,"d":"251.550"}},{"v":186.05,"d":"186.050"},{"v":57.779999999999994,"d":"57.780"},{"v":28.889999999999997,"d":"28.890"},{"v":28.889999999999997,"d":"28.890"},{"$nulls":15},{"v":251.55,"d":"251.550"},{"v":186.05,"d":"186.050"},{"v":57.779999999999994,"d":"57.780"},{"v":28.889999999999997,"d":"28.890"},{"v":28.889999999999997,"d":"28.890"},{"$f":"IF(AND('Att. Dairy'!R28=\"\"),\"\",'Att. Dairy'!R28)","v":""},{"$f":"IF(AND('Att. Dairy'!S28=\"\"),\"\",'Att. Dairy'!S28)","v":""},0,{"$f":"IF(AND('Att. Dairy'!G28=\"\"),\"\",'Att. Dairy'!G28)","v":""},{"$f":"IF(AND('Att. Dairy'!H28=\"\"),\"\",'Att. Dairy'!H28)","v":""},0,{"$f":"IF(AND('Att. Dairy'!L28=\"\"),\"\",'Att. Dairy'!L28)","v":""},{"$f":"IF(AND('Att. Dairy'!M28=\"\"),\"\",'Att. Dairy'!M28)","v":""},0,"0",{"v":0,"d":"0.000"},{"v":0,"d":"0.000"},{"v":0,"d":"0.000"},{"v":0,"d":"0.000"},{"v":251.55,"d":"251.550"},{"v":186.05,"d":"186.050"},{"v":57.779999999999994,"d":"57.780"},{"v":28.889999999999997,"d":"28.890"},{"v":28.889999999999997,"d":"28.890"},{"$f":"IF(AND('Att. Dairy'!B28=\"\"),\"\",IF(AND(AH28=\"\"),\"\",IF(AND(C28=\"YES\",AH28>0),AH28*$BB$1,AH28*$BC$1)))","v":{"v":0,"d":"0.00"}},{"$f":"IF(AND('Att. Dairy'!B28=\"\"),\"\",IF(AND(AK28=\"\"),\"\",AK28*$BD$1))","v":{"v":0,"d":"0.00"}},{"$f":"IF(AND('Att. Dairy'!B28=\"\"),\"\",IF(AND(AV28=\"\",AW28=\"\"),\"\",SUM(AV28,AW28)))","v":{"v":0,"d":"0.00"}},{"$f":"IF(AND('Att. Dairy'!B28=\"\"),\"\",IF(AND(AF28=\"\"),\"\",BI28))","v":""},{"$nulls":6},{"$f":"IF(AND('Att. Dairy'!C28=\"\"),\"\",'Att. Dairy'!C28)","v":""},"",{"$f":"IF(AND('Att. Dairy'!D28=\"\"),\"\",'Att. Dairy'!D28)","v":"Tuesday"},"nkypkoy",0,{"$nulls":15},"R","R",{"$nulls":45},"2019-07-23",0,251.55,186.05,{"v":115.55999999999999,"d":"115.56"},{"v":0,"d":"0.00"},{"v":0,"d":"0.00"},{"v":0,"d":"0.00"},251.55,186.05,{"v":115.55999999999999,"d":"115.56"},"","","","","","","0",{"v":0,"d":"0.00"},{"v":0,"d":"0.00"},251.55,186.05,{"v":115.55999999999999,"d":"115.56"},{"v":0,"d":"0.00"},{"v":0,"d":"0.00"},""]
[24,{"$f":"IF(AND('Att. Dairy'!B29=\"\"),\"\",'Att. Dairy'!B29)","v":"2019-07-24"},null,{"v":251.55,"d":"251.550"},{"v":186.05,"d":"186.050"},{"v":57.779999999999994,"d":"57.780"},{"v":28.889999999999997,"d":"28.890"},{"v":28.889999999999997,"d":"28.890"},{"$nulls":15},{"v":251.55,"d":"251.550"},{"v":186.05,"d":"186.050"},{"v":57.779999999999994,"d":"57.780"},{"v":28.889999999999997,"d":"28.890"},{"v":28.889999999999997,"d":"28.890"},{"$f":"IF(AND('Att. Dairy'!R29=\"\"),\"\",'Att. Dairy'!R29)","v":""},{"$f":"IF(AND('Att. Dairy'!S29=\"\"),\"\",'Att. Dairy'!S29)","v":""},0,{"$f":"IF(AND('Att. Dairy'!G29=\"\"),\"\",'Att. Dairy'!G29)","v":""},{"$f":"IF(AND('Att. Dairy'!H29=\"\"),\"\",'Att. Dairy'!H29)","v":""},0,{"$f":"IF(AND('Att. Dairy'!L29=\"\"),\"\",'Att. Dairy'!L29)","v":""},{"$f":"IF(AND('Att. Dairy'!M29=\"\"),\"\",'Att. Dairy'!M29)","v":""},0,{"v":0,"d":"0.000"},"0",{"v":0,"d":"0.000"},{"v":0,"d":"0.000"},{"v":0,"d":"0.000"},{"v":251.55,"d":"251.550"},{"v":186.05,"d":"186.050"},{"v":57.779999999999994,"d":"57.780"},{"v":28.889999999999997,"d":"28.890"},{"v":28.889999999999997,"d":"28.890"},{"$f":"IF(AND('Att. Dairy'!B29=\"\"),\"\",IF(AND(AH29=\"\"),\"\",IF(AND(C29=\"YES\",AH29>0),AH29*$BB$1,AH29*$BC$1)))","v":{"v":0,"d":"0.00"}},{"$f":"IF(AND('Att. Dairy'!B29=\"\"),\"\",IF(AND(AK29=\"\"),\"\",AK29*$BD$1))","v":{"v":0,"d":"0.00"}},{"$f":"IF(AND('Att. Dairy'!B29=\"\"),\"\",IF(AND(AV29=\"\",AW29=\"\"),\"\",SUM(AV29,AW29)))","v":{"v":0,"d":"0.00"}},{"$f":"IF(AND('Att. Dairy'!B29=\"\"),\"\",IF(AND(AF29=\"\"),\"\",BI29))","v":""},{"$nulls":6},{"$f":"IF(AND('Att. Dairy'!C29=\"\"),\"\",'Att. Dairy'!C29)","v":""},"",{"$f":"IF(AND('Att. Dairy'!D29=\"\"),\"\",'Att. Dairy'!D29)","v":"Wednesday"},"nkyjksVh",0,{"$nulls":15},"W","W",{"$nulls":45},"2019-07-24",0,251.55,186.05,{"v":115.55999999999999,"d":"115.56"},{"v":0,"d":"0.00"},{"v":0,"d":"0.00"},{"v":0,"d":"0.00"},251.55,186.05,{"v":115.55999999999999,"d":"115.56"},"","","","","","",{"v":0,"d":"0.00"},"0",{"v":0,"d":"0.00"},251.55,186.05,{"v":115.55999999999999,"d":"115.56"},{"v":0,"d":"0.00"},{"v":0,"d":"0.00"},""]
[25,{"$f":"IF(AND('Att. Dairy'!B30=\"\"),\"\",'Att. Dairy'!B30)","v":"2019-07-25"},null,{"v":251.55,"d":"251.550"},{"v":186.05,"d":"186.050"},{"v":57.779999999999994,"d":"57.780"},{"v":28.889999999999997,"d":"28.890"},{"v":28.889999999999997,"d":"28.890"},{"$nulls":15},{"v":251.55,"d":"251.550"},{"v":186.05,"d":"186.050"},{"v":57.779999999999994,"d":"57.780"},{"v":28.889999999999997,"d":"28.890"},{"v":28.889999999999997,"d":"28.890"},{"$f":"IF(AND('Att. Dairy'!R30=\"\"),\"\",'Att. Dairy'!R30)","v":""},{"$f":"IF(AND('Att. Dairy'!S30=\"\"),\"\",'Att. Dairy'!S30)","v":""},0,{"$f":"IF(AND('Att. Dairy'!G30=\"\"),\"\",'Att. Dairy'!G30)","v":""},{"$f":"IF(AND('Att. Dairy'!H30=\"\"),\"\",'Att. Dairy'!H30)","v":""},0,{"$f":"IF(AND('Att. Dairy'!L30=\"\"),\"\",'Att. Dairy'!L30)","v":""},{"$f":"IF(AND('Att. Dairy'!M30=\"\"),\"\",'Att. Dairy'!M30)","v":""},0,"0",{"v":0,"d":"0.000"},{"v":0,"d":"0.000"},{"v":0,"d":"0.000"},{"v":0,"d":"0.000"},{"v":251.55,"d":"251.550"},{"v":186.05,"d":"186.050"},{"v":57.779999999999994,"d":"57.780"},{"v":28.889999999999997,"d":"28.890"},{"v":28.889999999999997,"d":"28.890"},{"$f":"IF(AND('Att. Dairy'!B30=\"\"),\"\",IF(AND(AH30=\"\"),\"\",IF(AND(C30=\"YES\",AH30>0),AH30*$BB$1,AH30*$BC$1)))","v":{"v":0,"d":"0.00"}},{"$f":"IF(AND('Att. Dairy'!B30=\"\"),\"\",IF(AND(AK30=\"\"),\"\",AK30*$BD$1))","v":{"v":0,"d":"0.00"}},{"$f":"IF(AND('Att. Dairy'!B30=\"\"),\"\",IF(AND(AV30=\"\",AW30=\"\"),\"\",SUM(AV30,AW30)))","v":{"v":0,"d":"0.00"}},{"$f":"IF(AND('Att. Dairy'!B30=\"\"),\"\",IF(AND(AF30=\"\"),\"\",BI30))","v":""},{"$nulls":6},{"$f":"IF(AND('Att. Dairy'!C30=\"\"),\"\",'Att. Dairy'!C30)","v":""},"",{"$f":"IF(AND('Att. Dairy'!D30=\"\"),\"\",'Att. Dairy'!D30)","v":"Thursday"},"f[kpM+h",0,{"$nulls":15},"R","R",{"$nulls":45},"2019-07-25",0,251.55,186.05,{"v":115.55999999999999,"d":"115.56"},{"v":0,"d":"0.00"},{"v":0,"d":"0.00"},{"v":0,"d":"0.00"},251.55,186.05,{"v":115.55999999999999,"d":"115.56"},"","","","","","","0",{"v":0,"d":"0.00"},{"v":0,"d":"0.00"},251.55,186.05,{"v":115.55999999999999,"d":"115.56"},{"v":0,"d":"0.00"},{"v":0,"d":"0.00"},""]
[26,{"$f":"IF(AND('Att. Dairy'!B31=\"\"),\"\",'Att. Dairy'!B31)","v":"2019-07-26"},null,{"v":251.55,"d":"251.550"},{"v":186.05,"d":"186.050"},{"v":57.779999999999994,"d":"57.780"},{"v":28.889999999999997,"d":"28.890"},{"v":28.889999999999997,"d":"28.890"},{"$nulls":15},{"v":251.55,"d":"251.550"},{"v":186.05,"d":"186.050"},{"v":57.779999999999994,"d":"57.780"},{"v":28.889999999999997,"d":"28.890"},{"v":28.889999999999997,"d":"28.890"},{"$f":"IF(AND('Att. Dairy'!R31=\"\"),\"\",'Att. Dairy'!R31)","v":""},{"$f":"IF(AND('Att. Dairy'!S31=\"\"),\"\",'Att. Dairy'!S31)","v":""},0,{"$f":"IF(AND('Att. Dairy'!G31=\"\"),\"\",'Att. Dairy'!G31)","v":""},{"$f":"IF(AND('Att. Dairy'!H31=\"\"),\"\",'Att. Dairy'!H31)","v":""},0,{"$f":"IF(AND('Att. Dairy'!L31=\"\"),\"\",'Att. Dairy'!L31)","v":""},{"$f":"IF(AND('Att. Dairy'!M31=\"\"),\"\",'Att. Dairy'!M31)","v":""},0,{"v":0,"d":"0.000"},"0",{"v":0,"d":"0.000"},{"v":0,"d":"0.000"},{"v":0,"d":"0.000"},{"v":251.55,"d":"251.550"},{"v":186.05,"d":"186.050"},{"v":57.779999999999994,"d":"57.780"},{"v":28.889999999999997,"d":"28.890"},{"v":28.889999999999997,"d":"28.890"},{"$f":"IF(AND('Att. Dairy'!B31=\"\"),\"\",IF(AND(AH31=\"\"),\"\",IF(AND(C31=\"YES\",AH31>0),AH31*$BB$1,AH31*$BC$1)))","v":{"v":0,"d":"0.00"}},{"$f":"IF(AND('Att. Dairy'!B31=\"\"),\"\",IF(AND(AK31=\"\"),\"\",AK31*$BD$1))","v":{"v":0,"d":"0.00"}},{"$f":"IF(AND('Att. Dairy'!B31=\"\"),\"\",IF(AND(AV31=\"\",AW31=\"\"),\"\",SUM(AV31,AW31)))","v":{"v":0,"d":"0.00"}},{"$f":"IF(AND('Att. Dairy'!B31=\"\"),\"\",IF(AND(AF31=\"\"),\"\",BI31))","v":""},{"$nulls":6},{"$f":"IF(AND('Att. Dairy'!C31=\"\"),\"\",'Att. Dairy'!C31)","v":""},"",{"$f":"IF(AND('Att. Dairy'!D31=\"\"),\"\",'Att. Dairy'!D31)","v":"Friday"},"nkyjksVh",0,{"$nulls":15},"W","W",{"$nulls":45},"2019-07-26",0,251.55,186.05,{"v":115.55999999999999,"d":"115.56"},{"v":0,"d":"0.00"},{"v":0,"d":"0.00"},{"v":0,"d":"0.00"},251.55,186.05,{"v":115.55999999999999,"d":"115.56"},"","","","","","",{"v":0,"d":"0.00"},"0",{"v":0,"d":"0.00"},251.55,186.05,{"v":115.55999999999999,"d":"115.56"},{"v":0,"d":"0.00"},{"v":0,"d":"0.00"},""]
[27,{"$f":"IF(AND('Att. Dairy'!B32=\"\"),\"\",'Att. Dairy'!B32)","v":"2019-07-27"},null,{"v":251.55,"d":"251.550"},{"v":186.05,"d":"186.050"},{"v":57.779999999999994,"d":"57.780"},{"v":28.889999999999997,"d":"28.890"},{"v":28.889999999999997,"d":"28.890"},{"$nulls":15},{"v":251.55,"d":"251.550"},{"v":186.05,"d":"186.050"},{"v":57.779999999999994,"d":"57.780"},{"v":28.889999999999997,"d":"28.890"},{"v":28.889999999999997,"d":"28.890"},{"$f":"IF(AND('Att. Dairy'!R32=\"\"),\"\",'Att. Dairy'!R32)","v":""},{"$f":"IF(AND('Att. Dairy'!S32=\"\"),\"\",'Att. Dairy'!S32)","v":""},0,{"$f":"IF(AND('Att. Dairy'!G32=\"\"),\"\",'Att. Dairy'!G32)","v":""},{"$f":"IF(AND('Att. Dairy'!H32=\"\"),\"\",'Att. Dairy'!H32)","v":""},0,{"$f":"IF(AND('Att. Dairy'!L32=\"\"),\"\",'Att. Dairy'!L32)","v":""},{"$f":"IF(AND('Att. Dairy'!M32=\"\"),\"\",'Att. Dairy'!M32)","v":""},0,{"v":0,"d":"0.000"},"0",{"v":0,"d":"0.000"},{"v":0,"d":"0.000"},{"v":0,"d":"0.000"},{"v":251.55,"d":"251.550"},{"v":186.05,"d":"186.050"},{"v":57.779999999999994,"d":"57.780"},{"v":28.889999999999997,"d":"28.890"},{"v":28.889999999999997,"d":"28.890"},{"$f":"IF(AND('Att. Dairy'!B32=\"\"),\"\",IF(AND(AH32=\"\"),\"\",IF(AND(C32=\"YES\",AH32>0),AH32*$BB$1,AH32*$BC$1)))","v":{"v":0,"d":"0.00"}},{"$f":"IF(AND('Att. Dairy'!B32=\"\"),\"\",IF(AND(AK32=\"\"),\"\",AK32*$BD$1))","v":{"v":0,"d":"0.00"}},{"$f":"IF(AND('Att. Dairy'!B32=\"\"),\"\",IF(AND(AV32=\"\",AW32=\"\"),\"\",SUM(AV32,AW32)))","v":{"v":0,"d":"0.00"}},{"$f":"IF(AND('Att. Dairy'!B32=\"\"),\"\",IF(AND(AF32=\"\"),\"\",BI32))","v":""},{"$nulls":6},{"$f":"IF(AND('Att. Dairy'!C32=\"\"),\"\",'Att. Dairy'!C32)","v":""},"",{"$f":"IF(AND('Att. Dairy'!D32=\"\"),\"\",'Att. Dairy'!D32)","v":"Saturday"},"lCthjksVh",0,{"$nulls":15},"W","W",{"$nulls":45},"2019-07-27",0,251.55,186.05,{"v":115.55999999999999,"d":"115.56"},{"v":0,"d":"0.00"},{"v":0,"d":"0.00"},{"v":0,"d":"0.00"},251.55,186.05,{"v":115.55999999999999,"d":"115.56"},"","","","","","",{"v":0,"d":"0.00"},"0",{"v":0,"d":"0.00"},251.55,186.05,{"v":115.55999999999999,"d":"115.56"},{"v":0,"d":"0.00"},{"v":0,"d":"0.00"},""]
[28,{"$f":"IF(AND('Att. Dairy'!B33=\"\"),\"\",'Att. Dairy'!B33)","v":"2019-07-28"},null,{"v":251.55,"d":"251.550"},{"v":186.05,"d":"186.050"},{"v":57.779999999999994,"d":"57.780"},{"v":28.889999999999997,"d":"28.890"},{"v":28.889999999999997,"d":"28.890"},{"$nulls":15},{"v":251.55,"d":"251.550"},{"v":186.05,"d":"186.050"},{"v":57.779999999999994,"d":"57.780"},{"v":28.889999999999997,"d":"28.890"},{"v":28.889999999999997,"d":"28.890"},{"$f":"IF(AND('Att. Dairy'!R33=\"\"),\"\",'Att. Dairy'!R33)","v":""},{"$f":"IF(AND('Att. Dairy'!S33=\"\"),\"\",'Att. Dairy'!S33)","v":""},0,{"$f":"IF(AND('Att. Dairy'!G33=\"\"),\"\",'Att. Dairy'!G33)","v":""},{"$f":"IF(AND('Att. Dairy'!H33=\"\"),\"\",'Att. Dairy'!H33)","v":""},0,{"$f":"IF(AND('Att. Dairy'!L33=\"\"),\"\",'Att. Dairy'!L33)","v":""},{"$f":"IF(AND('Att. Dairy'!M33=\"\"),\"\",'Att. Dairy'!M33)","v":""},0,"0","0",{"v":0,"d":"0.000"},{"v":0,"d":"0.000"},{"v":0,"d":"0.000"},{"v":251.55,"d":"251.550"},{"v":186.05,"d":"186.050"},{"v":57.779999999999994,"d":"57.780"},{"v":28.889999999999997,"d":"28.890"},{"v":28.889999999999997,"d":"28.890"},{"$f":"IF(AND('Att. Dairy'!B33=\"\"),\"\",IF(AND(AH33=\"\"),\"\",IF(AND(C33=\"YES\",AH33>0),AH33*$BB$1,AH33*$BC$1)))","v":{"v":0,"d":"0.00"}},{"$f":"IF(AND('Att. Dairy'!B33=\"\"),\"\",IF(AND(AK33=\"\"),\"\",AK33*$BD$1))","v":{"v":0,"d":"0.00"}},{"$f":"IF(AND('Att. Dairy'!B33=\"\"),\"\",IF(AND(AV33=\"\",AW33=\"\"),\"\",SUM(AV33,AW33)))","v":{"v":0,"d":"0.00"}},{"$f":"IF(AND('Att. Dairy'!B33=\"\"),\"\",IF(AND(AF33=\"\"),\"\",BI33))","v":""},{"$nulls":6},{"$f":"IF(AND('Att. Dairy'!C33=\"\"),\"\",'Att. Dairy'!C33)","v":""},"",{"$f":"IF(AND('Att. Dairy'!D33=\"\"),\"\",'Att. Dairy'!D33)","v":"Sunday"},"vodk'k",0,{"$nulls":15},false,false,{"$nulls":45},"2019-07-28",0,251.55,186.05,{"v":115.55999999999999,"d":"115.56"},{"v":0,"d":"0.00"},{"v":0,"d":"0.00"},{"v":0,"d":"0.00"},251.55,186.05,{"v":115.55999999999999,"d":"115.56"},"","","","","","","0","0",{"v":0,"d":"0.00"},251.55,186.05,{"v":115.55999999999999,"d":"115.56"},{"v":0,"d":"0.00"},{"v":0,"d":"0.00"},""]
[29,{"$f":"IF(AND('Att. Dairy'!B34=\"\"),\"\",'Att. Dairy'!B34)","v":"2019-07-29"},null,{"v":251.55,"d":"251.550"},{"v":186.05,"d":"186.050"},{"v":57.779999999999994,"d":"57.780"},{"v":28.889999999999997,"d":"28.890"},{"v":28.889999999999997,"d":"28.890"},{"$nulls":15},{"v":251.55,"d":"251.550"},{"v":186.05,"d":"186.050"},{"v":57.779999999999994,"d":"57.780"},{"v":28.889999999999997,"d":"28.890"},{"v":28.889999999999997,"d":"28.890"},{"$f":"IF(AND('Att. Dairy'!R34=\"\"),\"\",'Att. Dairy'!R34)","v":""},{"$f":"IF(AND('Att. Dairy'!S34=\"\"),\"\",'Att. Dairy'!S34)","v":""},0,{"$f":"IF(AND('Att. Dairy'!G34=\"\"),\"\",'Att. Dairy'!G34)","v":""},{"$f":"IF(AND('Att. Dairy'!H34=\"\"),\"\",'Att. Dairy'!H34)","v":""},0,{"$f":"IF(AND('Att. Dairy'!L34=\"\"),\"\",'Att. Dairy'!L34)","v":""},{"$f":"IF(AND('Att. Dairy'!M34=\"\"),\"\",'Att. Dairy'!M34)","v":""},0,{"v":0,"d":"0.000"},"0",{"v":0,"d":"0.000"},{"v":0,"d":"0.000"},{"v":0,"d":"0.000"},{"v":251.55,"d":"251.550"},{"v":186.05,"d":"186.050"},{"v":57.779999999999994,"d":"57.780"},{"v":28.889999999999997,"d":"28.890"},{"v":28.889999999999997,"d":"28.890"},{"$f":"IF(AND('Att. Dairy'!B34=\"\"),\"\",IF(AND(AH34=\"\"),\"\",IF(AND(C34=\"YES\",AH34>0),AH34*$BB$1,AH34*$BC$1)))","v":{"v":0,"d":"0.00"}},{"$f":"IF(AND('Att. Dairy'!B34=\"\"),\"\",IF(AND(AK34=\"\"),\"\",AK34*$BD$1))","v":{"v":0,"d":"0.00"}},{"$f":"IF(AND('Att. Dairy'!B34=\"\"),\"\",IF(AND(AV34=\"\",AW34=\"\"),\"\",SUM(AV34,AW34)))","v":{"v":0,"d":"0.00"}},{"$f":"IF(AND('Att. Dairy'!B34=\"\"),\"\",IF(AND(AF34=\"\"),\"\",BI34))","v":""},{"$nulls":6},{"$f":"IF(AND('Att. Dairy'!C34=\"\"),\"\",'Att. Dairy'!C34)","v":""},"",{"$f":"IF(AND('Att. Dairy'!D34=\"\"),\"\",'Att. Dairy'!D34)","v":"Monday"},"lCthjksVh",0,{"$nulls":15},"W","W",{"$nulls":45},"2019-07-29",0,251.55,186.05,{"v":115.55999999999999,"d":"115.56"},{"v":0,"d":"0.00"},{"v":0,"d":"0.00"},{"v":0,"d":"0.00"},251.55,186.05,{"v":115.55999999999999,"d":"115.56"},"","","","","","",{"v":0,"d":"0.00"},"0",{"v":0,"d":"0.00"},251.55,186.05,{"v":115.55999999999999,"d":"115.56"},{"v":0,"d":"0.00"},{"v":0,"d":"0.00"},""]
[30,{"$f":"IF(AND('Att. Dairy'!B35=\"\"),\"\",'Att. Dairy'!B35)","v":"2019-07-30"},null,{"v":251.55,"d":"251.550"},{"v":186.05,"d":"186.050"},{"v":57.779999999999994,"d":"57.780"},{"v":28.889999999999997,"d":"28.890"},{"v":28.889999999999997,"d":"28.890"},{"$nulls":15},{"v":251.55,"d":"251.550"},{"v":186.05,"d":"186.050"},{"v":57.779999999999994,"d":"57.780"},{"v":28.889999999999997,"d":"28.890"},{"v":28.889999999999997,"d":"28.890"},{"$f":"IF(AND('Att. Dairy'!R35=\"\"),\"\",'Att. Dairy'!R35)","v":""},{"$f":"IF(AND('Att. Dairy'!S35=\"\"),\"\",'Att. Dairy'!S35)","v":""},0,{"$f":"IF(AND('Att. Dairy'!G35=\"\"),\"\",'Att. Dairy'!G35)","v":""},{"$f":"IF(AND('Att. Dairy'!H35=\"\"),\"\",'Att. Dairy'!H35)","v":""},0,{"$f":"IF(AND('Att. Dairy'!L35=\"\"),\"\",'Att. Dairy'!L35)","v":""},{"$f":"IF(AND('Att. Dairy'!M35=\"\"),\"\",'Att. Dairy'!M35)","v":""},0,"0",{"v":0,"d":"0.000"},{"v":0,"d":"0.000"},{"v":0,"d":"0.000"},{"v":0,"d":"0.000"},{"v":251.55,"d":"251.550"},{"v":186.05,"d":"186.050"},{"v":57.779999999999994,"d":"57.780"},{"v":28.889999999999997,"d":"28.890"},{"v":28.889999999999997,"d":"28.890"},{"$f":"IF(AND('Att. Dairy'!B35=\"\"),\"\",IF(AND(AH35=\"\"),\"\",IF(AND(C35=\"YES\",AH35>0),AH35*$BB$1,AH35*$BC$1)))","v":{"v":0,"d":"0.00"}},{"$f":"IF(AND('Att. Dairy'!B35=\"\"),\"\",IF(AND(AK35=\"\"),\"\",AK35*$BD$1))","v":{"v":0,"d":"0.00"}},{"$f":"IF(AND('Att. Dairy'!B35=\"\"),\"\",IF(AND(AV35=\"\",AW35=\"\"),\"\",SUM(AV35,AW35)))","v":{"v":0,"d":"0.00"}},{"$f":"IF(AND('Att. Dairy'!B35=\"\"),\"\",IF(AND(AF35=\"\"),\"\",BI35))","v":""},{"$nulls":6},{"$f":"IF(AND('Att. Dairy'!C35=\"\"),\"\",'Att. Dairy'!C35)","v":""},"",{"$f":"IF(AND('Att. Dairy'!D35=\"\"),\"\",'Att. Dairy'!D35)","v":"Tuesday"},"nkypkoy",0,{"$nulls":15},"R","R",{"$nulls":45},"2019-07-30",0,251.55,186.05,{"v":115.55999999999999,"d":"115.56"},{"v":0,"d":"0.00"},{"v":0,"d":"0.00"},{"v":0,"d":"0.00"},251.55,186.05,{"v":115.55999999999999,"d":"115.56"},"","","","","","","0",{"v":0,"d":"0.00"},{"v":0,"d":"0.00"},251.55,186.05,{"v":115.55999999999999,"d":"115.56"},{"v":0,"d":"0.00"},{"v":0,"d":"0.00"},""]
[31,{"$f":"IF(AND('Att. Dairy'!B36=\"\"),\"\",'Att. Dairy'!B36)","v":"2019-07-31"},null,{"v":251.55,"d":"251.550"},{"v":186.05,"d":"186.050"},{"v":57.779999999999994,"d":"57.780"},{"v":28.889999999999997,"d":"28.890"},{"v":28.889999999999997,"d":"28.890"},{"$nulls":15},{"v":251.55,"d":"251.550"},{"v":186.05,"d":"186.050"},{"v":57.779999999999994,"d":"57.780"},{"v":28.889999999999997,"d":"28.890"},{"v":28.889999999999997,"d":"28.890"},{"$f":"IF(AND('Att. Dairy'!R36=\"\"),\"\",'Att. Dairy'!R36)","v":""},{"$f":"IF(AND('Att. Dairy'!S36=\"\"),\"\",'Att. Dairy'!S36)","v":""},0,{"$f":"IF(AND('Att. Dairy'!G36=\"\"),\"\",'Att. Dairy'!G36)","v":""},{"$f":"IF(AND('Att. Dairy'!H36=\"\"),\"\",'Att. Dairy'!H36)","v":""},0,{"$f":"IF(AND('Att. Dairy'!L36=\"\"),\"\",'Att. Dairy'!L36)","v":""},{"$f":"IF(AND('Att. Dairy'!M36=\"\"),\"\",'Att. Dairy'!M36)","v":""},0,{"v":0,"d":"0.000"},"0",{"v":0,"d":"0.000"},{"v":0,"d":"0.000"},{"v":0,"d":"0.000"},{"v":251.55,"d":"251.550"},{"v":186.05,"d":"186.050"},{"v":57.779999999999994,"d":"57.780"},{"v":28.889999999999997,"d":"28.890"},{"v":28.889999999999997,"d":"28.890"},{"$f":"IF(AND('Att. Dairy'!B36=\"\"),\"\",IF(AND(AH36=\"\"),\"\",IF(AND(C36=\"YES\",AH36>0),AH36*$BB$1,AH36*$BC$1)))","v":{"v":0,"d":"0.00"}},{"$f":"IF(AND('Att. Dairy'!B36=\"\"),\"\",IF(AND(AK36=\"\"),\"\",AK36*$BD$1))","v":{"v":0,"d":"0.00"}},{"$f":"IF(AND('Att. Dairy'!B36=\"\"),\"\",IF(AND(AV36=\"\",AW36=\"\"),\"\",SUM(AV36,AW36)))","v":{"v":0,"d":"0.00"}},{"$f":"IF(AND('Att. Dairy'!B36=\"\"),\"\",IF(AND(AF36=\"\"),\"\",BI36))","v":""},{"$nulls":6},{"$f":"IF(AND('Att. Dairy'!C36=\"\"),\"\",'Att. Dairy'!C36)","v":""},"",{"$f":"IF(AND('Att. Dairy'!D36=\"\"),\"\",'Att. Dairy'!D36)","v":"Wednesday"},"nkyjksVh",0,{"$nulls":15},"W","W",{"$nulls":45},"2019-07-31",0,251.55,186.05,{"v":115.55999999999999,"d":"115.56"},{"v":0,"d":"0.00"},{"v":0,"d":"0.00"},{"v":0,"d":"0.00"},251.55,186.05,{"v":115.55999999999999,"d":"115.56"},"","","","","","",{"v":0,"d":"0.00"},"0",{"v":0,"d":"0.00"},251.55,186.05,{"v":115.55999999999999,"d":"115.56"},{"v":0,"d":"0.00"},{"v":0,"d":"0.00"},""]
[{"$nulls":3},"dqy",{"$nulls":4},{"$f":"SUM(I6:I36)","v":{"v":0,"d":"0.000"}},{"v":0,"d":"0.000"},{"v":0,"d":"0.000"},{"v":0,"d":"0.000"},{"v":0,"d":"0.000"},{"v":0,"d":"0.000"},{"v":0,"d":"0.000"},{"v":0,"d":"0.000"},{"v":0,"d":"0.000"},{"v":0,"d":"0.000"},{"v":0,"d":"0.000"},{"v":0,"d":"0.000"},{"v":0,"d":"0.000"},{"v":0,"d":"0.000"},{"$f":"SUM(W6:W36)","v":{"v":0,"d":"0.000"}},{"$nulls":5},{"$f":"SUM(AC6:AC36)","v":672},{"$f":"SUM(AD6:AD36)","v":777},1449,206,210,416,288,300,588,{"$f":"SUM(AL6:AL36)","v":{"v":48.45,"d":"48.450"}},{"$f":"SUM(AM6:AM36)","v":{"v":13.95,"d":"13.950"}},{"$f":"SUM(AN6:AN36)","v":{"v":2.2199999999999998,"d":"2.220"}},{"$f":"SUM(AO6:AO36)","v":{"v":1.1099999999999999,"d":"1.110"}},{"v":1.1099999999999999,"d":"1.110"},{"$nulls":5},{"$f":"SUM(AV6:AV36)","v":2425.48},{"$f":"SUM(AW6:AW36)","v":{"v":4116,"d":"4116.00"}},{"$f":"SUM(AX6:AX36)","v":{"v":6541.4800000000005,"d":"6541.48"}},{"$nulls":7},{"$f":"IF(AND('Att. Dairy'!C37=\"\"),\"\",'Att. Dairy'!C37)","v":""},"",{"$f":"IF(AND('Att. Dairy'!D37=\"\"),\"\",'Att. Dairy'!D37)","v":""},null,{"$f":"SUM(BJ6:BJ36)","v":680.8},{"$nulls":15},"","",{"$nulls":46},"dqy",{"$nulls":3},{"$f":"SUM(DZ6:DZ36)","v":{"v":0,"d":"0.00"}},{"$f":"SUM(EA6:EA36)","v":{"v":0,"d":"0.00"}},{"v":0,"d":"0.00"},{"$nulls":3},{"$f":"SUM(EF6:EF36)","v":672},{"$f":"SUM(EG6:EG36)","v":777},206,210,288,300,{"$f":"SUM(EL6:EL36)","v":48.45},{"$f":"SUM(EM6:EM36)","v":13.95},{"$f":"SUM(EN6:EN36)","v":{"v":4.4399999999999995,"d":"4.44"}},{"$nulls":3},{"$f":"SUM(ER6:ER36)","v":2425.48},{"$f":"SUM(ES6:ES36)","v":{"v":4116,"d":"4116.00"}}]
[{"$nulls":36},31,null,{"$f":"AL37+AM37","v":{"v":62.400000000000006,"d":"62.400"}},{"$nulls":8},{"$f":"SUM(C6:C36)","v":{"v":0,"d":"0.00"}},{"$nulls":9},{"$f":"IF(AND('[1]Attendance dairy'!C38=\"\"),\"\",'[1]Attendance dairy'!C38)","v":""},"",{"$nulls":17},{"v":0,"d":"0.000"},"",""]
[{"$nulls":18},{"$f":"N37+S37","v":{"v":0,"d":"0.000"}},{"$f":"O37+T37","v":{"v":0,"d":"0.000"}},{"$nulls":16},0,{"$nulls":10},{"$f":"#REF!","v":{"$error":"#REF!"}},{"$nulls":9},{"$f":"IF(AND('[1]Attendance dairy'!C39=\"\"),\"\",'[1]Attendance dairy'!C39)","v":""},"",{"$nulls":17},0,"",""]
[{"$nulls":18},{"v":0,"d":"0.000"},{"v":0,"d":"0.000"},{"$nulls":27},{"$f":"SUM(AV39-AV37+AV38)","v":{"$error":"#REF!"}},{"$nulls":9},{"$f":"IF(AND('[1]Attendance dairy'!C40=\"\"),\"\",'[1]Attendance dairy'!C40)","v":""},"",{"$nulls":17},{"v":0,"d":"0.00"},"",""]
[{"$nulls":57},{"$f":"IF(AND('[1]Attendance dairy'!C41=\"\"),\"\",'[1]Attendance dairy'!C41)","v":""},"",{"$nulls":18},"",""]
[{"$nulls":57},{"$f":"IF(AND('[1]Attendance dairy'!C42=\"\"),\"\",'[1]Attendance dairy'!C42)","v":""},"",{"$nulls":18},"",""]
[{"$nulls":37},"ekg esa çkIr dqy jkf'k",{"$nulls":19},{"$f":"IF(AND('[1]Attendance dairy'!C43=\"\"),\"\",'[1]Attendance dairy'!C43)","v":""},"",{"$nulls":18},"",""]
[{"$nulls":37},"ekg esa O;; dqy jkf'k",{"$nulls":20},"",{"$nulls":18},"",{"$f":"IF(AND(BW44=\"\"),BZ44,BX44)","v":""}]
[{"$nulls":37},"ekg esa 'ks\"k jkf'k"]
[{"$nulls":37},"ekg esa ykHkfUor fo|kFkhZ"]

{"sheet":"Praptra-1","index":6,"n_rows":60,"n_cols":7,"rows_kept":60,"merged":[[0,0,0,6],[1,0,1,1],[1,2,1,3],[1,5,1,6],[2,0,2,1],[2,2,2,3],[2,5,2,6],[3,1,3,3],[4,1,4,3],[5,1,5,3],[6,1,6,3],[7,0,8,0],[7,1,8,2],[9,0,11,0],[9,1,11,2],[12,0,13,0],[12,1,13,2],[14,0,16,0],[14,1,16,2],[17,0,18,0],[17,1,18,2],[19,0,21,0],[19,1,21,2],[22,0,23,0],[22,1,23,2],[24,0,26,0],[24,1,26,2],[27,0,28,0],[27,1,28,2],[29,0,31,0],[29,1,31,2],[32,0,33,0],[32,1,33,2],[34,0,36,0],[34,1,36,2],[37,0,41,0],[37,1,41,2],[42,0,46,0],[42,1,42,2],[47,0,53,0],[47,1,53,2],[55,1,55,4],[57,1,57,2],[57,4,57,6],[58,0,58,2],[58,4,58,6],[59,0,59,1],[59,3,59,4],[59,5,59,6]]}
["feM&Ms&ehy dk;ZØe ¼jktLFkku ljdkj½ fo|ky; ekfld lwpuk izi="]
["fo|ky; dk uke %&",null,{"$f":"IF(AND('MASTER DATA'!C4=\"\"),\"\",'MASTER DATA'!C4)","v":"jk-m-ek-fo- bUnjokM+k"},null,"MkbZl dksM ua- %&",{"$f":"IF(AND('MASTER DATA'!C12=\"\"),\"\",'MASTER DATA'!C12)","v":8200303101}]
["xzke iapk;r dk uke %&",null,{"$f":"IF(AND('MASTER DATA'!C15=\"\"),\"\",'MASTER DATA'!C15)","v":"bUnjokM+k "},null,"ekg@o\"kZ %&",{"$f":"IF(AND('MASTER DATA'!J4=\"\"),\"\",'MASTER DATA'!J4)","v":"tqykbZ&2019"}]
["Ø-l-","fooj.k",null,null,"d{kk 1 ls 5 rd","d{kk 6 ls 8 rd",";ksx"]
[1,"ekg ds dqy dk;Z fnol",null,null,{"$f":"'Att. Dairy'!I39","v":4},{"$f":"'Att. Dairy'!L39","v":4},{"$f":"SUM(E5,F5)","v":8}]
[2,"fo|ky; dk dqy ukekadu",null,null,{"$f":"'Att. Dairy'!Q37","v":2023},{"$f":"'Att. Dairy'!T37","v":1449},{"$f":"SUM(E6,F6)","v":3472}]
[3,"iks\"kkgkj ls ykHkkfUor dqy fo|kFkhZ",null,null,{"$f":"'PS Balance Sheet'!AH37","v":400},{"$f":"'UPS balance Sheet'!AH37","v":416},816]
[4,"izkjfEHkd 'ks\"k [kk|kUu ¼fdyksaxzke esa½",null,"xsgqa",{"$f":"'Dal & Khadhiyan master'!E7","v":{"v":250,"d":"250.000"}},{"$f":"'Dal & Khadhiyan master'!G7","v":{"v":300,"d":"300.000"}},{"v":550,"d":"550.000"}]
[{"$nulls":3},"pkoy",{"$f":"'Dal & Khadhiyan master'!E8","v":{"v":150,"d":"150.000"}},{"$f":"'Dal & Khadhiyan master'!G8","v":{"v":200,"d":"200.000"}},{"$f":"SUM(E9,F9)","v":{"v":350,"d":"350.000"}}]
[5,"izkjfEHkd 'ks\"k nky ¼fdyksaxzke esa½",null,"ewax",{"$f":"'Dal & Khadhiyan master'!E9","v":{"v":40,"d":"40.000"}},{"$f":"'Dal & Khadhiyan master'!G9","v":{"v":60,"d":"60.000"}},{"v":100,"d":"100.000"}]
[{"$nulls":3},"mMn",{"$f":"'Dal & Khadhiyan master'!E10","v":{"v":20,"d":"20.000"}},{"$f":"'Dal & Khadhiyan master'!G10","v":{"v":30,"d":"30.000"}},{"v":50,"d":"50.000"}]
[{"$nulls":3},"puk",{"$f":"'Dal & Khadhiyan master'!E11","v":{"v":20,"d":"20.000"}},{"$f":"'Dal & Khadhiyan master'!G11","v":{"v":30,"d":"30.000"}},{"v":50,"d":"50.000"}]
[6,"lIyk;j ls izkIr [kk|kUu ¼fdyksaxzke esa½",null,"xsgqa",{"$f":"'Dal & Khadhiyan master'!E12","v":{"v":0,"d":"0.000"}},{"$f":"'Dal & Khadhiyan master'!G12","v":{"v":0,"d":"0.000"}},{"v":0,"d":"0.000"}]
[{"$nulls":3},"pkoy",{"$f":"'Dal & Khadhiyan master'!E13","v":{"v":0,"d":"0.000"}},{"$f":"'Dal & Khadhiyan master'!G13","v":{"v":0,"d":"0.000"}},{"v":0,"d":"0.000"}]
[7,"lIyk;j ls izkIr nky ¼fdyksaxzke esa½",null,"ewax",{"$f":"'Dal & Khadhiyan master'!E14","v":{"v":0,"d":"0.000"}},{"$f":"'Dal & Khadhiyan master'!G14","v":{"v":0,"d":"0.000"}},{"v":0,"d":"0.000"}]
[{"$nulls":3},"mMn",{"$f":"'Dal & Khadhiyan master'!E15","v":{"v":0,"d":"0.000"}},{"$f":"'Dal & Khadhiyan master'!G15","v":{"v":0,"d":"0.000"}},{"v":0,"d":"0.000"}]
[{"$nulls":3},"puk",{"$f":"'Dal & Khadhiyan master'!E16","v":{"v":0,"d":"0.000"}},{"$f":"'Dal & Khadhiyan master'!G16","v":{"v":0,"d":"0.000"}},{"v":0,"d":"0.000"}]
[8,"vU;= ls izkIr [kk|kUu ¼tulg;ksx@m/kkj½ ¼fdyksaxzke esa½",null,"xsgqa",{"$f":"'Dal & Khadhiyan master'!E17","v":{"v":0,"d":"0.000"}},{"$f":"'Dal & Khadhiyan master'!G17","v":{"v":0,"d":"0.000"}},{"v":0,"d":"0.000"}]
[{"$nulls":3},"pkoy",{"$f":"'Dal & Khadhiyan master'!E18","v":{"v":0,"d":"0.000"}},{"$f":"'Dal & Khadhiyan master'!G18","v":{"v":0,"d":"0.000"}},{"v":0,"d":"0.000"}]
[9,"vU;= ls izkIr nky ¼tulg;ksx@m/kkj½ ¼fdyksxzke esa½",null,"ewax",{"$f":"'Dal & Khadhiyan master'!E19","v":{"v":0,"d":"0.000"}},{"$f":"'Dal & Khadhiyan master'!G19","v":{"v":0,"d":"0.000"}},{"v":0,"d":"0.000"}]
[{"$nulls":3},"mMn",{"$f":"'Dal & Khadhiyan master'!E20","v":{"v":0,"d":"0.000"}},{"$f":"'Dal & Khadhiyan master'!G20","v":{"v":0,"d":"0.000"}},{"v":0,"d":"0.000"}]
[{"$nulls":3},"puk",{"$f":"'Dal & Khadhiyan master'!E21","v":{"v":0,"d":"0.000"}},{"$f":"'Dal & Khadhiyan master'!G21","v":{"v":0,"d":"0.000"}},{"v":0,"d":"0.000"}]
[10,"miyC/k dqy [kk|kUu ¼4+6+8½ ¼fdyksxzke esa½",null,"xsgqa",{"$f":"'Dal & Khadhiyan master'!E22","v":{"v":250,"d":"250.000"}},{"$f":"'Dal & Khadhiyan master'!G22","v":{"v":300,"d":"300.000"}},{"v":550,"d":"550.000"}]
[{"$nulls":3},"pkoy",{"$f":"'Dal & Khadhiyan master'!E23","v":{"v":150,"d":"150.000"}},{"$f":"'Dal & Khadhiyan master'!G23","v":{"v":200,"d":"200.000"}},{"v":350,"d":"350.000"}]
[11,"miyC/k dqy nky ¼5+7+9½ ¼fdyksxzke esa½",null,"ewax",{"$f":"'Dal & Khadhiyan master'!E24","v":{"v":40,"d":"40.000"}},{"$f":"'Dal & Khadhiyan master'!G24","v":{"v":60,"d":"60.000"}},{"v":100,"d":"100.000"}]
[{"$nulls":3},"mMn",{"$f":"'Dal & Khadhiyan master'!E25","v":{"v":20,"d":"20.000"}},{"$f":"'Dal & Khadhiyan master'!G25","v":{"v":30,"d":"30.000"}},{"v":50,"d":"50.000"}]
[{"$nulls":3},"puk",{"$f":"'Dal & Khadhiyan master'!E26","v":{"v":20,"d":"20.000"}},{"$f":"'Dal & Khadhiyan master'!G26","v":{"v":30,"d":"30.000"}},{"v":50,"d":"50.000"}]
[12,"Hkkstu cukus esa [kpZ [kk|kUu ¼fdyksxzke esa½",null,"xsgqa",{"$f":"'Dal & Khadhiyan master'!E27","v":{"v":31.099999999999998,"d":"31.100"}},{"$f":"'Dal & Khadhiyan master'!G27","v":{"v":48.45,"d":"48.450"}},{"v":79.55,"d":"79.550"}]
[{"$nulls":3},"pkoy",{"$f":"'Dal & Khadhiyan master'!E28","v":{"v":8.9,"d":"8.900"}},{"$f":"'Dal & Khadhiyan master'!G28","v":{"v":13.95,"d":"13.950"}},{"v":22.85,"d":"22.850"}]
[13,"Hkkstu cukus esa [kpZ nky ¼fdyksxzke esa½",null,"ewax",{"$f":"'Dal & Khadhiyan master'!E29","v":{"v":1.4,"d":"1.400"}},{"$f":"'Dal & Khadhiyan master'!G29","v":{"v":2.2199999999999998,"d":"2.220"}},{"$f":"SUM(E30,F30)","v":{"v":3.6199999999999997,"d":"3.620"}}]
[{"$nulls":3},"mMn",{"$f":"'Dal & Khadhiyan master'!E30","v":{"v":0.7,"d":"0.700"}},{"$f":"'Dal & Khadhiyan master'!G30","v":{"v":1.1099999999999999,"d":"1.110"}},{"v":1.8099999999999998,"d":"1.810"}]
[{"$nulls":3},"puk",{"$f":"'Dal & Khadhiyan master'!E31","v":{"v":0.7,"d":"0.700"}},{"$f":"'Dal & Khadhiyan master'!G31","v":{"v":1.1099999999999999,"d":"1.110"}},{"v":1.8099999999999998,"d":"1.810"}]
[14," 'ks\"k [kk|kUu ¼10-12½ ¼fdyksxzke esa½",null,"xsgqa",{"$f":"'Dal & Khadhiyan master'!E32","v":{"v":218.9,"d":"218.900"}},{"$f":"'Dal & Khadhiyan master'!G32","v":{"v":251.55,"d":"251.550"}},{"v":470.45000000000005,"d":"470.450"}]
[{"$nulls":3},"pkoy",{"$f":"'Dal & Khadhiyan master'!E33","v":{"v":141.1,"d":"141.100"}},{"$f":"'Dal & Khadhiyan master'!G33","v":{"v":186.05,"d":"186.050"}},{"v":327.15,"d":"327.150"}]
[15," 'ks\"k nky ¼11-13½ ¼fdyksxzke esa½",null,"ewax",{"$f":"'Dal & Khadhiyan master'!E34","v":{"v":38.6,"d":"38.600"}},{"$f":"'Dal & Khadhiyan master'!G34","v":{"v":57.78,"d":"57.780"}},{"v":96.38,"d":"96.380"}]
[{"$nulls":3},"mMn",{"$f":"'Dal & Khadhiyan master'!E35","v":19.3},{"$f":"'Dal & Khadhiyan master'!G35","v":28.89},48.19]
[{"$nulls":3},"puk",{"$f":"'Dal & Khadhiyan master'!E36","v":19.3},{"$f":"'Dal & Khadhiyan master'!G36","v":28.89},48.19]
[16,"dqfdax dUotZu foÙkh; fLFkfr ¼:i;ksaa es½",null,"izkjfEHkd 'ks\"k",{"$f":"'Dal & Khadhiyan master'!E37","v":{"v":10000,"d":"10000.00"}},{"$f":"'Dal & Khadhiyan master'!G37","v":{"v":15000,"d":"15000.00"}},{"v":25000,"d":"25000.00"}]
[{"$nulls":3},"izkIRk jkf'k",{"$f":"'Dal & Khadhiyan master'!E38","v":{"v":15000,"d":"15000.00"}},{"$f":"'Dal & Khadhiyan master'!G38","v":{"v":20000,"d":"20000.00"}},{"v":35000,"d":"35000.00"}]
[{"$nulls":3},"dqy jkf'k",{"$f":"'Dal & Khadhiyan master'!E39","v":{"v":25000,"d":"25000.00"}},{"$f":"'Dal & Khadhiyan master'!G39","v":{"v":35000,"d":"35000.00"}},{"v":60000,"d":"60000.00"}]
[{"$nulls":3},"O;; jkf'k",{"$f":"'Dal & Khadhiyan master'!E40","v":1562.1999999999998},{"$f":"'Dal & Khadhiyan master'!G40","v":2425.48},3987.68]
[{"$nulls":3},"'ks\"k jkf'k",{"$f":"'Dal & Khadhiyan master'!E41","v":23437.8},{"$f":"'Dal & Khadhiyan master'!G41","v":32574.52},56012.32]
[17,"dqd&de&gsYij foÙkh; fLFkfr ¼:i;ksa esa½",null,"izkjfEHkd 'ks\"k",{"$f":"'Dal & Khadhiyan master'!E42","v":2000},{"$f":"'Dal & Khadhiyan master'!G42","v":2000},{"$f":"SUM(E43,F43)","v":4000}]
[null,"1- dqdgsYij",{"$f":"IF(AND('MASTER DATA'!C37=\"\"),\"\",'MASTER DATA'!C37)","v":"Dhagalai Devi"},"izkIRk jkf'k",{"$f":"'Dal & Khadhiyan master'!E43","v":6000},{"$f":"'Dal & Khadhiyan master'!G43","v":6000},12000]
[null,"2  uke %&",{"$f":"IF(AND('MASTER DATA'!C38=\"\"),\"\",'MASTER DATA'!C38)","v":"Geeta Devi"},"dqy jkf'k",{"$f":"'Dal & Khadhiyan master'!E44","v":8000},{"$f":"'Dal & Khadhiyan master'!G44","v":8000},16000]
[null,"3  uke %&",{"$f":"IF(AND('MASTER DATA'!C39=\"\"),\"\",'MASTER DATA'!C39)","v":""},"O;; jkf'k",{"$f":"'Dal & Khadhiyan master'!E45","v":0},{"$f":"'Dal & Khadhiyan master'!G45","v":0},0]
[null,"4  uke %&",{"$f":"IF(AND('MASTER DATA'!C40=\"\"),\"\",'MASTER DATA'!C40)","v":""},"'ks\"k jkf'k",{"$f":"'Dal & Khadhiyan master'!E46","v":8000},{"$f":"'Dal & Khadhiyan master'!G46","v":8000},16000]
[18,"vUuiw.kkZ nqX/k ;kstuk lEcfU/kr lwpuk",null,"nw/k ls ykHkkfUor la[;k",{"$f":"'Milk master'!E7","v":431},{"$f":"'Milk master'!G7","v":588},1019]
[{"$nulls":3},"nw/k dk mi;ksx yhVj esa",{"$f":"'Milk master'!E8","v":64.64999999999999},{"$f":"'Milk master'!G8","v":117.60000000000001},{"$f":"SUM(E49,F49)","v":182.25}]
[{"$nulls":3},"izkj- 'ks\"k jkf'k",{"$f":"'Milk master'!E9","v":{"v":5000,"d":"5000.00"}},{"$f":"'Milk master'!G9","v":{"v":7000,"d":"7000.00"}},{"v":12000,"d":"12000.00"}]
[{"$nulls":3},"izkIr jkf'k",{"$f":"'Milk master'!E10","v":{"v":1500,"d":"1500.00"}},{"$f":"'Milk master'!G10","v":{"v":2000,"d":"2000.00"}},{"v":3500,"d":"3500.00"}]
[{"$nulls":3},"dqy jkf'k",{"$f":"'Milk master'!E11","v":{"v":6500,"d":"6500.00"}},{"$f":"'Milk master'!G11","v":{"v":9000,"d":"9000.00"}},{"v":15500,"d":"15500.00"}]
[{"$nulls":3},"O;; jkf'k",{"$f":"'Milk master'!E12","v":2262.75},{"$f":"'Milk master'!G12","v":{"v":4116,"d":"4116.00"}},6378.75]
[{"$nulls":3},"'ks\"k jkf'k",{"$f":"'Milk master'!E13","v":4237.25},{"$f":"'Milk master'!G13","v":{"v":4884,"d":"4884.00"}},9121.25]
[]
[null,"uksV %& lHkh dkWye dks lgh ,oa iw.kZ :i ls HkjsaA bldh leLr ftEesnkjh gLrk{kjdrkZ dh gksxhA"]
[]
[null,{"$f":"IF(AND('MASTER DATA'!C9=\"\"),\"\",'MASTER DATA'!C9)","v":"vtqZuflag"},null,null,{"$f":"IF(AND('MASTER DATA'!C7=\"\"),\"\",'MASTER DATA'!C7)","v":"feJhyky"}]
["iks\"kkgkj izHkkjh gLrk{kj e; lhy",{"$nulls":3},"laLFkk iz/kku gLrk{kj e; lhy"]
["iks\"kkgkj izHkkjh eks-u- %&",null,{"$f":"IF(AND('MASTER DATA'!C11=\"\"),\"\",'MASTER DATA'!C11)","v":9929247228},"laLFkk iz/kku eksckbZy uEcj %&",null,{"$f":"IF(AND('MASTER DATA'!C10=\"\"),\"\",'MASTER DATA'!C10)","v":9929247227}]

{"sheet":"UC Food","index":7,"n_rows":27,"n_cols":36,"rows_kept":27,"merged":[[0,8,0,27],[1,8,1,24],[2,1,2,2],[2,3,2,13],[2,14,2,18],[2,19,2,31],[3,10,3,21],[3,26,3,27],[3,28,3,33],[4,0,6,0],[4,1,6,1],[4,2,4,3],[4,4,4,5],[4,6,4,9],[4,10,4,13],[4,14,4,17],[4,18,4,21],[4,22,4,25],[4,26,4,29],[4,30,4,33],[4,34,6,34],[4,35,6,35],[5,2,6,2],[5,3,6,3],[5,4,6,4],[5,5,6,5],[5,6,5,7],[5,8,5,9],[5,10,5,11],[5,12,5,13],[5,14,5,15],[5,16,5,17],[5,18,5,19],[5,20,5,21],[5,22,5,23],[5,24,5,25],[5,26,5,27],[5,28,5,29],[5,30,5,31],[5,32,5,33],[10,8,10,24],[11,10,11,21],[12,0,14,0],[12,1,14,2],[12,3,12,11],[12,12,12,17],[12,18,12,23],[12,24,12,29],[12,30,12,35],[13,3,14,5],[13,6,14,8],[13,9,14,11],[13,12,14,13],[13,14,14,15],[13,16,14,17],[13,18,14,19],[13,20,14,21],[13,22,14,23],[13,24,14,25],[13,26,14,27],[13,28,14,29],[13,30,14,31],[13,32,14,33],[13,34,14,35],[15,1,15,2],[15,3,15,5],[15,6,15,8],[15,9,15,11],[15,12,15,13],[15,14,15,15],[15,16,15,17],[15,18,15,19],[15,20,15,21],[15,22,15,23],[15,24,15,25],[15,26,15,27],[15,28,15,29],[15,30,15,31],[15,32,15,33],[15,34,15,35],[16,1,16,2],[16,3,16,5],[16,6,16,8],[16,9,16,11],[16,12,16,13],[16,14,16,15],[16,16,16,17],[16,18,16,19],[16,20,16,21],[16,22,16,23],[16,24,16,25],[16,26,16,27],[16,28,16,29],[16,30,16,31],[16,32,16,33],[16,34,16,35],[18,8,18,24],[19,10,19,21],[20,0,22,0],[20,1,22,2],[20,3,20,6],[20,7,20,14],[20,19,20,22],[20,23,22,24],[20,25,22,26],[20,27,22,28],[20,29,22,30],[20,31,22,33],[20,34,22,35],[21,3,22,4],[21,5,22,6],[21,7,21,8],[21,9,21,10],[21,11,21,12],[21,13,21,14],[21,15,22,15],[21,16,22,16],[21,17,22,18],[21,19,22,20],[21,21,22,22],[23,1,23,2],[23,3,23,4],[23,5,23,6],[23,17,23,18],[23,19,23,20],[23,21,23,22],[23,23,23,24],[23,25,23,26],[23,27,23,28],[23,29,23,30],[23,31,23,33],[23,34,23,35],[24,1,24,2],[24,3,24,4],[24,5,24,6],[24,17,24,18],[24,19,24,20],[24,21,24,22],[24,23,24,24],[24,25,24,26],[24,27,24,28],[24,29,24,30],[24,31,24,33],[24,34,24,35],[25,1,25,18],[26,24,27,34]]}
[{"$nulls":8},"feM&Ms&ehy dk;ZØe"]
[{"$nulls":8},"[kk|kUu dk mi;ksfxrk izek.k&i= ¼lesfdr½ ¼fdyksxzke esa½"]
[null," fo|ky; dk uke %&",null,{"$f":"IF(AND('MASTER DATA'!C4=\"\"),\"\",'MASTER DATA'!C4)","v":"jk-m-ek-fo- bUnjokM+k"},{"$nulls":10},"uksMy dsUnz dk uke %&",{"$nulls":4},{"$f":"IF(AND('MASTER DATA'!C6=\"\"),\"\",'MASTER DATA'!C6)","v":"jkmekfo ua- 02 jkuh"}]
[{"$nulls":10},"izi=&1",{"$nulls":15},"ekg %&",null,{"$f":"IF(AND('MASTER DATA'!J4=\"\"),\"\",'MASTER DATA'!J4)","v":"tqykbZ&2019"}]
["Øl"," fo|ky; dk uke","ukekadu",null,"ykHkkfoUr Nk=@Nk=k",null,"iwoZ dk 'ks\"k [kk|kUu",{"$nulls":3},"lIyk;j ls izkIr",{"$nulls":3},"tu lg;ksx ;k vU; ls izkIr",{"$nulls":3},"dqy miyC/k [kk|kUu",{"$nulls":3},"ekg esa mi;ksx",{"$nulls":3},"vU;= O;ofLFkr fd;k x;k [kk|kUu",{"$nulls":3}," 'ks\"k [kk|kUu",{"$nulls":3},"dk;Z fnol","dqd de gsYij  dh la[;k"]
[null,null,"d{kk 1 ls 5","d{kk 6 ls 8","d{kk 1 ls 5","d{kk 6 ls 8","d{kk 1 ls 5",null,"d{kk 6 ls 8",null,"d{kk 1 ls 5",null,"d{kk 6 ls 8",null,"d{kk 1 ls 5",null,"d{kk 6 ls 8",null,"d{kk 1 ls 5",null,"d{kk 6 ls 8",null,"d{kk 1 ls 5",null,"d{kk 6 ls 8",null,"d{kk 1 ls 5",null,"d{kk 6 ls 8",null,"d{kk 1 ls 5",null,"d{kk 6 ls 8"]
[{"$nulls":6},"xsagqW","pkoy","xsagqW","pkoy","xsagqW","pkoy","xsagqW","pkoy","xsagqW","pkoy","xsagqW","pkoy","xsagqW","pkoy","xsagqW","pkoy","xsagqW","pkoy","xsagqW","pkoy","xsagqW","pkoy","xsagqW","pkoy","xsagqW","pkoy","xsagqW","pkoy"]
[1,2,3,4,5,6,7,8,9,10,11,12,13,14,15,16,17,18,19,20,21,22,23,24,25,26,27,28,29,30,31,32,33,34,35,36]
[1,{"$f":"'MASTER DATA'!C4","v":"jk-m-ek-fo- bUnjokM+k"},{"$f":"'Praptra-1'!E6","v":2023},{"$f":"'Praptra-1'!F6","v":1449},{"$f":"'Praptra-1'!E7","v":400},{"$f":"'Praptra-1'!F7","v":416},{"$f":"'Praptra-1'!E8","v":{"v":250,"d":"250.000"}},{"$f":"'Praptra-1'!E9","v":{"v":150,"d":"150.000"}},{"$f":"'Praptra-1'!F8","v":{"v":300,"d":"300.000"}},{"$f":"'Praptra-1'!F9","v":{"v":200,"d":"200.000"}},{"$f":"'Praptra-1'!E13","v":{"v":0,"d":"0.000"}},{"$f":"'Praptra-1'!E14","v":{"v":0,"d":"0.000"}},{"$f":"'Praptra-1'!F13","v":{"v":0,"d":"0.000"}},{"$f":"'Praptra-1'!F14","v":{"v":0,"d":"0.000"}},{"$f":"'PS Balance Sheet'!N37","v":{"v":0,"d":"0.000"}},{"$f":"'PS Balance Sheet'!O37","v":{"v":0,"d":"0.000"}},{"$f":"'UPS balance Sheet'!N37","v":{"v":0,"d":"0.000"}},{"$f":"'UPS balance Sheet'!O37","v":{"v":0,"d":"0.000"}},{"$f":"G9+K9+O9","v":{"v":250,"d":"250.000"}},{"$f":"H9+L9+P9","v":{"v":150,"d":"150.000"}},{"$f":"I9+M9+Q9","v":{"v":300,"d":"300.000"}},{"$f":"J9+N9+R9","v":{"v":200,"d":"200.000"}},{"$f":"'Praptra-1'!E28","v":{"v":31.099999999999998,"d":"31.100"}},{"$f":"'Praptra-1'!E29","v":{"v":8.9,"d":"8.900"}},{"$f":"'Praptra-1'!F28","v":{"v":48.45,"d":"48.450"}},{"$f":"'Praptra-1'!F29","v":{"v":13.95,"d":"13.950"}},{"$f":"'PS Balance Sheet'!S37","v":0},{"$f":"'PS Balance Sheet'!T37","v":0},{"$f":"'UPS balance Sheet'!S37","v":0},{"$f":"'UPS balance Sheet'!T37","v":0},{"$f":"S9-W9-AA9","v":{"v":218.9,"d":"218.900"}},{"$f":"T9-X9-AB9","v":{"v":141.1,"d":"141.100"}},{"v":251.55,"d":"251.550"},{"v":186.05,"d":"186.050"},{"$f":"'Att. Dairy'!I39","v":4},{"$f":"COUNTA('MASTER DATA'!C37:D40)-COUNTIF('MASTER DATA'!C37:D40,\"0\")-COUNTIF('MASTER DATA'!C37:D40,\"blank\")","v":2}]
[]
[{"$nulls":8},"jkf'k dk mi;ksfxrk izek.k&i= ¼lesfdr½ ¼:i;ksa esa½"]
[{"$nulls":10},"izi=&2"]
["Øl"," fo|ky; dk uke",null,"izkjfEHkd 'ks\"k",{"$nulls":8},"izkIr jkf'k",{"$nulls":5},"dqy izkIr jkf'k",{"$nulls":5},"ekg esa mi;ksx jkf'k",{"$nulls":5},"Hkqxrku i'pkr 'ks\"k jkf'k"]
[{"$nulls":3},"d{kk 1 ls 5        ¼ $ ;k & ½",null,null,"d{kk 6 ls 8         ¼ $ ;k & ½",null,null,"d{kk 1 ls 8         ¼ $ ;k & ½",null,null,"d{kk 1    ls 5",null,"d{kk 6    ls 8",null,"d{kk 1    ls 8",null,"d{kk 1    ls 5",null,"d{kk 6    ls 8",null,"d{kk 1    ls 8",null,"d{kk 1    ls 5",null,"d{kk 6    ls 8",null,"d{kk 1    ls 8",null,"d{kk 1    ls 5",null,"d{kk 6    ls 8",null,"d{kk 1    ls 8"]
[]
[1,2,null,3,null,null,4,null,null,5,null,null,6,null,7,null,8,null,9,null,10,null,11,null,12,null,13,null,14,null,15,null,16,null,17]
[1,{"$f":"'MASTER DATA'!C4","v":"jk-m-ek-fo- bUnjokM+k"},null,{"$f":"'Dal & Khadhiyan master'!E37","v":{"v":10000,"d":"10000.00"}},null,null,{"$f":"'Dal & Khadhiyan master'!G37","v":{"v":15000,"d":"15000.00"}},null,null,{"$f":"D17+G17","v":{"v":25000,"d":"25000.00"}},null,null,{"$f":"'Dal & Khadhiyan master'!E38","v":{"v":15000,"d":"15000.00"}},null,{"$f":"'Dal & Khadhiyan master'!G38","v":{"v":20000,"d":"20000.00"}},null,{"$f":"M17+O17","v":{"v":35000,"d":"35000.00"}},null,{"$f":"D17+M17","v":{"v":25000,"d":"25000.00"}},null,{"$f":"G17+O17","v":{"v":35000,"d":"35000.00"}},null,{"$f":"J17+Q17","v":{"v":60000,"d":"60000.00"}},null,{"$f":"'Dal & Khadhiyan master'!E40","v":{"v":1562.1999999999998,"d":"1562.20"}},null,{"$f":"'Dal & Khadhiyan master'!G40","v":2425.48},null,{"$f":"Y17+AA17","v":3987.68},null,{"$f":"S17-Y17","v":{"v":23437.8,"d":"23437.80"}},null,{"$f":"U17-AA17","v":32574.52},null,{"$f":"W17-AC17","v":56012.32}]
[]
[{"$nulls":8},"HkkSfrd izxfr fjiksVZ ¼lesfdr½"]
[{"$nulls":10},"izi=&3"]
["Øl"," fo|ky; dk uke",null,"fujh{k.k dk fooj.k la[;k",{"$nulls":3},"fdpu 'ksM dh fLFkfr",{"$nulls":7},"is;ty lqfo/kk ¼gs.MiEi½",{"$nulls":3}," 'kkSpky; gS ;k ugh",{"$nulls":3},"vk;ksftr cSBd ,l-,elh- ¼fnuakd ½",null,"rjktq gS ;k ugh",null,"[kk|kUu lqjf{kr j[kus\nds crZu  la[;k",null,"jsEi gS ;k ugh",null,"ekg ds vUr rd dqy\n[kkyh cksfj;kW dh la[;k",null,null,"pkj fnokjh gS ;k ugh"]
[{"$nulls":3},"tuizfrfuf/k }kjk ",null,"vf/kdkfj;ksa }kjk",null,"Mh-ih-bZ-ih- }kjk",null,",l-th-vkj-okbZ }kjk",null,"vkn'kZ jlksbZ?kj",null,",e-Mh-,e- ;kstuk }kjk",null,"pkyw","[kjkc","udkjk",null,"Nk=",null,"Nk=k"]
[{"$nulls":7},"iw.kZ","viw.kZ","iw.kZ","viw.kZ","iw.kZ","viw.kZ","iw.kZ","viw.kZ"]
[1,2,null,3,null,4,null,5,6,7,8,9,10,11,12,13,14,15,null,16,null,17,null,18,null,19,null,20,null,21,null,22,null,null,23]
[1,{"$f":"'MASTER DATA'!C4","v":"jk-m-ek-fo- bUnjokM+k"},null,{"$f":"'MASTER DATA'!C24","v":0},null,{"$f":"'MASTER DATA'!E24","v":0},null,{"$f":"IF(AND('MASTER DATA'!AF38='MASTER DATA'!AF28),\"ü\",\"\")","v":""},{"$f":"IF(AND('MASTER DATA'!AG38='MASTER DATA'!AG28),\"ü\",\"\")","v":""},{"$f":"IF(AND('MASTER DATA'!AH38='MASTER DATA'!AH28),\"ü\",\"\")","v":""},{"$f":"IF(AND('MASTER DATA'!AI38='MASTER DATA'!AI28),\"ü\",\"\")","v":""},{"$f":"IF(AND('MASTER DATA'!AJ38='MASTER DATA'!AJ28),\"ü\",\"\")","v":"ü"},{"$f":"IF(AND('MASTER DATA'!AK38='MASTER DATA'!AK28),\"ü\",\"\")","v":""},{"$f":"IF(AND('MASTER DATA'!AL38='MASTER DATA'!AL28),\"ü\",\"\")","v":"ü"},{"$f":"IF(AND('MASTER DATA'!AM38='MASTER DATA'!AM28),\"ü\",\"\")","v":""},{"$f":"IF(AND('MASTER DATA'!AN38='MASTER DATA'!AN28),\"ü\",\"\")","v":"ü"},{"$f":"IF(AND('MASTER DATA'!AO38='MASTER DATA'!AO28),\"ü\",\"\")","v":""},{"$f":"IF(AND('MASTER DATA'!AP38='MASTER DATA'!AP28),\"ü\",\"\")","v":""},null,{"$f":"IF(AND('MASTER DATA'!AH40='MASTER DATA'!AP28),\"ü\",\"\")","v":"ü"},null,{"$f":"IF(AND('MASTER DATA'!AJ40='MASTER DATA'!AR28),\"ü\",\"\")","v":"ü"},null,{"$f":"IF(AND('MASTER DATA'!D27=\"\"),\"\",'MASTER DATA'!D27)","v":"2019-01-22"},null,{"$f":"IF(AND('MASTER DATA'!AF39='MASTER DATA'!AP28),\"YES\",\"NO\")","v":"YES"},null,{"$f":"IF(AND('MASTER DATA'!I27=\"\"),\"\",'MASTER DATA'!I27)","v":5},null,{"$f":"IF(AND('MASTER DATA'!AH39='MASTER DATA'!AP28),\"YES\",\"NO\")","v":"YES"},null,{"$f":"IF(AND('MASTER DATA'!P27=\"\"),\"\",'MASTER DATA'!P27)","v":10},null,null,{"$f":"IF(AND('MASTER DATA'!AJ39='MASTER DATA'!AP28),\"YES\",\"NO\")","v":"YES"}]
[null,"uksV %& lHkh dkWye dks lgh ,oa iw.kZ :i ls HkjsaA bldh leLr ftEesnkjh gLrk{kjdrkZ dh gksxhA"]
[{"$nulls":24},"gLrk{kj iz/kkuk/;kid @ iz/kkukpk;Z @ uksMy izHkkjh"]

{"sheet":"Milk Report","index":8,"n_rows":19,"n_cols":37,"rows_kept":19,"merged":[[0,9,0,28],[1,9,1,28],[2,1,2,3],[2,4,2,15],[2,16,2,19],[2,20,2,32],[3,11,3,22],[3,27,3,28],[3,29,3,34],[4,0,6,0],[4,1,6,2],[4,3,6,3],[4,4,4,12],[4,13,4,18],[4,19,4,24],[4,25,4,30],[4,31,4,34],[4,35,6,36],[5,4,6,6],[5,7,6,9],[5,10,6,12],[5,13,6,14],[5,15,6,16],[5,17,6,18],[5,19,6,20],[5,21,6,22],[5,23,6,24],[5,25,6,25],[5,26,6,26],[5,27,6,27],[5,28,6,28],[5,29,6,29],[5,30,6,30],[5,31,6,32],[5,33,6,34],[7,1,7,2],[7,4,7,6],[7,7,7,9],[7,10,7,12],[7,13,7,14],[7,15,7,16],[7,17,7,18],[7,19,7,20],[7,21,7,22],[7,23,7,24],[7,31,7,32],[7,33,7,34],[7,35,7,36],[8,1,8,2],[8,4,8,6],[8,7,8,9],[8,10,8,12],[8,13,8,14],[8,15,8,16],[8,17,8,18],[8,19,8,20],[8,21,8,22],[8,23,8,24],[8,31,8,32],[8,33,8,34],[8,35,8,36],[10,7,10,28],[11,11,11,22],[12,0,14,0],[12,1,14,2],[12,3,14,3],[12,4,12,5],[12,6,12,7],[12,8,12,13],[12,14,12,28],[12,29,12,31],[12,32,12,35],[12,36,14,36],[13,4,14,4],[13,5,14,5],[13,6,14,6],[13,7,14,7],[13,8,14,9],[13,10,14,11],[13,12,14,13],[13,14,13,16],[13,17,13,19],[13,20,13,22],[13,23,13,25],[13,26,13,28],[13,29,14,29],[13,30,14,31],[13,32,14,33],[13,34,14,35],[15,1,15,2],[15,8,15,9],[15,10,15,11],[15,12,15,13],[15,30,15,31],[15,32,15,33],[15,34,15,35],[16,1,16,2],[16,8,16,9],[16,10,16,11],[16,12,16,13],[16,32,16,33],[16,34,16,35],[17,1,17,19],[18,1,18,21],[18,24,20,36]]}
[{"$nulls":9},"feM&Ms&ehy ;kstukUrxZr ^^vUuiw.kkZ nw/k ;kstuk^^"]
[{"$nulls":9},"nqX/k iks\"kkgkj ;kstukUrxZr fiyk;s x;s nw/k ls ykHkkfUorksa dk mi;ksfxrk izek.k&i= ¼lesfdr½"]
[null," fo|ky; dk uke %&",null,null,{"$f":"IF(AND('MASTER DATA'!C4=\"\"),\"\",'MASTER DATA'!C4)","v":"jk-m-ek-fo- bUnjokM+k"},{"$nulls":11},"uksMy dsUnz dk uke %&",{"$nulls":3},{"$f":"IF(AND('MASTER DATA'!C6=\"\"),\"\",'MASTER DATA'!C6)","v":"jkmekfo ua- 02 jkuh"}]
[{"$nulls":11},"izi=&1",{"$nulls":15},"ekg %&",null,{"$f":"IF(AND('MASTER DATA'!J4=\"\"),\"\",'MASTER DATA'!J4)","v":"tqykbZ&2019"}]
["Øl"," fo|ky; dk uke",null,"nq/k ds\ndk;Z\nfnolksa dh la[;k","ukekadu\nd{kk 1 ls 5 ,oa d{kk 6 ls 8",{"$nulls":8},"nw/k ls ykHkkfoUr fo|kfFkZ;ksa dh la[;k\nd{kk 1 ls 5 ,oa d{kk 6 ls 8",{"$nulls":5},"Nk=ksa dks fiyk;s x;s nw/k dh ek=k ¼yhVj esa½ d{kk 1 ls 5 ,oa d{kk 6 ls 8",{"$nulls":5},"fo|ky; ftues ;kstuk dk lapkyu fd;k tk jgk gS esa nw/k Ø; djus\nds L=ksr ¼lEcfU/kr fodYi dj fDyd djsa½",{"$nulls":5},"nw/k miyC/k djkus okyh laLFkk@lewg\ndk uke ,oa eksckbZy ua-",{"$nulls":3},"fo-\nfo"]
[{"$nulls":4},"d{kk 1 ls 5        ",null,null,"d{kk 6 ls 8         ",null,null,"d{kk 1 ls 8         ",null,null,"d{kk 1    ls 5",null,"d{kk 6     ls 8",null,"d{kk 1    ls 8",null,"d{kk 1      ls 5",null,"d{kk 6      ls 8",null,"d{kk 1    ls 8",null,"ljl Ms;jh ¼'kgjh {ks=½","iathd`r efgyk nw/k\nmRiknd\nlgdkjh\nlfefr\n\n","vU;\niathd`r\nnw/k\nmRiknd\nlg0\nlfefr","efgyk\nLo;a\nlgk;rk\nlewg","vU;\nLo;a\nlgk;d\nlewg","vU; L=ksr","laLFkk@ lewg dk\nuke",null,"eksckbZy ua-"]
[]
[1,2,null,3,4,null,null,5,null,null,6,null,null,7,null,8,null,9,null,10,null,11,null,12,null,13,14,15,16,17,18,19,null,20,null,21]
[1,{"$f":"IF(AND('MASTER DATA'!C4=\"\"),\"\",'MASTER DATA'!C4)","v":"jk-m-ek-fo- bUnjokM+k"},null,{"$f":"IF(AND('Att. Dairy'!I42=\"\"),\"\",'Att. Dairy'!I42)","v":5},{"$f":"'PS Balance Sheet'!AE37","v":2023},null,null,{"$f":"'UPS balance Sheet'!AE37","v":1449},null,null,{"$f":"E9+H9","v":3472},null,null,{"$f":"'PS Balance Sheet'!AK37","v":431},null,{"$f":"'UPS balance Sheet'!AK37","v":588},null,{"$f":"N9+P9","v":1019},null,{"$f":"'Milk master'!E8","v":{"v":64.64999999999999,"d":"64.650"}},null,{"$f":"'Milk master'!G8","v":{"v":117.60000000000001,"d":"117.600"}},null,{"$f":"T9+V9","v":{"v":182.25,"d":"182.250"}},null,{"$f":"IF(AND('MASTER DATA'!AF42='MASTER DATA'!AP28),\"ü\",\"\")","v":"ü"},{"$f":"IF(AND('MASTER DATA'!AF43='MASTER DATA'!AP28),\"ü\",\"\")","v":""},{"$f":"IF(AND('MASTER DATA'!AF44='MASTER DATA'!AP28),\"ü\",\"\")","v":""},{"$f":"IF(AND('MASTER DATA'!AG42='MASTER DATA'!AP28),\"ü\",\"\")","v":""},{"$f":"IF(AND('MASTER DATA'!AG43='MASTER DATA'!AP28),\"ü\",\"\")","v":""},{"$f":"IF(AND('MASTER DATA'!AG44='MASTER DATA'!AP28),\"ü\",\"\")","v":"ü"},{"$f":"IF(AND('Milk master'!E19=\"\"),\"\",'Milk master'!E19)","v":"ljl Ms;jh bUnjokM+k"},null,{"$f":"IF(AND('Milk master'!E20=\"\"),\"\",'Milk master'!E20)","v":9922334455}]
[]
[{"$nulls":7},"nqX/k iks\"kkgkj ;kstukUrxZr izkIr nw/k ,oa jkf'k rFkk mi;ksx dh xbZ jkf'k dk mi;ksfxrk izek.k&i= ¼lesfdr½"]
[{"$nulls":11},"izi=&2"]
["Øl"," fo|ky; dk uke",null,"nq/k ds\ndk;Z\nfnolksa dh la[;k","ukekadu",null,"ykHkkfUor\nNk=&Nk=k",null,"1 ls 8 ds Nk=&Nk=ksa dks nw/k fiykus gsrq\nØ;&fd;s x;s nw/k dk fooj.k ¼yhVj esa½",{"$nulls":5},"Nk=&Nk=ksa dks forj.k fd;s x;s nw/k dh izkIr o forj.k jkf'k dk fooj.k",{"$nulls":14},"nw/k miyC/krk okyh laLFkk@lewg dks Hkqxrku dh xbZ",null,null,"laLFkk iz/kku dk uke ,o aeksckbZy ua-",{"$nulls":3},"fo- fo-"]
[{"$nulls":4},"d{kk 1    ls    5","d{kk 6    ls    8","d{kk 1    ls    5","d{kk 6    ls    8","Ø; fd;s x;s nw/k dk\newY;",null,"Ø;\nfd;s\nx;s nw/k\ndh ek=k",null,"mi;ksx\nfy;s x;s\nnw/k dh\nek=k",null,"iwoZ dh 'ks\"k jkf'k",null,null,"ekg esa dqy izkIr jkf'k",null,null,"dqy miyC/k izkIr jkf'k",null,null,"ekg esa mi;ksx yh xbZ jkf'k",null,null,"'ks\"k jkf'k",null,null,"Hkqxrku dh xbZ jkf'k","pSd @ vkjVhth,l\nla[;k ,oa\nfnukad",null,"laLFkk iz/kku dk uke ",null,"eksckbZy ua-"]
[{"$nulls":14},"PS","UPS","Total","PS","UPS","Total","PS","UPS","Total","PS","UPS","Total","PS","UPS","Total"]
[1,2,null,3,4,5,6,7,8,null,9,null,10,null,11,12,13,14,15,16,17,18,19,20,21,22,23,24,25,26,27,null,28,null,29,null,30]
[1,{"$f":"IF(AND('MASTER DATA'!C4=\"\"),\"\",'MASTER DATA'!C4)","v":"jk-m-ek-fo- bUnjokM+k"},null,{"$f":"IF(AND('Att. Dairy'!I42=\"\"),\"\",'Att. Dairy'!I42)","v":5},{"$f":"'PS Balance Sheet'!AE37","v":2023},{"$f":"'UPS balance Sheet'!AE37","v":1449},{"$f":"'PS Balance Sheet'!AH37","v":400},{"$f":"'UPS balance Sheet'!AH37","v":416},{"$f":"'Milk master'!E12+'Milk master'!G12","v":6378.75},null,{"$f":"'Milk master'!E8+'Milk master'!G8","v":182.25},null,{"$f":"K17","v":182.25},null,{"$f":"'Milk master'!E9","v":5000},{"$f":"'Milk master'!G9","v":7000},{"$f":"O17+P17","v":12000},{"$f":"'Milk master'!E10","v":1500},{"$f":"'Milk master'!G10","v":2000},{"$f":"R17+S17","v":3500},{"$f":"O17+R17","v":6500},{"$f":"P17+S17","v":9000},{"$f":"Q17+T17","v":15500},{"$f":"'Milk master'!E12","v":2262.75},{"$f":"'Milk master'!G12","v":{"v":4116,"d":"4116.00"}},{"$f":"X17+Y17","v":6378.75},{"$f":"'Milk master'!E13","v":4237.25},{"$f":"'Milk master'!G13","v":{"v":4884,"d":"4884.00"}},{"$f":"AA17+AB17","v":9121.25},{"$f":"IF(AND('Milk master'!E21=\"\"),\"\",'Milk master'!E21)","v":20000},{"$f":"IF(AND('Milk master'!E22=\"\"),\"\",'Milk master'!E22)","v":"RMGB123456"},{"$f":"IF(AND('Milk master'!E23=\"\"),\"\",'Milk master'!E23)","v":"2019-02-03"},{"$f":"IF(AND('MASTER DATA'!C7=\"\"),\"\",'MASTER DATA'!C7)","v":"feJhyky"},null,{"$f":"IF(AND('MASTER DATA'!C10=\"\"),\"\",'MASTER DATA'!C10)","v":9929247227}]
[null,"uksV %& lHkh dkWye dks lgh ,oa iw.kZ :i ls HkjsaA bldh leLr ftEesnkjh gLrk{kjdrkZ dh gksxhA"]
[null,"'kgjh {ks= ds fo|ky;ksa esa mPp xq.koRrkiw.kZ ik'P;wjhd`r VkasM feYd ^^ljl Ms;jh cwFk^^ ls gh nw/k Ø; fd;k tk jgk gSA",{"$nulls":22},"gLrk{kj e; lhy iz/kkuk/;kid@iz/kkukpk;Z@uksMy izHkkjh@ikbZbZvks"]

{"sheet":"Dal Report","index":9,"n_rows":12,"n_cols":42,"rows_kept":12,"merged":[[0,2,0,38],[1,2,1,38],[2,1,2,2],[2,3,2,19],[2,20,2,25],[2,26,2,41],[3,12,3,29],[3,33,3,35],[3,36,3,41],[4,0,6,0],[4,1,6,1],[4,2,4,3],[4,4,4,5],[4,6,4,11],[4,12,4,17],[4,18,4,23],[4,24,4,29],[4,30,4,35],[4,36,4,41],[5,2,6,2],[5,3,6,3],[5,4,6,4],[5,5,6,5],[5,6,5,8],[5,9,5,11],[5,12,5,14],[5,15,5,17],[5,18,5,20],[5,21,5,23],[5,24,5,26],[5,27,5,29],[5,30,5,32],[5,33,5,35],[5,36,5,38],[5,39,5,41],[10,1,10,24],[11,33,12,41]]}
[null,null,"feM&Ms&ehy dk;ZØe"]
[null,null,"nky dk mi;ksfxrk izek.k&i= ¼lesfdr½"]
[null," fo|ky; dk uke %&",null,{"$f":"IF(AND('MASTER DATA'!C4=\"\"),\"\",'MASTER DATA'!C4)","v":"jk-m-ek-fo- bUnjokM+k"},{"$nulls":16},"uksMy dsUnz dk uke %&",{"$nulls":5},{"$f":"IF(AND('MASTER DATA'!C6=\"\"),\"\",'MASTER DATA'!C6)","v":"jkmekfo ua- 02 jkuh"}]
[{"$nulls":12},"izi=&4",{"$nulls":20},"ekg %&",null,null,{"$f":"IF(AND('MASTER DATA'!J4=\"\"),\"\",'MASTER DATA'!J4)","v":"tqykbZ&2019"}]
["Øl"," fo|ky; dk uke","ukekadu",null,"ykHkkfoUr Nk=@Nk=k",null,"izkjfEHkd 'ks\"k nky",{"$nulls":5},"lIyk;j ls izkIr nky",{"$nulls":5},"LFkkuh; Lrj ij ¼m/kkj@tulg;ksx½ $ ;k &",{"$nulls":5},"dqy miyC/k nky",{"$nulls":5},"ekg esa nky mi;ksx",{"$nulls":5}," 'ks\"k nky"]
[null,null,"d{kk 1 ls 5","d{kk 6 ls 8","d{kk 1 ls 5","d{kk 6 ls 8","d{kk 1 ls 5",null,null,"d{kk 6 ls 8",null,null,"d{kk 1 ls 5",null,null,"d{kk 6 ls 8",null,null,"d{kk 1 ls 5",null,null,"d{kk 6 ls 8",null,null,"d{kk 1 ls 5",null,null,"d{kk 6 ls 8",null,null,"d{kk 1 ls 5",null,null,"d{kk 6 ls 8",null,null,"d{kk 1 ls 5",null,null,"d{kk 6 ls 8"]
[{"$nulls":6},"ewax","mMn","puk","ewax","mMn","puk","ewax","mMn","puk","ewax","mMn","puk","ewax","mMn","puk","ewax","mMn","puk","ewax","mMn","puk","ewax","mMn","puk","ewax","mMn","puk","ewax","mMn","puk","ewax","mMn","puk","ewax","mMn","puk"]
[1,2,3,4,5,6,7,8,9,10,11,12,13,14,15,16,17,18,19,20,21,22,23,24,25,26,27,28,29,30,31,32,33,34,35,36,37,38,39,40,41,42]
[1,{"$f":"IF(AND('MASTER DATA'!C4=\"\"),\"\",'MASTER DATA'!C4)","v":"jk-m-ek-fo- bUnjokM+k"},{"$f":"'PS Balance Sheet'!AE37","v":2023},{"$f":"'UPS balance Sheet'!AE37","v":1449},{"$f":"'PS Balance Sheet'!AH37","v":400},{"$f":"'UPS balance Sheet'!AH37","v":416},{"$f":"'Dal & Khadhiyan master'!E9","v":{"v":40,"d":"40.000"}},{"$f":"'Dal & Khadhiyan master'!E10","v":{"v":20,"d":"20.000"}},{"$f":"'Dal & Khadhiyan master'!E11","v":{"v":20,"d":"20.000"}},{"$f":"'Dal & Khadhiyan master'!G9","v":{"v":60,"d":"60.000"}},{"$f":"'Dal & Khadhiyan master'!G10","v":{"v":30,"d":"30.000"}},{"$f":"'Dal & Khadhiyan master'!G11","v":{"v":30,"d":"30.000"}},{"$f":"'Dal & Khadhiyan master'!E14","v":{"v":0,"d":"0.000"}},{"$f":"'Dal & Khadhiyan master'!E15","v":{"v":0,"d":"0.000"}},{"$f":"'Dal & Khadhiyan master'!E16","v":{"v":0,"d":"0.000"}},{"$f":"'Dal & Khadhiyan master'!G14","v":{"v":0,"d":"0.000"}},{"$f":"'Dal & Khadhiyan master'!G15","v":{"v":0,"d":"0.000"}},{"$f":"'Dal & Khadhiyan master'!G16","v":{"v":0,"d":"0.000"}},{"$f":"'Dal & Khadhiyan master'!E19","v":{"v":0,"d":"0.000"}},{"$f":"'Dal & Khadhiyan master'!E20","v":{"v":0,"d":"0.000"}},{"$f":"'Dal & Khadhiyan master'!E21","v":{"v":0,"d":"0.000"}},{"$f":"'Dal & Khadhiyan master'!G19","v":{"v":0,"d":"0.000"}},{"$f":"'Dal & Khadhiyan master'!G20","v":{"v":0,"d":"0.000"}},{"$f":"'Dal & Khadhiyan master'!G21","v":{"v":0,"d":"0.000"}},{"$f":"G9+M9+S9","v":{"v":40,"d":"40.000"}},{"$f":"H9+N9+T9","v":{"v":20,"d":"20.000"}},{"v":20,"d":"20.000"},{"v":60,"d":"60.000"},{"v":30,"d":"30.000"},{"$f":"L9+R9+X9","v":{"v":30,"d":"30.000"}},{"$f":"'Dal & Khadhiyan master'!E29","v":{"v":1.4,"d":"1.400"}},{"$f":"'Dal & Khadhiyan master'!E30","v":{"v":0.7,"d":"0.700"}},{"$f":"'Dal & Khadhiyan master'!E31","v":{"v":0.7,"d":"0.700"}},{"$f":"'Dal & Khadhiyan master'!G29","v":{"v":2.2199999999999998,"d":"2.220"}},{"$f":"'Dal & Khadhiyan master'!G30","v":{"v":1.1099999999999999,"d":"1.110"}},{"$f":"'Dal & Khadhiyan master'!G31","v":{"v":1.1099999999999999,"d":"1.110"}},{"$f":"Y9-AE9","v":{"v":38.6,"d":"38.600"}},{"$f":"Z9-AF9","v":{"v":19.3,"d":"19.300"}},{"v":19.3,"d":"19.300"},{"v":57.78,"d":"57.780"},{"v":28.89,"d":"28.890"},{"v":28.89,"d":"28.890"}]
[]
[null,"uksV %& lHkh dkWye dks lgh ,oa iw.kZ :i ls HkjsaA bldh leLr ftEesnkjh gLrk{kjdrkZ dh gksxhA"]
[{"$nulls":33},"gLrk{kj iz/kkuk/;kid @ iz/kkukpk;Z @ uksMy izHkkjh"]

{"sheet":"New UC Dak","index":10,"n_rows":72,"n_cols":35,"rows_kept":72,"merged":[[0,0,0,22],[1,8,1,13],[1,14,1,16],[2,7,2,16],[3,0,3,4],[3,5,3,14],[3,15,3,17],[3,18,3,22],[4,0,4,4],[4,5,4,14],[4,15,4,17],[4,18,4,22],[5,0,5,4],[5,5,5,14],[5,15,5,17],[5,18,5,22],[6,0,6,4],[6,5,6,14],[6,15,6,17],[6,18,6,22],[7,7,7,15],[8,0,8,4],[8,5,8,14],[8,15,8,17],[8,18,8,22],[9,0,12,0],[9,1,9,10],[9,11,11,11],[9,12,9,21],[9,22,11,22],[10,1,10,2],[10,3,10,4],[10,5,10,6],[10,7,10,8],[10,9,10,10],[10,12,10,13],[10,14,10,15],[10,16,10,17],[10,18,10,19],[10,20,10,21],[13,7,13,15],[14,0,14,9],[14,10,14,16],[14,17,14,22],[15,0,15,9],[15,10,15,16],[15,17,15,22],[16,7,16,15],[17,0,17,1],[17,2,17,11],[17,12,17,14],[17,15,17,17],[17,18,17,20],[17,21,17,22],[18,0,18,1],[18,2,18,11],[18,12,18,14],[18,15,18,17],[18,18,18,20],[18,21,18,22],[19,0,19,1],[19,2,19,11],[19,12,19,14],[19,15,19,17],[19,18,19,20],[19,21,19,22],[20,0,20,1],[20,2,20,11],[20,12,20,14],[20,15,20,17],[20,18,20,20],[20,21,20,22],[21,0,21,1],[21,2,21,11],[21,12,21,14],[21,15,21,17],[21,18,21,20],[21,21,21,22],[22,7,22,15],[23,0,23,1],[23,2,23,11],[23,12,23,14],[23,15,23,17],[23,18,23,22],[24,0,24,1],[24,2,24,11],[24,12,24,14],[24,15,24,17],[24,18,24,22],[25,0,25,1],[25,2,25,11],[25,12,25,14],[25,15,25,17],[25,18,25,22],[26,0,26,1],[26,2,26,11],[26,12,26,14],[26,15,26,17],[26,18,26,22],[27,0,27,1],[27,2,27,11],[27,12,27,14],[27,15,27,17],[27,18,27,22],[28,0,28,1],[28,2,28,11],[28,12,28,14],[28,15,28,17],[28,18,28,22],[29,3,29,20],[30,0,30,1],[30,2,30,6],[30,7,30,22],[31,0,31,1],[31,2,31,6],[31,7,31,22],[32,7,32,15],[33,0,34,1],[33,2,33,11],[33,12,33,22],[34,2,34,3],[34,4,34,5],[34,6,34,7],[34,8,34,9],[34,10,34,11],[34,12,34,13],[34,14,34,15],[34,16,34,17],[34,18,34,19],[34,20,34,22],[35,0,35,1],[35,2,35,3],[35,4,35,5],[35,6,35,7],[35,8,35,9],[35,10,35,11],[35,12,35,13],[35,14,35,15],[35,16,35,17],[35,18,35,19],[35,20,35,22],[36,0,36,1],[36,2,36,3],[36,4,36,5],[36,6,36,7],[36,8,36,9],[36,10,36,11],[36,12,36,13],[36,14,36,15],[36,16,36,17],[36,18,36,19],[36,20,36,22],[37,0,37,1],[37,2,37,3],[37,4,37,5],[37,6,37,7],[37,8,37,9],[37,10,37,11],[37,12,37,13],[37,14,37,15],[37,16,37,17],[37,18,37,19],[37,20,37,22],[38,7,38,15],[39,0,40,1],[39,2,39,11],[39,12,39,22],[40,2,40,3],[40,4,40,5],[40,6,40,7],[40,8,40,9],[40,10,40,11],[40,12,40,13],[40,14,40,15],[40,16,40,17],[40,18,40,19],[40,20,40,22],[41,0,41,1],[41,2,41,3],[41,4,41,5],[41,6,41,7],[41,8,41,9],[41,10,41,11],[41,12,41,13],[41,14,41,15],[41,16,41,17],[41,18,41,19],[41,20,41,22],[42,0,42,1],[42,2,42,3],[42,4,42,5],[42,6,42,7],[42,8,42,9],[42,10,42,11],[42,12,42,13],[42,14,42,15],[42,16,42,17],[42,18,42,19],[42,20,42,22],[43,0,43,1],[43,2,43,3],[43,4,43,5],[43,6,43,7],[43,8,43,9],[43,10,43,11],[43,12,43,13],[43,14,43,15],[43,16,43,17],[43,18,43,19],[43,20,43,22],[44,0,44,1],[44,2,44,3],[44,4,44,5],[44,6,44,7],[44,8,44,9],[44,10,44,11],[44,12,44,13],[44,14,44,15],[44,16,44,17],[44,18,44,19],[44,20,44,22],[45,6,45,16],[46,0,52,1],[46,2,46,11],[46,12,46,22],[47,2,47,5],[47,6,47,8],[47,9,48,11],[47,12,47,15],[47,16,47,18],[47,19,48,22],[48,2,48,5],[48,6,48,8],[48,12,48,15],[48,16,48,18],[49,2,49,5],[49,6,49,8],[49,9,49,11],[49,12,49,15],[49,16,49,18],[49,19,49,22],[50,2,50,11],[50,12,50,22],[51,2,51,3],[51,4,51,5],[51,6,51,7],[51,8,51,9],[51,10,51,11],[51,12,51,13],[51,14,51,15],[51,16,51,17],[51,18,51,19],[51,20,51,22],[52,2,52,3],[52,4,52,5],[52,6,52,7],[52,8,52,9],[52,10,52,11],[52,12,52,13],[52,14,52,15],[52,16,52,17],[52,18,52,19],[52,20,52,22],[54,5,54,17],[55,0,60,1],[55,2,55,11],[55,12,55,22],[56,2,57,5],[56,6,57,8],[56,9,57,11],[56,12,57,15],[56,16,57,18],[56,19,57,22],[58,2,58,5],[58,6,58,8],[58,9,58,11],[58,12,58,15],[58,16,58,18],[58,19,58,22],[59,2,59,3],[59,4,59,5],[59,6,59,7],[59,8,59,9],[59,10,59,11],[59,12,59,13],[59,14,59,15],[59,16,59,17],[59,18,59,19],[59,20,59,22],[60,2,60,3],[60,4,60,5],[60,6,60,7],[60,8,60,9],[60,10,60,11],[60,12,60,13],[60,14,60,15],[60,16,60,17],[60,18,60,19],[60,20,60,22],[61,7,61,15],[62,0,62,4],[62,5,62,9],[62,10,62,16],[62,17,62,22],[63,0,63,4],[63,5,63,9],[63,10,63,16],[63,17,63,22],[64,7,64,15],[65,0,65,4],[65,5,65,9],[65,10,65,16],[65,17,65,22],[66,0,66,4],[66,5,66,9],[66,10,66,16],[66,17,66,22],[69,1,69,7],[69,14,69,21],[70,0,70,7],[70,14,70,21],[71,0,71,4],[71,5,71,8],[71,13,71,18],[71,19,71,22]]}
["jk\"Vªh; iks\"kkgkj lgk;rk dk;ZØe (Mid Day Meal) "]
[{"$nulls":8},"fo|ky; ekfld lwpuk l=%&",{"$nulls":5},{"$f":"CONCATENATE('MASTER DATA'!F4,\"-\",'MASTER DATA'!H4)","v":"2019-20"}]
[{"$nulls":7},"izi= & 1"]
["fo|ky; dk uke %&",{"$nulls":4},{"$f":"IF(AND('MASTER DATA'!C4=\"\"),\"\",'MASTER DATA'!C4)","v":"jk-m-ek-fo- bUnjokM+k"},{"$nulls":9},"MkbZl dksM ua- %&",null,null,{"$f":"IF(AND('MASTER DATA'!C12=\"\"),\"\",'MASTER DATA'!C12)","v":8200303101}]
["ihbZbZvks@uksMy dk uke %&",{"$nulls":4},{"$f":"IF(AND('MASTER DATA'!C6=\"\"),\"\",'MASTER DATA'!C6)","v":"jkmekfo ua- 02 jkuh"},{"$nulls":9},"CykWd dk uke %&",null,null,{"$f":"IF(AND('MASTER DATA'!C16=\"\"),\"\",'MASTER DATA'!C16)","v":"jkuh"}]
["xzke iapk;r dk uke %&",{"$nulls":4},{"$f":"IF(AND('MASTER DATA'!C15=\"\"),\"\",'MASTER DATA'!C15)","v":"bUnjokM+k "},{"$nulls":9},"ekg@o\"kZ %&",null,null,{"$f":"IF(AND('MASTER DATA'!J4=\"\"),\"\",'MASTER DATA'!J4)","v":"tqykbZ&2019"}]
["tkod Øekad la[;k %&",{"$nulls":14},"fnukad %&",null,null,{"$f":"TODAY()","v":"2019-07-28"}]
[{"$nulls":7},"1- fo|ky; fooj.k"]
["fo|ky; dk izdkj %&",{"$nulls":4},{"$f":"IF(AND('MASTER DATA'!C17=\"\"),\"\",'MASTER DATA'!C17)","v":"Government"},{"$nulls":9},"{ks= %&",null,null,{"$f":"IF(AND('MASTER DATA'!C18=\"\"),\"\",'MASTER DATA'!C18)","v":"Rural"}]
["ukekadu","izkFkfed ",{"$nulls":9},"Grant Total","mPp izkFkfed ",{"$nulls":9},"Grant Total",{"$nulls":11},true]
[null,"SC",null,"ST",null,"OBC",null,"GEN",null,"TOTAL",null,null,"SC",null,"ST",null,"OBC",null,"GEN",null,"TOTAL"]
[null,"B","G","B","G","B","G","B","G","B","G",null,"B","G","B","G","B","G","B","G","B","G"]
[null,{"$f":"'MASTER DATA'!F15","v":33},{"$f":"'MASTER DATA'!G15","v":40},{"$f":"'MASTER DATA'!H15","v":33},{"$f":"'MASTER DATA'!I15","v":31},{"$f":"'MASTER DATA'!J15","v":44},{"$f":"'MASTER DATA'!K15","v":46},{"$f":"'MASTER DATA'!L15","v":34},{"$f":"'MASTER DATA'!M15","v":28},{"$f":"'MASTER DATA'!N15","v":144},{"$f":"'MASTER DATA'!O15","v":145},{"$f":"'MASTER DATA'!P15","v":289},{"$f":"'MASTER DATA'!F19","v":28},{"$f":"'MASTER DATA'!G19","v":27},{"$f":"'MASTER DATA'!H19","v":24},{"$f":"'MASTER DATA'!I19","v":33},{"$f":"'MASTER DATA'!J19","v":22},{"$f":"'MASTER DATA'!K19","v":22},{"$f":"'MASTER DATA'!L19","v":22},{"$f":"'MASTER DATA'!M19","v":29},{"$f":"'MASTER DATA'!N19","v":96},{"$f":"'MASTER DATA'!O19","v":111},{"$f":"'MASTER DATA'!P19","v":207}]
[{"$nulls":7},"2- cSad [kkrk fooj.k"]
["cSad dk uke e; 'kk[kk",{"$nulls":9},"vkbZ,Q,llh dksM ua-",{"$nulls":6},"[kkrk la[;k"]
["SBI SOMESAR",{"$nulls":9},"SBIN0033382",{"$nulls":6},51022334455]
[{"$nulls":7},"3- dqd de gsYij fooj.k"]
["Ø-l-",null,"dqd de gsYij dk uke",{"$nulls":9},"fyax",null,null,"oxZ",null,null,"ns; jkf'k dk izdkj ",null,null,"jkf'k"]
[1,null,{"$f":"IF(AND('MASTER DATA'!C37=\"\"),\"\",'MASTER DATA'!C37)","v":"Dhagalai Devi"},{"$nulls":9},{"$f":"IF(AND(C19=\"\"),\"\",IF(AND('MASTER DATA'!AF32=\"TRUE\"),\"MALE\",\"FEMALE\"))","v":"FEMALE"},null,null,{"$f":"IF(AND(C19=\"\"),\"\",IF(AND('MASTER DATA'!AH32=AI$10),\"GEN\",IF(AND('MASTER DATA'!AI32=AI$10),\"OBC\",IF(AND('MASTER DATA'!AJ32=AI$10),\"SC\",IF(AND('MASTER DATA'!AK32=AI$10),\"ST\")))))","v":"OBC"},null,null,{"$f":"IF(AND(C19=\"\"),\"\",IF(AND('MASTER DATA'!AL32=AI$10),\"By Cheque\",\"By Cash\"))","v":"By Cheque"},null,null,{"$f":"IF(AND(C19=\"\"),\"\",IF(AND('MASTER DATA'!P37=\"\"),\"\",'MASTER DATA'!P37))","v":1320}]
[2,null,{"$f":"IF(AND('MASTER DATA'!C38=\"\"),\"\",'MASTER DATA'!C38)","v":"Geeta Devi"},{"$nulls":9},{"$f":"IF(AND(C20=\"\"),\"\",IF(AND('MASTER DATA'!AF33=\"TRUE\"),\"MALE\",\"FEMALE\"))","v":"FEMALE"},null,null,{"$f":"IF(AND(C20=\"\"),\"\",IF(AND('MASTER DATA'!AH33=AI$10),\"GEN\",IF(AND('MASTER DATA'!AI33=AI$10),\"OBC\",IF(AND('MASTER DATA'!AJ33=AI$10),\"SC\",IF(AND('MASTER DATA'!AK33=AI$10),\"ST\")))))","v":"GEN"},null,null,{"$f":"IF(AND(C20=\"\"),\"\",IF(AND('MASTER DATA'!AL33=AI$10),\"By Cheque\",\"By Cash\"))","v":"By Cheque"},null,null,{"$f":"IF(AND(C20=\"\"),\"\",IF(AND('MASTER DATA'!P38=\"\"),\"\",'MASTER DATA'!P38))","v":1320}]
[3,null,{"$f":"IF(AND('MASTER DATA'!C39=\"\"),\"\",'MASTER DATA'!C39)","v":""},{"$nulls":9},{"$f":"IF(AND(C21=\"\"),\"\",IF(AND('MASTER DATA'!AF34=\"TRUE\"),\"MALE\",\"FEMALE\"))","v":""},null,null,{"$f":"IF(AND(C21=\"\"),\"\",IF(AND('MASTER DATA'!AH34=AI$10),\"GEN\",IF(AND('MASTER DATA'!AI34=AI$10),\"OBC\",IF(AND('MASTER DATA'!AJ34=AI$10),\"SC\",IF(AND('MASTER DATA'!AK34=AI$10),\"ST\")))))","v":""},null,null,{"$f":"IF(AND(C21=\"\"),\"\",IF(AND('MASTER DATA'!AL34=AI$10),\"By Cheque\",\"By Cash\"))","v":""},null,null,{"$f":"IF(AND(C21=\"\"),\"\",IF(AND('MASTER DATA'!P39=\"\"),\"\",'MASTER DATA'!P39))","v":""}]
[4,null,{"$f":"IF(AND('MASTER DATA'!C40=\"\"),\"\",'MASTER DATA'!C40)","v":""},{"$nulls":9},{"$f":"IF(AND(C22=\"\"),\"\",IF(AND('MASTER DATA'!AF35=\"TRUE\"),\"MALE\",\"FEMALE\"))","v":""},null,null,{"$f":"IF(AND(C22=\"\"),\"\",IF(AND('MASTER DATA'!AH35=AI$10),\"GEN\",IF(AND('MASTER DATA'!AI35=AI$10),\"OBC\",IF(AND('MASTER DATA'!AJ35=AI$10),\"SC\",IF(AND('MASTER DATA'!AK35=AI$10),\"ST\")))))","v":""},null,null,{"$f":"IF(AND(C22=\"\"),\"\",IF(AND('MASTER DATA'!AL35=AI$10),\"By Cheque\",\"By Cash\"))","v":""},null,null,{"$f":"IF(AND(C22=\"\"),\"\",IF(AND('MASTER DATA'!P40=\"\"),\"\",'MASTER DATA'!P40))","v":""}]
[{"$nulls":7},"4- bl ekg esa fo|ky; dk fujh{k.k"]
["Ø-l-",null,"vf/kdkjh dk fooj.k",{"$nulls":9},"gkW ;k ugh",null,null,"fnukad",null,null,"vf/kdkjh dk uke"]
[1,null,"l?ku fujh{k.k Vhe }kjk"]
[2,null,"ftyk Lrjh; Lrjh; vf/kdkjh }kjk"]
[3,null,"CykWd@rgfly Lrjh; Lrjh; vf/kdkjh }kjk"]
[4,null,"ihbZbZvks@iapk;r Lrjh; Lrjh; vf/kdkjh }kjk"]
[5,null,",l-Mh-,e-lh-@,l-,e-lh- ds lnL; }kjk"]
[{"$nulls":3},"5- bl ekg esa ?kfVr dksbZ feM Ms fey lEcfU/kr ?kVuk ;k f'kdk;r dk fooj.k ¼;fn dksbZ gks½"]
["Ø-l-",null,"f'kdk;r la[;k",{"$nulls":4},"?kVuk dk fooj.k"]
[1]
[{"$nulls":7},"6- [kk|kUu dh tkudkjh ¼fdyksxzke esa½"]
["[kk|kUu dk izdkj",null,"izkFkfed Lrj ij 100 xzke izfr fo|kFkhZ",{"$nulls":9},"mPp izkFkfed Lrj ij 150 xzke izfr fo|kFkhZ"]
[null,null,"izkjfEHkd 'ks\"k",null,"bl ekg esa izkIr",null,"dqy ",null,"bl ekg esa [kpZ ",null,"vfUre 'ks\"k [kk|kUu",null,"izkjfEHkd 'ks\"k",null,"bl ekg esa izkIr",null,"dqy ",null,"bl ekg esa [kpZ ",null,"vfUre 'ks\"k [kk|kUu"]
["xsgwW",null,{"$f":"'Dal & Khadhiyan master'!E7","v":{"v":250,"d":"250.00"}},null,{"$f":"'Praptra-1'!E13+'Praptra-1'!E18","v":{"v":0,"d":"0.00"}},null,{"$f":"C36+E36","v":{"v":250,"d":"250.00"}},null,{"$f":"'PS Balance Sheet'!AL37","v":{"v":31.099999999999998,"d":"31.10"}},null,{"$f":"G36-I36","v":{"v":218.9,"d":"218.90"}},null,{"$f":"'Praptra-1'!F8","v":{"v":300,"d":"300.00"}},null,{"$f":"'Praptra-1'!F13+'Praptra-1'!F18","v":{"v":0,"d":"0.00"}},null,{"$f":"M36+O36","v":{"v":300,"d":"300.00"}},null,{"$f":"'UPS balance Sheet'!AL37","v":48.45},null,{"$f":"Q36-S36","v":251.55}]
["pkoy",null,{"$f":"'Dal & Khadhiyan master'!E8","v":{"v":150,"d":"150.00"}},null,{"$f":"'Praptra-1'!E14+'Praptra-1'!E19","v":{"v":0,"d":"0.00"}},null,{"$f":"C37+E37","v":{"v":150,"d":"150.00"}},null,{"$f":"'PS Balance Sheet'!AM37","v":{"v":8.9,"d":"8.90"}},null,{"$f":"G37-I37","v":{"v":141.1,"d":"141.10"}},null,{"$f":"'Praptra-1'!F9","v":{"v":200,"d":"200.00"}},null,{"$f":"'Praptra-1'!G14+'Praptra-1'!F19","v":{"v":0,"d":"0.00"}},null,{"$f":"M37+O37","v":{"v":200,"d":"200.00"}},null,{"$f":"'UPS balance Sheet'!AM37","v":13.95},null,{"$f":"Q37-S37","v":186.05}]
[";ksx",null,{"$f":"C36+C37","v":{"v":400,"d":"400.00"}},null,{"$f":"E36+E37","v":{"v":0,"d":"0.00"}},null,{"$f":"G36+G37","v":{"v":400,"d":"400.00"}},null,{"$f":"I36+I37","v":{"v":40,"d":"40.00"}},null,{"$f":"K36+K37","v":{"v":360,"d":"360.00"}},null,{"$f":"M36+M37","v":{"v":500,"d":"500.00"}},null,{"$f":"O36+O37","v":{"v":0,"d":"0.00"}},null,{"$f":"Q36+Q37","v":{"v":500,"d":"500.00"}},null,{"$f":"S36+S37","v":{"v":62.400000000000006,"d":"62.40"}},null,{"$f":"U36+U37","v":{"v":437.6,"d":"437.60"}}]
[{"$nulls":7},"7- nkyksa dh tkudkjh ¼fdyksxzke esa½"]
["nky dk izdkj",null,"izkFkfed Lrj ij 20 xzke izfr fo|kFkhZ",{"$nulls":9},"mPp izkFkfed Lrj ij 30 xzke izfr fo|kFkhZ"]
[null,null,"izkjfEHkd 'ks\"k",null,"bl ekg esa izkIr",null,"dqy ",null,"bl ekg esa [kpZ ",null,"vfUre 'ks\"k ",null,"izkjfEHkd 'ks\"k",null,"bl ekg esa izkIr",null,"dqy ",null,"bl ekg esa [kpZ ",null,"vfUre 'ks\"k "]
["ewax",null,{"$f":"'Praptra-1'!E10","v":{"v":40,"d":"40.000"}},null,{"$f":"'Praptra-1'!E15+'Praptra-1'!E20","v":{"v":0,"d":"0.000"}},null,{"$f":"C42+E42","v":{"v":40,"d":"40.000"}},null,{"$f":"'PS Balance Sheet'!AN37","v":{"v":1.4,"d":"1.400"}},null,{"$f":"G42-I42","v":{"v":38.6,"d":"38.600"}},null,{"$f":"'Praptra-1'!F10","v":{"v":60,"d":"60.000"}},null,{"$f":"'Praptra-1'!F15+'Praptra-1'!F20","v":{"v":0,"d":"0.000"}},null,{"$f":"M42+O42","v":{"v":60,"d":"60.000"}},null,{"$f":"'UPS balance Sheet'!AN37","v":{"v":2.2199999999999998,"d":"2.220"}},null,{"$f":"Q42-S42","v":{"v":57.78,"d":"57.780"}}]
["mM+n",null,{"$f":"'Praptra-1'!E11","v":{"v":20,"d":"20.000"}},null,{"$f":"'Praptra-1'!E16+'Praptra-1'!E21","v":{"v":0,"d":"0.000"}},null,{"$f":"C43+E43","v":{"v":20,"d":"20.000"}},null,{"$f":"'PS Balance Sheet'!AO37","v":0.7},null,{"$f":"G43-I43","v":{"v":19.3,"d":"19.300"}},null,{"$f":"'Praptra-1'!F11","v":{"v":30,"d":"30.000"}},null,{"$f":"'Praptra-1'!F16+'Praptra-1'!F21","v":{"v":0,"d":"0.000"}},null,{"$f":"M43+O43","v":{"v":30,"d":"30.000"}},null,{"$f":"'UPS balance Sheet'!AO37","v":{"v":1.1099999999999999,"d":"1.110"}},null,{"$f":"Q43-S43","v":{"v":28.89,"d":"28.890"}}]
["puk",null,{"$f":"'Praptra-1'!E12","v":{"v":20,"d":"20.000"}},null,{"$f":"'Praptra-1'!E17+'Praptra-1'!E22","v":{"v":0,"d":"0.000"}},null,{"v":20,"d":"20.000"},null,{"$f":"'PS Balance Sheet'!AP37","v":0.7},null,{"v":19.3,"d":"19.300"},null,{"$f":"'Praptra-1'!F12","v":{"v":30,"d":"30.000"}},null,{"$f":"'Praptra-1'!F17+'Praptra-1'!F22","v":{"v":0,"d":"0.000"}},null,{"v":30,"d":"30.000"},null,{"$f":"'UPS balance Sheet'!AP37","v":{"v":1.1099999999999999,"d":"1.110"}},null,{"v":28.89,"d":"28.890"}]
[";ksx",null,{"$f":"C42+C43+C44","v":{"v":80,"d":"80.000"}},null,{"$f":"E42+E43+E44","v":{"v":0,"d":"0.000"}},null,{"$f":"G42+G43+G44","v":{"v":80,"d":"80.000"}},null,{"$f":"I42+I43+I44","v":{"v":2.8,"d":"2.800"}},null,{"$f":"K42+K43+K44","v":{"v":77.2,"d":"77.200"}},null,{"$f":"M42+M43+M44","v":{"v":120,"d":"120.000"}},null,{"$f":"O42+O43+O44","v":{"v":0,"d":"0.000"}},null,{"$f":"Q42+Q43+Q44","v":{"v":120,"d":"120.000"}},null,{"$f":"S42+S43+S44","v":{"v":4.4399999999999995,"d":"4.440"}},null,{"$f":"U42+U43+U44","v":{"v":115.56,"d":"115.560"}}]
[{"$nulls":6},"8- Hkkstu idkusa esa O;; dh jkf'k dh tkudkjh ¼:Ik;ksa esa½"]
["dqfdax dUotZu jkf'k",null,"nky ds fnu Hkkstu cukusa esa O;; jkf'k",{"$nulls":9},"fcuk nky ds fnu Hkkstu cukusa esa O;; jkf'k"]
[null,null,"izkFkfed",{"$nulls":3},"mPp izkFkfrd",null,null,"dqy jkf'k",null,null,"izkFkfed",{"$nulls":3},"mPp izkFkfrd",null,null,"dqy jkf'k"]
[null,null,{"$f":"CONCATENATE(\"RS\",\"-\",\"  \",'MASTER DATA'!$C$32,\"  \",\"@ Unit\")","v":"RS-  3.08  @ Unit"},{"$nulls":3},{"$f":"CONCATENATE(\"RS\",\"-\",\"  \",'MASTER DATA'!$C$33,\"  \",\"@ Unit\")","v":"RS-  4.6  @ Unit"},{"$nulls":5},{"$f":"CONCATENATE(\"RS\",\"-\",\"  \",'MASTER DATA'!D32,\"  \",\"@ Unit\")","v":"RS-  4.35  @ Unit"},{"$nulls":3},{"$f":"CONCATENATE(\"RS\",\"-\",\"  \",'MASTER DATA'!$D$33,\"  \",\"@ Unit\")","v":"RS-  6.51  @ Unit"}]
[null,null,{"$f":"'PS Balance Sheet'!BK37","v":{"v":431.20000000000005,"d":"431.20"}},{"$nulls":3},{"$f":"'PS Balance Sheet'!AV37-'New UC Dak'!C50","v":{"v":1130.9999999999998,"d":"1131.00"}},null,null,{"$f":"C50+G50","v":{"v":1562.1999999999998,"d":"1562.20"}},null,null,{"$f":"'UPS balance Sheet'!BJ37","v":680.8},{"$nulls":3},{"$f":"'UPS balance Sheet'!AV37-'New UC Dak'!M50","v":1744.68},null,null,{"$f":"M50+Q50","v":2425.48}]
[null,null,"izkFkfed",{"$nulls":9},"mPp izkFkfed"]
[null,null,"izkjfEHkd 'ks\"k",null,"bl ekg esa izkIr jkf'k",null,"dqy jkf'k",null,"bl ekg esa [kpZ jkf'k",null,"vfUre 'ks\"k ",null,"izkjfEHkd 'ks\"k",null,"bl ekg esa izkIr jkf'k",null,"dqy jkf'k",null,"bl ekg esa [kpZ jkf'k",null,"vfUre 'ks\"k "]
[null,null,{"$f":"'Praptra-1'!E38","v":{"v":10000,"d":"10000.00"}},null,{"$f":"'Praptra-1'!E39","v":{"v":15000,"d":"15000.00"}},null,{"$f":"'Praptra-1'!E40","v":{"v":25000,"d":"25000.00"}},null,{"$f":"'PS Balance Sheet'!AV37","v":{"v":1562.1999999999998,"d":"1562.20"}},null,{"$f":"G53-I53","v":{"v":23437.8,"d":"23437.80"}},null,{"$f":"'Praptra-1'!F38","v":{"v":15000,"d":"15000.00"}},null,{"$f":"'Praptra-1'!F39","v":{"v":20000,"d":"20000.00"}},null,{"$f":"'Praptra-1'!F40","v":{"v":35000,"d":"35000.00"}},null,{"$f":"'UPS balance Sheet'!AV37","v":2425.48},null,{"$f":"Q53-S53","v":32574.52}]
[]
[{"$nulls":5},"9- vUuiw.kkZ nwX/k ;kstuk dh tkudkjh ¼ek=k o jkf'k :Ik;ksa esa½"]
["nwX/k dh jkf'k o ek=k",null,"izkFkfed Lrj ¼ek=k 150 xzke izfr fo|kFkhZ½",{"$nulls":9},"mPp izkFkfed Lrj ¼ek=k 200 xzke izfr fo|kFkhZ½"]
[null,null,"dqy ykHkkfUor fo|kFkhZ",{"$nulls":3},"dqy nwX/k dh ek=k",null,null,"nwX/k dh nj izfr fo|kFkhZ",null,null,"dqy ykHkkfUor fo|kFkhZ",{"$nulls":3},"dqy nwX/k dh ek=k",null,null,"nwX/k dh nj izfr fo|kFkhZ"]
[]
[]
[null,null,"izkjfEHkd 'ks\"k",null,"bl ekg esa izkIr jkf'k",null,"dqy jkf'k",null,"bl ekg esa [kpZ jkf'k",null,"vfUre 'ks\"k ",null,"izkjfEHkd 'ks\"k",null,"bl ekg esa izkIr jkf'k",null,"dqy jkf'k",null,"bl ekg esa [kpZ jkf'k",null,"vfUre 'ks\"k "]
[null,null,{"$f":"'Praptra-1'!E50","v":{"v":5000,"d":"5000.00"}},null,{"$f":"'Praptra-1'!E51","v":{"v":1500,"d":"1500.00"}},null,{"$f":"'Praptra-1'!E52","v":{"v":6500,"d":"6500.00"}},null,{"$f":"'PS Balance Sheet'!AW37","v":2262.75},null,{"$f":"G61-I61","v":4237.25},null,{"$f":"'Praptra-1'!F50","v":{"v":7000,"d":"7000.00"}},null,{"$f":"'Praptra-1'!F51","v":{"v":2000,"d":"2000.00"}},null,{"$f":"'Praptra-1'!F52","v":{"v":9000,"d":"9000.00"}},null,{"$f":"'UPS balance Sheet'!AW37","v":{"v":4116,"d":"4116.00"}},null,{"$f":"Q61-S61","v":{"v":4884,"d":"4884.00"}}]
[{"$nulls":7},"10- dqd de gsYij dh jkf'k dk fooj.k"]
["izkjfEHkd 'ks\"k",{"$nulls":4},"bl ekg esa izkIr jkf'k",{"$nulls":4},"bl ekg esa [kpZ jkf'k",{"$nulls":6},"vfUre 'ks\"k "]
[{"$f":"'Praptra-1'!G43","v":4000},{"$nulls":4},{"$f":"'Praptra-1'!G44","v":12000},{"$nulls":4},{"$f":"'Praptra-1'!G46","v":0},{"$nulls":6},{"$f":"A64+F64-K64","v":16000}]
[{"$nulls":7},"11- ,e-,e-bZ jkf'k dk fooj.k"]
["izkjfEHkd 'ks\"k",{"$nulls":4},"bl ekg esa izkIr jkf'k",{"$nulls":4},"bl ekg esa [kpZ jkf'k",{"$nulls":6},"vfUre 'ks\"k "]
[{"$nulls":17},{"$f":"A67+F67-K67","v":0}]
[]
[]
[null,{"$f":"IF(AND('MASTER DATA'!C9=\"\"),\"\",'MASTER DATA'!C9)","v":"vtqZuflag"},{"$nulls":12},{"$f":"IF(AND('MASTER DATA'!C7=\"\"),\"\",'MASTER DATA'!C7)","v":"feJhyky"}]
["iks\"kkgkj izHkkjh gLrk{kj e; lhy",{"$nulls":13},"laLFkk iz/kku gLrk{kj e; lhy"]
["iks\"kkgkj izHkkjh eks-u- %&",{"$nulls":4},{"$f":"IF(AND('MASTER DATA'!C11=\"\"),\"\",'MASTER DATA'!C11)","v":9929247228},{"$nulls":7},"laLFkk iz/kku eksckbZy uEcj %&",{"$nulls":5},{"$f":"IF(AND('MASTER DATA'!C10=\"\"),\"\",'MASTER DATA'!C10)","v":9929247227}]

{"sheet":"Stock","index":11,"n_rows":77,"n_cols":76,"rows_kept":77,"merged":[[0,10,0,12],[1,2,2,14],[4,2,4,11],[4,12,4,14],[7,0,7,2],[42,2,42,10],[42,11,42,14],[45,0,45,2]]}
[]
[null,null,"QqzV~l ds fy, fuf'pr okj dks forfjr djds otu fdyksxzke esa fu;r~ rkjh[k ds lkeusa fy[ksa ;g dkWye vuykWd ¼lQsn dyj esa½ gSa H ↓"]
[]
[]
[null,null,"izfrfnu jk'ku lQykbZ dh ek=k",{"$nulls":9},"izkFkfed d{kk gsrq"]
[]
["fnukad","okj","dqy ykHkkfUor","xsagq","pkoy","nky","lCth","rsy","fephZ","/kfu;k","gYnh","thjk","ued","ÝqV","Gas"]
["izkjfEHkd 'ks\"k",null,null,{"$f":"'Dal & Khadhiyan master'!E7","v":{"v":250,"d":"250.000"}},{"$f":"'Dal & Khadhiyan master'!E8","v":{"v":150,"d":"150.000"}},{"$f":"'Dal & Khadhiyan master'!E9+'Dal & Khadhiyan master'!E10+'Dal & Khadhiyan master'!E11","v":{"v":80,"d":"80.000"}},{"v":45,"d":"45.000"},{"v":15,"d":"15.000"},{"v":3,"d":"3.000"},{"v":2,"d":"2.000"},{"v":2,"d":"2.000"},{"v":1,"d":"1.000"},{"v":3,"d":"3.000"},null,30,"KG"]
[{"$f":"'Att. Dairy'!B6","v":"2019-07-01"},{"$f":"'Att. Dairy'!D6","v":"Monday"},{"$f":"'PS Balance Sheet'!AH6","v":51},{"$f":"D8-'PS Balance Sheet'!AL6","v":{"v":244.9,"d":"244.900"}},{"$f":"E8-'PS Balance Sheet'!AM6","v":{"v":150,"d":"150.000"}},{"$f":"F8-('PS Balance Sheet'!AN6+'PS Balance Sheet'!AO6+'PS Balance Sheet'!AP6)","v":{"v":78.98,"d":"78.980"}},{"$f":"G8-IF(AND($B9=\"monday\"),C9*0.05,IF(AND($B9=\"thursday\"),C9*0.025,IF(AND($B9=\"saturday\"),C9*0.05,\"0\")))","v":{"v":42.45,"d":"42.450"}},{"$f":"H8-IF(AND(C9=\"\"),\"\",C9*0.005)","v":14.745},{"$f":"I8-IF(AND(C9=\"\"),\"\",C9*0.0015)","v":2.9235},{"$f":"J8-IF(AND(C9=\"\"),\"\",C9*0.0015)","v":1.9235},{"$f":"K8-IF(AND(C9=\"\"),\"\",C9*0.0005)","v":1.9745},{"$f":"L8-IF(AND(C9=\"\"),\"\",C9*0.0005)","v":0.9745},{"$f":"M8-IF(AND(C9=\"\"),\"\",C9*0.0015)","v":2.9235},null,{"$f":"O8-IF(AND($O$7=\"Fire Woods\"),C9*0.2,IF(AND($O$7=\"Gas\"),C9*0.02,\"\"))","v":{"v":28.98,"d":"28.980"}}]
[{"$f":"'Att. Dairy'!B7","v":"2019-07-02"},{"$f":"'Att. Dairy'!D7","v":"Tuesday"},{"$f":"'PS Balance Sheet'!AH7","v":0},{"$f":"D9-'PS Balance Sheet'!AL7","v":{"v":244.9,"d":"244.900"}},{"$f":"E9-'PS Balance Sheet'!AM7","v":{"v":150,"d":"150.000"}},{"$f":"F9-('PS Balance Sheet'!AN7+'PS Balance Sheet'!AO7+'PS Balance Sheet'!AP7)","v":{"v":78.98,"d":"78.980"}},{"$f":"G9-IF(AND($B10=\"monday\"),C10*0.05,IF(AND($B10=\"thursday\"),C10*0.025,IF(AND($B10=\"saturday\"),C10*0.05,\"0\")))","v":{"v":42.45,"d":"42.450"}},{"$f":"H9-IF(AND(C10=\"\"),\"\",C10*0.005)","v":14.745},{"$f":"I9-IF(AND(C10=\"\"),\"\",C10*0.0015)","v":2.9235},{"$f":"J9-IF(AND(C10=\"\"),\"\",C10*0.0015)","v":1.9235},{"$f":"K9-IF(AND(C10=\"\"),\"\",C10*0.0005)","v":1.9745},{"$f":"L9-IF(AND(C10=\"\"),\"\",C10*0.0005)","v":0.9745},{"$f":"M9-IF(AND(C10=\"\"),\"\",C10*0.0015)","v":2.9235},null,{"$f":"O9-IF(AND($O$7=\"Fire Woods\"),C10*0.2,IF(AND($O$7=\"Gas\"),C10*0.02,\"\"))","v":{"v":28.98,"d":"28.980"}}]
[{"$f":"'Att. Dairy'!B8","v":"2019-07-03"},{"$f":"'Att. Dairy'!D8","v":"Wednesday"},{"$f":"'PS Balance Sheet'!AH8","v":0},{"$f":"D10-'PS Balance Sheet'!AL8","v":{"v":244.9,"d":"244.900"}},{"$f":"E10-'PS Balance Sheet'!AM8","v":{"v":150,"d":"150.000"}},{"$f":"F10-('PS Balance Sheet'!AN8+'PS Balance Sheet'!AO8+'PS Balance Sheet'!AP8)","v":{"v":78.98,"d":"78.980"}},{"v":42.45,"d":"42.450"},14.745,2.9235,1.9235,1.9745,0.9745,2.9235,null,{"v":28.98,"d":"28.980"},{"$nulls":60},"Fire Woods"]
[{"$f":"'Att. Dairy'!B9","v":"2019-07-04"},{"$f":"'Att. Dairy'!D9","v":"Thursday"},{"$f":"'PS Balance Sheet'!AH9","v":89},{"$f":"D11-'PS Balance Sheet'!AL9","v":{"v":244.9,"d":"244.900"}},{"$f":"E11-'PS Balance Sheet'!AM9","v":{"v":141.1,"d":"141.100"}},{"$f":"F11-('PS Balance Sheet'!AN9+'PS Balance Sheet'!AO9+'PS Balance Sheet'!AP9)","v":{"v":77.2,"d":"77.200"}},40.225,{"v":14.299999999999999,"d":"14.300"},2.79,1.79,1.93,0.93,2.79,null,{"v":27.2,"d":"27.200"},{"$nulls":60},"Gas"]
[{"$f":"'Att. Dairy'!B10","v":"2019-07-05"},{"$f":"'Att. Dairy'!D10","v":"Friday"},{"$f":"'PS Balance Sheet'!AH10","v":0},{"$f":"D12-'PS Balance Sheet'!AL10","v":{"v":244.9,"d":"244.900"}},{"$f":"E12-'PS Balance Sheet'!AM10","v":{"v":141.1,"d":"141.100"}},{"$f":"F12-('PS Balance Sheet'!AN10+'PS Balance Sheet'!AO10+'PS Balance Sheet'!AP10)","v":{"v":77.2,"d":"77.200"}},40.225,{"v":14.299999999999999,"d":"14.300"},2.79,1.79,1.93,0.93,2.79,null,{"v":27.2,"d":"27.200"}]
[{"$f":"'Att. Dairy'!B11","v":"2019-07-06"},{"$f":"'Att. Dairy'!D11","v":"Saturday"},{"$f":"'PS Balance Sheet'!AH11","v":127},{"$f":"D13-'PS Balance Sheet'!AL11","v":{"v":232.20000000000002,"d":"232.200"}},{"$f":"E13-'PS Balance Sheet'!AM11","v":{"v":141.1,"d":"141.100"}},{"$f":"F13-('PS Balance Sheet'!AN11+'PS Balance Sheet'!AO11+'PS Balance Sheet'!AP11)","v":{"v":77.2,"d":"77.200"}},33.875,13.665,2.5995,1.5995,1.8664999999999998,0.8665,2.5995,null,{"v":24.66,"d":"24.660"}]
[{"$f":"'Att. Dairy'!B12","v":"2019-07-07"},{"$f":"'Att. Dairy'!D12","v":"Sunday"},{"$f":"'PS Balance Sheet'!AH12","v":0},{"$f":"D14-'PS Balance Sheet'!AL12","v":{"v":232.20000000000002,"d":"232.200"}},{"$f":"E14-'PS Balance Sheet'!AM12","v":{"v":141.1,"d":"141.100"}},{"$f":"F14-('PS Balance Sheet'!AN12+'PS Balance Sheet'!AO12+'PS Balance Sheet'!AP12)","v":{"v":77.2,"d":"77.200"}},33.875,13.665,2.5995,1.5995,1.8664999999999998,0.8665,2.5995,null,{"v":24.66,"d":"24.660"}]
[{"$f":"'Att. Dairy'!B13","v":"2019-07-08"},{"$f":"'Att. Dairy'!D13","v":"Monday"},{"$f":"'PS Balance Sheet'!AH13","v":133},{"$f":"D15-'PS Balance Sheet'!AL13","v":{"v":218.9,"d":"218.900"}},{"$f":"E15-'PS Balance Sheet'!AM13","v":{"v":141.1,"d":"141.100"}},{"$f":"F15-('PS Balance Sheet'!AN13+'PS Balance Sheet'!AO13+'PS Balance Sheet'!AP13)","v":{"v":77.2,"d":"77.200"}},27.225,{"v":13,"d":"13.000"},2.4,1.4,1.7999999999999998,0.8,2.4,null,{"v":22,"d":"22.000"}]
[{"$f":"'Att. Dairy'!B14","v":"2019-07-09"},{"$f":"'Att. Dairy'!D14","v":"Tuesday"},{"$f":"'PS Balance Sheet'!AH14","v":0},{"$f":"D16-'PS Balance Sheet'!AL14","v":{"v":218.9,"d":"218.900"}},{"$f":"E16-'PS Balance Sheet'!AM14","v":{"v":141.1,"d":"141.100"}},{"$f":"F16-('PS Balance Sheet'!AN14+'PS Balance Sheet'!AO14+'PS Balance Sheet'!AP14)","v":{"v":77.2,"d":"77.200"}},27.225,{"v":13,"d":"13.000"},2.4,1.4,1.7999999999999998,0.8,2.4,null,{"v":22,"d":"22.000"}]
[{"$f":"'Att. Dairy'!B15","v":"2019-07-10"},{"$f":"'Att. Dairy'!D15","v":"Wednesday"},{"$f":"'PS Balance Sheet'!AH15","v":0},{"$f":"D17-'PS Balance Sheet'!AL15","v":{"v":218.9,"d":"218.900"}},{"$f":"E17-'PS Balance Sheet'!AM15","v":{"v":141.1,"d":"141.100"}},{"$f":"F17-('PS Balance Sheet'!AN15+'PS Balance Sheet'!AO15+'PS Balance Sheet'!AP15)","v":{"v":77.2,"d":"77.200"}},27.225,{"v":13,"d":"13.000"},2.4,1.4,1.7999999999999998,0.8,2.4,null,{"v":22,"d":"22.000"}]
[{"$f":"'Att. Dairy'!B16","v":"2019-07-11"},{"$f":"'Att. Dairy'!D16","v":"Thursday"},{"$f":"'PS Balance Sheet'!AH16","v":0},{"$f":"D18-'PS Balance Sheet'!AL16","v":{"v":218.9,"d":"218.900"}},{"$f":"E18-'PS Balance Sheet'!AM16","v":{"v":141.1,"d":"141.100"}},{"$f":"F18-('PS Balance Sheet'!AN16+'PS Balance Sheet'!AO16+'PS Balance Sheet'!AP16)","v":{"v":77.2,"d":"77.200"}},27.225,{"v":13,"d":"13.000"},2.4,1.4,1.7999999999999998,0.8,2.4,null,{"v":22,"d":"22.000"}]
[{"$f":"'Att. Dairy'!B17","v":"2019-07-12"},{"$f":"'Att. Dairy'!D17","v":"Friday"},{"$f":"'PS Balance Sheet'!AH17","v":0},{"$f":"D19-'PS Balance Sheet'!AL17","v":{"v":218.9,"d":"218.900"}},{"$f":"E19-'PS Balance Sheet'!AM17","v":{"v":141.1,"d":"141.100"}},{"$f":"F19-('PS Balance Sheet'!AN17+'PS Balance Sheet'!AO17+'PS Balance Sheet'!AP17)","v":{"v":77.2,"d":"77.200"}},27.225,{"v":13,"d":"13.000"},2.4,1.4,1.7999999999999998,0.8,2.4,null,{"v":22,"d":"22.000"}]
[{"$f":"'Att. Dairy'!B18","v":"2019-07-13"},{"$f":"'Att. Dairy'!D18","v":"Saturday"},{"$f":"'PS Balance Sheet'!AH18","v":0},{"$f":"D20-'PS Balance Sheet'!AL18","v":{"v":218.9,"d":"218.900"}},{"$f":"E20-'PS Balance Sheet'!AM18","v":{"v":141.1,"d":"141.100"}},{"$f":"F20-('PS Balance Sheet'!AN18+'PS Balance Sheet'!AO18+'PS Balance Sheet'!AP18)","v":{"v":77.2,"d":"77.200"}},27.225,{"v":13,"d":"13.000"},2.4,1.4,1.7999999999999998,0.8,2.4,null,{"v":22,"d":"22.000"}]
[{"$f":"'Att. Dairy'!B19","v":"2019-07-14"},{"$f":"'Att. Dairy'!D19","v":"Sunday"},{"$f":"'PS Balance Sheet'!AH19","v":0},{"$f":"D21-'PS Balance Sheet'!AL19","v":{"v":218.9,"d":"218.900"}},{"$f":"E21-'PS Balance Sheet'!AM19","v":{"v":141.1,"d":"141.100"}},{"$f":"F21-('PS Balance Sheet'!AN19+'PS Balance Sheet'!AO19+'PS Balance Sheet'!AP19)","v":{"v":77.2,"d":"77.200"}},27.225,{"v":13,"d":"13.000"},2.4,1.4,1.7999999999999998,0.8,2.4,null,{"v":22,"d":"22.000"}]
[{"$f":"'Att. Dairy'!B20","v":"2019-07-15"},{"$f":"'Att. Dairy'!D20","v":"Monday"},{"$f":"'PS Balance Sheet'!AH20","v":0},{"$f":"D22-'PS Balance Sheet'!AL20","v":{"v":218.9,"d":"218.900"}},{"$f":"E22-'PS Balance Sheet'!AM20","v":{"v":141.1,"d":"141.100"}},{"$f":"F22-('PS Balance Sheet'!AN20+'PS Balance Sheet'!AO20+'PS Balance Sheet'!AP20)","v":{"v":77.2,"d":"77.200"}},27.225,{"v":13,"d":"13.000"},2.4,1.4,1.7999999999999998,0.8,2.4,null,{"v":22,"d":"22.000"}]
[{"$f":"'Att. Dairy'!B21","v":"2019-07-16"},{"$f":"'Att. Dairy'!D21","v":"Tuesday"},{"$f":"'PS Balance Sheet'!AH21","v":0},{"$f":"D23-'PS Balance Sheet'!AL21","v":{"v":218.9,"d":"218.900"}},{"$f":"E23-'PS Balance Sheet'!AM21","v":{"v":141.1,"d":"141.100"}},{"$f":"F23-('PS Balance Sheet'!AN21+'PS Balance Sheet'!AO21+'PS Balance Sheet'!AP21)","v":{"v":77.2,"d":"77.200"}},27.225,{"v":13,"d":"13.000"},2.4,1.4,1.7999999999999998,0.8,2.4,null,{"v":22,"d":"22.000"}]
[{"$f":"'Att. Dairy'!B22","v":"2019-07-17"},{"$f":"'Att. Dairy'!D22","v":"Wednesday"},{"$f":"'PS Balance Sheet'!AH22","v":0},{"$f":"D24-'PS Balance Sheet'!AL22","v":{"v":218.9,"d":"218.900"}},{"$f":"E24-'PS Balance Sheet'!AM22","v":{"v":141.1,"d":"141.100"}},{"$f":"F24-('PS Balance Sheet'!AN22+'PS Balance Sheet'!AO22+'PS Balance Sheet'!AP22)","v":{"v":77.2,"d":"77.200"}},27.225,{"v":13,"d":"13.000"},2.4,1.4,1.7999999999999998,0.8,2.4,null,{"v":22,"d":"22.000"}]
[{"$f":"'Att. Dairy'!B23","v":"2019-07-18"},{"$f":"'Att. Dairy'!D23","v":"Thursday"},{"$f":"'PS Balance Sheet'!AH23","v":0},{"$f":"D25-'PS Balance Sheet'!AL23","v":{"v":218.9,"d":"218.900"}},{"$f":"E25-'PS Balance Sheet'!AM23","v":{"v":141.1,"d":"141.100"}},{"$f":"F25-('PS Balance Sheet'!AN23+'PS Balance Sheet'!AO23+'PS Balance Sheet'!AP23)","v":{"v":77.2,"d":"77.200"}},27.225,{"v":13,"d":"13.000"},2.4,1.4,1.7999999999999998,0.8,2.4,null,{"v":22,"d":"22.000"}]
[{"$f":"'Att. Dairy'!B24","v":"2019-07-19"},{"$f":"'Att. Dairy'!D24","v":"Friday"},{"$f":"'PS Balance Sheet'!AH24","v":0},{"$f":"D26-'PS Balance Sheet'!AL24","v":{"v":218.9,"d":"218.900"}},{"$f":"E26-'PS Balance Sheet'!AM24","v":{"v":141.1,"d":"141.100"}},{"$f":"F26-('PS Balance Sheet'!AN24+'PS Balance Sheet'!AO24+'PS Balance Sheet'!AP24)","v":{"v":77.2,"d":"77.200"}},27.225,{"v":13,"d":"13.000"},2.4,1.4,1.7999999999999998,0.8,2.4,null,{"v":22,"d":"22.000"}]
[{"$f":"'Att. Dairy'!B25","v":"2019-07-20"},{"$f":"'Att. Dairy'!D25","v":"Saturday"},{"$f":"'PS Balance Sheet'!AH25","v":0},{"$f":"D27-'PS Balance Sheet'!AL25","v":{"v":218.9,"d":"218.900"}},{"$f":"E27-'PS Balance Sheet'!AM25","v":{"v":141.1,"d":"141.100"}},{"$f":"F27-('PS Balance Sheet'!AN25+'PS Balance Sheet'!AO25+'PS Balance Sheet'!AP25)","v":{"v":77.2,"d":"77.200"}},27.225,{"v":13,"d":"13.000"},2.4,1.4,1.7999999999999998,0.8,2.4,null,{"v":22,"d":"22.000"}]
[{"$f":"'Att. Dairy'!B26","v":"2019-07-21"},{"$f":"'Att. Dairy'!D26","v":"Sunday"},{"$f":"'PS Balance Sheet'!AH26","v":0},{"$f":"D28-'PS Balance Sheet'!AL26","v":{"v":218.9,"d":"218.900"}},{"$f":"E28-'PS Balance Sheet'!AM26","v":{"v":141.1,"d":"141.100"}},{"$f":"F28-('PS Balance Sheet'!AN26+'PS Balance Sheet'!AO26+'PS Balance Sheet'!AP26)","v":{"v":77.2,"d":"77.200"}},27.225,{"v":13,"d":"13.000"},2.4,1.4,1.7999999999999998,0.8,2.4,null,{"v":22,"d":"22.000"}]
[{"$f":"'Att. Dairy'!B27","v":"2019-07-22"},{"$f":"'Att. Dairy'!D27","v":"Monday"},{"$f":"'PS Balance Sheet'!AH27","v":0},{"$f":"D29-'PS Balance Sheet'!AL27","v":{"v":218.9,"d":"218.900"}},{"$f":"E29-'PS Balance Sheet'!AM27","v":{"v":141.1,"d":"141.100"}},{"$f":"F29-('PS Balance Sheet'!AN27+'PS Balance Sheet'!AO27+'PS Balance Sheet'!AP27)","v":{"v":77.2,"d":"77.200"}},27.225,{"v":13,"d":"13.000"},2.4,1.4,1.7999999999999998,0.8,2.4,null,{"v":22,"d":"22.000"}]
[{"$f":"'Att. Dairy'!B28","v":"2019-07-23"},{"$f":"'Att. Dairy'!D28","v":"Tuesday"},{"$f":"'PS Balance Sheet'!AH28","v":0},{"$f":"D30-'PS Balance Sheet'!AL28","v":{"v":218.9,"d":"218.900"}},{"$f":"E30-'PS Balance Sheet'!AM28","v":{"v":141.1,"d":"141.100"}},{"$f":"F30-('PS Balance Sheet'!AN28+'PS Balance Sheet'!AO28+'PS Balance Sheet'!AP28)","v":{"v":77.2,"d":"77.200"}},27.225,{"v":13,"d":"13.000"},2.4,1.4,1.7999999999999998,0.8,2.4,null,{"v":22,"d":"22.000"}]
[{"$f":"'Att. Dairy'!B29","v":"2019-07-24"},{"$f":"'Att. Dairy'!D29","v":"Wednesday"},{"$f":"'PS Balance Sheet'!AH29","v":0},{"$f":"D31-'PS Balance Sheet'!AL29","v":{"v":218.9,"d":"218.900"}},{"$f":"E31-'PS Balance Sheet'!AM29","v":{"v":141.1,"d":"141.100"}},{"$f":"F31-('PS Balance Sheet'!AN29+'PS Balance Sheet'!AO29+'PS Balance Sheet'!AP29)","v":{"v":77.2,"d":"77.200"}},27.225,{"v":13,"d":"13.000"},2.4,1.4,1.7999999999999998,0.8,2.4,null,{"v":22,"d":"22.000"}]
[{"$f":"'Att. Dairy'!B30","v":"2019-07-25"},{"$f":"'Att. Dairy'!D30","v":"Thursday"},{"$f":"'PS Balance Sheet'!AH30","v":0},{"$f":"D32-'PS Balance Sheet'!AL30","v":{"v":218.9,"d":"218.900"}},{"$f":"E32-'PS Balance Sheet'!AM30","v":{"v":141.1,"d":"141.100"}},{"$f":"F32-('PS Balance Sheet'!AN30+'PS Balance Sheet'!AO30+'PS Balance Sheet'!AP30)","v":{"v":77.2,"d":"77.200"}},27.225,{"v":13,"d":"13.000"},2.4,1.4,1.7999999999999998,0.8,2.4,null,{"v":22,"d":"22.000"}]
[{"$f":"'Att. Dairy'!B31","v":"2019-07-26"},{"$f":"'Att. Dairy'!D31","v":"Friday"},{"$f":"'PS Balance Sheet'!AH31","v":0},{"$f":"D33-'PS Balance Sheet'!AL31","v":{"v":218.9,"d":"218.900"}},{"$f":"E33-'PS Balance Sheet'!AM31","v":{"v":141.1,"d":"141.100"}},{"$f":"F33-('PS Balance Sheet'!AN31+'PS Balance Sheet'!AO31+'PS Balance Sheet'!AP31)","v":{"v":77.2,"d":"77.200"}},27.225,{"v":13,"d":"13.000"},2.4,1.4,1.7999999999999998,0.8,2.4,null,{"v":22,"d":"22.000"}]
[{"$f":"'Att. Dairy'!B32","v":"2019-07-27"},{"$f":"'Att. Dairy'!D32","v":"Saturday"},{"$f":"'PS Balance Sheet'!AH32","v":0},{"$f":"D34-'PS Balance Sheet'!AL32","v":{"v":218.9,"d":"218.900"}},{"$f":"E34-'PS Balance Sheet'!AM32","v":{"v":141.1,"d":"141.100"}},{"$f":"F34-('PS Balance Sheet'!AN32+'PS Balance Sheet'!AO32+'PS Balance Sheet'!AP32)","v":{"v":77.2,"d":"77.200"}},27.225,{"v":13,"d":"13.000"},2.4,1.4,1.7999999999999998,0.8,2.4,null,{"v":22,"d":"22.000"}]
[{"$f":"'Att. Dairy'!B33","v":"2019-07-28"},{"$f":"'Att. Dairy'!D33","v":"Sunday"},{"$f":"'PS Balance Sheet'!AH33","v":0},{"$f":"D35-'PS Balance Sheet'!AL33","v":{"v":218.9,"d":"218.900"}},{"$f":"E35-'PS Balance Sheet'!AM33","v":{"v":141.1,"d":"141.100"}},{"$f":"F35-('PS Balance Sheet'!AN33+'PS Balance Sheet'!AO33+'PS Balance Sheet'!AP33)","v":{"v":77.2,"d":"77.200"}},27.225,{"v":13,"d":"13.000"},2.4,1.4,1.7999999999999998,0.8,2.4,null,{"v":22,"d":"22.000"}]
[{"$f":"'Att. Dairy'!B34","v":"2019-07-29"},{"$f":"'Att. Dairy'!D34","v":"Monday"},{"$f":"'PS Balance Sheet'!AH34","v":0},{"$f":"D36-'PS Balance Sheet'!AL34","v":{"v":218.9,"d":"218.900"}},{"$f":"E36-'PS Balance Sheet'!AM34","v":{"v":141.1,"d":"141.100"}},{"$f":"F36-('PS Balance Sheet'!AN34+'PS Balance Sheet'!AO34+'PS Balance Sheet'!AP34)","v":{"v":77.2,"d":"77.200"}},27.225,{"v":13,"d":"13.000"},2.4,1.4,1.7999999999999998,0.8,2.4,null,{"v":22,"d":"22.000"}]
[{"$f":"'Att. Dairy'!B35","v":"2019-07-30"},{"$f":"'Att. Dairy'!D35","v":"Tuesday"},{"$f":"'PS Balance Sheet'!AH35","v":0},{"$f":"D37-'PS Balance Sheet'!AL35","v":{"v":218.9,"d":"218.900"}},{"$f":"E37-'PS Balance Sheet'!AM35","v":{"v":141.1,"d":"141.100"}},{"$f":"F37-('PS Balance Sheet'!AN35+'PS Balance Sheet'!AO35+'PS Balance Sheet'!AP35)","v":{"v":77.2,"d":"77.200"}},27.225,{"v":13,"d":"13.000"},2.4,1.4,1.7999999999999998,0.8,2.4,null,{"v":22,"d":"22.000"}]
[{"$f":"'Att. Dairy'!B36","v":"2019-07-31"},{"$f":"'Att. Dairy'!D36","v":"Wednesday"},{"$f":"'PS Balance Sheet'!AH36","v":0},{"$f":"D38-'PS Balance Sheet'!AL36","v":{"v":218.9,"d":"218.900"}},{"$f":"E38-'PS Balance Sheet'!AM36","v":{"v":141.1,"d":"141.100"}},{"$f":"F38-('PS Balance Sheet'!AN36+'PS Balance Sheet'!AO36+'PS Balance Sheet'!AP36)","v":{"v":77.2,"d":"77.200"}},{"$f":"G38-IF(AND($B39=\"monday\"),C39*BP$13/1000,IF(AND($B39=\"thursday\"),C39*BP$13/2000,IF(AND($B39=\"saturday\"),C39*BP$13/1000,\"0\")))","v":27.225},{"$f":"H38-IF(AND(C39=\"\"),\"\",C39*BP$14/1000)","v":{"v":13,"d":"13.000"}},2.4,1.4,1.7999999999999998,0.8,2.4,{"$f":"SUM(N9:N38)","v":0},{"v":22,"d":"22.000"}]
[]
[]
[]
[null,null,"izfrfnu jk'ku lQykbZ dh ek=k",{"$nulls":8},"mPp izkFkfed d{kk gsrq"]
[]
["fnukad","okj","dqy ykHkkfUor","xsagq","pkoy","nky","lCth","rsy","fephZ","/kfu;k","gYnh","thjk","ued","ÝqV","Gas"]
["izkjfEHkd 'ks\"k",null,null,{"$f":"'Dal & Khadhiyan master'!G7","v":{"v":300,"d":"300.000"}},{"$f":"'Dal & Khadhiyan master'!G8","v":{"v":200,"d":"200.000"}},{"$f":"'Dal & Khadhiyan master'!G9+'Dal & Khadhiyan master'!G10+'Dal & Khadhiyan master'!G11","v":{"v":120,"d":"120.000"}},{"v":45,"d":"45.000"},{"v":15,"d":"15.000"},{"v":3,"d":"3.000"},{"v":2,"d":"2.000"},{"v":2,"d":"2.000"},{"v":1,"d":"1.000"},{"v":3,"d":"3.000"},null,30,"KG"]
[{"$f":"'Att. Dairy'!B6","v":"2019-07-01"},{"$f":"'Att. Dairy'!D6","v":"Monday"},{"$f":"'UPS balance Sheet'!AH6","v":55},{"$f":"D46-'UPS balance Sheet'!AL6","v":{"v":291.75,"d":"291.750"}},{"$f":"E46-'UPS balance Sheet'!AM6","v":{"v":200,"d":"200.000"}},{"$f":"F46-('UPS balance Sheet'!AN6+'UPS balance Sheet'!AO6+'UPS balance Sheet'!AP6)","v":{"v":118.35,"d":"118.350"}},{"$f":"G46-IF(AND($B47=\"monday\"),C47*0.075,IF(AND($B47=\"thursday\"),C47*0.038,IF(AND($B47=\"saturday\"),C47*0.075,\"0\")))","v":40.875},{"$f":"H46-IF(AND(C47=\"\"),\"\",C47*0.0075)","v":{"v":14.5875,"d":"14.588"}},{"$f":"I46-IF(AND(C47=\"\"),\"\",C47*0.0015)","v":{"v":2.9175,"d":"2.918"}},{"$f":"J46-IF(AND(C47=\"\"),\"\",C47*0.0015)","v":{"v":1.9175,"d":"1.918"}},{"$f":"K46-IF(AND(C47=\"\"),\"\",C47*0.0005)","v":{"v":1.9725,"d":"1.973"}},{"$f":"L46-IF(AND(C47=\"\"),\"\",C47*0.0005)","v":{"v":0.9725,"d":"0.973"}},{"$f":"M46-IF(AND(C47=\"\"),\"\",C47*0.0015)","v":{"v":2.9175,"d":"2.918"}},null,{"$f":"O46-IF(AND($O$45=\"Fire Woods\"),C47*0.2,IF(AND($O$45=\"Gas\"),C47*0.02,\"\"))","v":{"v":28.9,"d":"28.900"}}]
[{"$f":"'Att. Dairy'!B7","v":"2019-07-02"},{"$f":"'Att. Dairy'!D7","v":"Tuesday"},{"$f":"'UPS balance Sheet'!AH7","v":0},{"$f":"D47-'UPS balance Sheet'!AL7","v":{"v":291.75,"d":"291.750"}},{"$f":"E47-'UPS balance Sheet'!AM7","v":{"v":200,"d":"200.000"}},{"$f":"F47-('UPS balance Sheet'!AN7+'UPS balance Sheet'!AO7+'UPS balance Sheet'!AP7)","v":{"v":118.35,"d":"118.350"}},{"$f":"G47-IF(AND($B48=\"monday\"),C48*0.075,IF(AND($B48=\"thursday\"),C48*0.038,IF(AND($B48=\"saturday\"),C48*0.075,\"0\")))","v":40.875},{"$f":"H47-IF(AND(C48=\"\"),\"\",C48*0.0075)","v":{"v":14.5875,"d":"14.588"}},{"$f":"I47-IF(AND(C48=\"\"),\"\",C48*0.0015)","v":{"v":2.9175,"d":"2.918"}},{"$f":"J47-IF(AND(C48=\"\"),\"\",C48*0.0015)","v":{"v":1.9175,"d":"1.918"}},{"$f":"K47-IF(AND(C48=\"\"),\"\",C48*0.0005)","v":{"v":1.9725,"d":"1.973"}},{"$f":"L47-IF(AND(C48=\"\"),\"\",C48*0.0005)","v":{"v":0.9725,"d":"0.973"}},{"$f":"M47-IF(AND(C48=\"\"),\"\",C48*0.0015)","v":{"v":2.9175,"d":"2.918"}},null,{"$f":"O47-IF(AND($O$45=\"Fire Woods\"),C48*0.2,IF(AND($O$45=\"Gas\"),C48*0.02,\"\"))","v":{"v":28.9,"d":"28.900"}}]
[{"$f":"'Att. Dairy'!B8","v":"2019-07-03"},{"$f":"'Att. Dairy'!D8","v":"Wednesday"},{"$f":"'UPS balance Sheet'!AH8","v":0},{"$f":"D48-'UPS balance Sheet'!AL8","v":{"v":291.75,"d":"291.750"}},{"$f":"E48-'UPS balance Sheet'!AM8","v":{"v":200,"d":"200.000"}},{"$f":"F48-('UPS balance Sheet'!AN8+'UPS balance Sheet'!AO8+'UPS balance Sheet'!AP8)","v":{"v":118.35,"d":"118.350"}},40.875,{"v":14.5875,"d":"14.588"},{"v":2.9175,"d":"2.918"},{"v":1.9175,"d":"1.918"},{"v":1.9725,"d":"1.973"},{"v":0.9725,"d":"0.973"},{"v":2.9175,"d":"2.918"},null,{"v":28.9,"d":"28.900"}]
[{"$f":"'Att. Dairy'!B9","v":"2019-07-04"},{"$f":"'Att. Dairy'!D9","v":"Thursday"},{"$f":"'UPS balance Sheet'!AH9","v":93},{"$f":"D49-'UPS balance Sheet'!AL9","v":{"v":291.75,"d":"291.750"}},{"$f":"E49-'UPS balance Sheet'!AM9","v":{"v":186.05,"d":"186.050"}},{"$f":"F49-('UPS balance Sheet'!AN9+'UPS balance Sheet'!AO9+'UPS balance Sheet'!AP9)","v":{"v":115.55999999999999,"d":"115.560"}},37.341,{"v":13.89,"d":"13.890"},2.778,1.778,1.926,0.926,2.778,null,{"v":27.04,"d":"27.040"}]
[{"$f":"'Att. Dairy'!B10","v":"2019-07-05"},{"$f":"'Att. Dairy'!D10","v":"Friday"},{"$f":"'UPS balance Sheet'!AH10","v":0},{"$f":"D50-'UPS balance Sheet'!AL10","v":{"v":291.75,"d":"291.750"}},{"$f":"E50-'UPS balance Sheet'!AM10","v":{"v":186.05,"d":"186.050"}},{"$f":"F50-('UPS balance Sheet'!AN10+'UPS balance Sheet'!AO10+'UPS balance Sheet'!AP10)","v":{"v":115.55999999999999,"d":"115.560"}},37.341,{"v":13.89,"d":"13.890"},2.778,1.778,1.926,0.926,2.778,null,{"v":27.04,"d":"27.040"}]
[{"$f":"'Att. Dairy'!B11","v":"2019-07-06"},{"$f":"'Att. Dairy'!D11","v":"Saturday"},{"$f":"'UPS balance Sheet'!AH11","v":131},{"$f":"D51-'UPS balance Sheet'!AL11","v":{"v":272.1,"d":"272.100"}},{"$f":"E51-'UPS balance Sheet'!AM11","v":{"v":186.05,"d":"186.050"}},{"$f":"F51-('UPS balance Sheet'!AN11+'UPS balance Sheet'!AO11+'UPS balance Sheet'!AP11)","v":{"v":115.55999999999999,"d":"115.560"}},{"v":27.516000000000002,"d":"27.516"},{"v":12.9075,"d":"12.908"},{"v":2.5815,"d":"2.582"},{"v":1.5815000000000001,"d":"1.582"},{"v":1.8605,"d":"1.861"},{"v":0.8605,"d":"0.861"},{"v":2.5815,"d":"2.582"},null,{"v":24.419999999999998,"d":"24.420"}]
[{"$f":"'Att. Dairy'!B12","v":"2019-07-07"},{"$f":"'Att. Dairy'!D12","v":"Sunday"},{"$f":"'UPS balance Sheet'!AH12","v":0},{"$f":"D52-'UPS balance Sheet'!AL12","v":{"v":272.1,"d":"272.100"}},{"$f":"E52-'UPS balance Sheet'!AM12","v":{"v":186.05,"d":"186.050"}},{"$f":"F52-('UPS balance Sheet'!AN12+'UPS balance Sheet'!AO12+'UPS balance Sheet'!AP12)","v":{"v":115.55999999999999,"d":"115.560"}},{"v":27.516000000000002,"d":"27.516"},{"v":12.9075,"d":"12.908"},{"v":2.5815,"d":"2.582"},{"v":1.5815000000000001,"d":"1.582"},{"v":1.8605,"d":"1.861"},{"v":0.8605,"d":"0.861"},{"v":2.5815,"d":"2.582"},null,{"v":24.419999999999998,"d":"24.420"}]
[{"$f":"'Att. Dairy'!B13","v":"2019-07-08"},{"$f":"'Att. Dairy'!D13","v":"Monday"},{"$f":"'UPS balance Sheet'!AH13","v":137},{"$f":"D53-'UPS balance Sheet'!AL13","v":{"v":251.55,"d":"251.550"}},{"$f":"E53-'UPS balance Sheet'!AM13","v":{"v":186.05,"d":"186.050"}},{"$f":"F53-('UPS balance Sheet'!AN13+'UPS balance Sheet'!AO13+'UPS balance Sheet'!AP13)","v":{"v":115.55999999999999,"d":"115.560"}},17.241,{"v":11.88,"d":"11.880"},{"v":2.3760000000000003,"d":"2.376"},{"v":1.3760000000000001,"d":"1.376"},1.792,0.792,{"v":2.3760000000000003,"d":"2.376"},null,{"v":21.68,"d":"21.680"}]
[{"$f":"'Att. Dairy'!B14","v":"2019-07-09"},{"$f":"'Att. Dairy'!D14","v":"Tuesday"},{"$f":"'UPS balance Sheet'!AH14","v":0},{"$f":"D54-'UPS balance Sheet'!AL14","v":{"v":251.55,"d":"251.550"}},{"$f":"E54-'UPS balance Sheet'!AM14","v":{"v":186.05,"d":"186.050"}},{"$f":"F54-('UPS balance Sheet'!AN14+'UPS balance Sheet'!AO14+'UPS balance Sheet'!AP14)","v":{"v":115.55999999999999,"d":"115.560"}},17.241,{"v":11.88,"d":"11.880"},{"v":2.3760000000000003,"d":"2.376"},{"v":1.3760000000000001,"d":"1.376"},1.792,0.792,{"v":2.3760000000000003,"d":"2.376"},null,{"v":21.68,"d":"21.680"}]
[{"$f":"'Att. Dairy'!B15","v":"2019-07-10"},{"$f":"'Att. Dairy'!D15","v":"Wednesday"},{"$f":"'UPS balance Sheet'!AH15","v":0},{"$f":"D55-'UPS balance Sheet'!AL15","v":{"v":251.55,"d":"251.550"}},{"$f":"E55-'UPS balance Sheet'!AM15","v":{"v":186.05,"d":"186.050"}},{"$f":"F55-('UPS balance Sheet'!AN15+'UPS balance Sheet'!AO15+'UPS balance Sheet'!AP15)","v":{"v":115.55999999999999,"d":"115.560"}},17.241,{"v":11.88,"d":"11.880"},{"v":2.3760000000000003,"d":"2.376"},{"v":1.3760000000000001,"d":"1.376"},1.792,0.792,{"v":2.3760000000000003,"d":"2.376"},null,{"v":21.68,"d":"21.680"}]
[{"$f":"'Att. Dairy'!B16","v":"2019-07-11"},{"$f":"'Att. Dairy'!D16","v":"Thursday"},{"$f":"'UPS balance Sheet'!AH16","v":0},{"$f":"D56-'UPS balance Sheet'!AL16","v":{"v":251.55,"d":"251.550"}},{"$f":"E56-'UPS balance Sheet'!AM16","v":{"v":186.05,"d":"186.050"}},{"$f":"F56-('UPS balance Sheet'!AN16+'UPS balance Sheet'!AO16+'UPS balance Sheet'!AP16)","v":{"v":115.55999999999999,"d":"115.560"}},17.241,{"v":11.88,"d":"11.880"},{"v":2.3760000000000003,"d":"2.376"},{"v":1.3760000000000001,"d":"1.376"},1.792,0.792,{"v":2.3760000000000003,"d":"2.376"},null,{"v":21.68,"d":"21.680"}]
[{"$f":"'Att. Dairy'!B17","v":"2019-07-12"},{"$f":"'Att. Dairy'!D17","v":"Friday"},{"$f":"'UPS balance Sheet'!AH17","v":0},{"$f":"D57-'UPS balance Sheet'!AL17","v":{"v":251.55,"d":"251.550"}},{"$f":"E57-'UPS balance Sheet'!AM17","v":{"v":186.05,"d":"186.050"}},{"$f":"F57-('UPS balance Sheet'!AN17+'UPS balance Sheet'!AO17+'UPS balance Sheet'!AP17)","v":{"v":115.55999999999999,"d":"115.560"}},17.241,{"v":11.88,"d":"11.880"},{"v":2.3760000000000003,"d":"2.376"},{"v":1.3760000000000001,"d":"1.376"},1.792,0.792,{"v":2.3760000000000003,"d":"2.376"},null,{"v":21.68,"d":"21.680"}]
[{"$f":"'Att. Dairy'!B18","v":"2019-07-13"},{"$f":"'Att. Dairy'!D18","v":"Saturday"},{"$f":"'UPS balance Sheet'!AH18","v":0},{"$f":"D58-'UPS balance Sheet'!AL18","v":{"v":251.55,"d":"251.550"}},{"$f":"E58-'UPS balance Sheet'!AM18","v":{"v":186.05,"d":"186.050"}},{"$f":"F58-('UPS balance Sheet'!AN18+'UPS balance Sheet'!AO18+'UPS balance Sheet'!AP18)","v":{"v":115.55999999999999,"d":"115.560"}},17.241,{"v":11.88,"d":"11.880"},{"v":2.3760000000000003,"d":"2.376"},{"v":1.3760000000000001,"d":"1.376"},1.792,0.792,{"v":2.3760000000000003,"d":"2.376"},null,{"v":21.68,"d":"21.680"}]
[{"$f":"'Att. Dairy'!B19","v":"2019-07-14"},{"$f":"'Att. Dairy'!D19","v":"Sunday"},{"$f":"'UPS balance Sheet'!AH19","v":0},{"$f":"D59-'UPS balance Sheet'!AL19","v":{"v":251.55,"d":"251.550"}},{"$f":"E59-'UPS balance Sheet'!AM19","v":{"v":186.05,"d":"186.050"}},{"$f":"F59-('UPS balance Sheet'!AN19+'UPS balance Sheet'!AO19+'UPS balance Sheet'!AP19)","v":{"v":115.55999999999999,"d":"115.560"}},17.241,{"v":11.88,"d":"11.880"},{"v":2.3760000000000003,"d":"2.376"},{"v":1.3760000000000001,"d":"1.376"},1.792,0.792,{"v":2.3760000000000003,"d":"2.376"},null,{"v":21.68,"d":"21.680"}]
[{"$f":"'Att. Dairy'!B20","v":"2019-07-15"},{"$f":"'Att. Dairy'!D20","v":"Monday"},{"$f":"'UPS balance Sheet'!AH20","v":0},{"$f":"D60-'UPS balance Sheet'!AL20","v":{"v":251.55,"d":"251.550"}},{"$f":"E60-'UPS balance Sheet'!AM20","v":{"v":186.05,"d":"186.050"}},{"$f":"F60-('UPS balance Sheet'!AN20+'UPS balance Sheet'!AO20+'UPS balance Sheet'!AP20)","v":{"v":115.55999999999999,"d":"115.560"}},17.241,{"v":11.88,"d":"11.880"},{"v":2.3760000000000003,"d":"2.376"},{"v":1.3760000000000001,"d":"1.376"},1.792,0.792,{"v":2.3760000000000003,"d":"2.376"},null,{"v":21.68,"d":"21.680"}]
[{"$f":"'Att. Dairy'!B21","v":"2019-07-16"},{"$f":"'Att. Dairy'!D21","v":"Tuesday"},{"$f":"'UPS balance Sheet'!AH21","v":0},{"$f":"D61-'UPS balance Sheet'!AL21","v":{"v":251.55,"d":"251.550"}},{"$f":"E61-'UPS balance Sheet'!AM21","v":{"v":186.05,"d":"186.050"}},{"$f":"F61-('UPS balance Sheet'!AN21+'UPS balance Sheet'!AO21+'UPS balance Sheet'!AP21)","v":{"v":115.55999999999999,"d":"115.560"}},17.241,{"v":11.88,"d":"11.880"},{"v":2.3760000000000003,"d":"2.376"},{"v":1.3760000000000001,"d":"1.376"},1.792,0.792,{"v":2.3760000000000003,"d":"2.376"},null,{"v":21.68,"d":"21.680"}]
[{"$f":"'Att. Dairy'!B22","v":"2019-07-17"},{"$f":"'Att. Dairy'!D22","v":"Wednesday"},{"$f":"'UPS balance Sheet'!AH22","v":0},{"$f":"D62-'UPS balance Sheet'!AL22","v":{"v":251.55,"d":"251.550"}},{"$f":"E62-'UPS balance Sheet'!AM22","v":{"v":186.05,"d":"186.050"}},{"$f":"F62-('UPS balance Sheet'!AN22+'UPS balance Sheet'!AO22+'UPS balance Sheet'!AP22)","v":{"v":115.55999999999999,"d":"115.560"}},17.241,{"v":11.88,"d":"11.880"},{"v":2.3760000000000003,"d":"2.376"},{"v":1.3760000000000001,"d":"1.376"},1.792,0.792,{"v":2.3760000000000003,"d":"2.376"},null,{"v":21.68,"d":"21.680"}]
[{"$f":"'Att. Dairy'!B23","v":"2019-07-18"},{"$f":"'Att. Dairy'!D23","v":"Thursday"},{"$f":"'UPS balance Sheet'!AH23","v":0},{"$f":"D63-'UPS balance Sheet'!AL23","v":{"v":251.55,"d":"251.550"}},{"$f":"E63-'UPS balance Sheet'!AM23","v":{"v":186.05,"d":"186.050"}},{"$f":"F63-('UPS balance Sheet'!AN23+'UPS balance Sheet'!AO23+'UPS balance Sheet'!AP23)","v":{"v":115.55999999999999,"d":"115.560"}},17.241,{"v":11.88,"d":"11.880"},{"v":2.3760000000000003,"d":"2.376"},{"v":1.3760000000000001,"d":"1.376"},1.792,0.792,{"v":2.3760000000000003,"d":"2.376"},null,{"v":21.68,"d":"21.680"}]
[{"$f":"'Att. Dairy'!B24","v":"2019-07-19"},{"$f":"'Att. Dairy'!D24","v":"Friday"},{"$f":"'UPS balance Sheet'!AH24","v":0},{"$f":"D64-'UPS balance Sheet'!AL24","v":{"v":251.55,"d":"251.550"}},{"$f":"E64-'UPS balance Sheet'!AM24","v":{"v":186.05,"d":"186.050"}},{"$f":"F64-('UPS balance Sheet'!AN24+'UPS balance Sheet'!AO24+'UPS balance Sheet'!AP24)","v":{"v":115.55999999999999,"d":"115.560"}},17.241,{"v":11.88,"d":"11.880"},{"v":2.3760000000000003,"d":"2.376"},{"v":1.3760000000000001,"d":"1.376"},1.792,0.792,{"v":2.3760000000000003,"d":"2.376"},null,{"v":21.68,"d":"21.680"}]
[{"$f":"'Att. Dairy'!B25","v":"2019-07-20"},{"$f":"'Att. Dairy'!D25","v":"Saturday"},{"$f":"'UPS balance Sheet'!AH25","v":0},{"$f":"D65-'UPS balance Sheet'!AL25","v":{"v":251.55,"d":"251.550"}},{"$f":"E65-'UPS balance Sheet'!AM25","v":{"v":186.05,"d":"186.050"}},{"$f":"F65-('UPS balance Sheet'!AN25+'UPS balance Sheet'!AO25+'UPS balance Sheet'!AP25)","v":{"v":115.55999999999999,"d":"115.560"}},17.241,{"v":11.88,"d":"11.880"},{"v":2.3760000000000003,"d":"2.376"},{"v":1.3760000000000001,"d":"1.376"},1.792,0.792,{"v":2.3760000000000003,"d":"2.376"},null,{"v":21.68,"d":"21.680"}]
[{"$f":"'Att. Dairy'!B26","v":"2019-07-21"},{"$f":"'Att. Dairy'!D26","v":"Sunday"},{"$f":"'UPS balance Sheet'!AH26","v":0},{"$f":"D66-'UPS balance Sheet'!AL26","v":{"v":251.55,"d":"251.550"}},{"$f":"E66-'UPS balance Sheet'!AM26","v":{"v":186.05,"d":"186.050"}},{"$f":"F66-('UPS balance Sheet'!AN26+'UPS balance Sheet'!AO26+'UPS balance Sheet'!AP26)","v":{"v":115.55999999999999,"d":"115.560"}},17.241,{"v":11.88,"d":"11.880"},{"v":2.3760000000000003,"d":"2.376"},{"v":1.3760000000000001,"d":"1.376"},1.792,0.792,{"v":2.3760000000000003,"d":"2.376"},null,{"v":21.68,"d":"21.680"}]
[{"$f":"'Att. Dairy'!B27","v":"2019-07-22"},{"$f":"'Att. Dairy'!D27","v":"Monday"},{"$f":"'UPS balance Sheet'!AH27","v":0},{"$f":"D67-'UPS balance Sheet'!AL27","v":{"v":251.55,"d":"251.550"}},{"$f":"E67-'UPS balance Sheet'!AM27","v":{"v":186.05,"d":"186.050"}},{"$f":"F67-('UPS balance Sheet'!AN27+'UPS balance Sheet'!AO27+'UPS balance Sheet'!AP27)","v":{"v":115.55999999999999,"d":"115.560"}},17.241,{"v":11.88,"d":"11.880"},{"v":2.3760000000000003,"d":"2.376"},{"v":1.3760000000000001,"d":"1.376"},1.792,0.792,{"v":2.3760000000000003,"d":"2.376"},null,{"v":21.68,"d":"21.680"}]
[{"$f":"'Att. Dairy'!B28","v":"2019-07-23"},{"$f":"'Att. Dairy'!D28","v":"Tuesday"},{"$f":"'UPS balance Sheet'!AH28","v":0},{"$f":"D68-'UPS balance Sheet'!AL28","v":{"v":251.55,"d":"251.550"}},{"$f":"E68-'UPS balance Sheet'!AM28","v":{"v":186.05,"d":"186.050"}},{"$f":"F68-('UPS balance Sheet'!AN28+'UPS balance Sheet'!AO28+'UPS balance Sheet'!AP28)","v":{"v":115.55999999999999,"d":"115.560"}},17.241,{"v":11.88,"d":"11.880"},{"v":2.3760000000000003,"d":"2.376"},{"v":1.3760000000000001,"d":"1.376"},1.792,0.792,{"v":2.3760000000000003,"d":"2.376"},null,{"v":21.68,"d":"21.680"}]
[{"$f":"'Att. Dairy'!B29","v":"2019-07-24"},{"$f":"'Att. Dairy'!D29","v":"Wednesday"},{"$f":"'UPS balance Sheet'!AH29","v":0},{"$f":"D69-'UPS balance Sheet'!AL29","v":{"v":251.55,"d":"251.550"}},{"$f":"E69-'UPS balance Sheet'!AM29","v":{"v":186.05,"d":"186.050"}},{"$f":"F69-('UPS balance Sheet'!AN29+'UPS balance Sheet'!AO29+'UPS balance Sheet'!AP29)","v":{"v":115.55999999999999,"d":"115.560"}},17.241,{"v":11.88,"d":"11.880"},{"v":2.3760000000000003,"d":"2.376"},{"v":1.3760000000000001,"d":"1.376"},1.792,0.792,{"v":2.3760000000000003,"d":"2.376"},null,{"v":21.68,"d":"21.680"}]
[{"$f":"'Att. Dairy'!B30","v":"2019-07-25"},{"$f":"'Att. Dairy'!D30","v":"Thursday"},{"$f":"'UPS balance Sheet'!AH30","v":0},{"$f":"D70-'UPS balance Sheet'!AL30","v":{"v":251.55,"d":"251.550"}},{"$f":"E70-'UPS balance Sheet'!AM30","v":{"v":186.05,"d":"186.050"}},{"$f":"F70-('UPS balance Sheet'!AN30+'UPS balance Sheet'!AO30+'UPS balance Sheet'!AP30)","v":{"v":115.55999999999999,"d":"115.560"}},17.241,{"v":11.88,"d":"11.880"},{"v":2.3760000000000003,"d":"2.376"},{"v":1.3760000000000001,"d":"1.376"},1.792,0.792,{"v":2.3760000000000003,"d":"2.376"},null,{"v":21.68,"d":"21.680"}]
[{"$f":"'Att. Dairy'!B31","v":"2019-07-26"},{"$f":"'Att. Dairy'!D31","v":"Friday"},{"$f":"'UPS balance Sheet'!AH31","v":0},{"$f":"D71-'UPS balance Sheet'!AL31","v":{"v":251.55,"d":"251.550"}},{"$f":"E71-'UPS balance Sheet'!AM31","v":{"v":186.05,"d":"186.050"}},{"$f":"F71-('UPS balance Sheet'!AN31+'UPS balance Sheet'!AO31+'UPS balance Sheet'!AP31)","v":{"v":115.55999999999999,"d":"115.560"}},17.241,{"v":11.88,"d":"11.880"},{"v":2.3760000000000003,"d":"2.376"},{"v":1.3760000000000001,"d":"1.376"},1.792,0.792,{"v":2.3760000000000003,"d":"2.376"},null,{"v":21.68,"d":"21.680"}]
[{"$f":"'Att. Dairy'!B32","v":"2019-07-27"},{"$f":"'Att. Dairy'!D32","v":"Saturday"},{"$f":"'UPS balance Sheet'!AH32","v":0},{"$f":"D72-'UPS balance Sheet'!AL32","v":{"v":251.55,"d":"251.550"}},{"$f":"E72-'UPS balance Sheet'!AM32","v":{"v":186.05,"d":"186.050"}},{"$f":"F72-('UPS balance Sheet'!AN32+'UPS balance Sheet'!AO32+'UPS balance Sheet'!AP32)","v":{"v":115.55999999999999,"d":"115.560"}},17.241,{"v":11.88,"d":"11.880"},{"v":2.3760000000000003,"d":"2.376"},{"v":1.3760000000000001,"d":"1.376"},1.792,0.792,{"v":2.3760000000000003,"d":"2.376"},null,{"v":21.68,"d":"21.680"}]
[{"$f":"'Att. Dairy'!B33","v":"2019-07-28"},{"$f":"'Att. Dairy'!D33","v":"Sunday"},{"$f":"'UPS balance Sheet'!AH33","v":0},{"$f":"D73-'UPS balance Sheet'!AL33","v":{"v":251.55,"d":"251.550"}},{"$f":"E73-'UPS balance Sheet'!AM33","v":{"v":186.05,"d":"186.050"}},{"$f":"F73-('UPS balance Sheet'!AN33+'UPS balance Sheet'!AO33+'UPS balance Sheet'!AP33)","v":{"v":115.55999999999999,"d":"115.560"}},17.241,{"v":11.88,"d":"11.880"},{"v":2.3760000000000003,"d":"2.376"},{"v":1.3760000000000001,"d":"1.376"},1.792,0.792,{"v":2.3760000000000003,"d":"2.376"},null,{"v":21.68,"d":"21.680"}]
[{"$f":"'Att. Dairy'!B34","v":"2019-07-29"},{"$f":"'Att. Dairy'!D34","v":"Monday"},{"$f":"'UPS balance Sheet'!AH34","v":0},{"$f":"D74-'UPS balance Sheet'!AL34","v":{"v":251.55,"d":"251.550"}},{"$f":"E74-'UPS balance Sheet'!AM34","v":{"v":186.05,"d":"186.050"}},{"$f":"F74-('UPS balance Sheet'!AN34+'UPS balance Sheet'!AO34+'UPS balance Sheet'!AP34)","v":{"v":115.55999999999999,"d":"115.560"}},17.241,{"v":11.88,"d":"11.880"},{"v":2.3760000000000003,"d":"2.376"},{"v":1.3760000000000001,"d":"1.376"},1.792,0.792,{"v":2.3760000000000003,"d":"2.376"},null,{"v":21.68,"d":"21.680"}]
[{"$f":"'Att. Dairy'!B35","v":"2019-07-30"},{"$f":"'Att. Dairy'!D35","v":"Tuesday"},{"$f":"'UPS balance Sheet'!AH35","v":0},{"$f":"D75-'UPS balance Sheet'!AL35","v":{"v":251.55,"d":"251.550"}},{"$f":"E75-'UPS balance Sheet'!AM35","v":{"v":186.05,"d":"186.050"}},{"$f":"F75-('UPS balance Sheet'!AN35+'UPS balance Sheet'!AO35+'UPS balance Sheet'!AP35)","v":{"v":115.55999999999999,"d":"115.560"}},17.241,{"v":11.88,"d":"11.880"},{"v":2.3760000000000003,"d":"2.376"},{"v":1.3760000000000001,"d":"1.376"},1.792,0.792,{"v":2.3760000000000003,"d":"2.376"},null,{"v":21.68,"d":"21.680"}]
[{"$f":"'Att. Dairy'!B36","v":"2019-07-31"},{"$f":"'Att. Dairy'!D36","v":"Wednesday"},{"$f":"'UPS balance Sheet'!AH36","v":0},{"$f":"D76-'UPS balance Sheet'!AL36","v":{"v":251.55,"d":"251.550"}},{"$f":"E76-'UPS balance Sheet'!AM36","v":{"v":186.05,"d":"186.050"}},{"$f":"F76-('UPS balance Sheet'!AN36+'UPS balance Sheet'!AO36+'UPS balance Sheet'!AP36)","v":{"v":115.55999999999999,"d":"115.560"}},17.241,{"v":11.88,"d":"11.880"},{"v":2.3760000000000003,"d":"2.376"},{"v":1.3760000000000001,"d":"1.376"},1.792,0.792,{"v":2.3760000000000003,"d":"2.376"},{"$f":"SUM(N47:N76)","v":0},{"v":21.68,"d":"21.680"}]

{"sheet":"Bill generate","index":12,"n_rows":40,"n_cols":10,"rows_kept":40,"merged":[[0,0,0,1],[0,2,0,9],[1,3,1,6],[3,0,3,9],[4,0,4,9],[5,0,5,3],[5,4,5,9],[6,0,8,0],[6,1,6,2],[6,3,6,9],[7,1,7,2],[7,3,7,9],[8,1,8,2],[8,3,8,9],[9,0,12,0],[9,1,9,9],[10,1,10,2],[10,3,10,4],[10,5,10,6],[10,7,10,9],[11,1,11,2],[11,3,11,4],[11,5,11,6],[11,7,11,9],[12,1,12,2],[12,3,12,4],[12,5,12,6],[12,7,12,9],[13,0,13,4],[13,5,13,9],[14,1,14,2],[14,5,14,6],[14,7,14,8],[15,1,15,2],[15,5,15,6],[15,7,15,8],[16,3,16,9],[17,1,17,2],[17,3,17,5],[17,6,17,8],[18,1,18,2],[18,3,18,5],[18,6,18,8],[19,1,19,2],[19,3,19,5],[19,6,19,8],[20,1,20,2],[20,3,20,5],[20,6,20,8],[21,1,21,2],[21,3,21,5],[21,6,21,8],[22,1,22,2],[22,3,22,5],[22,6,22,8],[23,1,23,2],[23,3,23,5],[23,6,23,8],[24,0,24,9],[25,1,25,2],[25,3,25,8],[26,1,26,2],[26,3,26,8],[27,1,27,9],[28,1,28,2],[28,3,28,6],[28,7,28,9],[29,1,29,2],[29,3,29,6],[29,7,29,9],[30,1,30,2],[30,3,30,6],[30,7,30,9],[31,0,39,0],[31,1,31,9],[32,1,32,2],[32,3,32,4],[32,5,32,6],[32,7,32,9],[33,1,33,2],[33,3,33,4],[33,5,33,6],[33,7,33,9],[34,1,34,2],[34,3,34,4],[34,5,34,6],[34,7,34,9],[35,1,35,9],[36,1,36,2],[36,3,36,4],[36,5,36,6],[36,7,36,9],[37,1,37,2],[37,3,37,4],[37,5,37,6],[37,7,37,9],[38,1,38,2],[38,3,38,4],[38,5,38,6],[38,7,38,9],[39,1,39,2],[39,3,39,4],[39,5,39,6],[39,7,39,9]]}
["dk;kZy; iz-@v-",null,{"$f":"'MASTER DATA'!C3","v":"jktdh; vkn'kZ mPp ek/;fed fo|ky; bUnjokM+k ] ia-l-& jkuh ] ikyh"}]
[{"$nulls":3},"pkyw ekg esa LVkWd o fcy fooj.k"]
[]
["feM Ms ehy dk¸kZØe"]
["vuqekfur fcy"]
["Month",{"$nulls":3},{"$f":"'MASTER DATA'!J4","v":"tqykbZ&2019"}]
[{"$nulls":3},"pkyw ekg esa ykHkkfUor fo|kFkhZ"]
[null,"çkFkfed",null,{"$f":"'PS Balance Sheet'!AH37","v":400}]
[null,"mPp çkFkfed",null,{"$f":"'UPS balance Sheet'!AH37","v":416}]
[null,"jk'ku lkexzh vuqekfur ek=k ¼fdyksxzke esa ½"]
[{"$nulls":3},"çkFkfed",null,"mPp çkFkfed",null,"dqy ek=k"]
[null,"lCth",null,{"$f":"Stock!G8-Stock!G39","v":17.775},null,{"$f":"Stock!G46-Stock!G77","v":27.759},null,{"$f":"D12+F12","v":45.534}]
[null,"rsy ",null,{"$f":"Stock!H8-Stock!H39","v":{"v":2,"d":"2.000"}},null,{"$f":"Stock!H46-Stock!H77","v":{"v":3.119999999999999,"d":"3.120"}},null,{"$f":"D13+F13","v":{"v":5.119999999999999,"d":"5.120"}}]
[" ekg dh izkjfEHkd 'ks\"k jkf'k",{"$nulls":4}," ekg ds nkSjku izkIr jkf'k"]
[1,"çkFkfed",null,{"$f":"'Dal & Khadhiyan master'!E37","v":{"v":10000,"d":"10000.00"}},":Ik,","çkFkfed",null,{"$f":"'Dal & Khadhiyan master'!E38","v":{"v":15000,"d":"15000.00"}},null,":Ik,"]
[2,"mPPk çkFkfed",null,{"$f":"'Dal & Khadhiyan master'!G37","v":{"v":15000,"d":"15000.00"}},":Ik,","mPPk çkFkfed",null,{"$f":"'Dal & Khadhiyan master'!G38","v":{"v":20000,"d":"20000.00"}},null,":Ik,"]
[{"$nulls":3},"ekg ds nkSjku [kpZ jkf'k :Ik, ¼estimate Bill½"]
[null,"lkexzh",null,"çkFkfed",null,null," mPp çkFkfed"]
["1-","ydMh @ xSal",null,{"$f":"'PS Balance Sheet'!AV37*10/100","v":{"v":156.21999999999997,"d":"156.22"}},null,null,{"$f":"'UPS balance Sheet'!AV37*10/100","v":{"v":242.548,"d":"242.55"}},null,null,":Ik,"]
["2-","xsagw filkbZ ",null,{"$f":"'PS Balance Sheet'!AL37*2.5","v":77.75},null,null,{"$f":"'UPS balance Sheet'!AL37*2.5","v":{"v":121.125,"d":"121.13"}},null,null,":Ik,"]
[3,"Qy",null,{"$f":"'PS Balance Sheet'!AV37*15/100","v":{"v":234.32999999999996,"d":"234.33"}},null,null,{"$f":"'UPS balance Sheet'!AV37*15/100","v":{"v":363.82199999999995,"d":"363.82"}},null,null,":Ik,"]
[4,"lCth",null,{"$f":"'PS Balance Sheet'!AV37*30/100","v":{"v":468.6599999999999,"d":"468.66"}},null,null,{"$f":"'UPS balance Sheet'!AV37*30/100","v":{"v":727.6439999999999,"d":"727.64"}},null,null,":Ik,"]
[5,"fdjk.kk jk'ku",null,{"$f":"'PS Balance Sheet'!AV37-D19-D20-D21-D22","v":625.24},null,null,{"$f":"'UPS balance Sheet'!AV37-G19-G20-G21-G22","v":{"v":970.341,"d":"970.34"}},null,null,":Ik,"]
[null,"dqy vuqekfur jkf'k",null,{"$f":"SUM(D19:F23)","v":{"v":1562.1999999999998,"d":"1562.20"}},null,null,{"$f":"SUM(G19:I23)","v":{"v":2425.4799999999996,"d":"2425.48"}},null,null,":Ik,"]
[" ekg ds vUr esa 'ks\"k jkf'k"]
[1,"çkFkfed",null,{"$f":"D15+H15-D24","v":{"v":23437.8,"d":"23437.80"}},{"$nulls":5},":Ik,"]
[2,"mPp çkFkfed",null,{"$f":"D16+H16-G24","v":32574.52},{"$nulls":5},":Ik,"]
[null,"vUuiw.kkZ nqX/k ;kstuk gsrw jkf'k "]
[1,"çkFkfed",null,{"$f":"'Milk master'!E11","v":{"v":6500,"d":"6500.00"}},{"$nulls":3},":Ik,"]
[2,"m çk",null,{"$f":"'Milk master'!G11","v":{"v":9000,"d":"9000.00"}},{"$nulls":3},":Ik,"]
[3,";ksx",null,{"$f":"D29+D30","v":{"v":15500,"d":"15500.00"}},{"$nulls":3},":Ik,"]
[null,"vUuiw.kkZ nqX/k ;kstuk esa ekg ds vUr esa 'ks\"k jkf'k "]
[{"$nulls":3},"çkFkfed",null,"mPp çkFkfed",null,"dqy 'ks\"k jkf'k"]
[null,"ekg esa [kpZ jkf'k",null,{"$f":"'PS Balance Sheet'!AW37","v":2262.75},null,{"$f":"'UPS balance Sheet'!AW37","v":{"v":4116,"d":"4116.00"}},null,{"$f":"D34+F34","v":6378.75}]
[null,"ekg ds vUr esa 'ks\"k",null,{"$f":"'Milk master'!E13","v":4237.25},null,{"$f":"'Milk master'!G13","v":{"v":4884,"d":"4884.00"}},null,{"$f":"F35+D35","v":9121.25}]
[null,"nky dk LVkWd"]
[null,"nky LVkWd",null,"çkFkfed",null,"mPp çkFkfed",null,"dqy ek=k"]
[null,"ekg dk izkj- 'ks\"k ",null,{"$f":"Stock!F8","v":80},null,{"$f":"Stock!F46","v":120},null,{"$f":"D38+F38","v":200}]
[null,"ekg esa [kpZ nky",null,{"$f":"'Dal Report'!AE9+'Dal Report'!AF9+'Dal Report'!AG9","v":2.8},null,{"$f":"'Dal Report'!AH9+'Dal Report'!AI9+'Dal Report'!AJ9","v":4.4399999999999995},null,{"$f":"D39+F39","v":7.239999999999999}]
[null,"ekg ds vUr esa 'ks\"k",null,{"$f":"Stock!F39","v":{"v":77.2,"d":"77.20"}},null,{"$f":"Stock!F77","v":{"v":115.55999999999999,"d":"115.56"}},null,{"$f":"D40+F40","v":192.76}]